##TITLE=1H_CA-8536
 CDCl3, 8 sc, 
 18.1.2019
##JCAMPDX= 6.0         $$ Bruker NMR JCAMP-DX V2.0
##DATA TYPE= NMR FID
##DATA CLASS= NTUPLES
##ORIGIN= UXNMR, Bruker Analytische Messtechnik GmbH
##OWNER= root
$$ XWIN-NMR		Version 3.5
$$ Fri Jan 18 14:05:34 2019 Russian Standard Time (UT+4h)  she@DPX200
##.OBSERVE FREQUENCY= 200.1313
##.OBSERVE NUCLEUS= ^1H
##.DELAY= (6, 6)
##.ACQUISITION MODE= SIMULTANEOUS
##.ACQUISITION SCHEME= undefined
##.AVERAGES= 8
##.DIGITISER RES= 18
##SPECTROMETER/DATA SYSTEM= spect
##.PULSE SEQUENCE= zg30
##.SOLVENT NAME= CDCl3
##.SHIFT REFERENCE= (INTERNAL, CDCl3, 0, 15.7039)
##AUDIT TRAIL= $$ (NUMBER, WHEN, WHO, WHERE, WHAT)
$$ ##TITLE= Audit trail, XWIN-NMR		Version 3.5
$$ ##JCAMPDX= 5.01
$$ ##ORIGIN= Bruker BioSpin GmbH
$$ ##OWNER= she
$$ F:/spectra/data/she/nmr/H-F/1/audita.txt
$$ ##AUDIT TRAIL=  $$ (NUMBER, WHEN, WHO, WHERE, WHAT)
(   1,<2019-01-18 14:04:18.67 +0400>,<she>,<DPX200>,
      <created by zg, POWCHK disabled, PULCHK disabled
       configuration hash MD5:
       00 E9 B6 7A A2 85 ED C7 34 08 36 98 17 FE 4E 26
       data hash MD5: 16K
       B7 5C F3 2E 5D D3 14 96 ED 99 2A 21 A2 B1 71 F6>)
$$ ##END=
$$ 
$$ hash MD5
$$ C2 08 1C 35 8B 63 20 53 3C 63 79 A5 5E 1B 08 BE
##$RELAX= 
##$RELAX= 
##$RELAX= 
##$RELAX= 
##$RELAX= 
##$RELAX= 
$$ Bruker specific parameters
$$ --------------------------
##$DU= <F:/spectra>
##$EXPNO= 1
##$NAME= <H-F>
##$PROCNO= 1
##$TYPE= <nmr>
##$USER= <she>
##$AMP= (0..31)
100 100 100 100 100 100 100 100 100 100 100 100 100 100 100 100 100 100 
100 100 100 100 100 100 100 100 100 100 100 100 100 100 
##$AQSEQ= 0
##$AQ_mod= 1
##$AUNM= <au_zg>
##$AUTOPOS= <>
##$BF1= 200.13
##$BF2= 200.13
##$BF3= 200.13
##$BF4= 200.13
##$BF5= 200.13
##$BF6= 200.13
##$BF7= 200.13
##$BF8= 200.13
##$BYTORDA= 1
##$CFDGTYP= 0
##$CFRGTYP= 5
##$CHEMSTR= <none>
##$CNST= (0..31)
1 1 145 1 1 1 1 1 1 1 1 1 1 1 1 1 1 1 1 1 1 1 1 1 1 1 1 1 1 1 1 1 
##$CPDPRG= <>
##$CPDPRG1= <>
##$CPDPRG2= <>
##$CPDPRG3= <>
##$CPDPRG4= <mlev>
##$CPDPRG5= <mlev>
##$CPDPRG6= <mlev>
##$CPDPRG7= <mlev>
##$CPDPRG8= <mlev>
##$CPDPRGB= <>
##$CPDPRGT= <>
##$D= (0..31)
0 1.2 0 0 0 0 0 0 0 0 0 0.03 0 0 0 0 0 0 0 0 0 0 0 0 0 0 0 0 0 0 0 0 
##$DATE= 1547805858
##$DBL= (0..7)
120 120 120 120 120 120 120 120 
##$DBP= (0..7)
150 150 150 150 150 150 150 150 
##$DBP07= 0
##$DBPNAM0= <>
##$DBPNAM1= <>
##$DBPNAM2= <>
##$DBPNAM3= <>
##$DBPNAM4= <>
##$DBPNAM5= <>
##$DBPNAM6= <>
##$DBPNAM7= <>
##$DBPOAL= (0..7)
0.5 0.5 0.5 0.5 0.5 0.5 0.5 0.5 
##$DBPOFFS= (0..7)
0 0 0 0 0 0 0 0 
##$DE= 6
##$DECBNUC= <off>
##$DECIM= 32
##$DECNUC= <off>
##$DECSTAT= 4
##$DIGMOD= 1
##$DIGTYP= 9
##$DL= (0..7)
0 120 120 120 120 120 120 120 
##$DP= (0..7)
150 150 150 150 150 150 150 150 
##$DP07= 0
##$DPNAME0= <>
##$DPNAME1= <>
##$DPNAME2= <>
##$DPNAME3= <>
##$DPNAME4= <>
##$DPNAME5= <>
##$DPNAME6= <>
##$DPNAME7= <>
##$DPOAL= (0..7)
0.5 0.5 0.5 0.5 0.5 0.5 0.5 0.5 
##$DPOFFS= (0..7)
0 0 0 0 0 0 0 0 
##$DQDMODE= 0
##$DR= 18
##$DS= 0
##$DSLIST= <SSSSSSSSSSSSSSS>
##$DSPFIRM= 0
$$ [...]
##$SUBNAM2= <"">
##$SUBNAM3= <"">
##$SUBNAM4= <"">
##$SUBNAM5= <"">
##$SUBNAM6= <"">
##$SUBNAM7= <"">
##$SUBNAM8= <"">
##$SUBNAM9= <"">
##$SW= 20.0189088683792
##$SWIBOX= (0..15)
0 0 2 0 0 0 0 0 0 0 0 0 0 0 0 0 
##$SW_h= 4006.41025641026
##$TD= 16384
##$TD0= 1
##$TE= 0
##$TE2= 300
##$TE3= 300
##$TEG= 300
##$TL= (0..7)
0 120 120 120 120 120 120 120 
##$TP= (0..7)
150 150 150 150 150 150 150 150 
##$TP07= 0
##$TPNAME0= <>
##$TPNAME1= <>
##$TPNAME2= <>
##$TPNAME3= <>
##$TPNAME4= <>
##$TPNAME5= <>
##$TPNAME6= <>
##$TPNAME7= <>
##$TPOAL= (0..7)
0.5 0.5 0.5 0.5 0.5 0.5 0.5 0.5 
##$TPOFFS= (0..7)
0 0 0 0 0 0 0 0 
##$TUNHIN= 0
##$TUNHOUT= 0
##$TUNXOUT= 0
##$USERA1= <user>
##$USERA2= <user>
##$USERA3= <user>
##$USERA4= <user>
##$USERA5= <user>
##$V9= 5
##$VALIST= <valist>
##$VCLIST= <CCCCCCCCCCCCCCC>
##$VD= 0
##$VDLIST= <DDDDDDDDDDDDDDD>
##$VPLIST= <PPPPPPPPPPPPPPP>
##$VTLIST= <TTTTTTTTTTTTTTT>
##$WBST= 1024
##$WBSW= 4
##$XGAIN= (0..3)
0 0 0 0 
##$XL= 0
##$YL= 0
##$YMAX_a= 149015
##$YMIN_a= -303765
##$ZGOPTNS= <>
##$ZL1= 120
##$ZL2= 120
##$ZL3= 120
##$ZL4= 120
##$ABSF1= 10
##$ABSF2= 0
##$ABSG= 5
##$ABSL= 3
##$ALPHA= 0
##$AQORDER= 0
##$ASSFAC= 0
##$ASSFACI= 0
##$ASSFACX= 0
##$ASSWID= 0
##$AUNMP= <proc_1d>
##$AZFE= 0.1
##$AZFW= 0.1
##$BCFW= 1
##$BC_mod= 2
##$BYTORDP= 1
##$COROFFS= 0
##$CY= 11.3945322036743
##$DATMOD= 1
##$DC= 2
##$DFILT= <>
##$DTYPP= 0
##$F1P= 18.9103706918063
##$F2P= -1.10871071338519
##$FCOR= 0.5
##$FTSIZE= 0
##$FT_mod= 4
##$GAMMA= 1
##$GB= 0.15
##$INTBC= 1
##$INTSCL= 1
##$ISEN= 128
##$LB= 0.24
##$LEV0= 0
##$LPBIN= 0
##$MAXI= 10000
##$MC2= 0
##$MEAN= 0
##$ME_mod= 0
##$MI= 1.114404
##$NCOEF= 0
##$NC_proc= 0
##$NLEV= 6
##$NOISF1= 3.799351
##$NOISF2= 2.8
##$NSP= 1
##$NTH_PI= 0
##$NZP= 0
##$OFFSET= 15.70392
##$PC= 1
##$PHC0= -9059.028
##$PHC1= 18.20004
##$PH_mod= 1
##$PKNL= yes
##$PPARMOD= 0
##$PSCAL= 0
##$PSIGN= 0
##$REVERSE= no
##$SF= 200.130013532006
##$SI= 16384
##$SIGF1= 3
##$SIGF2= 2
##$SINO= 400
##$SIOLD= 16384
##$SREGLST= <1H.CDCl3>
##$SSB= 0
##$STSI= 0
##$STSR= 0
##$SW_p= 3612.71676300578
##$SYMM= 0
##$S_DEV= 0
##$TDeff= 0
##$TDoff= 0
##$TI= <>
##$TILT= no
##$TM1= 0
##$TM2= 0
##$TOPLEV= 0
##$USERP1= <user>
##$USERP2= <user>
##$USERP3= <user>
##$USERP4= <user>
##$USERP5= <user>
##$WDW= 1
##$XDIM= 8192
##$YMAX_p= 0
##$YMIN_p= 0
$$ End of Bruker specific parameters
$$ ---------------------------------
##NTUPLES= NMR FID
##VAR_NAME=  TIME,          FID/REAL,        FID/IMAG
##SYMBOL=    X,             R,               I
##VAR_TYPE=  INDEPENDENT,   DEPENDENT,       DEPENDENT
##VAR_FORM=  AFFN,          ASDF,            ASDF
##VAR_DIM=   8192,          8192,            8192
##UNITS=     SECONDS,       ARBITRARY UNITS, ARBITRARY UNITS
##FACTOR=    0.0002496,     1,               1
##FIRST=     0,             0,               0
##LAST=      2.0444736,     0,               0
##MIN=       0,             -303765,         0
##MAX=       2.0444736,     149015,          0
$$ Real data points
##PAGE= N=1
##DATA TABLE= (X++(R..R)), XYDATA
$$ [...]
$$ plain form
1794 195 -189 -616 283 -499 -712 688 -385 -1229 659 26 -679 412 -747 -777 583 -442 -867 604
1812 604 -626 -816 647 -55 -521 465 -491 -354 1024 -344 -303 1397 347 57 943 204 543 1223
1830 1223 -559 229 1066 -619 -376 705 -607 -340 445 -745 -49 746 -718 -118 855 -921 -296
1847 -296 355 -1059 -480 -396 -1778 -415 175 -1215 -79 589 113 750 1154 197 1535 1427 -212 1096
1865 1096 715 -714 159 292 -833 57 -349 -956 480 386 -776 526 571 -478 728 361 -547 668
1883 668 -268 -931 273 -354 -1401 -176 -541 -702 330 -265 -465 504 24 -330 707 230 -338 732
1901 732 117 -541 833 -268 -184 765 -55 -144 873 97 245 1000 -318 -31 931 -575 -391 464 -442
1920 -442 -562 57 -809 -377 173 -889 -753 551 -815 -360 269 -447 -52 652 -340 318 939 -422 475
$$ packed form
1794A95l84m27Q99p82k13J400j073q44J888o33p05J091j159l0J360j025m25J471
1812F04j230j90J463p02m66R86r56J37J378j368M1J700j050k90Q86p39L39O80
1830A223j782P88Q37j685K43J081j312K67P85j190O96P95j464O00R73j776O25
1847b96O51j414N79Q4j382J363N90j390J136O68m76O37M04r57J338j08j639J308
1865A096l81j429Q73J33j125Q90m06o07J436r4j162J302M5j049J206l67r08J215
1883F68r36o63J204o27j047J225l65j61J032n95k00R69m80l54J037m77n68J070
1901G32o15o58J374j101Q4R49q20q9J017p76J48P55j318K87R62j506J84Q55r06
1920d42j20O19q66M32N50j062J36J304j366M55O29p16L95P04r92O58O21j361Q97
$$ plain form
1939 475 1060 -293 -15 432 -425 221 179 -895 143 338 -696 48 587 -100 506 814 -268 648 447
1958 447 -545 262 20 -1019 -187 -230 -817 179 -310 -703 332 328 -558 743 338 -359 490 -160 -327 568
1978 568 52 -405 703 -33 -653 399 54 -137 698 206 44 852 248 -247 724 47 -694 184 -403
1997 -403 -763 163 -713 -707 371 -339 -349 465 -86 -122 576 -245 -18 538 -215 -129 706 -248 -307 333 -324 -227
2019 -227 359 -341 -248 190 -426 -30 942 -82 50 571 -230 365 555 -294 73 366 -512 -225 68 -867
2039 -867 -5 260 -863 -50 255 -571 233 638 -295 63 576 -360 467 -22 -732 163 163 -510 209 99
2059 99 -193 373 -51 -476 438 422 -235 248 194 -673 28 -32 -494 215 19 -495 158 -269 -430 565 285
2080 285 144 656 89 -143 826 -47 -227 478 -14 -227 399 -358 -390 370 -377 -427 97 -328 -163 572 -326
$$ packed form
1939D75N85j353K78M47q57O46m2j074J038J95j034P44N39o87O06L08j082R16k01
1958D47r92Q07k42j039Q32m3n87R96m89l93J035mq86J301m05o97Q49o50j67Q95
1978E68n16m57J108p36o20J052l45j91Q35m92j62Q08o04m95R71o77p41Q78n87
1997d03l60R26q76OJ078p10j0Q14n51l6O98q21K27N56p53Q6Q35r54n9O40o57R7
2019b27N86p00R3M38o16L96R72j024J32N21q01N95J90q49L67K93q78K87K93r35
2039h67Q62K65j123Q13L05q26Q04M05r33L58N13r36Q27m89p10Q95%o73P19j10
2059I9k92N66m24m25R14j6o57M83n4q67P01o0m62P09j96n14O53m27j61R95k80
2080B85j41N12n67k32R69q73j80P05m92k13O26p57l2P60p47n0N24m25J65P35q98
$$ plain form
2101 -326 -92 259 -114 -134 720 -192 -278 554 -251 -354 347 -189 -82 69 -747 -135 502 -154 95 718 -367
2122 -367 250 533 -99 228 552 -574 -153 287 -303 -8 172 -442 227 522 -35 110 365 -276 -15 67
2142 67 -423 -35 -68 -618 138 -117 -538 40 98 -314 107 359 14 462 427 -127 211 255 -52 232 92 -605
2164 -605 86 -318 -327 29 -219 -218 515 304 -201 344 -50 -126 421 -207 -279 230 -209 -632 302 -220 -248 535
2186 535 -137 -440 270 -221 -196 297 -253 -180 449 -318 -247 494 -21 -42 211 -194 -188 327 149 -138 261 -270
2208 -270 -159 163 -170 -141 254 -167 -180 396 -227 -24 297 -528 39 36 -553 -132 150 -446 96 97 -404 411
2230 411 184 -145 549 409 -281 217 131 48 210 -14 -520 -22 -70 -454 287 0 -226 163 153 -42 461
2251 461 305 -316 310 -64 -696 194 18 -684 12 -290 -608 153 13 -226 232 -2 -353 384 62 23
$$ packed form
2101c26K34L51l73k0Q54r12q6Q32q05j03P01n36J07J51q16O12O37o56K49O23j085
2122c67O17K83o32L27L24j126M21M40n90K95J80o14O69K95n57J45K55o41K61Q2
2142F7m90L88l3n50P56k55m21N78N8m12M21K52l45M48l5n54L38M4l07K84j40o97
2164f05O91m04rL56k48JP33k11n05N45l94p6N47o28p2N09m39m23R34n22k8P83
2186E35o72l03P10m91K5M93n50P3O29p67P1P41n15k1K53m05ON15j78k87L99n31
2208b70J11L22l33K9L95m21j3N76o23K03L21q25N67ln89M21K82n96N42Jn01Q15
2230D11k27l29O94j40o90M98q6q3J62k24n06M98m8l84P41k87k26L89j0j95N03
2251D61j56o21O26l74o32Q90j76p02O96l02l18P61j40k39M58k34l51P37l22l9
$$ plain form
2271 23 370 153 -313 323 -455 -287 111 68 5 188 -43 -156 594 -22 130 399 -46 -299 124 -152 -330
2292 -330 369 -307 -26 145 -236 -102 176 -269 24 53 -407 46 324 -81 83 41 -327 37 185 -193 33
2313 33 117 -178 193 241 -387 137 201 -72 51 -23 -233 258 128 -69 232 71 -108 -13 35 -435 -34 230
2335 230 -346 44 -34 -371 16 -23 -306 228 99 -160 238 -198 -218 255 -201 -365 271 -3 -167 177 206
2356 206 -170 341 10 -16 208 139 -164 617 -50 -306 91 -179 -440 94 -15 -118 297 -262 86 277 156
2377 156 -70 386 -82 -247 166 -60 24 137 117 -27 297 -154 105 230 -12 37 178 -151 39 177 -226
2398 -226 -86 361 1 -25 229 -200 99 233 -40 -38 4 -277 -71 150 -96 8 -83 -15 20 79 -208 4 114
2421 114 -90 -28 91 -93 46 108 -36 -11 -18 57 96 277 -109 -1 96 -144 270 203 -118 70 -36 -102 268
$$ packed form
2271B3L47k17m66O36p78J68L98m3o3J83k31j13P50o16J52K69m45k53M23k76j78
2292c30O99o76K81J71l81J34K78m45K93K9m60M53K78m05J64m2l68L64J48l78K26
2313C3Q4k95L71M8o28N24O4k73J23p4k10M91j30j97L01j61j79R5M8m70M01K64
2335B30n76L90p8l37L87l9k83N34j29k59L98m36k0M73m56j64O36k74j64L44K9
2356B06l76N11l31k6K24o9l03P81o67k56L97k70k61N34j09j03M15n59L48J91j21
2377A56k26M56m68j65M13k26Q4J13k0j44L24m51K59J25k42M9J41l29J90J38m03
2398b26J40M47l60k6K54m29K99J34k73KM2k81K06K21k46J04r1O8L5N9k87K12J10
2421A14k04O2J19j84J39O2j44K5pP5L9J81l86J08R7k40M14o7l21J88j06o6L70
$$ plain form
2444 268 117 -127 -111 259 -230 397 41 79 381 -21 -178 253 17 -38 420 -316 -112 214 -113 -212 20
2465 20 -76 -248 -84 -146 -140 84 -309 81 86 -207 -149 276 228 -195 -16 -50 -114 -20 -172 -79 159 -97 -160 12 104
2490 104 -36 13 -106 58 186 -196 -278 112 -121 -82 -152 -144 42 45 -200 -39 262 36 285 92 -105 144 271
2513 271 -215 8 55 -213 204 155 -71 -262 135 -286 -64 167 10 74 88 -245 120 3 -170 46 25 -265
2535 -265 47 -4 103 24 -161 -163 109 166 1 -22 -113 -163 32 -79 -100 308 180 -128 -63 -222 -140 258 235 -181
2559 -181 -145 -244 191 181 -23 -324 135 -136 -186 92 -173 -56 61 -19 12 154 76 -8 48 -182 -227 15 -58 -142
2583 -142 106 115 -18 86 -37 -64 -55 74 -116 -56 110 -45 -99 -140 -179 -40 -67 19 112 108 -18 131 -111 -167 215
2608 215 -52 89 134 -145 -97 -65 -184 -145 -61 114 -126 29 -49 -184 -41 -270 69 6 -207 -12 -24 85 174
$$ packed form
2444B68j51k44J6L70m89O27l56L8L02m02j57M31k36n5M58p36K04L26l27r9K32
2465B0r6j72J64o2OK24l93L90Nk93N8M25m8m23J79l4o4R4j52R3K38k56o3J72R2
2490A04j40M9j19J64J28l82q2L90k33L9p0QJ86Lk45J61L01k26K49j93j97K49J27
2513B71m86K23M7k68M17m9k26j91L97m21K22K31j57O4J4l33L65j17j73K16k1k90
2535b65L12n1J07p9j85kK72N7j65k3r1n0J95j11k1M08j28l08O5j59Q2L98k3m16
2559a81L6r9M35j0k04l01M59k71n0K78k65J17J17q0L1J42p8q4N6k30m5K42p3q4
2583a42K48Rj33J04j23k7RJ29j90O0J66j55n4m1l9J39k7Q6R3mj26J49k42n6L82
2608B15k67J41M5k79M8L2j19L9Q4J75k40J55p8j35J43k29L39o3k13J95j2J09Q9
$$ plain form
2631 174 281 -69 176 52 35 264 73 54 208 -46 -139 -115 223 -67 -3 177 -269 -97 -82 -361 108 21
2653 21 165 18 105 66 -32 -30 163 13 -125 -446 332 14 16 231 -68 -269 222 -15 30 283 -165 51 -35
2676 -35 78 175 4 8 98 51 -78 -25 -63 131 -27 102 122 -126 237 -58 39 -227 33 -18 -154 -61 12 -184
2700 -184 80 4 52 -33 -76 81 72 133 201 88 -208 138 14 -105 -37 -240 -257 99 -72 -91 208 -1 -212 -49
2724 -49 -47 99 37 -63 -142 190 15 -7 -156 -186 156 42 -1 107 116 -101 -198 -199 59 173 -96 18 43 -149 -1
2749 -1 -97 183 96 -181 -190 -37 42 -100 -170 4 -33 -202 -46 -87 -7 10 -216 -184 19 -16 194 -60 201 47 342
2774 342 51 -145 33 -1 -146 102 167 -61 -263 28 -11 96 -8 97 63 90 -66 -93 164 -17 32 38 -38
2797 -38 68 -62 41 247 66 -120 331 -95 152 115 -28 147 -115 -69 -150 -250 41 -70 297 -45 -67 29
$$ packed form
2631A74J07l50K45j24j7K29j91j9J54k54r3K4L38k90O4J80m46J72J5k79M69q7
2653B1J44j47Q7l9r8KJ93j50j38l21P78l18KK15k99k01M91k37M5K53m48K16q6
2676c5J13R7j71MR0m7j29N3l8J94j58J29K0k48L63k95R7k66K60n1j36R3P3j96
2700a84K64p6M8q5m3J57rO1O8j13k96L46j24j19O8k03j7L56j71j9K99k09k11J63
2724d9KJ46o2j00p9L32j75k2j49l0L42j14m3J08Rk17r7jK58J14k69J14K5j92J48
2749ar6K80q7k77rJ53P9j42p0J74l7j69J56m1Q0J7k26L2K03l5K10k54K61j54K95
2774C42k91j96J78l4j45K48O5k28k02K91l9J07j04J05l4K7j56k7K57j81M9Op6
2797c8J06j30J03K06j81j86M51m26K47l7j43J75k62M6q1j00K91j11L67l42k2R6
$$ plain form
2819 29 87 -376 103 -70 -207 179 179 -146 115 -12 -78 -28 -17 44 254 73 -255 64 52 93 138 47 39 204 141
2844 141 -73 7 38 57 -17 154 -154 66 -14 -88 -71 79 -158 236 307 -125 124 38 -79 106 -7 16 230
2867 230 163 299 121 -253 -221 239 -33 -14 -89 -162 132 145 -98 38 -256 -47 160 -9 50 -48 -149 -23 141
2890 141 -11 -195 -41 196 7 86 101 96 -3 81 -138 32 166 33 -142 77 -73 107 130 -141 -5 -59 -186
2913 -186 248 -111 -14 -7 124 120 33 -22 9 53 104 68 186 257 -86 66 -152 -13 -130 -3 -34 49 -93 -82 -76 -158
2939 -158 -2 108 16 35 87 -72 34 -4 79 -64 111 119 -320 270 -40 -123 27 77 29 7 -178 -273 144 -76
2963 -76 -204 110 55 -60 34 134 -174 129 -167 -9 125 -45 -91 163 -56 61 -334 -75 -115 -370 124 179
2985 179 27 -195 48 -7 -165 -234 140 86 147 34 -16 97 19 154 165 -96 -62 85 -5 23 -20 -62 -160 63
$$ packed form
2819B9N8m63M79j73j37L86%l25K61j27o6N0J1O1K10j81l28L19j2M1M5r1qJ65o3
2844A41k14Q0L1J9p4J71l08K20q0p4J7J50k37L94P1m32K49q6j17J85j13K3K14
2867B30o7J36j78l74L2M60k72J9p5p3K94J3k43J36k94K09K07j69N9r8j01J26J64
2890A41j52j84J54K37j89P9J5nr9Q4k19J70J34j33j75K19j50J80K3k71J36n4j27
2913a86M34l59R7PJ31mq7n5L1M4N1l6J18P1l43J52k18J39j17J27l1Q3j42J1Oq2
2939a58J56J10r2J9N2j59J06l8Q3j43J75Qm39N90l10q3J50N0m8k2j85r5M17k20
2963g6j28L14n5j15R4J00l08L03k96J58J34j70m6K54k19J17l95K59m0k55M94N5
2985A79j52k22K43n5j58o9L74n4O1j13n0J13p8J35J1k61L4J47r0K8m3m2r8K23
$$ plain form
3009 63 -13 -54 174 246 -140 39 -33 -128 152 -31 -114 43 -151 -260 -45 49 -92 43 40 -60 -32 -35 -92 -76 -3
3034 -3 -108 281 34 151 179 -47 -34 52 9 -215 97 -47 36 -47 -71 -322 -100 106 -40 -62 -68 249 82 23
3058 23 -120 59 -64 -98 -19 -140 55 -70 27 11 262 -210 76 54 -205 8 -108 -3 -72 107 -27 110
3080 110 -78 -146 -140 77 -145 23 152 -230 141 16 -322 -238 118 -41 48 100 -287 -84 159 -72 5 -91 -3
3103 -3 86 -118 18 74 3 -57 76 -157 -209 -63 155 -72 47 -41 -138 64 -104 -164 49 -97 -155 2 -21 73
3127 73 146 -131 74 -21 6 82 212 -19 -81 88 29 -117 -29 -73 -153 391 86 41 122 40 -265 -58 -157 -77 230
3152 230 -57 -195 30 -111 -17 -43 -14 -46 291 140 44 274 -163 -131 29 -77 72 125 -77 84 30 7 -183
3175 -183 45 -285 208 93 189 -87 234 -168 -248 -105 -238 -102 -171 90 -36 270 68 223 160 2 75 -1
$$ packed form
3009F3p6m1K28P2l86J79p2r5K80j83q3J57j94j09K15R4j41J35lj00K8ln7J6P3
3034cj05L89k47J17K8k26J3Q6m3k24L12j44Q3q3k4k51K22K06j46k2oL17j67n9
3058B3j43J79j23l4P9j21J95j25R7j6K51m72K86k2k59K13j16J05o9J79j34J37
3080A10j88o8OK17k22J68J29l82L71j25l38Q4L56j59Q9N2l87K03K43k31P7r6Q8
3103cQ9k04J36N6p1o0J33k33n2J46K18k27J19q8r7K02j68o0K13j46n8J57k3R4
3127G3P3k77K05r5K7P6J30k31o2J69n9j46Q8m4q0N44l05m5Q1q2l05K07r9Q0L07
3152B30k87j38K25j41R4k6K9l2L37j51r6K30m37L2J60j06J49N3k02J61n4k3j90
3175a83K28l30M93j15R6k76L21m02q0J43j33J36o9K61j26L06k02J55o3j58P3p6
$$ plain form
3197 -1 -230 36 -146 -78 35 19 -94 -137 87 166 -61 -2 -188 -123 -209 -195 -52 27 57 242 1 -20 52 -93 -242
3222 -242 155 28 -7 6 169 -10 82 -36 -103 55 -5 3 296 11 74 163 26 -39 -60 41 -21 165 76 -83
3246 -83 -26 22 -162 -18 -96 147 330 -127 86 95 -24 -76 264 7 21 35 -45 96 167 -189 217 163 -336 20
3270 20 15 -234 55 169 -145 -89 106 193 -97 -11 96 -86 31 -99 -39 -253 32 108 3 -286 -59 27 -98
3293 -98 33 -55 -405 -103 327 -147 43 -41 -213 -202 -98 40 -133 76 -80 73 -60 -207 122 144 -127 293
3315 293 63 -195 40 20 -153 22 -125 -478 -2 -98 81 -58 47 -94 200 -127 -79 276 159 -73 212
3336 212 223 -26 220 -235 -36 -126 -77 -111 -56 -113 -32 -61 38 -65 -67 -206 -19 -42 -65 -115 104 -135 37 -59 90
3361 90 97 225 123 -12 -14 -163 -37 -95 -129 -36 -13 -86 125 -52 -140 -112 43 -197 -74 33 130 -107 -34 -24 38
$$ packed form
3197ak29K66j82O8J13j6j13m3K24P9k27N9j86O5q6J4J43P9L0J85k41k1P2j45j49
3222b42L97j27l5J3J63j79R2j18o7J58o0QK93k85O3Q9j37o5k1J01o2J86q9j59
3246h3N7M8j84J44p8K43J83m57K13Rj19n2L40k57J4J4q0J41P1l56M06n4m99L56
3270B0nk49K89J14l14N6J95Q7k90Q6J07j82J17j30O0k14K85P6j05k89K27Q6j25
3293i8J31q8l50L02M30m74J90q4j72J1J04J38j73K09j56J53j33j47L29K2k71M20
3315B93k30k58K35k0j73J75j47l53M76r6J79j39J05j41K94l27M8L55j17k32K85
3336B12J1k49K46m55J99r0M9l4N5n7Q1k9R9j03kj39J87k3k3n0K19k39J72r6J49
3361I0PJ28j02j35kj49J26n8l4R3K3p3K11j77q8K8J55k40J23J07R7k37P3J0O2
$$ plain form
3386 38 301 -185 -104 -216 -247 -60 98 -111 315 91 -177 50 136 -224 173 -91 113 337 31 -274 -51
3407 -51 186 -7 -129 -285 -208 211 176 107 -29 21 -73 220 -76 -169 -160 -95 -260 231 -82 -117 15 -208 17 4
3431 4 -72 161 62 -111 58 130 95 257 438 -94 67 209 -130 80 131 -128 -2 64 12 145 -135 -132 -82 163
3455 163 -105 -75 -47 -102 -8 330 -252 -107 26 -130 279 95 -155 -242 -75 -167 49 154 -257 122 -44 21
3477 21 93 -117 20 272 237 -43 217 127 -58 106 370 170 40 223 21 59 -100 -68 320 123 40 4 -80
3500 -80 -7 193 -197 -66 172 99 -198 169 -226 -23 -5 73 -87 179 -116 -116 99 -83 -80 177 196 35 158
3523 158 4 76 128 141 78 90 -183 -50 -2 26 28 -24 210 102 72 -187 149 296 -68 113 -211 -94 -167 -96
3547 -96 115 -13 -163 -238 29 194 97 -107 147 -178 102 88 -57 199 125 -140 179 158 -114 218 90 -141
$$ packed form
3386C8K63m86Q1j12l1J87J58k09M26k24k68K27Q6l60L97k64K04K24l06l05K23
3407e1K37j93j22j56P7M19l5o9j36N0r4K93k96r3RO5j65M91l13l5J32k23K25j3
3431Dp6K33r9j73J69P2l5J62J81n32J61J42l39K10N1k59J26O6n2J33k80LN0K45
3455A63k68L0K8n5R4L38n82J45J33j56M09j84k50q7J67r2K16J05m11L79j66O5
3477B1P2k10J37K52l5k80K60r0j85J64K64k00j30J83k02L8j59L2L88j97q3l6q4
3500h0P3K00l90J31K38p3k97L67l95K03J8P8j60K66k95%K15j82LK57J9j61J23
3523A58j54P2N2J3o3J2k73J33M8K8Kn2K34j08l0k59L36J47l64J81l24J17p3P1
3547i6K11j28j50p5K67J65r7k04K54l25K80j4j45K56p4k65L19k1k72L32j28k31
$$ plain form
3569 -141 56 67 38 -11 47 56 -43 53 -95 -38 63 -302 490 56 -145 266 -63 -46 255 -167 -254 131 -63 -101
3593 -101 220 32 -281 -4 70 -106 -26 90 -53 102 -25 133 343 -17 -364 -63 -9 -36 130 -101 214
3614 214 -12 -60 -292 71 -207 65 -116 -64 -192 -50 -194 -61 253 -12 217 61 83 -23 73 -207 156
3635 156 110 -314 -138 295 -56 35 138 39 73 2 -22 -9 231 -186 33 38 125 9 43 -135 -64 -74 -109 98 -167
3660 -167 140 11 -69 4 -156 46 -109 102 5 25 145 -34 -150 -47 60 -160 41 -179 223 58 -193
3681 -193 -2 370 230 -224 168 284 6 137 -92 -129 -32 -92 -18 77 -223 -47 165 -136 -124 167 -146 -93
3703 -93 -121 -134 11 -71 -124 46 -68 132 -65 334 45 -5 80 20 11 232 85 -1 48 5 281 225 -12 -62 161
3728 161 -35 -153 -33 37 -57 221 -211 -25 173 114 219 142 -414 133 12 -220 -269 -22 -128 103 212 -400
$$ packed form
3569a41J97J1k9m9N8Rr9R6j48N7J01l65P92m34k01M11l29J7L01m22q7L85j94l8
3593a01L21j88l13K77P4j76Q0J16j43J55j27J58K10l60l47L01N4k7J66k31L15
3614B14k26m8k32L63k78K72j81N2j28J42j44J33L14k65K29j56K2j06R6k80L63
3635A56m6m24J76M33l51R1J03r9L4p1k4J3K40m17K19NQ7j16L4j78P1j0l5K07k65
3660a67L07j29q0P3j60K02j55K11r7K0J20j79j16J03J07k20K01k20M02j65k51
3681a93J91L72j40m54L92J16k78J31k29l7R7o0P4R5l00J76K12l01J2K91l13N3
3703i3k8j3J45q2n3J70j14K00j97L99k89n0Q5o0rK21j47q6M9m3K76n6k37n0K23
3728A61j96j18J20P0r4K78m32J86J98n9J05p7n56N47j21k32m9K47j06K31J09o12
$$ plain form
3750 -400 114 -5 -130 202 -120 48 89 236 -240 -40 169 -196 223 -114 -30 19 -146 -301 82 148 -26
3771 -26 159 -16 -236 111 178 -292 -162 -97 28 -120 5 -148 -88 -21 -248 123 75 -106 185 97 -11 191
3793 191 -118 117 288 36 160 54 102 41 77 -96 -25 243 -174 -29 194 36 -199 42 -227 35 190
3814 190 167 62 167 -31 -9 -111 75 -51 -30 -97 12 248 -187 103 -117 -72 -9 53 -105 256 186 -138 75
3837 75 213 -17 -136 170 -181 -210 -35 48 -8 -22 -134 -150 39 -82 10 -33 -165 6 -114 -13 -4 0 -45 78
3861 78 349 -172 169 180 -227 -26 -103 -208 -69 43 81 106 -57 37 184 -119 -82 369 -121 -67 154 -114 -200
3884 -200 261 321 -2 -25 -13 -74 -168 -4 145 267 174 50 139 24 103 249 8 -55 -19 -178 -49 161 -95
3907 -95 369 -266 -44 -14 99 -168 12 217 -152 -77 55 -166 -158 -22 -229 24 -167 -145 22 66 88 -92 -231
$$ packed form
3750d00N14j19j25L32l22J68M1J47m76K00K09l65M19l37Q4M9j65j55L83O6j74
3771b6J85j75k20L47O7m70J30O5J25j48J25j53O0O7k27L71m8j81K91q8j08K02
3793A91l09K35J71k52J24j06M8o1L6j73P1K68m17J45K23j58k35K41k69K62J55
3814A90k3j05J05j98K2j02J86j26K1o7J09K36m35K90k20M5O3O2j58L61p0l24K13
3837G5J38k30j19L06l51k9J75Q3n6j4j12j6J89j21R2m3j32J71j20J01RMm5J23
3861G8K71n21L41J1m07K01p7j05J39J12L8K5j63R4J47l03L7M51m90N4K21k68q6
3884b00M61O0l23k3J2o1r4J64J49J22r3j24Q9j15P9J46k41o3L6j59J29K10k56
3907i5M64o35K22L0J13k67J80K05l69P5J32k21QJ36k07K53j91K2J67M4K2j80j39
$$ plain form
3930 -231 -52 28 215 -51 225 -5 -126 80 60 119 151 29 -176 341 51 -49 13 -49 -215 48 -3 -49 206
3953 206 34 -102 154 -124 -130 32 42 165 -215 128 -115 58 -27 -184 128 3 -28 76 205 -121 239 -181
3975 -181 -71 202 -21 -27 195 -101 65 82 -239 -42 271 25 14 27 -6 -305 -3 -69 -138 172 -75 94 187
3998 187 -338 -80 241 -63 -239 17 -16 -59 88 -271 28 -31 -153 -115 -7 -9 -34 -36 -5 -61 -70 136 207 85 -231
4023 -231 45 99 -21 -87 33 -4 133 286 74 221 42 68 126 -177 57 -54 -94 -84 -53 102 -126 -89 -92 -6
4047 -6 125 60 34 140 -4 -32 229 115 -8 372 35 -85 348 235 -29 22 -185 -68 347 80 -139 248
4069 248 29 -228 42 -163 88 37 -119 -18 256 25 -71 77 83 -76 172 13 -80 164 -187 -52 351 -43
4091 -43 -28 55 72 108 56 -101 -168 6 -115 149 252 -74 15 53 -291 -41 181 -222 233 171 197 273 155 -219
$$ packed form
3930b31J79Q0J87k66K76k30j21K06k0N9L2j22k05N17k90j00O2o2j66K63n1m6K55
3953B06j72j36K56k78oJ62J0J23l80L43k43J73q5j57L12j25l1J04J29l26L60m20
3975a81J10K73k23oK22k96J66J7l21J97L13k46j1J3l3k99L02o6o9L10k47J69R3
3998A87n25K58L21l04j76K56l3m3J47l59K99n9j22L8J08kk5kL1n6rK06P1j22l16
4023b31K76N4j20o6J20l7J37J53k12J47j79K6N8l03K34j11m0J0L1J55k28L7lQ6
4047fJ31o5k6J06j44k8K61j14j23L80l37j20M33j13k64N1k07J17M15k67k19L87
4069B48k19k57K70k05K51n1j56J01K74k31r6J48Oj59K48j59r3K44l51J35M03l94
4091d3J5Q3J7L6n2j57o7J74j21K64J03l26Q9L8l44K50K22m03M55o2K6P6j18l74
$$ plain form
4115 -219 4 237 -131 66 84 -41 -21 -87 -67 -41 244 -389 -61 -7 -392 74 -16 -39 -6 -66 -207 74 -187
4138 -187 5 -18 142 -78 223 -69 -122 -193 55 -103 76 -170 110 157 128 -36 71 90 -65 195 74 -25
4160 -25 -58 206 -92 30 100 -144 258 66 -39 -45 -24 -33 62 -313 -2 193 -103 -53 64 88 -139 75 -48 -145
4184 -145 85 -17 138 373 -79 -123 45 -304 116 45 -298 -85 -61 -30 148 40 69 -43 -4 -98 -143 284 -100
4207 -100 -43 18 -32 291 -17 -258 -7 1 -90 3 -47 -26 142 147 3 51 66 3 66 14 -508 103 70 -17 121 142
4233 142 -71 85 30 -159 228 -26 50 192 -27 -185 36 -72 -244 242 71 215 260 -115 1 4 -53 35
4255 35 -60 -250 -29 124 43 62 67 139 -108 200 147 18 416 -11 -161 328 -18 212 206 -19 46 -118 68 133
4279 133 -75 100 152 -10 -285 148 -50 44 -128 -107 -68 50 164 -64 8 98 -126 1 153 -20 356 52
$$ packed form
4115b19K23K33l68J97J8j25K0o6K0K6K85o33L28N4l85M66r0k3L3o0j41K81k61
4138a87J92k3J60k20L01k92n3p1K48j58J79k46K80M7k9j64J07J9j55K60j21r9
4160b5l3K64k98J22P0k44M02j92j05oK1rR5l75L11J95k96N0J17K4k27K14j23r7
4184a45K30j02J55K35m52m4J68l49M20p1l43K13K4L1J78j08K9j12L9r4m5M27l84
4207a00N7O1n0L23l08k41K51Qr1R3n0K1J68Nj44M8J5o3O3n2n22O11l3q7J38K1
4233A42k13J56n5j89L87k54P6J42k19j58K21j08j72M86j71J44M5l75J16Ln7Q8
4255C5r5j90K21J53q1J9NP2k47L08n3j29L98m27j50M89l46K30ok25O5j64J86O5
4279A33k08J75N2j62k75M33j98R4j72K1L9J18J14k28P2R0k24J27J52j73L76l04
$$ plain form
4301 52 -153 -168 39 -53 -165 75 -107 163 133 -239 57 161 -240 -104 60 -156 -3 34 -163 200 80 -136
4323 -136 2 0 -178 135 -52 147 181 25 0 71 -95 -17 -100 -150 -334 144 -135 -201 -65 -88 -18 7 -64 -88 63
4348 63 -69 -96 241 -18 -108 -99 -4 36 -60 -22 -2 597 69 -182 -50 137 -149 81 5 139 34 53 -161 -22
4372 -22 110 -100 188 -191 74 -267 -8 -4 99 -257 417 112 12 98 63 -205 -28 -144 -221 227 23 -161
4394 -161 128 421 116 -288 214 -92 267 85 -78 223 -262 67 61 151 -74 71 -39 -235 0 44 -180
4415 -180 23 -296 -237 231 -158 -57 132 116 101 121 -111 41 -86 -66 -334 206 38 -145 -131 -45 -54 50 272
4438 272 -113 200 -198 -315 58 -297 -134 -86 -27 113 -48 176 41 -132 -104 15 103 -134 184 232 52 14
4460 14 85 40 107 179 -257 -23 210 -115 58 162 28 192 146 -127 -220 1 -16 -15 79 -21 -171 -82 -283 216
$$ packed form
4301E2k05j5K07r2j12K40j82K70l0l72K96J04m01J36J64k16J53L7j97L63j20k16
4323a36J38kj78L13j87J99L4j56k5P1j66P8q3n0j84M78k79o6J36k3P0K5p1k4J51
4348F3j32k7L37k59r0RR5M0r6L8K0N99n28k51J32J87k86K30p6J34j05J9k14J39
4372b2J32k10K88l79K65l41K59MJ03l56O74l05j00Q6l5k68J77j16p7M48k04j84
4394a61K89K93l05m04N02l06L59j82j63L01m85L29oR0k25J45j10j96K35M4k24
4415a80K03l19N9M68l89J01J89j6j5K0k32J52j27K0k68N40j68j83J4Q6rJ04K22
4438B72l85L13l98j17L73l55J63M8N9J40j61K24j35j73K8J19Q8k37L18M8j80l8
4460A4P1m5O7P2m36K34K33l25J73J04j34J64m6k73r3K21j7JR4j00j50Q9k01M99
$$ plain form
4484 216 59 -81 75 120 -93 -131 77 129 184 110 -88 -287 83 -190 115 -168 -136 114 -84 -167 105 18 -291
4507 -291 -235 5 51 3 -206 49 108 174 215 -95 -15 33 -51 -117 -283 152 -197 32 259 -23 81 199 -55
4530 -55 -28 100 47 97 43 -204 96 222 -31 52 158 -2 68 -62 120 156 -72 -72 -54 82 -55 -10 86 154 30
4555 30 -130 211 26 171 237 -140 146 82 140 94 -79 135 193 163 -72 11 -195 -131 62 156 -13 -17 54 78 -1
4580 -1 -192 68 -58 -97 153 215 -147 -24 131 -3 169 190 -169 113 -65 -36 42 118 -222 58 -291 5 23
4603 23 233 -117 158 55 47 4 -72 -54 98 -163 0 244 -37 -235 203 60 -128 69 -134 -117 5 -134
4625 -134 -379 246 395 -21 211 -11 -68 85 -87 110 80 144 24 96 -205 -34 -188 -19 22 65 80 69 48
4648 48 189 213 244 -50 119 107 125 115 164 -238 -91 -69 -127 -84 184 -158 -157 112 -76 101 -18 -299 227 290
$$ packed form
4484B16j57j40J56M5k13l8K08N2N5p4j98j99L70k73L05k83L2K50j98q3K72q7l09
4507b91N6K40M6m8k09K55N9O6M1l10Q0M8q4o6j66M35l49K29K27k82J04J18k54
4530e5K7J28n3N0n4k47L00J26k53Q3J06j60P0j30J82L6k28%J8J36j37M5R6O8j24
4555C0j60L41j85J45O6l77K86o4N8m6j73K14N8l0k35Q3k06O4J93R4j69mP1K4p9
4580aj91K60j26l9K50O2l62J23J55j34J72K1l59K82j78K9P8P6l40K80l49K96J8
4603B3K10l50K75j03qm3p6J8J52k61J63K44k81j98M38j43j88J97k03J7J22j39
4625a34k45O25J49m16K32k22n7J53j72J97l0O4j20P2l01J71j54J69M1M3J5j1k1
4648D8J41K4L1k94J69j2J8j0M9m02J47K2n8M3K68l42JK69j88J77j19k81N26O3
$$ plain form
4672 290 -103 23 0 132 -169 150 -216 -49 -31 27 126 205 206 59 143 -57 207 -291 -5 35 22 216 65
4695 65 -21 -192 33 177 -28 139 17 -117 56 315 -229 152 -68 -65 256 -37 33 -41 -238 -144 73 28 236
4718 236 26 15 -1 -34 215 171 -86 -122 -77 -156 -71 -95 100 -73 -61 -116 -137 -90 183 -198 116 54 4 -76 53
4743 53 -300 -139 129 -268 43 -107 -108 86 184 70 120 267 -67 19 -70 -95 276 109 -208 39 -77 -125 -156
4766 -156 54 -123 114 -1 84 -31 -43 -32 32 229 -82 40 8 -24 -67 118 2 -20 -98 68 -35 40 28 196
4790 196 -15 -264 88 10 -297 167 47 -49 -36 3 -88 114 -134 82 -56 -214 14 42 -45 -64 -13 -120 -123 4
4814 4 226 -38 179 -61 75 63 -42 -87 45 -50 -114 121 204 -115 98 -145 -144 247 -29 -50 170 -179 -146 35
4838 35 -18 -14 66 -8 2 -24 205 17 -29 65 37 -3 74 18 80 -325 95 -171 37 186 -37 -42 -121 91 221 -107
$$ packed form
4672B90l93J26k3J32l01L19l66J67J8N8R9P9Jj47Q4k00K64m98K86M0j3J94j51
4695F5q6j71K25J44k05J67j22j34J73K59n44L81k20LL21k93P0p4j97R4K17m5K08
4718B36k10j1j6l3K49m4k57l6M5p9Q5k4J95j73J2n5k1M7K73l81L14o2n0q0J29
4743E3l53J61K68l97L11j50jJ94R8j14N0J47l34Q6q9k5L71j67l17K47j16m8l1
4766a56K10j77K37j15Q5j15j2J1O4J97l11J22l2l2m3J85j16k2p8J66j03P5j2J68
4790A96k11k49L52p8l07M64j20r6J3L9r1K02k48K16j38j58K28K8q7j9N1j07lJ27
4814DK22k64K17k40J36j2j05m5J32r5o4K35Q3l19K13k43JL91k76k1K20l49L3J81
4838C5n3MQ0p4J0k6K29j88m6R4k8m0P7n6O2m05M20k66K08J49k23np9K12J30l28
$$ plain form
4864 -107 -124 -82 108 105 -21 -58 84 122 -47 -199 -34 164 -112 -40 -158 -26 -71 223 120 132 21 -182 -202
4887 -202 -166 -273 81 -224 -121 -68 116 100 -318 -31 -44 3 169 -86 -55 -125 98 169 121 8 105 24 -170 154
4911 154 357 -101 -124 97 18 -137 -22 -156 -50 -111 198 -23 98 -176 -133 -62 171 59 132 23 -51 31 -237
4934 -237 52 202 37 -287 -144 -29 69 6 -12 73 -175 58 200 167 -88 217 37 61 -89 -20 -63 8 371
4957 371 -41 -14 183 93 86 101 -136 71 -17 7 35 -25 -25 275 -41 -40 -111 29 59 90 -16 51 247 28 -51 -212
4983 -212 32 -40 -35 -91 -77 -18 22 -81 36 -285 1 -146 -64 -85 -223 -186 -143 221 170 -97 -119 -28 -51 158 -63
5008 -63 -101 28 11 15 149 47 -44 154 -177 -194 -57 28 -82 71 -62 119 -119 77 -9 -189 87 59 51 108
5032 108 136 -163 -20 144 4 146 123 -135 -82 -37 55 -174 99 80 38 -267 -169 -244 39 135 -123 194 4
$$ packed form
4864a07j7M2J90lj26l7J42L8j69j52J65J98k76P2j18J32m5K94j03J2j11k03k0
4887b02L6j07L54l05J03N3J84j6m18K87j3M7J66k55L1p0K23P1m8j13R7q1j94L24
4911A54K03m58k3K21p9j55J15j34J06o1L09k21J21k74M3P1K33j12P3j09p4Q2k68
4934b37K89J50j65l24J43J15R8o3j8Q5k48K33J42l3k55L05j80K4j50O9m3P1L63
4957C71m12K7J97r0pJ5k37K07q8K4K8o0%L00l16Jp1J40L0L1j06O7J96k19p9j61
4983b12K44p2Nn6J4N9M0j03J17l21K86j47Q2k1j38L7M3L64n1k67k2R1k3K09k21
5008f3l8J29j7MJ34j02r1J98l31j7J37Q5j10J53j33J81k38J96q6j80K76k8qN7
5032A08K8k99J43J64j40J42k3k58N3M5R2k29K73j9m2l05R8p5K83R6k58L17j90
$$ plain form
5055 4 6 -221 59 -57 105 -223 -241 -95 17 119 -60 118 -156 -128 -192 -42 138 -41 -286 -148 65 100 217
5078 217 6 -107 -49 86 1 -175 -89 -59 237 -123 -175 -54 -53 -76 199 10 50 219 23 107 142 81 -269 248
5102 248 4 -76 101 -151 -40 -231 -273 -22 163 69 274 36 -102 -217 -171 -69 -122 -30 9 -105 156 -232
5124 -232 128 202 -103 -281 3 55 -91 131 106 353 -162 74 167 -134 -63 -117 -273 99 104 -191 -41 344 -253
5147 -253 -123 43 -154 -67 30 305 -72 117 10 -256 193 -109 121 -13 -235 -79 -14 76 35 -115 -123 -83 115
5170 115 -105 -139 80 -45 -199 65 -110 -12 -14 57 -99 -109 7 -18 -6 37 173 -231 -59 77 -162 -144 163
5193 163 208 377 -55 -94 31 -26 152 -91 73 -112 -110 184 256 -26 24 -123 252 -59 110 111 41 -159 24
5216 24 -26 -12 -163 58 -96 -203 -40 -247 -8 51 91 187 125 263 -99 24 207 -200 98 -68 -69 22 -154
$$ packed form
5055DKk27K80j16J62l28j8J46J12J02j79J78k74K8o4J50J80j79k45J38K13L5J17
5078B17k11j13N8J35q5j76Q6L0K96l60n2J21Jk3K75j89M0J69j96Q4L5o1l50N17
5102B48k44q0J77k52J11j91m2K51J85r4K05k38j38j15M6J02n3R2L9j14K61l88
5124b32L60P4l05j78K84N2j46K22k5K47n15K36R3l01P1n4j56L72Nk95J50L85n97
5147b53J30J66j97Q7R7K75l77J89j07k66M49l02K30j34k22J56O5R0m1j50qM0J98
5170A15k20l4K19j25j54K64j75R8kP1j56j0J16k5J2M3J36m04J72J36k39J8L07
5193A63M5J69m32l9J25n7J78k43J64j85KK94P2k82N0j47L75l11J69Jp0k00J83
5216B4n0J4j51K21j54j07J63k07K39N9M0R6o2J38l62J23J83m07K98j66jR1j76
$$ plain form
5239 -154 -151 -3 65 -56 -148 -36 106 178 122 -6 -27 -33 -83 -81 9 -137 -61 52 -301 70 97 -219 51 -114 -128
5264 -128 -15 -245 -21 55 9 156 7 -267 -103 255 129 -54 80 -175 141 -16 -51 -87 80 26 168 -14
5286 -14 -163 1 -57 -17 -50 -26 -144 22 111 179 220 259 -66 -89 274 149 90 215 -115 -26 336 -50 -15 72 -94
5311 -94 -29 -4 -57 6 -198 -158 1 135 -36 -129 63 156 -128 144 7 -22 -129 297 -114 92 -154 -37 34
5334 34 -208 -122 297 -114 -36 -115 -175 -2 -145 26 -55 -54 -180 131 -124 35 -191 -17 -34 -78 8 -113 -74 -140
5358 -140 -34 -40 170 -178 30 -142 -26 -163 84 -13 -53 10 183 173 -134 139 -184 89 -127 234 139 -10
5380 -10 205 204 -191 -22 -27 -33 26 -79 4 40 -41 -107 52 -89 18 -43 -84 -260 122 44 95 -79 -159 -66 5 -94 -205
5407 -205 32 -11 -10 193 250 -26 248 -10 247 -149 -135 -155 -101 -84 -69 119 19 120 -62 21 106 -20 37 25
$$ packed form
5239a54LJ48O8j21r2J12J42P2n6j28k1on0KR0j46P6J13l53L71K7l16K70j65j4
5264a28J13k30K24P6m6J47j49k74J64L58j26j83J34k55L16j57l5l6J67n4J42j82
5286a4j49J64n8M0l3K4j18J66Q9O8M1L9l25k3L63j25n9J25l30Q9L62l86L5Q7j66
5311i4O5K5n3O3k04M0J59J34j71r3J92R3k84K72j37k9j07M26m11K06k46J17P1
5334C4k42Q6M19m11P8p9o0J73j43J71q1Jj26L11k55J59k26J74j7m4Q6j21L9o6
5358a40J06oK10l48K08j72J16j37K47r7m0O3J73j0l07K73l23K73k16L61r5j49
5380a0K15jl95J69noN9j05Q3L6q1o6J59j41J07o1m1j76L82p8N1j74q0R3P1r9j11
5407b05K37m3JK03N7k76K74k58K57l96J4k0N4J7J5J88j00J01j82Q3Q5j26N7j2
$$ plain form
5431 25 -272 97 -140 -102 -59 240 -105 -49 8 -77 243 -37 -72 -73 -39 128 -9 -118 146 -122 128 4 64 61
5455 61 61 7 33 -154 72 -146 -40 -16 119 -109 154 -180 -40 -21 159 20 -146 195 103 37 149 21 29 185
5479 185 -28 223 -238 -211 45 157 9 112 -101 8 113 214 89 -105 329 -208 -196 -103 38 -132 168
5500 168 -157 -206 156 71 95 -115 -9 -102 42 -93 57 143 74 -136 91 -229 13 20 -8 0 196 -197 52 109
5524 109 -94 67 193 85 -64 -222 -233 -129 44 81 -209 -32 81 -83 -71 -87 -167 -187 19 -36 15 142 -223
5547 -223 61 -135 -77 102 -19 84 114 283 2 -74 48 -92 -12 20 105 -10 211 -68 19 165 226 -74 -43
5570 -43 51 180 68 92 84 28 -82 226 48 79 60 -70 240 76 122 444 -153 -129 159 -83 -80 -57 -81 -97 -55
5595 -55 33 -73 22 -81 106 34 -260 -3 177 63 127 -292 107 43 10 104 172 -249 3 -12 21 107 43 50 -154
$$ packed form
5431B5k97L69k37L8M3K99l45N6N7q5L20k80l5jL4J67j37j09K64k68K50j24O0l
5455F1%n4K6j87K26k18J06K4J35k28K63l34J40J9J80j39j66L41r2o6J12j28QJ56
5479A85k13K51m61K7K56J12j48J03k13J09J05J01j25j94M34n37J2R3J41j70L00
5500A68l25m9L62q5K4k10J06r3J44j35J50Q6o9k10K27l20K42Pk8QJ96l93K49N7
5524A09k03J61J26j08j49j58j1J04J73L7k90J77J13j64J2j6q0k0K06n5N1J27l65
5547b23K84j96N8J79j21J03L0J69k81p6J22j40Q0L2Q5j15K21k79Q7J46O1l00L1
5570d3R4J29j12K4qn6j10L08j78L1j9j30L10j64M6L22n97K4K88k42LK3k4j6M2
5595e5Q8j06R5j03J87p2k94K57J80j14O4m19L99o4l3R4O8m21K52j5L3Q6o4Pk04
$$ plain form
5620 -154 -47 -87 -36 120 23 -51 39 -24 -156 -33 180 -81 -148 -91 -83 -48 217 -261 246 38 -30 136 -66 -61 19
5645 19 34 32 198 122 -130 -86 286 79 20 -110 15 -7 41 85 61 32 62 5 190 -77 -57 -33 1 -8 -89 -191 55
5672 55 -80 -234 31 64 77 1 -142 -64 64 -69 3 96 -105 -383 21 -184 -128 -211 60 29 -215 73 267
5695 267 67 -74 75 183 -187 -193 14 17 152 117 -175 33 89 -222 162 114 97 35 103 85 27 159 -46 287
5719 287 141 -93 -97 -74 32 161 -59 178 -89 59 -47 3 -83 -182 -42 -61 -46 -81 -8 -126 212 30 -53 -271
5743 -271 -35 -125 13 -9 -44 195 -27 -75 -49 38 41 156 197 63 -49 41 312 -72 222 -79 52 236 -99
5766 -99 253 30 95 -89 -304 -163 -26 -8 12 -1 -43 -125 39 -73 -35 -102 43 -151 116 64 12 -120 74 -14
5790 -14 46 -61 122 100 -192 -116 -99 -87 -33 21 -18 -75 48 -19 -109 -38 -40 -11 28 -190 -361 100 93 -110 73 -9 66
$$ packed form
5620a54J07m0N1J56r7p4R0o3j32J23K13k61o7N7QL5K65m78N07k08o8J66k02NQ0
5645A9J5kJ66p6k52M4L72k07n9j30J25k2M8M4k4k9L0n7J85k67K0K4L4rq1j02K46
5672E5j35j54K65L3J3p6j43P8J28j33P2R3k01k78M04k05N6q3K71l1k44K88J94
5695B67k00j41J49J08l70oK07LJ35l5k92K08N6l11L84m8j7o2O8j8n8J32k05L33
5719B87j46k34mK3J06J29k20K37k67J48j06N0q6r9J40j9J5l5P3j18L38j82q3k18
5743b71K36r0J38k2l5K39k22m8K6Q7LJ15M1j34j12R0K71l84K94l01J31J84l35
5766i9L52k23O5j84k15J41J37J8K0j3m2q2J64j12L8o7J45j94K67n2n2j32J94q8
5790a4O0j07J83k2k92P6J7J2N4N4l9n7J23o7r0P1kK9L9k18j71M61pk03J83q2P5
$$ plain form
5817 66 141 125 -185 20 -7 -41 30 66 99 145 58 52 -106 -131 -50 109 -67 80 166 199 -80 -64 -90 136 86 -33
5843 -33 8 -186 -51 -74 -116 4 67 -318 -154 -109 -81 -273 90 -175 -130 92 51 -164 -17 114 27 93 -241 1
5867 1 -8 -12 -50 246 165 -63 -86 2 10 89 -38 215 189 97 -42 -23 98 -75 23 -4 -290 63 -168 112 169 -131
5893 -131 -219 134 -82 211 12 -112 -66 -122 -45 -191 -40 32 -168 -166 16 -55 -50 38 28 -125 10 -127 66 179
5917 179 119 9 181 203 -143 52 276 8 154 54 -13 -28 161 41 163 246 -172 -112 21 -121 -56 -51 -57 103
5941 103 -227 29 27 -18 -6 108 -122 6 97 -77 -16 -157 13 -194 114 58 74 -138 -114 -41 -117 99 36 82
5965 82 -64 -109 -3 -83 -61 184 132 173 110 -49 256 -80 156 -39 22 203 115 314 -119 -67 -20 184 101 76
5989 76 68 148 210 -84 -130 -129 123 83 -38 -12 -58 -268 -138 205 -58 -77 0 73 -79 15 -161 165 70 -122 -128 5
$$ packed form
5817F6P5j6l10K05k7l4P1L6L3M6q7oj58k5Q1J59j76J47Q6L3k79J6k6K26n0j19
5843c3M1j94J35k3m2J20O3l85J64M5K8j92L63k65M5K22m1k15J47J31q7O6l34K42
5867Arml8K96q1k28k3Q8QP9j27K53k6r2j39J9J21j73R8k7k86L53k31K80N7l00
5893a31q8L53k16K93j99j24M6n6P7j46J51P2k00KJ82p1NQ8j0j53J35j37J93J13
5917A79o0j10J72K2l46J95K24k68J46j00o7j5J89j20J22Q3m18O0J33j42O5NoJ60
5941A03l30K56km5J2J14k30J28R1j74O1j41J70k07L08n6J6k12K4P3p6K16o3M6
5965H2j46m5J06q0K2K45n2M1o3j59L05l36K36j95O1J81q8J99m33N2M7K04q3k5
5989G6qQ0O2k94m6JK52m0j21K6m6k10J30L43k63j9P7P3j52R4j76L26r5j92oJ33
$$ plain form
6015 5 82 12 -349 -115 -108 -30 -40 -277 -242 43 77 17 -336 18 -171 33 84 12 -162 200 109 -145 136 -126 318
6040 318 181 21 52 -46 -160 57 -58 -75 -93 -134 -76 205 174 -63 118 10 -45 35 -104 -81 -31 119 27 188
6064 188 -18 -71 3 -11 126 -42 47 -57 107 234 -68 -136 -247 -95 161 16 -25 274 -27 56 -137 -37
6086 -37 -51 -138 -23 -32 50 83 -230 99 182 -178 59 -11 138 49 -234 30 78 183 238 44 -19 132 -35 -46 146
6111 146 56 42 -97 -9 -279 15 260 -121 -133 17 203 58 165 -221 96 183 -73 -269 -93 -175 82 4
6133 4 -44 225 43 47 -35 101 -74 -5 9 -192 -104 -6 10 110 39 -18 114 -186 31 -2 92 -37 68 1 -127
6158 -127 -282 -42 74 -17 -75 -37 88 -202 -186 -30 -80 -40 -36 28 -115 272 34 -77 -84 30 -219 -136 108 -99
6182 -99 -148 -96 175 91 -56 -63 96 -14 -91 156 71 -82 10 56 -193 97 46 -62 139 -173 66 -75 165 -40
$$ packed form
6015EP7p0l61K34PP8j0k37L5K85L4o0l53L54j89K04N1p2j74L62r1k54K81k62M44
6040C18j37j60L1r8j14K17j15j7j8m1N8K81l1k37J81j08n5Q0j39K3N0J50r2J61
6064A88k06n3P4j4J37j68Q9j04J64J27l02o8j11J52K56j45m1K99l01Q3j93J00
6086c7j4q7J15rQ2L3l13L29Q3l60K37p0J49q9k83K64M8J05N5j94o3J51j67j1J92
6111A46r0j4j39Q8k70K94K45l81j2J50J86j45J07l86L17Q7k56j96J76q2K57p8
6133Dm8K69j82Mq2J36j75O9J4k01Q8R8J6J00p1n7J32l00K17l3R4j29J05o7j28
6158a27j55K40J16r1n8L8J25k90J6J56n0M0MO4j43L87k38j11pJ14k49Q3K44k07
6182i9m9N2K71q4j47pJ59j10p7K47q5j53R2M6k49K90n1j08K01l12K39j41K40k05
$$ plain form
6206 -40 29 -156 -202 -155 -320 -3 251 116 -96 -191 144 -90 34 -84 -194 110 -115 -3 97 53 -39 34 8
6229 8 91 -48 188 -6 -18 -59 -75 115 -84 152 271 43 -133 87 19 -190 -79 -38 32 46 -300 161 89 192
6253 192 126 66 145 -68 149 104 179 142 -60 -9 137 -10 -64 29 -86 -47 -15 137 135 172 -93 27 -340 -144 190
6278 190 15 -76 -55 -105 55 92 57 -130 -76 -132 -64 -47 -8 -75 63 -29 -184 180 -29 11 -58 58 68 79 -82
6303 -82 -93 -10 -18 -122 72 -14 -225 -153 -37 72 228 48 -149 198 21 12 110 -73 33 116 -75 30 116 -233
6327 -233 -7 43 73 -46 1 111 -126 6 -48 -97 53 -43 -27 -113 19 -108 11 63 8 -193 -156 146 -14 -183
6351 -183 -182 11 88 101 22 -308 98 251 -29 -5 177 52 126 99 -99 144 189 112 -18 -3 124 -4 -213 10
6375 10 197 -137 187 163 47 79 -178 15 -160 128 -42 109 -27 208 239 -3 -117 -109 174 -186 -113 -48 138
$$ packed form
6206d0O9j85m6M7j65L17K54j35k12r5L35k34J24j18j10L04k25J12J00m4r2P3k6
6229HQ3j39K36j94j2m1j6J90j99K36J19k28j76K20o8k09J11M1P0J4l46M61p2J03
6253A92o6o0P9k13K17m5P5l7k02N1J46j47n4R3j15L9L2J52kL7k65J20l67J96L34
6278A90j75r1K1n0J60L7l5j87N4n6O8J7L9o7J38r2j55L64k09M0o9J16J0J1j61
6303h2j1Q3qj04J94q6k11P2J16J09J56j80j97L47j77rR8j83J06Q3j91J05Q6l49
6327b33K26N0L0j19M7J10k37J32n4m9J50r6J6q6J32j27J19N2n5k01L7L02j60j69
6351a83JJ93P7J3p9l30M06J53k80K4J82j25P4k7j98K43M5p7j30J5J27j28k09K23
6375A0J87l34L24k4j16L2k57J93j75K88j70J51j36K35L1k42j14QK83l60P3O5J86
$$ plain form
6398 138 156 24 63 149 -99 -84 -52 226 34 -57 92 -183 -54 59 199 -374 -34 -17 52 242 -79 -124 45
6421 45 -154 -89 -14 -146 75 141 -46 -42 -116 -43 -2 112 -68 19 -123 -52 -19 122 -8 25 28 -212 -114 155 20
6446 20 86 171 -208 119 -109 -182 107 -169 172 -23 -101 -16 -57 272 98 58 -101 3 60 179 200 147 -27 29
6470 29 217 124 -133 163 114 -24 -215 -30 -62 81 177 115 60 -104 122 0 -313 24 48 -124 -167 -107 107
6493 107 31 -119 2 218 88 95 51 -94 -130 4 -222 75 173 116 91 -291 139 -195 259 -150 -256 -190 -29
6516 -29 19 -75 300 168 68 2 -10 62 -151 -140 139 92 0 -21 -100 -129 86 230 -35 93 2 31 -33 -108 178
6541 178 -28 132 179 78 0 -120 -10 -91 -44 386 -183 56 -96 27 -159 15 68 165 149 64 50 3 -239
6564 -239 -108 193 -126 69 33 -25 -93 441 -159 60 -196 -79 53 8 -56 276 -3 -177 -96 -29 -81 -222 35
$$ packed form
6398A38J8j32L9Q6k48J5L2K78j92r1J49k75J29J13J40n73L40J7O9J90l21m5J69
6421D5j99O5P5j32K21O6j87Mp4P3M1J14j80Q7j42P1L3J41j30L3Lk40R8K69j35
6446B0O6Q5l79L27k28p3K89k76L41j95p8Q5m1L29j74m0j59J04N7J19K1n3j74N6
6470B9J88r3k57K96m9j38j91J85l2J43R6o2n5j64K26j22l13L37K4j72m3O0K14
6493A07p6j50J21K16j30Pm4j45l6J34k26K97R8n7k5l82M30l34M54m09j06O6J61
6516b9M8r4L75j32j00o6j2P2k13J1K79m7r2k1p9k9K15J44k65J28r1K9o4p5K86
6541A78k06J60M7j01p8j20J10q1M7M30n69K39j52J23j86J74N3R7j6q5j4m7k42
6564b39J31L01l19J95l6n8o8N34o00K19k56J17J32m5o4L32k79j74Q1O7n2j41K57
$$ plain form
6587 35 -46 139 19 16 48 192 -247 191 133 11 216 -118 120 83 67 -177 49 126 -125 -140 -73 137 26 -234
6611 -234 -50 72 97 -10 -43 -204 9 -133 -11 -342 64 -1 11 -149 36 -51 -105 126 -270 16 45 133 32
6634 32 49 -153 -2 113 -3 -97 -136 134 -43 -142 -64 -80 -14 -61 50 31 -228 159 108 77 134 -78 165 95 -6
6659 -6 109 -10 158 -1 -259 4 -19 17 11 -191 103 -70 110 72 185 193 70 -142 -68 167 -112 43 121 -4
6683 -4 24 4 186 -337 284 97 -120 -17 159 30 308 -32 -104 30 -130 104 -41 -158 -43 -90 -25 -136
6705 -136 -74 237 -24 89 -73 156 -73 -67 -39 -275 219 51 -12 30 -161 128 147 24 281 35 22 126 76
6728 76 193 54 -60 -39 200 -47 -175 8 -14 -49 3 82 220 7 -83 -201 3 19 25 48 -49 303 -246 131
6752 131 152 -99 -8 -10 -58 -68 -2 7 161 27 -164 57 -2 -109 15 -23 29 -74 -116 40 -4 53 -189 -139 -144 -146 151
$$ packed form
6587C5q1J85j20lL2J44m39M38n8j22K05l34K38l7j6k44K26P7k51j5O7K10j11k60
6611b34J84J22K5j07l3j61K13j42J22l31M06o5J2j60J85q7n4K31l96K86K9Q8j01
6634C2J7k02J51J15j16r4l9K70j77r9P8j6O6m7J11j9k59L87n1l1N7k12K43p0j01
6659fJ15j19J68j59k58K63k3L6ok02K94j73J80l8J13Qj23k12P4K35k79J55P8j25
6683dK8k0J82n23O21j87k17J03J76j29K78l40p2J34j60K34j45j17J15m7O5j11
6705a36O2L11k61J13j62K29k29OK8k36M94j68o3M2j91K89J9j23K57k46j3J04n0
6728G6J17j39j14K1K39k47j28J83k2l5N2P9J38k13r0j18K04J6OK3r7L52n49L77
6752A31K1k51R1km8j0O6RJ54j34j91K21n9j07J24l8N2j03m2J56m4N7k42N0nkK97
$$ plain form
6779 151 105 52 79 -157 323 -49 -157 -83 134 -72 -86 10 -2 -53 -57 228 -186 74 69 -103 21 86 -112 58
6803 58 -75 -33 -1 138 -3 -138 -62 -37 -251 158 -49 83 99 -34 216 48 -34 34 -29 -174 63 47 4 -40
6827 -40 -40 37 -112 -176 -226 71 -136 69 -31 -75 -103 -265 -43 132 55 -20 8 -101 59 -84 -34 -140 19 76
6851 76 77 167 4 -8 119 -73 -182 -85 -326 -106 53 312 -122 -56 207 -21 -17 -214 -130 204 -198 -103 140 150
6875 150 -85 41 -335 53 -46 90 130 335 -57 63 264 -46 -201 -119 -27 32 -66 60 -77 177 36 15
6897 15 18 19 -214 -70 98 24 0 -185 19 163 -116 -45 -11 -54 -84 -242 25 -227 58 91 -179 -108 -46 -95 260
6922 260 36 -69 45 93 -154 67 -70 58 63 74 167 15 81 22 154 37 46 118 170 -93 -68 -89 36 153
6946 153 204 24 36 -285 -54 109 -217 75 17 -125 -126 120 -69 32 37 -51 65 81 -75 23 20 105 46 66 -15
$$ packed form
6779A51m6n3K7k36M80l72j08P4K17k06j4R6j2n1mK85m14K60nj72J24O5j98J70
6803E8j33M2L2J39j41j35P6K5k14M09k07J32J6j33K50j68q2O8o3j45K37j6m3m4
6827d0%P7j49o4n0K97k07K05j00m4k8j62K22J75p7p5K8j09J60j43N0j06J59N7
6851G6JR0j63j2J27j92j09R7k41K20J59K59m34O6K63k28Mj97Q4L34m02R5K43J0
6875A50k35J26l76L88r9J36M0K05l92J20K01l10j55Q2R2N9r8J26j37K54j41k1
6897A5LJk33J44J68p4k4j85K04J44k79P1L4m3l0j58K67k52K85L3k70P1O2m9L55
6922B60k24j05J14M8k47K21j37J28NJ1R3j52O6n9J32j17RP2N2k63K5k1J25J17
6946A53N1j80J2l21K31J63l26K92n8j42jK46j89J01Nq8J16J6j56R8lQ5n9K0q1
$$ plain form
6971 -15 -110 -30 5 151 -152 -123 -80 82 -38 -3 25 -207 -85 18 178 141 -245 -126 -75 33 -156 106 -169
6994 -169 -386 165 1 -53 280 -72 40 -123 185 132 -137 -116 6 30 87 -35 148 35 -83 -102 -194 -121 -82
7017 -82 -116 68 42 -175 12 -67 -93 -26 140 -43 -73 12 148 -7 177 76 168 -218 263 114 77 -95 -148 186
7041 186 -35 -210 125 -207 184 61 -82 117 -33 -195 -257 404 191 181 118 -15 -142 -88 56 -99 -156 -27
7063 -27 -42 348 133 -176 143 10 -76 -143 -86 -13 81 -285 -58 21 225 -33 98 -99 -118 119 -209 -72 138
7086 138 -23 60 147 120 -10 51 354 238 71 -108 184 160 132 -63 295 -162 26 3 -37 214 -21 18 -27
7109 -27 -70 -32 6 38 0 213 -41 283 67 -49 43 102 -18 176 112 -27 -60 100 -78 -208 -107 -29 24 83
7133 83 -92 19 -52 -68 153 160 123 3 -5 167 -22 -248 -98 -136 105 -244 -217 -66 -83 -177 47 99 -128 317
$$ packed form
6971a5r5Q0L5J46l03K9M3J62j20L5K8k32J22J03J60l7l86J19N1J08j89K62k75
6994a69k17N51j64n4L33l52J12j63L08n3k69K1J22K4N7j22J83j13j18j9r2P3L9
7017h2l4J84k6k17J87p9k6O7J66j83l0Q5J36j55J84j01R2l86M81j49l7j72n3L34
7041A86k21j75L35l32L91j23j43J99j50j62o2O61k13j0o3j33j27N4J44j55n7J29
7063b7j5L90k15l09L19j33q6o7N7P3R4l66K27P9K04k58J31j97j9K37l28J37K10
7086A38j61Q3Q7k7j30O1L03j16j67j79K92k4k8j95L58m57J88k3m0K51k35L9m5
7109b7m3L8L8L2l8K13k54L24k16j16R2N9j20J94o4j39l3J60j78j30J01P8N3N9
7133H3j75J11p1j6K21Pl7j20qJ72j89k26J50l8K41l49K7J51j7r4K24N2k27M45
$$ plain form
7157 317 -2 81 146 -7 -126 127 -103 -174 -260 127 61 -73 -93 82 17 -155 -38 -57 14 186 -115 -11 -91
7180 -91 82 28 -23 138 103 94 -19 111 112 75 -103 21 0 300 224 -206 -3 -53 26 -114 -125 -164 38 141 20
7205 20 195 91 -132 -6 24 65 -143 -7 27 -17 -11 -28 -43 280 34 -92 37 88 43 41 -34 14 134 -34 90
7230 90 54 94 -178 46 -22 125 -58 173 7 -160 -190 -226 -116 -120 153 255 -264 -146 30 -130 102 -88 -22
7253 -22 -102 -4 -162 76 90 174 -59 -12 64 252 78 86 -43 -141 136 8 21 77 120 -51 -240 44 47 -43 80
7278 80 -1 -89 13 -53 -66 -85 -145 81 -101 -58 46 23 39 53 -266 263 132 136 298 -78 210 61 -163 -15
7302 -15 -52 -115 208 121 -4 -9 3 -105 26 -47 -330 235 -155 -1 -212 -67 -85 -256 41 154 -64 90 -115
7325 -115 181 -76 58 -85 -195 61 -81 -64 -16 218 11 46 115 145 18 125 -242 -71 -54 52 176 -103
$$ packed form
7157C17l19Q3O5j53j19K53k30p1q6L87o6j34k0J75o5j72J17j9P1J72l01J04q0
7180i1J73n4n1J61l5rj13J30Jl7j78J24k1L00p6m30K03n0P9j40j1l9K02J03j21
7205B0J75j04k23J26L0M1k08J36L4m4Oj7j5L23k46j26J29N1m5kp5M8J20j68J24
7230I0l6M0k72K24o8J47j83K31j66j67l0l6J10mK73J02n19J18J76j60K32j90O6
7253b2q0R8j58K38J4Q4k33M7P6J88j74Qj29r8K77j28J3N6M3j71j89K84Lr0J23
7278H0q1q8J02o6j3j9o0K26j82M3J04k3J6J4l19N29j31MJ62l76K88j49k24J48
7302a5l7o3L23q7j25nJ2j08J31p3k83N65l90J54k11J45j8j71K97J13k18J54k05
7325a15K96k57J34j43j10K56j42J7M8K34k07L5O9L0j27J07l67J71J7J06J24k79
$$ plain form
7347 -103 -62 11 36 102 100 -113 -95 -14 47 -41 -237 268 -161 -35 212 -117 -151 -119 -81 -222 -33 -62 157 49 9
7372 9 153 1 -72 59 30 353 144 -57 -59 102 -105 -71 91 -371 -53 -67 -39 -67 55 211 26 -6 -16 24
7396 24 69 155 133 -127 -16 24 -18 353 29 130 -62 -225 15 -165 44 90 -7 156 -278 73 -150 72 279
7419 279 306 -64 22 -66 -77 182 -31 -207 134 291 35 72 -173 -80 -148 13 -100 113 -171 141 -27 46 73
7442 73 223 -104 30 -204 128 -41 55 74 7 -132 8 -19 101 118 141 144 75 -164 -143 158 73 -242 203 101
7466 101 -74 -128 -7 -133 -44 38 70 276 262 -59 0 11 -132 -203 19 206 -127 10 77 -107 28 10 249
7489 249 287 7 -70 -48 30 164 -151 -159 38 22 -150 174 248 -30 44 81 57 -72 -37 -16 90 -130 75 -145
7513 -145 0 -155 -175 -89 123 21 21 -158 259 74 -65 51 28 180 58 -199 141 -139 -95 -110 41 45 -150
$$ packed form
7347a03M1P3K5O6kk13J8Q1O1q8j96N05m29J26K47l29l4L2L8j41J89k9K19j08m0
7372IJ44j52p3J31k9L23k09k01kJ61k07L4J62m62L18j4K8k8J22J56j85l2j0M0
7396B4M5Q6k2k60J11M0m2L71l24J01j92j63K40j80K09M6r7J63m34L51k23K22K07
7419B79K7l70Q6q8j1K59k13j76L41J57k56L7k45R3o8J61j13K13k84L12j68P3K7
7442G3J50l27J34k34L32j69R6J9o7j39J40k7J20J7K3Lo9k39K1L01q5l15M45j02
7466A01j75n4J21j26Q9Q2L2K06j4l21N9J1j43p1K22J87l33J37O7j84J35j8K39
7489B49L8k80p7K2P8J34l15qJ97j6j72L24P4k78P4L7k4j29L5K1J06k20K05k20
7513a45J45j55k0Q6K12j02%j79M17j85j39J16k3J52j22k57L40k80M4j5J51Mj95
$$ plain form
7536 -150 58 111 58 -68 -193 -66 -192 98 9 -86 -79 183 -98 76 68 13 -100 175 67 39 246 -83 63
7559 63 148 129 -58 16 -57 73 -123 -35 117 -8 53 8 -33 75 -115 -173 97 350 -154 -155 -79 157 -27 -426
7583 -426 -81 83 63 0 29 85 146 38 243 -1 -216 -105 62 49 125 -19 -36 -154 -116 -115 -174 -3 13 -157
7607 -157 -218 -101 94 6 -184 -5 119 71 -77 21 -71 94 20 -10 -145 -36 -202 103 -16 -339 96 188 24
7630 24 -18 118 78 46 -20 55 162 -109 -28 8 -44 -319 41 151 -69 -99 179 -15 73 -139 7 -176 76 -266
7654 -266 213 -185 123 -26 18 51 83 -98 3 163 86 105 65 61 -34 64 142 -124 111 -86 7 150 -200 51
7678 51 139 -6 -199 3 -41 -95 93 77 -239 -54 -121 -1 -139 120 -138 327 -18 146 99 185 114 111 183 -237
7702 -237 80 -29 -47 6 -259 6 228 11 215 214 -99 124 55 -126 161 -65 -110 45 -59 -204 -20 -53
$$ packed form
7536a50K08N3n3j26j25J27j26K90q9r5PK62k81J74qn5j13K75j08k8K07l29J46
7559F3Q5j9j87P4p3J30j96Q8J52j25O1m5m1J08j90n8K70K53n04jP6K36j84l99
7583d26L45J64k0o3K9N6O1j08K05k44k15J11J67j3P6j44j7j18L8Jn9J71J6j70
7607a57o1J17J95q8j90J79J24m8j48R8r2J65p4l0j35J09j66L05j19l23M35R2j64
7630B4m2J36m0l2o6P5J07k71Q1L6n2k75L60J10k20l0K78j94Q8k12J46j83K52l42
7654b66M79l98L08j49M4L3L2j81J01J60p7J9m0mr5R8P8k66K35j97R3J43l50K51
7678E1Q8j45j93K02m4n4J88j6l16J85o7J20j38K59k58M65l45J64m7Q6p1lP2m20
7702b37L17j09j8N3k65K65K22k17K04jl13K23o9j81K87k26m5J55j04j45J84l3
$$ plain form
7724 -53 10 -10 170 -116 73 -118 79 -35 92 -113 45 127 -319 -84 -21 -130 169 16 -42 -20 -6 -109 28
7747 28 -89 -156 113 41 -41 140 -80 -139 -72 16 -167 166 -220 134 117 -68 -23 -56 -75 -107 54 -4 -1 42 -43 78
7773 78 83 -278 -54 16 -242 -14 295 -115 -152 -97 7 101 86 -120 40 56 51 -100 -34 -121 -100 -253 -139 197 108
7798 108 -39 112 264 112 129 288 28 -194 88 43 28 19 42 34 -16 -222 78 182 -73 109 119 -71 119
7821 119 172 129 86 -146 -101 -14 206 -116 195 17 -62 105 88 -60 79 241 -235 -146 -295 -31 143 296 -241
7844 -241 80 349 53 -64 -3 -69 -21 -65 -52 168 15 -19 78 -26 11 -37 68 107 210 157 20 157 -108 -17
7868 -17 22 -271 -51 -77 -100 -81 -30 76 -36 -49 66 42 49 94 -212 -272 -96 181 -62 94 -300 -44 1 63 3
7893 3 107 -143 197 -325 -129 70 282 -10 34 57 80 4 10 44 -72 158 211 -91 -205 188 -78 -179 158
$$ packed form
7724e3O3k0J80k86J89j91J97j14J27k05J58Q2m46K35O3j09K99j53n8K2J4j03J37
7747B8j17o7K69p2q2J81k20n9O7Q8j83L33l86L54j7j85M5l3j9l2J61n8LM3q5J21
7773G8Nl61K24P0k58K28L09m10l7N5J04R4j5k06J60J6nj51O6q7K1j53J14L36q9
7798A08j47J51J52j52J7J59k60k22K82m5j5rK3qn0k06L00J04k55J82J0j90J90
7821A19N3m3m3k32M5Q7K20l22L11j78p9J67j7j48J39J62m76Q9j49K64J74J53n37
7844b41L21K69k96j17O1o6M8m4J3K20j53l4R7j04L7m8J05L9J03n3j37J37k65R1
7868a7L9k93K20k6k3J9N1J06j12j3J15k4PM5l06o0J76K77k43J56l94K56M5O2o0
7893CJ04k50L40n22J96J99K12k92M4K3K3p6OL4j16K30N3l02j14L93k66j01L37
$$ plain form
7916 158 -50 -68 -126 -252 -60 -79 49 -93 -238 77 -354 -104 77 -283 104 21 -116 141 -124 -49 -84 13
7938 13 185 -113 -250 -55 194 48 -18 206 172 -109 49 -53 -136 36 123 -179 -124 172 -148 -84 15 42 -17
7961 -17 -4 -201 156 -199 7 124 -24 -180 -36 -141 11 90 -87 -82 41 -40 -2 76 -5 -67 60 -174 237
7984 237 177 71 -170 -140 -123 -192 -110 46 54 156 -133 -21 -19 -42 -99 43 -102 39 -139 42 128 -195 -60 -6
8008 -6 -25 -159 19 -208 -252 47 -40 38 -8 19 60 -64 79 171 -25 -39 -35 -55 90 21 66 48 -200 92 -61 318
8034 318 -322 -114 -23 -121 20 51 33 6 231 202 -104 45 94 94 34 -124 -209 283 -129 -255 220 37 172 98
8058 98 163 -34 -140 -213 -48 137 -50 70 58 -152 -120 -100 42 22 -99 204 -110 173 141 118 127 50 -90 -16
8082 -16 160 75 62 126 63 45 41 -144 2 117 76 80 -47 334 49 13 -183 42 -150 -132 -139 147 -101 -103 -173 -38
$$ packed form
7916A58k08j8n8j26J92j9J28j42j45L15m31K50J81l60L87q3j37K57k65P5l5R7
7938A3J72k98j37J95K49j46o6K24l4k81J58j02q3J72Q7l02N5K96l20O4R9K7n9
7961a7J3j97L57l55K06J17j48j56J44j05J52P9j77NJ23q1L8P8q1o2J27k34M11
7984B37o0j06k41L0J7o9Q2J56QJ02k89J12Kk3n7J42j45J41j78J81Q6l23J35N4
8008fj9j34J78k27m4K99q7P8m6K7M1j24J43R2j96j4Mk0J45o9M5j8k48K92j53L79
8034C18o40K08R1r8J41L1j8k7K25k9l06J49M9%o0j58q5M92m12j26M75j83J35p4
8058I8O5j97j06p3J65J85j87J20j2k10L2K0J42k0j21L03l14K83l2k3Rp7j40P4
8082a6J76q5j3O4o3j8mj85J46J15m1Mj27L81k85l6j96K25j92J8pK86k48kp0J35
$$ plain form
8108 -38 -116 98 -32 -115 15 -18 -158 -121 22 -201 131 26 128 111 -17 -341 59 344 48 18 92 -15 9
8131 9 -132 156 26 114 205 47 6 48 -152 -229 -181 -184 175 64 -200 -12 -116 101 217 -97 46 -14 83 63
8155 63 186 -183 -48 -243 -55 -54 -34 36 -78 -91 266 161 42 10 -181 72 191 9 -176 38 -39 -24 15
8178 15 -288 114 48 -263 -160 -132 25 42 79 33 -70 7 94
$$ packed form
8108c8p8K14j30q3J30l3j40L7J43k23L32j05J02j7j28l24M00K85k96l0P4j07K4
8131Ij41K88j30Q8R1j58m1M2k00p7M8lL59j11k64J88j04K17J16l14J43o0R7k0
8155F3J23l69J35j95J88JK0P0j14j3L57j05j19l2j91K53J19j82j85K14p7J5L9
8178A5l03M02o6l11J03K8J57J7L7m6j03P7Q7
8191I4
$$ Imaginary data points
##PAGE= N=2
##DATA TABLE= (X++(I..I)), XYDATA
$$ plain form
0 0 0 0 0 0 0 0 0 0 0 0 0 0 8 -8 8 -8 14 -16 16 -24 24 -32 40 -46 48 -62 72 -80 94 -105 120 -136 160 -176
34 -176 200 -225 254 -284 318 -353 394 -437 484 -536 594 -655 724 -796 877 -968 1065 -1174
52 -1174 1294 -1429 1580 -1749 1944 -2170 2428 -2738 3113 -3574 4160 -4935 6008 -7595 10201
67 10201 -15202 28339 -140013 -303765 -6042 131215 106945 15853 9199 49938 45039 -14838
79 -14838 48960 73377 -33545 -72983 308 6080 -21869 -22204 41851 102917 6398 -130526
91 -130526 -21958 149015 113504 -17851 -79844 -54696 10190 3177 -5650 58681 17777 -120432
103 -120432 -108902 -345 32557 4753 -29601 -9387 42492 -3077 -39343 55023 74220 -40911
115 -40911 -81078 -23397 33956 33441 -24727 -3965 85357 32246 -70851 -16104 71347 57953
$$ packed form
0@%%%%%%%%%%%%Qj6J6j6K2l0L2m0M8n6P2q6R4j10J34j52J74j99K25k56K96l36
34a76L76m25M79n38O02o71P47q31R21j020J130j249J379j520J673j845K033k239
52a174K468k723L009l329L693m114M598n166N851o687P734r095J0943j3603J7796
67A0201k5403M3541j68352j63752K97723J37257k4270r1092o654M0739m899n9877
79a4838O3798K4417j06922l9438P3291N772k7949l35O4055O1066r6519j36924
91a30526J08568J70973l5511j31355o1993K5148O4886p013q827O4331m0904j38209
103a20432J1530J08557L2902k7804l4354K0214N1879m5569l6266R4366J9197j15131
115d0911m0167N7681N7353n15n8168K0762Q9322n3111j03097N4747Q7451j3394
$$ plain form
127 57953 -3747 -53542 -22206 36088 9243 9075 67803 15752 -67220 -20654 46116 29962
139 29962 -46582 -99796 -16429 76203 -8757 -94706 -34147 22487 13826 -11528 -36649 -9466
151 -9466 21495 2612 36953 74618 -1813 -44162 24092 50939 -237 -63706 -64305 34743 66567
164 66567 -41452 -65091 32756 74504 53641 19463 -12361 816 4718 -12315 29737 32437
176 32437 -57725 -71311 -3807 11817 -9744 -34567 -29538 21173 2991 -55519 4185 79748
188 79748 39878 -14134 -25737 -12033 15284 -8676 -33900 12520 5888 -61472 -36220 31601
200 31601 48443 41525 10489 -8743 14206 2024 541 63196 47231 -46768 -58938 -6586
212 -6586 34218 30797 -35311 -54642 3644 -3147 -41716 -3123 29601 18799 7073 -17768 -13937
$$ packed form
127E7953o1700m9795L1336N8294k6845j68N8728n2051q2972M6566O6770j6154
139B9962p6544n3214Q3367R2632q4960q5949O0559N6634q661k5354k5121K7183
151i466L0961j8883L4341L7665p6431m2349O8254K6847n1176o3469n99R9048L1824
164F6567j08019k3639R7847M1748k0863l4178l1824J3177L902j7033M2052K700
176C2437r0162j3586O7504J5624k1561k4823N029N0711j8182n8510N9704P5563
188G9748l9870n4012j1603J3704K7317k3960k5224M6420o632o7360K5252O7821
200C1601J6842o918l1036j9232K2949j2182j483O2655j5965r3999j2170N2352
212f586M0804l421o6108j9331N8286o791l8569L8593L2724j0802j1726k4841L831
$$ plain form
225 -13937 18621 6726 8829 37360 -14904 -69379 -21675 37260 47154 10161 -51486 -35052
237 -35052 27486 11672 -10025 17786 9676 -9550 372 3523 23591 32322 -5851 -3808 18447
250 18447 -24593 -40535 7597 24061 8839 -21025 -46210 -1167 40337 4221 -6339 13475
262 13475 -7887 -13164 6672 8793 18416 3849 -33499 -10234 12010 -21757 -17592 10441 -186
275 -186 -5966 -7880 -5985 32868 33317 -8960 5715 24871 -4511 -9560 -654 -2058 8367 -12755
289 -12755 -38978 -4505 9687 -14248 -867 5563 -12125 -120 9224 10367 26813 5673 -14652
302 -14652 21264 23556 -14126 -13311 -3712 -55 7539 -20004 -31708 7912 11078 -7213 7548
315 7548 2473 -8106 11096 10133 5780 13747 -9817 -13728 17230 -142 -25302 -7802 -3392 -4852
$$ packed form
225a3937L2558j1895K103K8531n2264n4475M7704N8935R894l6993o1647J6434
237c5052O2538j5814k1697K7811q110j9226R922L151K0068Q731l8173K043K2255
250A8447m3040j5942M8132J6464j5222k9864k5185M5043M1504l6116j0560J9814
262A3475k1362n277J9836K121R623j4567l7348K3265K2244l3767M165K8033j0627
275a86n780j914J895L8853M49m2277J4675J9156k9382n049Q906j404J0425k1122
289a2755k6223L4473J4192k3935J3381O430j7688J2005R344J143J6446k1140k0325
302a4652L5916K292l7682Q15R599L657P594k7543j1704L9620L166j8291J4761
315G548n075j0579J9202r63m353P967k3564l911L0958j7372k5160J7500M410j460
$$ plain form
329 -4852 -460 -19780 -9448 24153 9183 -455 19664 9030 1799 14369 3154 3243 7688 -19906
343 -19906 -16410 7509 -10341 -14205 4719 -3426 -1187 8735 -2047 12721 25026 -2274 -484
356 -484 15722 -3951 -8326 -1822 -15165 -8987 -7986 -29087 -12315 6020 -10832 -2971 9939
369 9939 -1957 7059 13564 1779 14818 12995 -11758 1922 12592 -5201 423 3096 -8056
382 -8056 5452 4830 -9240 8478 9666 -8952 4968 7804 -7831 2424 1642 -7828 6277 -2944
396 -2944 -18127 3879 5358 -10762 -1902 -5993 -12592 4579 -3053 -14309 3246 -2528 -11016 9101
410 9101 5153 -3774 12199 6996 1997 14781 1158 -4721 13534 646 -11618 1925 -4356
423 -4356 -4969 9390 -2377 -2320 16244 5228 2644 18271 5689 806 8413 -9163 -12522 -2686
$$ packed form
329d852M392j9320J0332L3601j4970r638K0119j0634p231J2570j1215Q9M445k7594
343a9906L496K3919j7850l864J8924q145K239R922j0782J4768J2305k7300J790
356d84J6206j9673m375O504j3343O178J001k1101J6772J8335j6852P861J2910
369I939j1896R016O505j1785J3039j823k4753J3680J0670j7793N624K673j1152
382h056J3508o22j4070J7718J188j8618J3920K836j5635J0255p82r470J4105r221
396b944j5183K2006J479j6120Q860m091o599J7171p632j1256J7555n774q488K0117
410I101l948q927J5973n203m999J2784j3623n879J8255j2888j2264J3543o281
423d356o13J4359j1767N7J8564j1016k584J5627j2582m883P607j7576l359R836
$$ plain form
437 -2686 -18913 -19690 -8293 -22448 -17581 798 -6315 -428 12736 2684 10563 21245 3397
450 3397 5671 14408 -3198 -3294 581 -14106 -5193 5528 -8115 156 9492 -802 12186 20599
464 20599 5276 11202 12971 -3551 3088 2953 -15289 -7211 -4689 -19446 -8544 -3394 -12710 2275
478 2275 5198 -6818 6087 6801 -5602 6198 4017 -11568 -1866 -4462 -13849 1608 333 -9607
492 -9607 5161 4584 -2516 13029 9791 550 13337 7390 -1950 10274 3573 -4166 9037 1455
506 1455 -6478 6395 -224 -5010 7129 -3422 -10876 1392 -7787 -12632 -587 -10269 -13588 -290
520 -290 -8338 -7531 8374 1118 542 12364 1825 1348 12073 -1718 -4510 4232 -8357 -6492 3902
535 3902 -7479 -3320 10868 2172 5874 14938 4038 9415 17298 533 -479 4092 -9695 -4953
$$ packed form
437b686j6227p77J1397j4155M867J8379p113N887J3164j0052P879J0682j7848
450C397K274Q737j7606r6L875j4687Q913J0721j3643Q271R336j0294J2988Q413
464B0599j5323N926J769j6522O639j35j8242Q078K522j4757J0902N150r316J4985
478B275K923j2016J2905P14j2403J1800k181j5585R702k596r387J5457j275r940
492i607J4768n77p100J5545l238r241J2787n947r340J2224o701p739J3203p582
506A455p933J2873o619m786J2139j0551p454J2268r179m845J2045r682l319J3298
520b90q048Q07J5905p256n76J1822j0539m77J0725j3791k792Q742j2589J865J0394
535C902j1381M159J4188q696L702R064j0900N377P883j6765j012M571j3787M742
$$ plain form
549 -4953 -587 -16481 -10979 -2003 -10893 -1674 4982 -5698 4533 12294 -187 3740 4490 -8802
563 -8802 -1287 -892 -16603 -9128 -4326 -11899 253 4081 -4354 8897 13576 5637 15886 13808
577 13808 852 9457 7097 -5544 1732 -1558 -10824 -223 -3280 -11734 1211 570 -6141 5760
591 5760 2755 -4168 6629 1647 -5943 5063 -2756 -11183 632 -3905 -8410 3763 -1602 -5408
605 -5408 6342 -398 -2541 10318 1031 -4986 5148 -1724 -3263 7049 -2132 -2221 9868 471
619 471 -1424 8858 -13 -292 8426 -2962 -4420 3304 -5677 -1804 7222 -7430 -8084 2862 -2898
634 -2898 911 5992 -6436 -2329 5772 -5710 -3216 2825 -8007 -4108 1119 -9708 -3819 3777
648 3777 -1621 7831 11450 -2782 3423 11814 4290 7498 4069 -9844 -1902 1327 -8922 -570
$$ packed form
549d953M366j5894N502Q976q890R219O656j0680J0231P761j2481L927P50j3292
563h802P515L95j5711P475M802p573J2152L828q435J3251M679p939J0249k078
577A3808j2956Q605k360j2641P276l290r266J0601l057q454J2945o41o711J1901
591E760l005o923J0797m982p590J1006p819q427J1815m537m505J2173n365l806
605e408J1750o740k143J2859r287o017J0134o872j539J0312r181q9J2089r397
619D71j895J0282q871k79Q718j1388j458P724q981L873R026j4652o54J0946n760
634b898L809N081j2428M107Q101j1482K494O041j0832L899N227j0827N889P596
648C777n398R452L619j4232O205Q391p524L208l429j3913P942L229j0249Q352
$$ plain form
662 -570 1510 -9714 -2510 455 -5303 6127 7484 -1592 6211 3620 -6623 4745 6581 -3276
676 -3276 352 -5600 -12548 36 66 -5706 5304 1470 -7699 2933 4531 2577 10940 1095 -8401
691 -8401 1727 -1142 -3722 8241 1206 -7286 -200 -3483 -2473 9118 1754 -2561 6373 -2064
705 -2064 -5728 6637 4204 2035 5143 -8710 -10589 2981 -790 -1238 4242 -8107 -9523 2553
719 2553 958 4365 8545 -4984 -3621 6622 -1256 742 9236 714 -425 1033 -9065 -1883
733 -1883 7340 -2841 -2997 -790 -10961 -3614 7249 1651 4030 2582 -8628 814 8814 -1298
747 -1298 1804 4222 -6016 -994 1367 -4182 5224 5449 -7029 -1177 1432 -5544 3148 5384 -3103
762 -3103 1588 -426 -6511 4382 4370 -5088 1689 803 -6690 1573 1670 -2076 6082 1006 -7220 2997
$$ packed form
662e70K080j1224P204K965n758J1430J357r076P803k591j0243J1368J836r857
676c276L628n952o948J2584L0n772J1010l834r169J0632J598j954Q363r845r496
691h401J0128k869k580J1963p035q492P086l283J010J1591p364m315Q934q437
705b064l664J2365k433k169L108j3853j879J3570l771m48N480j2349j416J2076
719B553j595L407M180j3529J363J0243p878J998Q494q522j139J458j0098P182
733a883R223j0181j56K207j0171P347J0863n598K379j448j1210R442Q000j0112
747a298L102K418j0238N022K361n549R406K25j2478N852K609o976Q692K236q487
762c103M691k014o085J0893j2r458O777q86p493Q263R7l746Q158n076q226J0217
$$ plain form
778 2997 2515 -4138 2770 -203 -4238 4195 -571 -4565 5020 1076 -3204 5194 -498 -6779 819
793 819 -1135 -928 6608 -2454 -5538 6281 2103 -379 6989 1300 -688 5243 -3890 -4312 4868 -2161
809 -2161 -3891 1328 -8632 -9330 827 -1062 2318 5211 -6072 -2989 8396 3165 4169 7521 -2875
824 -2875 -3542 349 -6101 67 5853 -4646 -3885 816 -5037 2647 10056 2727 2765 866 -8186 854
840 854 7985 -1293 -341 -1505 -10426 -3374 2168 -1073 6118 3934 -7574 -274 5026 1181 7489
855 7489 4274 -7207 -4251 -4011 -6447 3827 2484 -7382 -1961 -1512 -3697 7282 7415 1346 5398
870 5398 -1475 -7451 4376 5550 -277 2591 -4084 -8604 2049 2265 961 7091 -965 -7000 2435
885 2435 1517 -932 4725 -2387 -6556 -791 -5865 -4953 6123 1334 -2753 2705 -1728 75 9674
$$ packed form
778B997m82o653O908k973m035Q433m766l994R585l944m280Q398n692o281P598
793H19j954K07P536r062l084J1819m178k482P368n689j988N931r133m22R180p029
809b161j730N219r960o98J0157j889L380K893j1283L083J1385n231J004L352j0396
824b875o67L891o450O168N786j0499P61M701n853P684P409p329L8j899r052R040
840H54P131r278R52j164q921P052N542l241P191k184j1508P300N300l845O308
855G489l215j1481K956K40k436J0274j343r866N421M49k185J0979J33o069M052
870E398o873n976J1827J174n827K868o675m520J0653K16j304O130q056o035R435
885B435r18k449N657p112m169N765n074R12J1076m789m087N458m433J803R599
$$ plain form
900 9674 3318 676 3680 -5736 -5599 3380 -1771 -3317 924 -5177 -2840 4443 -1028 2253 8365
915 8365 -267 -1105 3751 -2177 179 3776 -4943 -3161 662 -6536 -1544 4703 -1461 1339 4465
930 4465 -2051 2256 4903 -2685 1388 2215 -7422 -3888 -624 -6011 -584 1370 -4004 2923 4124
945 4124 -2029 5014 7085 -11 4000 2326 -5216 280 -106 -5048 1239 -788 -7885 -137 2038
960 2038 -1128 4995 2426 -2459 3801 846 -3717 4090 1304 -5044 -360 -2933 -5195 3447 1803
975 1803 -377 5453 -157 -3375 5698 3539 -694 2687 -3930 -6284 589 -3452 -3599 3794 -1879
990 -1879 -4633 2632 438 2002 7713 761 -600 3688 -3155 -2409 4449 -1462 -3885 -363 -5138
1005 -5138 -2091 4339 -1084 1094 5154 -2738 -1571 4508 -324 722 1964 -5896 -2842 1914 -4160
$$ packed form
900I674o356k642L004r416J37Q979n151j546M241o101K337P283n471L281O112
915H365q632q38M856n928K356L597q719J782L823p198M992O247o164K800L126
930D465o516M307K647p588M073Q27r637L534L264n387N427J954n374O927J201
945D124o153P043K071p096M011j674p542N496l86m942O287k027p097P748K175
960B038l166O123k569m885O260k955m563P807k786o348M684k573k262Q642j644
975A803k180N830n610l218R073k159m233L381o617k354O873m041j47P393n673
990a879k754P265k194J564N711o952j361M288o843P46O858n911k423L522m775
1005e138L047O430n423K178M060p892J167O079m832J046J242p860L054M756o074
$$ plain form
1020 -4160 278 4615 -2901 10 3823 -412 3969 4869 -2889 884 1965 -6361 -1787 1873 -3664
1035 -3664 -1098 -931 -5734 1833 3598 -1870 3478 3881 -2597 1950 2935 -1701 2203 240 -5097 2004
1051 2004 966 -5090 1902 2611 -2069 1934 385 -2170 4263 759 -4104 2063 -904 -5381 1052
1066 1052 -98 -2546 2566 -966 -2082 5252 1090 -2093 4626 1590 -2182 1854 -1932 -2664 2437
1081 2437 -3557 -4142 3075 -1636 -3312 3426 451 42 3874 -1620 -75 5212 -2067 -2291 3590 -1751
1097 -1751 -2973 1252 -2130 383 3172 -2956 27 5103 -1950 -1658 3097 -1437 -626 900 -4768
1112 -4768 -981 1854 -4514 -892 3256 -2827 -336 3271 -53 3111 2733 -3096 2701 4470 -3284
1127 -3284 -617 1966 -2515 -65 -436 -4363 1250 1217 -4244 1632 2787 -3329 1129 2391 -1127 2342
$$ packed form
1020d160M438M337p516K911L813m235M381R00p758L773J081q326M574L660n537
1035c664K566J67m803P567J765n468N348M03o478M547R85m636L904j963n337P101
1051B004j038o056O992P09m680M003j549k555O433l504m863O167k967m477O433
1066A052j150k448N112l532j116P334m162l183O719l036l772M036l786p32N101
1081B437n994n85P217m711j676O738k975m09L832n494J545N287p279k24N881n341
1097a751j222M225l382K513K789o128K983N076p053K92M755m534Q11J526n668
1112d768L787K835o368L622M148o083K491L607l324L164l78n829N797J769p754
1127c284K667K583m481K450l71l927N613l3n461N876J155o116M458J262l518L469
$$ plain form
1143 2342 -165 -3410 3920 2224 -4406 932 1469 -2211 1409 -622 -2439 2845 -558 -3960 3358
1158 3358 1106 -3181 1489 682 -1317 2190 -1388 -1856 4544 -569 -3893 2693 858 -1615 2114
1173 2114 -840 -538 3357 -2273 -1847 4920 -67 -2850 1744 -1085 -1165 2026 -2829 -1180 2835 -3419
1189 -3419 -2548 3826 -296 -1227 1987 -866 1447 3306 -2616 484 4744 -2030 -2444 1656 -1342 101
1205 101 1266 -3214 -210 1261 -4513 -154 3684 -2615 -1906 1110 -1291 2463 2012 -3098 2265 3809
1221 3809 -3001 164 2910 -749 1366 558 -3405 1272 619 -4033 2109 2109 -3808 -728 1235 -165
1237 -165 3523 355 -3272 2997 1433 -3751 1214 1126 -2444 -80 -1712 -2563 2725 -132 -2737 3489
1253 3489 1243 -2828 1734 1606 -169 2169 -2051 -3190 2007 -1914 -4247 2179 200 -2288 1406
$$ packed form
1143B342k507l245P330j696o630N338N37l680L620k031j817N284l403l402P318
1158C358k252m287M670q07j999L507l578m68O400n113l324O586j835k473L729
1173B114k954L02L895n630M26O767m987k783M594k829q0L191m855J649M015o254
1189c419Q71O374m122r31L214k853K313J859n922L100M260o774m14M100k998J443
1205A01J165m480L004J471n774M359L838o299P09L016k401L754m51n110N363J544
1221C809o810L165K746l659K115q08l963M677o53m652O142%n917L080J963j400
1237a65L688l168l627O269j564n184M965q8l570K364j632q51N288k857k605O226
1253C489k246m071M562j28j775K338m220j139N197l921k333O426j979k488L694
$$ plain form
1268 1406 135 1650 5638 107 -475 4871 398 -1520 2108 -1257 -2527 -407 -4500 -2282 1915
1283 1915 -3173 -2320 3224 -516 -1340 2033 -147 2006 3148 -3388 -1140 2839 -2121 -1396 1428 -1892
1299 -1892 -515 1426 -1711 1932 3268 -2124 732 3981 -1266 -354 1261 -1278 1221 775 -3914
1314 -3914 524 2463 -2134 753 2279 -1423 680 897 -1946 1411 203 -4254 517 1056 -3292
1329 -3292 -431 586 -1373 1642 -67 -2512 2480 1203 -2683 1492 783 -2234 978 -196 -1074
1344 -1074 3645 552 -1493 3979 2398 -543 3280 1699 -661 1384 -1964 -3364 854 -2484 -4468
1359 -4468 322 -1723 -2492 955 -381 356 3858 -376 -796 3168 -490 -1415 1716 -1865 -2665 -664
1375 -664 -3156 -1063 2497 -1701 -770 3815 972 1212 3811 716 1795 2716 -2378 -792 2017 -2258
$$ packed form
1268A406j271J515L988n531n82N346m473j918L628l365j270K120m093K218M197
1283A915n088Q53N544l740q24L373k180K153J142o536K248L979m960P25K824l320
1299a892J377J941l137L643J336n392K856L249n247R12J615k539K499m46m689
1314c914M438J939m597K887J526l702K103K17k843L357j208m457M771N39m348
1329c292K861J017j959L015j709k445M992j277l886M175p09l017L212j174q78
1344a074M719l093k045N472j581k941L823j581k360K045l348j400M218l338j984
1359d468M790k045p69L447j336P37L502m234m20L964l658r25L131l581q00K001
1375f64k492K093L560m198R31M585k843K40K599l095J079R21n094J586K809m275
$$ plain form
1391 -2258 -1362 1165 -2426 -715 1409 -843 2025 2780 -2020 256 2509 -1561 -307 -24 -3332 -1437
1407 -1437 -1114 -4408 -548 873 -2729 372 1450 -1165 1846 2244 229 2896 1544 -1930 1818
1422 1818 2089 -1306 1394 773 -1627 1498 674 -1429 2291 518 -2765 499 196 -1701 903 -482
1438 -482 -2496 1023 -658 -1930 2617 689 -1815 1001 -507 -1905 1260 -1084 -2043 1119 -1922
1453 -1922 -2967 1356 304 -587 2167 -10 187 3354 854 641 3406 -305 -1508 1460 -1020 -901
1469 -901 1346 -1610 -912 1676 -1259 -79 3361 35 -205 1340 -1807 -690 902 -2643 -2025 -479
1485 -479 -3993 -2344 502 -1675 -46 1289 -804 1721 3214 -99 2086 2880 -589 235 1091 -1959
1501 -1959 155 637 -2532 -34 570 -2202 856 1958 -517 1293 1419 -652 1547 1165 -1517 807
$$ packed form
1391b258Q96K527l591J711K124k252K868P55m800K276K253m070J254K83l308J895
1407a437L23l294L860J421l602L101J078k615L011L98k015K667j352l474L748
1422A818K71l395K700o21k400L125q24k103L720j773l283L264l03j897K604j385
1438d82k014L519j681j272M547j928k504K816j508j398L165k344r59L162l041
1453a922j045M323j052q91K754k177J97L167k500k13K765l711j203K968k480J19
1469i01K247k956O98K588k935J180L440l326k40J545l147J117J592l545O18J546
1485d79l514J649K846k177J629J335k093K525J493l313K185P94l469Q24Q56l050
1501a959K114M82l169K498O04k772L058J102k475J810J26k071K199l82k682K324
$$ plain form
1517 807 219 -2680 -256 -215 -2046 536 -287 -2296 949 202 -1844 1223 620 -1442 977 -16 -1315
1534 -1315 1773 -82 -1400 1517 272 -1411 1582 355 -633 1491 -488 -995 2239 369 -884
1549 -884 1927 92 -755 1624 -876 -1048 1286 -1109 -1440 834 -1664 -2015 714 -952 -1020 974 -1230
1566 -1230 -189 2224 -130 420 2564 -302 -161 1420 -1165 -430 1133 -1666 -1197 402 -2038 -467
1582 -467 1433 -655 171 1305 -780 1117 2268 -533 607 1626 -1454 -246 457 -1717 238 148
1598 148 -2472 -116 701 -1255 840 1119 -1257 355 795 -830 1583 798 -1492 527 198 -1818
1614 -1818 500 324 -1118 415 -250 -1680 1778 1174 -537 1576 620 -1017 1140 265 -713 1188
1630 1188 -803 -2316 125 -515 -1654 708 -271 -941 1209 73 -117 2558 848 -225 1695 251
$$ packed form
1517H07n88k899K424M1j831K582q23k009L245p47k046L067o03k062K419r93j299
1534a315L088j855j318K917j245j683K993j227r88K124j979n07L234j870j253
1549h84K811j835q47K379k500j72K334k395l31K274k498l51K729j666o8J994k204
1566a230J041K413k354N50K144k866J41J581k585P35J563k799M69J599k440J571
1582d67J900k088Q26J134k085J897J151k801J140J019l080J208P03k174J955r0
1598A48k620K356Q17j956K095K79k376J612M40j625K413p85k290K019l29k016
1614a818K318j76j442J533o65j430L458o04j711K113r56j637K157q75r78J901
1630A188j991j513K441o40j139K362r79o70K150j136j90K675j710j073J920j444
$$ plain form
1646 251 -543 1305 -358 -716 385 -1746 -1809 927 -1127 -1020 824 -879 -624 1423 -263 440 1888
1663 1888 -784 -357 1079 -776 -635 925 -1049 -767 486 -1629 -258 1620 -694 137 1359 -723
1679 -723 522 1702 -421 679 768 -1550 -284 1183 -1229 -110 724 -1319 481 604 -1288 819
1695 819 1096 -965 449 675 -1106 172 310 -1161 222 -172 -2206 337 431 -1328 245 250 -1118
1712 -1118 825 251 -333 1638 975 -130 1335 1015 -176 1591 607 -573 860 -615 -1844 554
1728 554 -333 -1654 -65 -735 -1322 860 -269 -179 1756 13 -902 1029 -85 -726 517 -1034 -1141
1745 -1141 43 -1433 -962 914 -393 -332 1138 165 526 1970 311 821 1683 -379 -546 914 -497
1762 -497 -824 279 -1242 -302 1014 -580 536 1640 -410 128 1120 -341 24 414 -1495 -739 -148
$$ packed form
1646B51p94J848j663l58J101k131o3K736k054J07J844j703K55K047j686P03J448
1663A888k672M27J436j855J41J560j974K82J253k115J371J878k314Q31J222k082
1679g23J245J180k123J100Q9k318J266J467k412J119Q34k043J800J23j892K107
1695H19K77k061J414K26j781J278J38j471J383l94k034K543R4j759J573Nj368
1712a118J943n74n84J971o63j105J465l20j191J767r84j180J433j475j229K398
1728E54q87j321J589o70n87K182j129R0J935j743r15J931j114o41J243j551j07
1745a141J184j476M71J876j307O1J470r73L61J444j659N10Q62k062j67J460j411
1762d97l27J103j521R40J316j594J116J104k050N38R92j461L65L90j909P56N91
$$ plain form
1779 -148 -2353 -832 146 -1506 -465 212 -930 810 1196 -33 976 1150 -589 1001 1095 -351 323
1796 323 383 -716 787 134 -902 778 679 -614 528 36 -697 746 109 -1127 569 -145 -1204
1813 -1204 646 201 -888 168 -268 -1023 471 -550 -1335 394 -379 -1412 255 -274 -497 933 -73
1830 -73 -5 1389 330 -147 1394 185 -284 527 -454 -338 742 -431 -442 1065 -320 -261 1485 138
1848 138 302 710 -774 -147 564 -1364 -1519 -225 -1345 -1291 -468 -1041 -307 565 -625 108 1224 139
1866 139 495 1713 -24 242 503 -744 230 379 -1304 -439 668 -597 133 776 -232 909 1004 -136
1884 -136 745 737 -729 -91 147 -931 -77 -303 -1347 54 -135 -1288 374 -43 -660 406 368 -565 269
1903 269 -39 -499 596 -136 -736 624 316 -317 462 162 -87 1237 440 -141 1318 429 -356 974
$$ packed form
1779a48k205J521R78j652J041O77j142J740L86j229J009J74j739J590R4j446O74
1796C23O0j099J503o53j036J680r9j293J142m92p33J443o37j236J696p14j059
1813a204J850m45j089J056m36p55J494j021p85J729p73j033J667n29k23J430j006
1830g3O8J394j059m77J541j209m69Q11r81J16J080j173j1J507j385N9J746j347
1848A38J64M08j484O27P11j928j55J294j120N4Q23n73P34Q72j190P33J116j085
1866A39L56J218j737K66K61j247R74J49j683Q65J107j265P30O43j008J141R5j140
1884a36Q81qj466O38K38j078Q54k26j044J401j89j153J662m17o17J066l8r33Q34
1903B69l08m60J095p32o00J360l08o33P79l00k49J324p97n81J459q89p85J330
$$ plain form
1921 974 -108 -289 339 -232 -626 574 -351 -1035 326 -643 -767 465 -628 -806 228 -517 -344 1030
1939 1030 -251 -458 901 138 126 606 -680 -259 624 -425 -589 304 -587 -154 631 -338 208 775 -144
1958 -144 487 955 -347 315 648 -260 13 82 -917 -57 49 -873 -214 158 -791 208 382 -644 338 305
1978 305 -398 347 359 -661 49 155 -700 13 -128 -699 448 359 -186 871 582 62 793 464 -17 421
1998 421 50 -645 436 -155 -798 57 1 -694 389 -146 -491 498 314 -333 679 295 -171 742 -143
2017 -143 -471 497 -330 -485 312 -311 -330 467 -336 -225 306 -432 -213 603 -463 -55 879 -180 -59 648
2037 648 -25 3 470 -618 -314 201 -368 -76 269 -508 -105 362 -113 194 650 -544 38 306 -510 31
2057 31 584 -439 -13 194 -691 135 620 -552 60 349 -210 472 679 -232 161 260 -493 -205 88 -627
$$ packed form
1921I74j082j81O28n71l94J200r25o84J361r69j24J232j093j78J034p45J73J374
1939A030j281k07J359p63j2M80j286M21Q83j049j64Q93q91M33P85r69N46N67r19
1958a44O31M68j302O62L33r08K73O9r99Q60J06r22O59L72r49R99J74j026R82l3
1978C05p03P45J2j020P10J06q55P13j41n71J147q9n45J057k89n20P31l29m81M38
1998D21l71o95J081n91o43Q55n6o95J083n35l45R89j84o47J012l84m66R13q85
2017a43l28R68q27j55P97o23j9P97q03J11N31p38K19Q16j066M08R34j059J21P07
2037F48o73K8M67j088L04N15n69K92L45p77M03M67m75L07M56j194N82K68q16N41
2057C1N53j023M26K07q85Q26M85j172O12K89n59O82K07r11L93R9p53K88K93p15
$$ plain form
2077 -627 -60 123 -887 208 -134 -580 189 302 -536 580 339 -223 617 378 -247 487 84 -374 155
2096 155 17 -449 45 -171 -490 26 -138 -414 490 -64 -316 489 69 -244 510 -87 -161 212 -325 -428
2116 -428 454 -347 -384 447 -33 -260 566 -43 -5 613 -237 -158 324 45 -384 279 -508 -146 148 -283 -8
2137 -8 716 -433 -53 480 33 241 507 -33 30 187 -756 -77 217 -673 -369 -37 -622 -72 115 -543 14
2158 14 406 -372 156 406 -321 369 456 -247 106 90 -285 242 162 -294 85 173 -164 546 317 -554 301 -30
2180 -30 -404 430 100 -339 349 63 -543 350 -91 -324 512 -75 -374 -18 -167 -659 56 110 -125 276 -140
2201 -140 -281 328 -53 -243 187 -354 -61 435 -52 -189 764 161 -243 527 14 -63 491 -68 81 441
2221 441 -151 -27 286 -189 -171 -25 -426 -292 -61 -194 -200 99 -295 -416 532 -46 -38 473 -384 202 342 -348
$$ packed form
2077f27N67J83j010J095l42m46P69J13q38J116k41n62Q40k39o25P34m03m58N29
2096A55j38m66M94k16l19N16j64k76R04n54k52Q05m20l13P54n97p4L73n37j03
2116d28Q82q01l7Q31m80k27Q26o09L8O18q50P9M82k79m29O63p87L62K94m31K75
2137hP24j149L80N33m47K08K66n40O3J57r43O79K94q90L04L32n85N50J87o58N57
2158A4L92p78N28K50p27O90Q7p03L53j6l75N27q0m56L79Q8l37P10k29q71Q55l31
2180c0l74Q34l30m39O88k86o06Q93m41k33Q36n87k99L56j49m92P15N4k35M01m16
2201a40j41O09l81j90M30n41K93M96m87j37R53o03m04P70n13p7N54n59J49L60
2221D41n92J24L13m75J8J46m01J34K31j33oK99l94j21R48n78QN11q57N86J40o90
$$ plain form
2243 -348 139 132 -324 -102 -10 -493 80 296 47 336 221 -156 302 544 -195 98 128 -338 -33 -63 -432 62
2265 62 43 -496 101 107 -131 279 88 -338 121 101 -492 148 -54 -269 31 -198 -321 421 155 -149 425 -178
2287 -178 -133 227 145 -19 582 106 -106 322 -131 -141 5 -117 -111 88 -332 -1 256 -217 -455 27 -326 -207
2309 -207 221 -249 -166 300 -161 -24 389 -238 -100 214 47 -203 62 -76 -1 12 -286 -13 303 -30 -131
2330 -131 413 79 187 301 -222 -102 286 -136 -138 110 -303 -107 -10 -214 158 93 -182 -2 173 -319 155
2351 155 186 -190 -85 -41 -216 190 82 -462 12 115 152 428 225 81 401 348 7 77 79 -252 75 38 -168
2374 -168 -42 79 5 92 -116 -135 70 -36 -68 154 -11 -13 128 -138 -197 216 -97 -183 460 -68 -307 231 -110
2397 -110 -184 194 -193 -122 125 -69 -277 215 -6 -97 248 72 148 108 -337 -102 380 -83 120 365 -191 -21
$$ packed form
2243c48M87pm56K22R2m83N73K16k49K89j15l77M58K42p39K93L0m66L05l0l69M94
2265F2j9n39N97Ok38M10j91m26M59k0n93O40k02k15L00k29j23P42k66l04N74o03
2287a78M5L60q2j64O01m76k12M28m53j0J46j22OJ99m20L31K57m73k38M82l53J19
2309b07M28m70Q3M66m61J37M13o27J38L14j67k50K65j38P5J3k98K73L16l33j01
2330a31N44l34J08J14n23J20L88m22kK48m13J96R7k04L72o5k75J80J75m92M74
2351A55L1l76J05M4j75M06j08n44M74J03L7K76k03j44L20n3l41P0Kl31L27l7k06
2374a68J26J21p4Q7k08j9K05j06l2K22j65kJ41k66n9M13l13q6O43n28k39N38l41
2397a10p4L78l87P1K47j94k08M92k21r1L45j76P6m0m45K35M82m63K03K45n56J70
$$ plain form
2419 -21 141 -17 -198 208 -176 201 204 -159 175 248 -127 -20 -94 -39 -101 147 -171 -49 -1 4 22 184 -192 106
2443 106 325 -179 309 58 -35 -65 -175 -214 0 293 -252 94 270 -77 43 237 -13 31 110 -61 45 204
2465 204 -151 -59 143 -140 297 13 -211 142 39 -126 26 133 118 93 -210 5 19 52 -132 -74 33 -23
2487 -23 -74 105 75 528 -42 -130 -132 -307 -50 325 -117 -53 275 -107 120 16 -87 -137 77 -19 104 11 -79 3
2511 3 52 -24 -57 111 -54 -29 175 -66 -295 100 -68 194 151 -290 -310 -54 -125 -83 436 101 191 -17 -89 90
2535 90 98 -67 -25 76 -404 62 85 14 -65 -174 -307 157 190 127 11 113 -90 -36 -107 -49 120 187 14 -94
2559 -94 126 2 187 42 -224 3 55 -278 126 -179 213 -133 119 -220 186 -21 -27 49 185 -34 -98 150
2581 150 55 -9 -181 -168 -170 -223 -133 274 188 3 263 181 -159 59 33 34 135 -112 -274 51 250 -104 103 258
$$ packed form
2419b1J62j58j81M06l84L77Ll63L34P3l75J07p4N5o2K48l18J22M8NJ8J62l76K98
2443A06K19n04M88k51r3l0j10l9K14K93n45L46J76l47J20J94k50M4P9j71J06J59
2465B04l55R2K02k83M37k84k24L53j03j65J52J07j5k5l03K15J4L3j84N8J07n6
2487b3n1J79l0M53n70q8kj75K57L75m42O4L28l82K27j04j03n0K14r6J23r3r0Q2
2511CM9p6l3J68j65K5K04k41k29L95j68K62m3m41k0K56p1M2N19l35R0k08p2J79
2535I0Qj65M2J01m80M66K3p1p9j09j33M64L3o3j16J02k03N4p1N8J69O7j73j08
2559i4K20j24J85j45k66K27N2l33M04l05L92l46K52l39M06k07oP6J36k19o4K48
2581A50r5o4j72J3kn3R0M07q6j85K60q2l40K18k6JJ01k47j62L25J99l54K07J55
$$ plain form
2605 258 -65 173 -25 -142 266 -9 -79 -201 -46 92 161 -122 -184 -76 -70 140 21 -129 185 66 -282 -36
2627 -36 138 -219 -72 32 -331 -57 20 -99 -127 -99 -205 -12 -81 42 26 58 -62 -60 -50 2 19 -172 107 -18
2651 -18 33 -276 -20 -13 -113 -65 -92 -262 -103 -82 19 -147 122 33 -40 74 -109 148 -75 31 30 -178 126 -11
2675 -11 91 -35 -52 25 -78 -28 -36 57 129 -52 56 271 105 -64 77 3 -34 19 -119 23 19 87 208 141 202
2700 202 177 -13 -30 -31 -154 -95 -24 -11 194 -64 -189 172 129 -98 10 -25 71 43 62 -82 -75 -66 -16 28 -59 172
2726 172 46 -70 -100 75 -20 154 96 -24 157 22 -36 98 -8 141 -36 81 123 -244 -37 -190 -40 119
2748 119 -70 -24 57 83 33 -16 -111 145 -98 -175 -70 -177 -4 -116 -78 -57 42 21 25 31 -3 -67 -142 146 -157 -319
2774 -319 33 166 163 -104 204 171 -140 -114 164 89 153 -88 -37 -4 -51 46 -11 150 -115 -115 13 -186 148 96 57
$$ packed form
2605B58l23K38j98j17M08k75p0j22J55J38O9k83o2J08OK10j19j50L14j19l48K46
2627c6J74l57J47J04l63K74P7j19k8K8j06J93o9J23j6L2j20KJ0N2J7j91K79j25
2651a8N1l09K56Pj00M8k7j70J59K1J01j66K69q9p3J14j83K57k23J06jk08L04j37
2675a1J02j26j7P7j03N0qR3P2j81J08K15j66j69J41p4l7N3j38J42mO8J21o7O1
2700B02k5j90j7jj23N9P1J3K05k58j25L61m3k27J08l5R6k8J9j44PRN0M4q7K31
2726A72j26j16l0J75r5J74n8j20J81j35n8J34j06J49j77J17M2l67K07j53J50J59
2748A19j89M6Q1K6n0m9r5K56k43p7J05j07J73j12L8K1R9k1MOl4o4p5K88l03j62
2774c19L52J33lk67L08l3l11K6K78p5O4k41N1L3m7R7n7J61k65%J28j99L34n2l9
$$ plain form
2799 57 -53 71 -117 -123 40 -359 322 183 -66 321 33 -60 120 -116 -107 -62 111 -55 95 -124 61 63 -111
2822 -111 -46 130 -13 -19 33 -18 241 44 124 122 271 -56 -136 -70 57 -50 -170 157 115 19 -45 226 -30 -5 -130
2847 -130 -40 -187 -69 83 128 127 91 -13 86 -166 203 -51 63 -22 -51 164 -5 -202 -43 -186 31 -55 -155
2870 -155 -117 14 252 -102 281 -210 -122 7 -76 43 -37 148 6 2 -134 -83 222 138 24 141 -179 -130 6
2893 6 -97 182 241 -14 92 55 108 -53 -157 102 123 -99 8 11 2 -98 63 137 -28 3 -3 -56 -4 -83 -59 -80
2919 -80 -48 -66 -87 216 -101 30 -78 49 55 -127 -207 40 -62 -220 -14 158 144 -17 -24 -12 0 48 17 -151 34
2944 34 -80 70 -8 -56 -36 68 -38 30 -57 -137 58 157 -157 -74 26 -113 52 -42 -128 -233 218 -80 14 -52
2968 -52 -265 207 129 -96 49 178 -250 -106 196 -264 212 -145 -168 -39 -102 -308 91 12 -140 157 62 -267
$$ packed form
2799E7j10J24j88oJ63l99O81j39k49L87k88r3J80k36RM5J73j66J50k19J85Kj74
2822a11O5J76j43oN2n1K59j97Q0kJ49l27q0O6J27j07j20L27m2r6o4K71k56K5j25
2847a30R0j47J18J52M5jl6j04R9k52L69k54J14q5k9K15j69j97J59j43K17q6j00
2870a55L8J31K38l54L83m91Q8J29q3J19q0J85j42mj36N1L05q4j14J17l20M9J36
2893Fj03K79N9k55J06l7N3j61j04K59K1k22J07Lrj00J61P4j65L1on3N2p9K4k1
2919h0L2j8k1L03l17J31j08J27Oj82q0K47j02j58K06J72j4j61pJ2J2M8l1j68J85
2944C4j14J50p8m8K0J04j06O8q7q0J95R9l14Q3J00j39J65r4q6j05M51k98R4o6
2968e2k13M72p8k25J45J29m28J44L02m60M76l57k3J29o3k06L99p9j52K97r5l29
$$ plain form
2990 -267 12 -103 77 140 74 55 107 -127 -50 -23 48 -24 -120 8 -28 70 -223 84 -50 36 -110 45 -1 37 -192
3015 -192 20 113 171 180 118 36 -147 171 200 175 -11 76 0 -51 260 -253 146 66 22 152 67 144 -7 5 -99
3040 -99 23 59 -192 39 -221 45 39 0 103 87 -19 -185 -180 245 -66 137 217 -64 55 -41 31 71 -77 138
3064 138 141 238 -81 -113 57 14 -105 -90 -31 155 4 -1 228 -35 31 -33 -49 -76 -41 -127 144 -101 -46 54 -64
3089 -64 -176 70 82 -101 -124 298 -83 71 138 -195 -346 141 15 -108 145 -178 118 99 -11 136 -277 -258
3111 -258 -89 262 -116 172 183 -127 66 -20 226 46 133 66 -24 218 -257 212 -221 -240 153 -81 -209 -201 -47
3134 -47 -194 48 163 -37 -6 -82 -72 158 -72 -382 -127 107 -158 -86 -26 -92 252 130 2 40 30 2 -125
3157 -125 166 -40 -29 163 198 111 -62 -133 222 202 -27 -225 -139 85 142 -63 145 18 -164 -254 112 -130 53
$$ packed form
2990b67K79j15J80O3o6j9N2k34P7K7P1p2r6J28l6R8k93L07j34Q6j46J55m6L8k29
3015a92K12R3N8Ro2q2j83L18K9k5j86Q7p6n1L11n13L99q0m4J30q5P7j51J2j04
3040i9J22L6k51K31k60K66ol9J03j6j06j66NM25l11K03Q0k81J19r6P2M0j48K15
3064A38LR7l19l2J70m3j19J5N9J86j51nK29k63O6o4j6k7L5q6K71k45N5J00j18
3089f4j12K46J2j83k3M22l81J54O7l33j51M87j26j23K53l23K96j9j10J47m13J9
3111b58J69L51l78K88J1l10J93q6K46j80Q7o7r0K42m75M69m33j9L93k34j28QJ54
3134d7j47K42J15k00L1p6J0K30k30l10K55K34k65P2O0o6L44j22j28L8j0k8j27
3157a25K91k06J1J92L5q7j73p1L55k0k29j98Q6K24N7k05K08j27j82r0L66k42J83
$$ plain form
3180 53 37 -71 -41 151 -109 222 8 -158 19 94 -37 -53 -34 -43 -50 39 -30 -67 228 55 210 285 -256 -217 165
3205 165 -111 112 33 -302 173 -54 -324 96 25 -3 -87 -26 -191 75 240 123 262 -72 -182 57 44 -121
3227 -121 -140 110 -188 282 48 93 -27 -149 -74 175 -84 -91 37 126 -307 168 -36 87 82 -192 -81 144 -108
3250 -108 64 185 27 -198 201 -37 -204 136 28 -93 100 4 -64 109 61 16 93 -96 -295 148 -28 92
3272 92 315 -14 195 256 174 -35 -32 -322 -75 316 -28 -184 -180 -277 -183 71 -159 -94 -95 -94 -201 165 -149 97 57
3297 57 167 3 15 196 -29 15 -58 205 32 -202 -21 25 -99 30 135 -259 49 132 82 -133 167 -56
3319 -56 -34 -74 -289 247 118 -251 187 57 -102 171 51 -219 70 20 -177 29 146 27 146 172 -172 22
3341 22 -310 64 -137 82 -388 27 -18 -190 100 -78 -238 174 24 -181 290 -166 -374 119 9 -41 -83
$$ packed form
3180E3j6j08L0J92k60L31k14j66J77P5j31j6J9rpQ9o9l7K95j73J55P5n41L9L82
3205A65k76K23p9l35M75k27k70M20p1k8q4O1j65K66J65j17J39l34j10K39j3j65
3227a21j9K50k98M70k34M5j20j22P5K49k59pJ28Q9m33M75k04J23nk74J11K25k52
3250a08J72J21j58k25L99k38j67L40j08j21J93r6o8J73m8m5P7j89j99M43j76J20
3272I2K23l29K09O1q2k09Lk90K47L91l44j56Mr7R4K54k30O5jJj07L66l14K46m0
3297E7J10j64J2J81k25M4p3K63j73k34J81M6j24J29J05l94L08Q3n0k15L00k23
3319e6K2m0k15N36j29l69M38j30j59K73j20k70K89n0j97K06J17j19J19K6l44J94
3341B2l32L74k01K19m70M15m5j72K90j78j60M12j50k05M71m56k08M93j10n0m2
$$ plain form
3362 -83 -138 -104 305 25 5 143 -205 78 61 69 -112 193 51 -23 281 -76 113 278 -166 -69 173 55 -203
3385 -203 189 -67 2 -78 -129 -136 117 -66 79 -61 -118 101 345 -48 218 -13 -60 -93 -30 14 -140 -153 -172 201
3409 201 129 -28 -116 217 -144 159 -13 -58 -27 230 93 -4 -97 -42 225 -112 -52 104 -125 -93 101 -281 -146
3432 -146 145 -150 -154 32 -253 55 36 6 103 248 -23 68 220 -38 -141 470 169 -344 408 8 -110 154
3454 154 -93 -295 116 31 7 252 -176 3 53 73 -28 314 -317 -77 100 -60 123 -92 22 -350 44
3475 44 -200 18 60 -92 97 123 -213 -39 199 -39 -262 -21 27 -218 54 -154 125 -75 -193 -204 19 -121
3497 -121 -29 40 -114 94 -14 -81 -116 -69 11 20 124 -255 -29 -30 -191 85 33 -203 157 55 -38 102 -74 -210
3521 -210 -24 77 -105 185 263 -25 -57 -2 21 222 13 -148 74 -49 -40 255 45 -110 219 -78 149 161
$$ packed form
3362h3n5L4M09k80k0J38l48K83j7Qj81L05j42p4L04l57J89J65m44R7K42j18k58
3385b03L92k56O9q0n1pK53j83J45j40n7K19K44l93K66k31m7l3O3M4j54j3j9L73
3409B01p2j57q8L33l61L03j72m5L1K57j37r7r3N5K67l37O0J56k29L2J94l82J35
3432a46K91k95mJ86k85L08j9l0R7J45k71R1J52k58j03O11l01n13P52m00j18K64
3454A54k47k02M11q5k4K45m28J79N0K0j01L42o31K40J77j60J83k15J14l72L94
3475D4k44K18M2j52J89K6l36J74K38k38k23K41M8k45K72k08K79k00j18j1K23j40
3497a21R2O9j54K08j08o7l5M7Q0RJ04l79K26jj61K76n2k36L60j02r3J40j76j36
3521b10J86J01j82K90P8k88l2N5K3K01k09j61K22j23RK95k10j55L29k97K27J2
$$ plain form
3543 161 -143 205 293 -29 -173 138 -277 -120 -242 -52 -52 296 44 -234 267 -302 74 16 -144 -137 33 99
3565 99 8 104 -146 49 130 -47 51 -14 -147 85 -99 -161 17 223 20 6 74 -150 18 203 -31 -38 -132 -141 -24
3590 -24 46 -42 42 72 23 332 -45 -194 -127 -80 -135 27 -37 -259 49 208 -59 45 141 50 205 -4 -60 223
3614 223 96 130 177 77 -62 307 10 -204 63 116 -105 -37 3 -172 319 102 -136 165 -88 -223 173 -52
3636 -52 -46 -107 38 -251 32 -189 -267 30 43 151 317 58 84 203 -212 59 -79 -250 -63 -82 -31 53 121 -208
3660 -208 27 162 171 26 136 7 -179 -12 -266 -287 159 -253 337 90 -212 52 212 41 -109 -42 -187
3681 -187 56 -88 -82 -20 63 -212 -173 43 -33 11 158 -28 189 61 -12 169 296 -79 -78 -98 125 205 -124 59
3705 59 -19 50 -200 95 -172 -185 138 -306 -2 143 -33 -49 210 -278 -87 355 22 115 144 -106 -234 169
$$ packed form
3543A61l04L48Q8l22j44L11m15J57j22J90%L48k52k78N01n69L76n8j60PJ70O6
3565I9r1R6k50J95Q1j77R8o5j33K32j84o2J78K06k03j4O8k24J68J85k34pr4rJ17
3590b4P0q8Q4L0m9L09l77j49O7M7n5J62o4k22L08J59k67J04R6r1J55k09n6K83
3614B23j27L4M7j00j39L69k97k14K67N3k21O8M0j75M91k17k38L01k53j35L96k25
3636e2Oo1J45k89K83k21p8K97J3J08J66k59K6J19m15K71j38j71J87j9N1Q4O8l29
3660b08K35J35Rj45J10j29j86J67k54k1M46m12N90k47l02K64J60j71j50O7j45
3681a87K43j44OO2Q3k75L9K16p6M4J47j86K17j28p3J81J27l75Jk0K23Q0l29J83
3705E9p8O9k50K95k67j3L23m44L04J45j76j6K59m88J91M42l33R3K9k50j28M03
$$ plain form
3727 169 70 -27 -39 -168 37 85 -110 164 68 -11 212 167 41 37 79 -284 55 221 -288 54 69 -13 52 59 -41
3752 -41 5 -60 -352 -11 170 13 -87 -128 -155 1 222 -260 171 249 -204 -105 79 -94 -91 75 -23 0 18 -139
3776 -139 57 -40 -159 49 -117 -300 164 -252 -103 250 24 -114 135 32 -65 14 -111 25 -139 103 -179
3797 -179 168 -39 -42 50 -121 -13 73 45 -91 -111 149 -107 58 37 -1 153 -161 -129 274 -135 210 40 -126
3820 -126 201 97 46 -97 72 -59 -192 129 -3 -218 154 -88 28 -14 -174 30 19 -202 137 -31 -102
3841 -102 163 295 -62 -6 222 -71 49 141 -103 76 92 -323 55 172 -279 6 189 -161 29 99 -76
3862 -76 -60 31 78 -101 222 -40 110 129 22 109 178 -249 142 144 -102 -72 -65 -110 -64 6 -255 80 -93 52 154
3887 154 -59 -131 120 -4 -9 -134 119 -94 103 -81 21 169 -253 107 222 -119 -250 164 145 -29 -12 -151
$$ packed form
3727A69r9r7j2j29K05M8j95K74r6p9K23m5j26mM2l63L39J66n09L42J5q2O5Pj00
3752d1M6o5k92L41J81j57j00m1k7J56K21m82M31P8m53R9J84j73LJ66r8K3J8j57
3776a39J96r7j19K08j66j83M64m16J49L53k26j38K49j03r7P9j25J36j64K42k82
3797a79L47k07lR2j71J08Q6k8j36k0K60k56J65k1l8J54l14L2M03m09L45j70j66
3820a26L27j04n1j43J69j31j33L21j32k15L72k42J16m2j60K04j1k21L39j68p1
3841a02K65J32l57N6K28k93J20R2k44J79J6m15L78J17m51K85J83l50J90P0j75
3862g6J6R1M7j79L23k62J50J9j07Q7O9m27L91Kk46L0Pm5M6P0k61L35j73J45J02
3887A54k13p2K51j24nj25K53k13J97j84J02J48m22L60J15l41j31M14j9j74J7j39
$$ plain form
3909 -151 -160 11 -242 25 339 76 -68 43 -133 79 38 -212 -133 216 -182 -1 69 -177 111 171 -107 -12
3931 -12 12 92 -74 30 95 135 213 -95 76 289 197 59 122 -176 258 -42 -85 -133 126 -150 52 -45 -238 156
3955 156 -161 -70 -6 -50 37 230 -18 -222 -72 -36 183 224 119 -164 161 98 -241 84 21 -187 227 -40 -106
3978 -106 243 156 26 106 -126 -172 46 -24 -102 263 168 -204 136 28 66 45 20 -208 78 -208 -57 -103 -131 -112
4002 -112 38 -149 -179 29 72 -343 109 -24 -21 225 -24 9 -32 -244 -12 160 17 255 288 -96 24 175
4024 175 189 125 379 50 -96 76 -65 90 109 62 81 167 -159 -293 181 -28 153 -6 -58 142 60 7 -8
4047 -8 27 -80 35 -62 -47 288 -32 -245 47 -17 -73 -53 138 -17 99 162 -75 251 -214 -77 261 -73 109
4070 109 -20 -33 -94 -81 -61 34 250 94 -93 -11 61 -75 307 -169 -303 30 -104 -85 51 14 53 249 110
$$ packed form
3909a51rJ71k53K67L14k63j44J11j76K12m1k50P9L49l98J81P0k46K88O0k78R5
3931a2K4Q0j66J04O5M0P8l08J71K13r2j38O3k98M34l00m3m8K59k76K02r7j93L94
3955A56l17R1O4m4Q7J93k48k04J50L6K19M1j05k83L25o3l39L25o3k08M14k67o6
3978a06L49q7j30Q0k32m6K18p0p8L65r5l72L40j08L8k1k5k28K86k86J51m6k8J9
4002a12J50j87l0K08M3m15M52j33LK46k49L3m1k12K32J72j43K38L3l84J20J51
4024A75J4o4K54l29j46J72j41J55J9m7J9Q6l26j34M74k09J81j59n2K00q2n3j5
4047hL5j07J15r7J5L35l20k13K92o4n6K0J91j55J16O3k37L26m65J37L38l34J82
4070A09j29j3o1J3K0R5K16j56j87Q2P2j36L82m76j34L33j34J9J36l7L9J96j39
$$ plain form
4093 110 -271 101 100 -112 71 -248 -38 14 -74 52 61 -213 -171 304 -17 95 85 36 67 73 88 -181 172 -294
4117 -294 159 426 134 -4 233 20 101 136 -240 -44 220 -395 187 6 -282 87 160 -109 165 45 -11
4138 -11 230 214 -267 126 124 -183 39 127 -35 226 82 -17 -28 140 -12 48 16 -172 -52 -203 -255 97 -9
4161 -9 88 91 19 124 118 78 -147 119 -81 23 36 69 -189 273 27 47 7 49 -45 147 -11 -93 124 -116 -120 182
4187 182 -61 -135 258 -23 13 138 -234 -99 173 150 96 84 23 -72 157 13 -19 -215 -351 -261 220 -90 190
4210 190 230 -96 38 -29 -71 122 267 -255 33 -175 -135 63 252 29 40 -1 -2 -117 135 -220 -36 11 -42
4233 -42 23 74 8 -78 147 -102 46 43 -13 -21 157 -92 30 279 -221 -85 66 -61 62 -140 -234 247 -23 -202
4257 -202 29 -1 41 -33 123 8 256 -25 -144 132 -64 -175 245 -132 -98 -124 -201 -201 -124 -102 -181 159 -86 -19
$$ packed form
4093A10l81L72jk12J83l19K10N2q8J26Rk74M2M75l21J12j0m9L1OJ5k69L53m66
4117b94M53K67k92j38K37k13Q1L5l76J96K64o15N82j81k88L69P3k69K74j20n6
4138a1K41j6m81L93kl07K22Q8j62K61j44r9j1J68j52O0l2j88J20j51n2L52j06
4161iR7Lp2J05om0k25K66k00J04J3L3k58M62k46K0m0M2r4J92j58q2K17k40mL02
4187A82k43p4L93k81L6J25l72J35K72k3n4j2o1r5K29j44l2j96j36R0M81l10K80
4210A90M0l26J34o7m2J93J45n22K88k08M0J98J89k23J1m1jj15K52l55J84M7n3
4233d2O5N1o6q6K25k49J48ln6qJ78k49J22K49n00J36J51j27J23k02r4M81k70j79
4257b02K31l0M2p4J56j15K48k81j19K76j96j11M20l77L4k6p7%P7K2p9L40k45O7
$$ plain form
4281 -19 12 -87 -43 235 -66 40 147 123 -126 96 -316 -40 210 38 -143 123 21 -68 227 -198 103 38
4303 38 -146 103 108 60 155 -106 -225 -52 13 -141 -34 279 -101 -181 134 -336 125 81 -69 71 294 91 -109
4326 -109 -33 -177 -1 38 19 -67 -100 -388 -137 -49 -358 94 -121 -51 114 -9 65 278 303 -175 86 27 -180
4349 -180 210 -145 -316 -61 -203 -19 66 -178 -75 -127 -148 -174 121 1 -101 -17 73 84 125 70 67 -108 -65 -63 141
4374 141 -33 -150 2 211 -49 -12 -147 -23 118 -39 -219 131 -111 -185 -66 70 112 43 -115 97 35 -268
4396 -268 75 91 33 -24 7 -220 -252 27 141 -76 -47 -12 19 25 -97 61 110 -77 93 -83 -53 -44 72 -153 137
4421 137 60 -61 -145 -60 -129 119 127 -261 243 65 59 8 2 22 187 60 -61 319 -40 -238 394 -125 -3 -9 130
4446 130 -75 163 23 -152 -7 174 -114 162 124 -10 33 -135 -41 78 -108 83 -159 -296 -82 83 -254
$$ packed form
4281a9L1r9M4K78l01J06J07k4k49K22m12K76K50j72j81K66j02q9K95m25L01o5
4303C8j84K49Nm8R5k61j19J73O5j54J07L13l80q0L15m70M61m4j50J40K23k03k00
4326a09P6j44J76L9j9q6l3k88K51Q8l09M52k15P0J65j23P4K13K5m78K61n9k07
4349a80L90l55j71K55j42J84Q5k44J03n2k1k6K95j20j02Q4R0J1M1n5lj75M3KK04
4374A41j74j17J52K09k60L7j35J24J41j57j80L50k42p4J19J36M2o9j58K12o2l03
4396b68L43J6n8n7L1k27l2K79J14k17K9L5L1Oj22J58M9j87J70j76L0RJ16k25K90
4421A37p7j21q4Q5o9K48Ql88N04j78on1oK0J65j27j21L80l59j98O32n19J22oJ39
4446A30k05K38j40j75J45J81k88K76l8j34M3j68R4J19j86J91k42j37K14J65l37
$$ plain form
4467 -254 113 135 17 39 133 -212 15 94 -161 -146 30 -28 86 101 -394 -71 24 -152 114 266 -151 -98 154
4490 154 -100 -208 -63 -147 -127 -10 -162 64 37 -47 -114 -5 45 -21 24 13 -313 263 -93 75 132 -61 95
4513 95 220 -214 254 259 -216 201 142 -238 71 1 -151 76 83 51 147 262 -61 -116 -152 -132 40 201 -56 -12
4537 -12 -149 92 146 -156 -132 -225 -122 -293 122 -77 -81 217 -97 -228 3 -178 16 14 -119 -193 -71 58 -222
4560 -222 76 -18 22 48 193 -91 140 -143 -261 3 -203 -86 -176 52 144 -117 -310 159 182 -109 -279 -58
4582 -58 16 -7 -137 -35 -60 64 -129 -112 76 -104 -97 -97 -16 -3 120 38 -41 -4 -32 187 91 108 48 76 -142 13
4608 13 52 12 115 -15 -121 27 125 96 -155 -213 34 103 62 13 158 131 107 149 42 -256 -155 33 13 -199
4632 -199 91 83 252 -12 48 97 -114 -15 106 -136 -223 326 164 14 37 -77 -48 -24 -93 -69 -21 28 -146 106
$$ packed form
4467b54L67K2j18K2R4l45K27P9k55J5J76n8J14J5m95L23R5j76K66J52m17N3K52
4490A54k54j08J45q4K0J17j52K26k7q4o7J09N0o6M5j1l26N76l56J68N7j93J56
4513I5J25m34M68Nm75M17n9l80L09p0j52K27Pl2R6J15l23n5l6K0J72J61k57M4
4537a2j37K41N4l02K4r3J03j71M15j99mK98l14j31K31j81J94kj33p4J22J29k80
4560b22K98r4M0K6J45k84K31k83j18K64k06J17r0K28R2k61j93M69K3k91j70K21
4582e8P4k3j30J02k5J24j93J7J88j80P%Q1J3J23q2p9L7k8K19r6J7o0K8k18J55
4608A3L9m0J03j30j06J48R8k9k51n8K47O9m1m9J45k7k4M2j07k98J01J88k0k12
4632a99K90qJ69k64O0M9k11R9J21k42q7N49j62j50K3j14K9K4o9K4M8M9j74K52
$$ plain form
4656 106 -28 38 -143 39 120 164 1 -149 4 -113 -128 146 17 135 -129 -66 -179 49 -82 -39 -210 -301
4678 -301 31 -91 -25 -89 -23 171 3 124 -97 140 169 -152 32 48 -161 34 153 58 16 323 -33 -78 -34
4701 -34 -24 93 52 126 -72 52 -79 -250 176 -335 134 211 -153 155 46 115 7 250 -124 84 -73 -175
4723 -175 45 168 -80 -109 -139 -88 131 44 -85 391 -104 63 -18 48 54 -9 59 67 5 -31 -148 48 20 -135 85
4748 85 16 175 -31 -211 -240 -25 22 43 -108 79 133 174 -24 113 322 -253 171 -134 -257 -86 294 -37
4770 -37 190 11 -58 -35 -89 -455 36 169 -260 161 98 -158 -179 42 9 -33 -34 -99 -167 125 -176 34 182 45
4794 45 60 234 150 39 206 -189 231 99 -42 -10 0 208 54 72 -74 95 49 -28 36 -62 12 138 -97 -22
4818 -22 -24 -109 -60 48 192 -177 204 136 -146 163 -223 -283 -98 10 -6 60 -115 -51 339 -207 118 237 2
$$ packed form
4656A06j34O6j81J82Q1M4j63j50J53j17j5K74j29J18k64O3j13K28j31M3j71r1
4678c01L32j22O6o4O6J94j68J21k21K37K9l21J84J6k09J95J19r5m2L07l56m5M4
4701c4J0J17m1P4j98J24j31j71M26n11M69P7l64L08j09O9j08K43l74K08j57j02
4723a75K20J23k48k9l0N1K19q7j29M76m95J67q1O6Oo3O8Qo2l6j17J96k8j55K20
4748H5o9J59k06j80k9K15M7K1j51J87N4M1j98J37K09n75M24l05j23J71L80l31
4770c7K27j79o9K3n4l66M91J33m29M21o3k56k1K21l3m2jo5o8K92l01K10J48j37
4794D5J5J74q4j11J67l95M20j32j41L2J0K08j54J8j46J69m6p7O4r8P4J26k35P5
4818b2kq5M9J08J44l69L81o8k82L09l86o0J85J08j6O6j75O4L90n46L25J19k35
$$ plain form
4841 2 -125 78 87 -7 171 -235 11 -18 -198 -121 283 114 217 105 189 259 -76 -68 49 256 -48 160 -79 13
4865 13 -172 -45 -234 61 126 12 82 56 -32 36 36 14 -58 120 -17 -60 246 -133 -143 164 -177 124 163 -140
4889 -140 -40 -56 48 35 76 183 238 125 48 11 46 141 89 -130 -13 131 110 -167 -66 -201 89 303 17
4912 17 297 140 106 46 183 -99 -135 133 -207 112 70 117 86 123 110 -241 -228 -148 -43 60 -135 179 163 -2
4936 -2 25 36 -146 -186 145 -97 -134 112 -174 67 230 -247 -47 146 26 58 23 94 -31 14 -94 -142 239 -62
4960 -62 72 133 6 184 -123 -47 -274 43 -92 71 -122 -78 -297 -36 -54 10 123 45 -159 -75 -296 -14 23
4983 23 21 291 79 173 105 0 12 89 8 -156 59 -4 -251 -190 -122 -111 -3 214 -108 -55 -101 -109 20 -266 -104
5008 -104 213 -108 27 -40 -22 -76 48 89 -88 -257 -3 -298 -130 25 41 175 159 30 134 -223 124 256
$$ packed form
4841Bj27K03Rr4J78m06K46k9j80P7M04j69J03j12Q4P0l35QJ17K07l04K08k39R2
4865A3j85J27j89K95O5j14P0k6q8O8%k2p2J78j37m3L06l79j0L07l41L01L9l03
4889a40J00j6J04j3M1J07N5j13p7l7L5R5n2k19J17J44k1k77J01j35K90K14k86
4912A7K80j57l4o0J37k82l6K68l40L19m2M7l1L7j3l51J3Q0J05J03j95L14j6j65
4936bK7J1j82m0L31k42l7K46k86K41J63m77K00J93j20L2l5P1j25M5j08m8L81l01
4960f2J34O1j27J78l07P6k27L17j35J63j93M4k19K61j8O4J13p8k04Q4k21K82L7
4983B3kK70k12R4o8j05J2P7q1j64K15o3k47O1O8J1J08K17l22N3m6qJ29k86J62
5008a04L17l21J35o7J8n4J24M1j77j69K54k95J68J55J6J34j6j29J04l57L47J32
$$ plain form
5030 256 -67 66 -48 -167 77 -157 -105 17 -103 64 -148 -59 -102 74 77 -71 88 100 19 -264 131 -114
5052 -114 83 134 -4 -166 90 -26 18 -85 -100 87 -261 182 39 87 119 39 -2 -146 57 -57 244 251 176
5075 176 -186 -10 64 64 166 43 -17 1 -109 -81 -45 -123 -116 228 30 -40 238 -14 -126 -30 49 5 52 31 -174
5100 -174 53 287 11 118 -30 -65 -29 -92 108 116 -118 -110 -131 0 -48 -93 -30 137 -58 5 -192 -11 168 143
5124 143 -51 57 -189 232 -291 -63 64 -262 81 -81 73 -9 168 -2 47 8 -249 105 95 -46 -81 113
5146 113 -202 -196 267 -262 -281 218 -240 -26 192 142 20 70 99 -109 58 -245 54 23 142 149 -87 -73 91
5169 91 179 90 -63 -113 -171 -171 159 200 -105 3 83 -288 123 112 -40 172 45 58 -1 -90 237 13 -115 21
5193 21 26 -172 -34 59 -37 53 -237 167 93 -211 -144 -88 -163 44 10 -134 69 163 34 -141 -93 -92 49 -227 -361
$$ packed form
5030B56l23J33j14j19K44k34N2J22j20J67k12Q9m3J76Lj48J59J2q1k83L95k45
5052a14J97N1j38j62K56j16M4j03j5J87l48M43j43M8L2q0m1j44K03j14L01Pp5
5075A76l62J76P4%J02j23o0J8j10K8L6p8PL44j98p0K78k52j12R6P9m4M7k1k05
5100a74K27K34k76J07j48l5L6o3K00Qk34Qk1J31m8m5O3J67j95O3j97J81J79k5
5124A43j94J08k46M21n23K28J27l26L43j62J54q2J77j70M9l9k57L54j0j41l5J94
5146A13l15OM63n29j9M99m58K14K18n0j22N0K9k08J67l03K99l1J19Pk36J4J64
5169I1Q8q9j53n0n8%L30M1l05J08Q0l71M11j1j52K12j27J3n9q9L27k24j28J36
5193B1Nj98J38R3r6R0k90M04p4l04O7N6p5K07l4j44K03R4j29j75M8JJ41k76j34
$$ plain form
5218 -361 46 58 -10 -198 34 -42 -5 143 46 80 207 -61 1 244 -96 -84 38 143 25 72 -20 55 69 -59
5242 -59 -96 355 -60 -53 159 124 -170 -73 93 85 101 29 -122 148 -110 161 11 -71 39 125 -80 208 -96 -25
5266 -25 -40 -208 108 50 -201 -59 -33 -176 87 -144 -77 -203 -148 -145 -83 56 -44 193 242 -28 -35 -85 40 -4 30
5291 30 -202 -209 178 -309 -1 8 -219 -2 -23 13 59 -102 -94 270 13 223 -134 -1 -305 -55 126 -41 144
5314 144 -29 -114 -237 116 -228 -166 -65 67 -33 104 42 51 155 -110 -37 12 -82 114 6 144 -300 -28 10
5337 10 156 89 -64 44 -129 -62 -36 84 30 -74 -100 97 -36 -4 -123 -43 175 -63 -102 145 0 22 -117
5360 -117 -44 27 116 17 28 -43 -12 -97 86 -43 179 387 123 -39 -87 84 22 -165 -163 101 -39 2 177 -32
5384 -32 -65 -43 -153 -13 -172 85 77 79 -131 -58 -58 -117 101 -234 -207 53 -120 -296 -43 -49 -211 -273 97 -68 -321
$$ packed form
5218c61M07J2o8j88K32p6L7J48r7L4J27k68O2K43l40J2J22J05j18M7r2P5J4j28
5242e9l7M51m15PK12l5k94R7J66qJ6p2j51K70k58K71j50q2J10Q6k05K88l04P1
5266b5j5j68L16n8k51J42K6j43K63k31O7j26N5LO2J39j00K37M9k70pn0J25m4L4
5291C0k32pL87m87L08Rk27K17k1L6M6j61QL64k57K10l57J33l04K50J81j67J85
5314A44j73q5j23L53l44O2J01J32j00J37o2RJ04k65P3M9r4J96j08J38m44K72L8
5337A0J46o7j53J08j73O7K6J20n4j04k6J97j33L2j19Q0K18k38l9K47j45K2j39
5360a17P3P1Q9r9J1p1L1q5J83j29K22K08k64j62m8J71o2j87KK64j40M1J75k09
5384c2l3K2j10J40j59K57qKk10P3%n9K18l35K7K60j73j76K53oj62o2L70j65k53
$$ plain form
5409 -321 -64 -214 -283 80 129 344 24 -273 -61 213 -94 101 6 -114 77 71 9 85 -10 -259 10 -43 -172
5432 -172 -185 74 217 -109 51 -127 118 -41 -120 84 5 6 38 -174 212 -144 -48 -131 213 129 -120 286 355
5455 355 164 4 -311 -160 127 -79 -138 0 203 -150 279 -78 49 78 -168 114 -51 158 -158 54 116
5476 116 -92 84 -78 -24 -109 29 -73 -211 -118 -30 -106 -78 -38 166 201 -6 107 166 -105 0 -92 -136 -82 -11
5500 -11 304 -124 -116 -94 24 -298 -193 278 -37 152 101 26 47 95 188 -96 160 32 144 104 2 -44 -1 116
5524 116 -39 -63 -20 -78 19 4 -1 233 73 89 165 189 -54 -229 -88 110 -8 68 -12 -81 -12 58 86 -220 -115
5549 -115 -142 60 154 -104 35 47 -84 136 141 -108 -177 -224 249 133 1 75 -57 20 14 -1 -64 -14 -160 -192 31
5574 31 -12 -93 -162 32 73 155 -60 62 -96 -120 -43 -121 44 22 14 71 -129 184 323 -131 266 216 20 106 -61
$$ packed form
5409c21K57j50o9L63M9K15l20k97K12K74l07J95r5j20J91oo2P6r5k49K69n3j29
5432a72j3K59J43l26J60j78K45j59p9K04p9JL2k12L86l56R6q3L44q4k49M06O9
5455C55j91j60l15J51K87k06n9J38K03l53M29l57J27K9k46K82j65K09l16K12O2
5476A16k08J76j62N4q5J38j02j38R3Q8p6K8M0K04L5k07J13N9k71J05r2m4N4P1
5500a1L15m28QK2J18l22J05M71l15J89n1p5K1M8R3k84K56j28J12m0j02m6M3J17
5524A16j55k4M3n8R7j5nK34j60J6P6K4k43j75J41J98j18P6q0o9O9P0K8l06J05
5549a15k7K02R4k58J39J2j31K20Nk49o9m7M73j16j32P4j32P7oj5o3N0j46l2K23
5574C1m3q1o9J94M1Q2k15J22j58k4P7p8J65k2qN7k00L13J39m54L97n0j96Q6j67
$$ plain form
5599 -61 32 133 -94 66 -54 44 19 218 -41 5 -170 -52 156 -72 -87 -1 -98 166 -65 224 72 -192 43
5622 43 -26 45 72 232 90 -76 184 118 -21 3 159 -197 225 48 82 -28 -46 8 280 -161 -57 -174 97
5645 97 214 -94 -35 -72 66 -84 153 134 215 -32 287 -154 -91 -22 76 -11 140 33 -127 -240 -113 -137 -62 54
$$ packed form
5599f1R3J01k27J60j20R8k5J99k59M6j75J18K08k28j5Q6r7K64k31K89j52k64K35
5622D3o9P1K7J60j42j66K60o6j39K4J56l56M22j77L4j10j8N4K72m41J04j17K71
5645I7J17l08N9l7J38j50K37j9Q1k47L19m41O3O9R8q7J51j07j60j13J27k4P5J16
$$ [...]
8191h
##END NTUPLES=NMR FID
##END=
