##TITLE=1H_CA-8535
 CDCl3, 8 sc, 
 18.1.2019
##JCAMPDX= 6.0         $$ Bruker NMR JCAMP-DX V2.0
##DATA TYPE= NMR FID
##DATA CLASS= NTUPLES
##ORIGIN= UXNMR, Bruker Analytische Messtechnik GmbH
##OWNER= root
$$ XWIN-NMR		Version 3.5
$$ Fri Jan 18 13:59:59 2019 Russian Standard Time (UT+4h)  she@DPX200
##.OBSERVE FREQUENCY= 200.1313
##.OBSERVE NUCLEUS= ^1H
##.DELAY= (6, 6)
##.ACQUISITION MODE= SIMULTANEOUS
##.ACQUISITION SCHEME= undefined
##.AVERAGES= 8
##.DIGITISER RES= 18
##SPECTROMETER/DATA SYSTEM= spect
##.PULSE SEQUENCE= zg30
##.SOLVENT NAME= CDCl3
##.SHIFT REFERENCE= (INTERNAL, CDCl3, 0, 15.7039)
##AUDIT TRAIL= $$ (NUMBER, WHEN, WHO, WHERE, WHAT)
$$ ##TITLE= Audit trail, XWIN-NMR		Version 3.5
$$ ##JCAMPDX= 5.01
$$ ##ORIGIN= Bruker BioSpin GmbH
$$ ##OWNER= she
$$ F:/spectra/data/she/nmr/H-F/1/audita.txt
$$ ##AUDIT TRAIL=  $$ (NUMBER, WHEN, WHO, WHERE, WHAT)
(   1,<2019-01-18 13:59:02.32 +0400>,<she>,<DPX200>,
      <created by zg, POWCHK disabled, PULCHK disabled
       configuration hash MD5:
       00 E9 B6 7A A2 85 ED C7 34 08 36 98 17 FE 4E 26
       data hash MD5: 16K
       B5 1C E0 D1 06 1F D7 28 FC FC 4C 18 8A 57 DD A3>)
$$ ##END=
$$ 
$$ hash MD5
$$ 6C 01 B6 C9 88 B0 59 1D BC C2 D4 21 92 EB 9D 78
##$RELAX= 
##$RELAX= 
##$RELAX= 
##$RELAX= 
##$RELAX= 
##$RELAX= 
$$ Bruker specific parameters
$$ --------------------------
##$DU= <F:/spectra>
##$EXPNO= 1
##$NAME= <H-F>
##$PROCNO= 1
##$TYPE= <nmr>
##$USER= <she>
##$AMP= (0..31)
100 100 100 100 100 100 100 100 100 100 100 100 100 100 100 100 100 100 
100 100 100 100 100 100 100 100 100 100 100 100 100 100 
##$AQSEQ= 0
##$AQ_mod= 1
##$AUNM= <au_zg>
##$AUTOPOS= <>
##$BF1= 200.13
##$BF2= 200.13
##$BF3= 200.13
##$BF4= 200.13
##$BF5= 200.13
##$BF6= 200.13
##$BF7= 200.13
##$BF8= 200.13
##$BYTORDA= 1
##$CFDGTYP= 0
##$CFRGTYP= 5
##$CHEMSTR= <none>
##$CNST= (0..31)
1 1 145 1 1 1 1 1 1 1 1 1 1 1 1 1 1 1 1 1 1 1 1 1 1 1 1 1 1 1 1 1 
##$CPDPRG= <>
##$CPDPRG1= <>
##$CPDPRG2= <>
##$CPDPRG3= <>
##$CPDPRG4= <mlev>
##$CPDPRG5= <mlev>
##$CPDPRG6= <mlev>
##$CPDPRG7= <mlev>
##$CPDPRG8= <mlev>
##$CPDPRGB= <>
##$CPDPRGT= <>
##$D= (0..31)
0 1.2 0 0 0 0 0 0 0 0 0 0.03 0 0 0 0 0 0 0 0 0 0 0 0 0 0 0 0 0 0 0 0 
##$DATE= 1547805541
##$DBL= (0..7)
120 120 120 120 120 120 120 120 
##$DBP= (0..7)
150 150 150 150 150 150 150 150 
##$DBP07= 0
##$DBPNAM0= <>
##$DBPNAM1= <>
##$DBPNAM2= <>
##$DBPNAM3= <>
##$DBPNAM4= <>
##$DBPNAM5= <>
##$DBPNAM6= <>
##$DBPNAM7= <>
##$DBPOAL= (0..7)
0.5 0.5 0.5 0.5 0.5 0.5 0.5 0.5 
##$DBPOFFS= (0..7)
0 0 0 0 0 0 0 0 
##$DE= 6
##$DECBNUC= <off>
##$DECIM= 32
##$DECNUC= <off>
##$DECSTAT= 4
##$DIGMOD= 1
##$DIGTYP= 9
##$DL= (0..7)
0 120 120 120 120 120 120 120 
##$DP= (0..7)
150 150 150 150 150 150 150 150 
##$DP07= 0
##$DPNAME0= <>
##$DPNAME1= <>
##$DPNAME2= <>
##$DPNAME3= <>
##$DPNAME4= <>
##$DPNAME5= <>
##$DPNAME6= <>
##$DPNAME7= <>
##$DPOAL= (0..7)
0.5 0.5 0.5 0.5 0.5 0.5 0.5 0.5 
##$DPOFFS= (0..7)
0 0 0 0 0 0 0 0 
##$DQDMODE= 0
##$DR= 18
##$DS= 0
##$DSLIST= <SSSSSSSSSSSSSSS>
##$DSPFIRM= 0
$$ [...]
##$SUBNAM2= <"">
##$SUBNAM3= <"">
##$SUBNAM4= <"">
##$SUBNAM5= <"">
##$SUBNAM6= <"">
##$SUBNAM7= <"">
##$SUBNAM8= <"">
##$SUBNAM9= <"">
##$SW= 20.0189088683792
##$SWIBOX= (0..15)
0 0 2 0 0 0 0 0 0 0 0 0 0 0 0 0 
##$SW_h= 4006.41025641026
##$TD= 16384
##$TD0= 1
##$TE= 0
##$TE2= 300
##$TE3= 300
##$TEG= 300
##$TL= (0..7)
0 120 120 120 120 120 120 120 
##$TP= (0..7)
150 150 150 150 150 150 150 150 
##$TP07= 0
##$TPNAME0= <>
##$TPNAME1= <>
##$TPNAME2= <>
##$TPNAME3= <>
##$TPNAME4= <>
##$TPNAME5= <>
##$TPNAME6= <>
##$TPNAME7= <>
##$TPOAL= (0..7)
0.5 0.5 0.5 0.5 0.5 0.5 0.5 0.5 
##$TPOFFS= (0..7)
0 0 0 0 0 0 0 0 
##$TUNHIN= 0
##$TUNHOUT= 0
##$TUNXOUT= 0
##$USERA1= <user>
##$USERA2= <user>
##$USERA3= <user>
##$USERA4= <user>
##$USERA5= <user>
##$V9= 5
##$VALIST= <valist>
##$VCLIST= <CCCCCCCCCCCCCCC>
##$VD= 0
##$VDLIST= <DDDDDDDDDDDDDDD>
##$VPLIST= <PPPPPPPPPPPPPPP>
##$VTLIST= <TTTTTTTTTTTTTTT>
##$WBST= 1024
##$WBSW= 4
##$XGAIN= (0..3)
0 0 0 0 
##$XL= 0
##$YL= 0
##$YMAX_a= 209420
##$YMIN_a= -462545
##$ZGOPTNS= <>
##$ZL1= 120
##$ZL2= 120
##$ZL3= 120
##$ZL4= 120
##$ABSF1= 10
##$ABSF2= 0
##$ABSG= 5
##$ABSL= 3
##$ALPHA= 0
##$AQORDER= 0
##$ASSFAC= 0
##$ASSFACI= 0
##$ASSFACX= 0
##$ASSWID= 0
##$AUNMP= <proc_1d>
##$AZFE= 0.1
##$AZFW= 0.1
##$BCFW= 1
##$BC_mod= 2
##$BYTORDP= 1
##$COROFFS= 0
##$CY= 11.3945322036743
##$DATMOD= 1
##$DC= 2
##$DFILT= <>
##$DTYPP= 0
##$F1P= 18.9103706918063
##$F2P= -1.10871071338519
##$FCOR= 0.5
##$FTSIZE= 0
##$FT_mod= 4
##$GAMMA= 1
##$GB= 0.15
##$INTBC= 1
##$INTSCL= 1
##$ISEN= 128
##$LB= 0.24
##$LEV0= 0
##$LPBIN= 0
##$MAXI= 10000
##$MC2= 0
##$MEAN= 0
##$ME_mod= 0
##$MI= 1.114404
##$NCOEF= 0
##$NC_proc= 0
##$NLEV= 6
##$NOISF1= 3.799351
##$NOISF2= 2.8
##$NSP= 1
##$NTH_PI= 0
##$NZP= 0
##$OFFSET= 15.70392
##$PC= 1
##$PHC0= -9052.682
##$PHC1= 13.20004
##$PH_mod= 1
##$PKNL= yes
##$PPARMOD= 0
##$PSCAL= 0
##$PSIGN= 0
##$REVERSE= no
##$SF= 200.130013532006
##$SI= 16384
##$SIGF1= 3
##$SIGF2= 2
##$SINO= 400
##$SIOLD= 16384
##$SREGLST= <1H.CDCl3>
##$SSB= 0
##$STSI= 0
##$STSR= 0
##$SW_p= 3612.71676300578
##$SYMM= 0
##$S_DEV= 0
##$TDeff= 0
##$TDoff= 0
##$TI= <>
##$TILT= no
##$TM1= 0
##$TM2= 0
##$TOPLEV= 0
##$USERP1= <user>
##$USERP2= <user>
##$USERP3= <user>
##$USERP4= <user>
##$USERP5= <user>
##$WDW= 1
##$XDIM= 8192
##$YMAX_p= 0
##$YMIN_p= 0
$$ End of Bruker specific parameters
$$ ---------------------------------
##NTUPLES= NMR FID
##VAR_NAME=  TIME,          FID/REAL,        FID/IMAG
##SYMBOL=    X,             R,               I
##VAR_TYPE=  INDEPENDENT,   DEPENDENT,       DEPENDENT
##VAR_FORM=  AFFN,          ASDF,            ASDF
##VAR_DIM=   8192,          8192,            8192
##UNITS=     SECONDS,       ARBITRARY UNITS, ARBITRARY UNITS
##FACTOR=    0.0002496,     1,               1
##FIRST=     0,             0,               0
##LAST=      2.0444736,     0,               0
##MIN=       0,             -462545,         0
##MAX=       2.0444736,     209420,          0
$$ Real data points
##PAGE= N=1
##DATA TABLE= (X++(R..R)), XYDATA
0@%%%%%%%%%%oJ4j6J6j6K4l2M0m8N6p2Q8j04J21j44J71j99K30k65L06l51M01m57
33b43N18n86O61p43Q34r33J042j164J294j436J593j762J949k153K375k620K887
50A513l180L503l858M255m697N192n755O394p131P993r015J0246j1765J3707j6279
65h877J9864k5259L4384n3785J68598k36193k31442L88015R3322j44555l8598
76c4526J07236n1986r4965k3771K3841o0452L5645J75663K7703k16707n7761Q5969
88h4111m6801J6294K51225L3406k59779p0419J73026L0569r7862L9171J65350
99A50069K8774j51455q9813N4983J4936J9552J27538R857j57047k3340M7845r6195
111f4296j3199J75589L4915j30067k3018J9235j12907p2333J69077K01925j08503
$$ plain form
0 0 0 0 0 0 0 0 0 0 0 0 -6 8 -8 8 -8 16 -16 24 -24 32 -40 48 -56 65 -79 92 -107 123 -142 164 -187 214 -243
33 -243 275 -311 350 -393 441 -492 550 -614 680 -756 837 -925 1024 -1129 1246 -1374 1513
50 1513 -1667 1836 -2022 2233 -2464 2728 -3027 3367 -3764 4229 -4786 5460 -6305 7402 -8877
65 -8877 10987 -14272 20112 -33673 134925 -101268 -332710 55305 148627 4072 -34526
76 -34526 72710 20724 -74241 -98012 -74171 -134623 -98978 76685 104388 -112319 -170080 -84111
88 -84111 -130912 -114618 136607 170013 -89766 -160185 12841 43410 -54452 -15281 150069
99 150069 178843 27388 -62425 -7442 7494 27046 154584 164441 7394 -15946 31899 -64296
111 -64296 -77495 98094 133009 2942 -20076 -841 -113748 -186081 -17004 184921 76418
122G6418k54647M3423J88468r9655j43833J64792J49093r3903n7491J735j02817
133a28417p952J97645J11707j08397j01709M0881K3726r1724J7302J98471K3780
144A75313j95610J781J35910j20620j49149J61668J70895p9038j11110k3274l5407
155f8641k6034O3845R4934o158r0255j0388K7851r3199m1000J67069Q0650j14099
167a5425j1047N6388j10903p3690J49254J20664n3590n6412J7236j6670q0641
178g4836K815J43932O5943r8168k7769M2625r5045o5047J41225P7674q3633K999
190C2715M1103j11038r8672Q7295J26311l810p4612p237J5096q6872n0655J27547
202b829P6587q5609J605O2847j09444j02205J11543J10396k3245j3236J1374n3343
$$ plain form
122 76418 -178229 -134806 53662 -45993 -189826 -25034 124059 30156 -27335 -25600 -128417
133 -128417 -136369 61276 172983 64586 -37123 3758 27484 -64240 -46938 151533 175313
144 175313 -20297 -18516 117394 -3226 -152375 9293 180188 101150 -9960 -33234 -68641
155 -68641 -94675 -30830 64104 57946 -32309 -42697 -14846 -108045 -149045 18024 98674 -15425
167 -15425 -26472 29916 -80987 -154677 -5423 115241 61651 5239 22475 5805 -74836
178 -74836 -72021 71911 137854 39686 11917 54542 -40503 -105550 35675 113349 29716 32715
190 32715 73818 -37220 -135892 -48597 77714 73904 -708 -7945 7151 -79721 -130376 -2829
202 -2829 73758 -11851 -10246 52601 -56843 -159048 -47505 62891 39646 26410 37784 -15559
214a5559o8362K0298J00582M6492m7220K572L3264r8056q1625J12572Q5954n6976
226C3936Q834M3860r8182r6848N7085Q2511R232q717O471k2979q6534m7713R0057
239b8987Q0551l7489l0L5406r2740q1420Q8357O7652l5045K4737N1797n4657q8881
252g0749j2141N8997O1885J9364P668j3337r5210n9466R9359P2831n7184R296
264B1313O6949o1925r2819J9232L8754J5090M5220K8535m4457q4598m6811M9320
276d6197O9580l26O821K2348p5720p6528N4344M3174k6793M8528O5614o0181r0059
289f5395q836L9034M4407K8689J3079N746m7742p0721J5096M9595P105M4407M7200
302A01664p9347r0706K6232L3855j407M0976L5955l1320n1486l4343J309K8028
$$ plain form
214 -15559 -83921 -63623 36959 83451 36231 38803 72067 -25989 -107614 4958 90912 33936
226 33936 42770 86630 -11552 -108400 -51315 31196 40428 31711 38182 15203 -71331 -119044 -28987
239 -28987 51564 14075 14045 49451 -43289 -124709 -36352 31300 -3745 20992 72789 18132 -70749
252 -70749 -82890 -23893 37992 57356 65024 51687 -43523 -102989 -3630 69201 12017 21313
264 21313 88262 26337 -66482 -47250 -8496 6594 51814 80349 35892 -48706 -95517 -46197
276 -46197 23383 23057 29878 52226 -23494 -100022 -45678 -2504 -29297 19231 84845 24664 -65395
289 -65395 -74231 -35197 9210 37899 50978 56724 8982 -61739 -46643 2952 10057 54464 101664
302 101664 22317 -68389 -42157 -8302 -9709 31267 67222 35902 -15584 -49927 -48618 -20590
314b0590J5612L5521M9629m9683j04032n84M8713J2082M4491M1482n3220n9604
326d0183L71J575Q676L7273K9784J6333j9706o8591l2676L0455L0331M9030M9073
339I1745n1819q1644N373J9824n492L7678M2398o723k4132m5945m8912K1086N5362
352H799K7672J6136k0497o0191k1069P366k602M6876O2433k4640n2095j4176k1349
365d7337m840M8391M0995J3284o142n4549m7728J9502L0471K3553L9947m763m8953
378A831j8910j4147k0128M1878O1209M828k3393m0563n0307J0516M6962J5258
390A5034K0198J7768m2630m6897k773k74K3658N8277J2926l4781l3271l6762o364
403e5891M4872K7499R529K2443k9608o6972k806K9778J3265L7764K9460l2910
$$ plain form
314 -20590 -4978 30543 80172 30489 -73543 -74127 -25414 -13332 31159 72641 19421 -40183
326 -40183 -39812 -38237 -29561 7712 37496 53829 34123 -34468 -67144 -36689 -6358 42672 91745
339 91745 39926 -41718 -36345 -16521 -22013 15665 58063 51340 27208 -18737 -67649 -46563 8799
352 8799 36471 52607 32110 -28081 -49150 -41784 -44386 2490 64923 40283 -11812 -25988 -47337
365 -47337 -52177 -3786 37209 50493 44351 -10198 -57926 -38424 -7953 15600 55547 50784 1831
378 1831 -17079 -31226 -51354 -9476 51733 56561 33168 -7395 -57702 -47186 -224 15034
390 15034 35232 53000 10370 -36527 -39300 -39574 -15916 42361 55287 20506 -12765 -49527 -55891
403 -55891 -11019 16480 26009 48452 18844 -48128 -50934 -21156 -7891 29873 59333 26423
415B6423l8669j7592j2242K4730M5151J7319K444k5698n9732j0042L7646P825
427b437J7840M3105k3320o3382j2453N647N172M2645L5295j3279l2768l6337j3666
440d7938K5804J8970J7864M0962j3462p3091j5650K6758k271K7059N4038j3850
452D5193n3058j9905o361M149K8432L0917K0758j5669n7561k1954K5547K088J7614
465A90N9606p207o7570j3650Q865j6027K5147N4767M146l3680l3111j8961N746
478c1739J1742K2442M4604k411o1623j7151J5615k1344J8857P4078J727n7315
490b518j2597M93k1836J0761M7462L3659j3433m8914k2756R328r070J4719O5897
503E1195L635o4136p621J2446m0479K113P3295K6039l5348k6970j4788j4579m99
$$ plain form
415 26423 -12246 -29838 -42080 -17350 27801 45120 47564 21866 -37866 -47908 -10262 -2437
427 -2437 15403 58508 35188 -28194 -40647 -35000 -29828 12817 48112 34833 2065 -34272 -47938
440 -47938 -22134 -3164 14700 55662 42200 -30891 -46541 -19783 -22054 5005 59043 45193
452 45193 -7865 -27770 -34131 -29982 -1550 29367 50125 34456 -23105 -45059 -19512 -17424 190
465 190 59796 52589 -14981 -28631 -19766 -35793 -10646 44121 48267 14587 -18524 -37485 -31739
478 -31739 -19997 2445 47049 44638 -16985 -34136 -18521 -39865 -21008 53070 54797 -2518
490 -2518 -15115 -14622 -36458 -25697 21765 55424 41991 -6923 -29679 -20351 -29421 -14702 51195
503 51195 54830 -9306 -16927 -4481 -44960 -42847 30448 56487 21139 -5831 -20619 -35198 -35697
516c5697L1587N1562J399n3652j2919J2032l5719M63P8729J9019n2499o581L508
529A232m4508p746N8184M1862j1233l3776j7609n737j9568J1999O5614J4371n0946
542B139m66J1891n7967j4713Q1111L5703l6619j4896n101l2024j7362L1044M9411
555C2151Q457l2636q095j24m9323q506Q2071L2277m7067k861J0430n3556k1198
568e7980N9254L8813j3484j0048j300k3168m0024M923O4341K6376l5715p45P257
581A8500o2340k2970P7091L4776l6220L678J4278m4742l5896K8523M3565J1331
593B9574q919K864j3019n7114j3936P3508L1588m0230Q208K1663o0037l9104N2281
606a2673L4348j1117J1821J2657l7693m8499O707N4556K2994k0647R756J0822
$$ plain form
516 -35697 -4110 47452 48851 -4801 -17720 -5688 -41407 -40944 37785 56804 4305 -2276 1232
529 1232 -43276 -51022 7162 49024 37791 4015 -13594 -19331 -38899 -26900 38714 53085 2139
542 2139 1673 13564 -44403 -59116 21995 57698 21079 6183 1082 -30942 -48304 -17260 32151
555 32151 40608 7972 -123 -247 -49570 -58076 23995 56272 9205 6344 16774 -36782 -57980
568 -57980 1274 40087 26603 16555 15255 -7913 -47937 -43014 21327 47703 11988 11243 18500
581 18500 -43840 -66810 10281 45057 8837 12515 26793 -17949 -53845 -25322 18243 29574
593 29574 20655 23519 10500 -46614 -60550 12958 44546 4316 12524 34187 -25850 -64954 -12673
606 -12673 21675 10558 22379 35036 -2657 -51156 -44449 10107 33101 12454 22210 33032
618C3032o1423l4687O1848L0271k9061K2985K7015n9759n1410L1903L9878K555
630A3147K378J5665j2623n4804j9228N3001K4642k5861K5552L1201o5044n2725
642f4699M7471L3250j6708K1891K7327l9891n1872O546L6725R314o939K5996J5414
655D3825n9889m4856M5859K8024k1471L0786L5154n7633n2569L1059K5586j0222
667f347J6605L3359j2488n3563k2562L3019J6826j3084L2874L2839o1637n4482
679e8641M1235K4140k5904K8209M3929l4022n1680L666K0589K4O208L5943J5632
692D9328n2961m3743L3332K1007k4790K9506M7390m3698n4742K0181J3927j7052
704b2315K3247M1265j0365m4018j9477J4169P689l012L3094L1798m2874m5503
$$ plain form
618 33032 -28391 -63078 -1230 29041 -20 22965 49980 -9779 -61189 -29286 10592 13147
630 13147 15525 31190 18567 -36237 -55465 -2464 22178 -3683 21869 53070 -11974 -64699
642 -64699 -17228 16022 -686 21205 48532 8641 -43231 -36685 40 9354 2415 28411 43825
655 43825 -16064 -60920 -15061 12963 -8508 22278 57432 -201 -52770 -21711 3875 -6347
667 -6347 10258 43617 31129 -22434 -44996 -11977 4849 -8235 24639 57478 -4159 -58641
679 -58641 -17406 6734 -19170 9039 52968 18946 -32734 -29068 -8479 -8455 -2247 33696 49328
692 49328 -3633 -47376 -14044 6963 -17827 11679 59069 15371 -39371 -19190 -5263 -22315
704 -22315 932 42197 31832 -12186 -31663 -17494 -9805 -12817 20277 52075 9201 -36302
716c6302K4457P818k5697L6138N0308l3369m6258Q437L227j5135J7002M2276Q394
729D1296m0340k8897J6030N13j9739L9695N0508m0933m8540K4719L202l4311K7935
742h862N6035j1293m2617q254P528j1990p096L9060L9930l3681m7693J7654P604
755c675l2570K5524N7227j8289m1255P388j175k5897J3066M4810J5693k6419k7182
768a2754K343k091j7008K7005M8227j9239l9904J1286m109l4480K2991N1893m937
781B9223k6026k545j0739k0611N389L5661K6057j7786k4695Q080q855l4682K5092
794a6437N7165j1268l2715J0329j0043l6751J4455M5118Q604j7781r356j729j5461
807a5870j9655K1871M5305m414k7250Q178r589m0674J7125N4019j301k2190N862
$$ plain form
716 -36302 -11845 -4027 -29724 6414 56722 23353 -22905 -14468 -11241 -26376 -9374 32902 41296
729 41296 956 -27941 -11911 -11398 -31137 8558 59066 18133 -30407 -5688 -2486 -36797 -8862
742 -8862 47173 35880 -6737 -14991 -7463 -19453 -26549 12511 52441 18760 -28933 -11279 -3675
755 -3675 -36245 -10721 46506 28217 -13038 -5650 -6825 -32722 -19656 25154 40847 14428 -12754
768 -12754 -10411 -12502 -29510 -2505 45722 26483 -13421 -2135 -6244 -40724 -17733 34160 29223
781 29223 3197 652 -10087 -30698 -25309 10352 36409 18623 -6072 2008 -6847 -41529 -16437
794 -16437 40728 29460 -3255 7074 -2969 -39720 -25265 19853 28457 10676 1320 -409 -15870
807 -15870 -35525 -13654 31651 27237 -13 8165 -1424 -42098 -24973 29046 27745 5555 11417
820A1417q636k9525k423K7018K4726r52j3716j966j4593l1765J5281M9841J7k1539
834C185J1051j0812l9709Q343L8407O524m360O995q423k8227j8488J8724L7959
847B1169L221j7874O202q656l9741M882M2742L400r641J6256r447l8350p234K4466
861h605K0497P321k148m658j4745k7158L099L6973P881j1551J3783n787m2052
874b7150n967K9224J0353O514J1813j2854k7326j1596Q049K0487J2964j127N477
887A8861p676l5308o523L0198Q388J004K0482j0153m0174o753J8465Q097R363
900H271J1699k385j5264k3221o809K1184J2882J536J6804m243l9917j0607K4389
913e681N441L991K0883k755k5688j3751j303Q894J5513R015N849m304k9857j6491
$$ plain form
820 11417 2781 -26744 -29167 -2149 22577 21625 7909 5943 -8650 -40415 -25134 24707 24724 3185
834 3185 14236 3424 -36285 -27942 10465 16989 12629 19624 11201 -17026 -35514 -16790 21169
847 21169 24390 6516 12718 4062 -35679 -30797 11945 15345 5704 21960 12513 -25837 -33071 -8605
861 -8605 11892 19213 17065 12407 -2338 -29496 -26397 10576 18457 6906 20689 14902 -27150
874 -27150 -33117 -3893 6460 12974 24787 11933 -15393 -26989 -18940 1547 14511 13384 18861
887 18861 11185 -24123 -30646 -448 7940 8944 29426 19273 -20901 -27654 -9189 -1092 8271
900 8271 19970 17585 2321 -20900 -27709 -6525 6357 7893 24697 20454 -19463 -30070 -5681
913 -5681 -240 3751 24634 21879 -3809 -17560 -18863 -9969 5544 14559 20408 16104 -13753 -30244
927c0244J9475J1573K056J9158L85l0882j1620O735R16J3551K0212L30j2554j7956
941h865j4911Q706J8100N702J0878K434k7520j6785R655K232O623K4676J934k1174
955A685j1779q111j554J8007J5593L965r55j7510k0072N738J0260L988J8376Q077
969B5708k2399j5041j596m703J1999K2993J563r387q366j7262n196J4664J0482
982C459J0226Q711j6491k1066R00J751N510K2405P875j4419r299j1153j0558J3781
996h368J8237L141L325o743k2920o985R198N596J5278J3370j3080j6445n094o479
1010a7969O430K0822O844k078l387j9578j3683J3200J1008M811J3616m038k2571
1023f573q455J274J993J6170J3094m576o911j3140j5619Q486J8039M006P783K625
$$ plain form
927 -30244 -10769 804 2860 22018 22403 -8479 -20099 -13364 -12448 1103 21315 21645 9091 -8865
941 -8865 -23776 -15070 3030 8732 19610 22044 -5476 -22261 -12606 -10374 -3751 20925 22859 1685
955 1685 -10094 -18205 -19759 -1752 13841 17806 16851 -659 -20731 -14993 -4733 -745 17631 25708
969 25708 3309 -11732 -13328 -18031 -6032 16961 18524 9137 771 -16491 -21687 -7023 3459
982 3459 13685 22396 5905 -15161 -14261 -12510 -7000 15405 23280 8861 -438 -11591 -22149 -8368
996 -8368 9869 13010 16335 9592 -13328 -20313 -11115 -5519 9759 23129 10049 -6396 -11490 -17969
1010 -17969 -11539 9283 16127 14049 10662 -8916 -22599 -9399 1609 6420 20036 15998 -6573
1023 -6573 -15028 -13754 -11761 4409 17503 12927 6016 -7124 -22743 -14257 3782 7788 15571 18196
1037A8196k2913j4102Q875L836O276J8291P52j6282j1968q449K718J6230R321
1050A0781K629J948j8121j9600Q705J0671J939J5893P176k1312j3679J807j586
1063a2749Q532J8182N064o663j4460j5777L404J2524K758J0983J1198k0091k0630
1076a7725O323K198M25K0100J0716j4673j3074o512k875P999J1946R339O053j5627
1090D613k0234L984O062l192J8035J7744j9148j9328K294k896q33J8277J2674
1103A8052m181j2118j3632k827N818L344J4608J5920j5440k1780M810p61p114
1116a5301K0287K0226j2570j5445k826o576k026J0881J4572Q112j0510j8460j075
1129a0711J445n596J7133K2895j2979j8220L617o618j0363J7630K0404l003j0025
$$ plain form
1037 18196 -4717 -18819 -9944 -6108 168 18459 19211 2929 -9039 -17488 -14770 1460 10781
1050 10781 13410 15358 -2763 -22363 -13658 -2987 -1048 14845 22021 709 -12970 -11163 -12749
1063 -12749 -4217 13965 19029 12366 -2094 -17871 -14467 -1943 815 11798 22996 2905 -17725
1076 -17725 -11402 -9204 -8779 11321 22037 7364 -5710 -12222 -15097 -7098 4848 14187 20240 4613
1090 4613 -15621 -11637 -5575 -8767 9268 27012 7864 -11464 -9170 -12066 -12899 5378 18052
1103 18052 13871 1753 -11879 -14706 -8888 -5544 9064 24984 9544 -12236 -7426 -8187 -15301
1116 -15301 4986 25212 12642 -2803 -5629 -12205 -14231 -3350 11222 19334 8824 -9636 -10711
1129 -10711 -9266 -14862 2271 25166 12187 -6033 -2416 -9034 -19397 -1767 18637 15634 5609
1142E609p973o526l793N19J5694J9488r992j9581K255l810j3452J7382K5561q300
1156A3081j3333J992r727j1370J0596J8529P889o735j1239l358n227j0261J5558
1169c605K6233q105j7436M823o744j7745J2704K3111o66o372j488r561j0711N95
1183a4967J4594J6959l374j1890J467p294j7978J3300K6907n185j0871P084r445
1196f93k0246O940J9241O272k115l956n027r980j0177J1877K2301l179r930Q512
1210I840r001k4638R794K6478k342n902P426p858j8905k537J4954J4173j350o693
1224C439L203p170k1462O743K5910j314p664J1092p636k5088L980J9432L785q05
1238F445M358k925j3628j2286P735J8891N96o454Q862n899k5687K828K2377j08
$$ plain form
1142 5609 -2364 -8890 -12683 -12164 3530 23018 13026 -6555 -4300 -8110 -21562 -4180 21381 13081
1156 13081 -252 1740 -7987 -19357 -8761 9768 17657 10922 -317 -3675 -8902 -19163 -3605
1169 -3605 22628 14523 -2913 1910 -4834 -22579 -9875 13236 12570 6198 4710 -4851 -15562 -14967
1183 -14967 -373 16586 13212 1322 2789 -4505 -22483 -9183 17724 12539 1668 8752 -693
1196 -693 -20939 -13999 5242 11514 9399 5443 416 -9564 -19741 -7864 14437 11258 1328 9840
1210 9840 839 -23799 -14005 12473 10131 4229 11655 3797 -15108 -17645 -2691 11482 10132 3439
1224 3439 6642 -528 -21990 -15247 10663 9349 1685 12777 5141 -19947 -15967 3465 7250 6445
1238 6445 10803 7878 -5750 -18036 -10301 8590 9186 2732 11594 5695 -19992 -17164 5213 5105
1252E105k580J1490o430k1214k436J2094P443K523K754L120j0420j9317L824K0552
1266F508j189m033J4812n910k7312M22J8118k51K13J1631j792j6847j0585N463
1280a0752J2644K237J7R957n357k5230R23J9373k936k079J8205k635k4885m383
1294a4901J1026K467J899Q527M429r710j7850k82J4361M74q75J5966k242k5761
1308a2472k075J4687l474K72J7842J355j8249r683L422N670K278M502J0791m078
1322A0788k1957l691J4080k731r45J9890P31k3251m841Q498k757J650J4426N846
1336A5736r926j3828k776P562k7K089J6284O23k2912m497J0837o368j093K0566
1350A2270M830j7511p793J640j182J867R114J0643k351j6259m705P426n168m18
$$ plain form
1252 5105 2525 14015 7585 -13629 -16065 -3971 3472 5995 8749 11869 1449 -17868 -14044 6508
1266 6508 5319 1286 16098 10188 -17124 -16702 1416 1165 1378 13009 11217 -5630 -16215 -10752
1280 -10752 1892 4129 4146 14103 8746 -16484 -15561 3812 876 -1203 17002 14367 -10518 -14901
1294 -14901 -3875 -1408 491 9018 13447 3737 -14113 -14395 -34 440 -435 15531 13289 -12472
1308 -12472 -14547 140 -3334 -3062 14780 16135 -2114 -11797 -8375 -2705 -427 4075 14866 10788
1322 10788 -11169 -14860 -780 -3511 -4456 15434 16165 -7086 -11927 -3429 -6186 -4536 9890 15736
1336 15736 5810 -8018 -10794 -3232 -3259 -1170 15114 15737 -7175 -11672 -835 -7203 -8296 12270
1350 12270 17100 -411 -8204 -6564 -7746 -5879 3235 13878 11527 -4732 -9437 -2011 -7179 -7597
1364g597K1630N140k1635n985O834o920r24J6520P893q934r537l979M73p07L912
1379c816J5622L639j7088n607O020q334j754K1854P683j5663o670K135o221j494
1393i694J0536J0449j33r951o949O58m615k48J8658P866j5674n001M420j0038
1407i716l356J7690Q676o803m517k532o224l517M809J4107N877j1521o670L086
1421f11q471m086J8017Q628j0505j912J136j1966l677J2272R846P13m088n422
1435a26l945o130O24J5537Q161j1167l166M128j1857p055J4993R650m054r2k721
1450B780j0562m617O435J0557N396m963m198L21q923n924J5008R631p138J99K800
1465F802j2963p981J0245R450J230J22l671o062n738j747R597R421l681k047J760
$$ plain form
1364 -7597 14033 19173 -2462 -8447 -1613 -8533 -9457 7063 14956 6022 -3515 -7494 -7021 -7728 -3816
1379 -3816 11806 15445 -1643 -7250 -1230 -9564 -11318 10536 18219 2556 -4114 -1979 -8200 -9694
1393 -9694 842 11291 11158 1207 -5742 -5084 -9699 -9947 8711 16577 903 -4098 322 -9716
1407 -9716 -13072 4618 13294 6491 1974 -558 -6782 -10299 -5490 8617 14494 2973 -3697 -611
1421 -611 -9082 -13168 4849 13477 2972 1060 2196 -9770 -13447 -1175 8671 9384 5296 -126
1435 -126 -4071 -10201 -9577 5960 14121 2954 -212 3916 -7941 -14996 -3 9647 5593 5501 2780
1450 2780 -7782 -12399 -5964 4593 9989 5026 828 1149 -7774 -13698 1310 10941 3803 4002 6802
1465 6802 -6161 -14142 -3897 5553 6783 6905 3234 -2828 -8566 -10313 -716 8705 5024 2977 4737
1480D737j0914q241J1831R103k263K562J40j1084n961M065N795O027J998k950
1494D845k810p958o870R079R953k290J413J743j2469p334Q935N142N36N579N85
1509H079q242o597j943N517P966J065k64J324j0186r888Q615Q207k143L922L248
1524H680r878q232K550L858M544M915j50k474o477q005M520R428N78J344L512
1539H713q667j0137L960N122J894N879J009o917m951l271j86P585N752P2j98n680
1555b1q886J769O266J770N693L232r021o837J471j39K602Q408J814m294m036o411
1571f620j524N835M150L260L438p123r079J928K418K8Q062M850o421n442k316
1586d556k256L844O534K426J269m072r726j716N929J426M115N685n091p697r57
$$ plain form
1480 4737 -6177 -14418 -2587 6516 4253 6815 6955 -4129 -10090 -6025 -230 5797 7795 4845
1494 4845 2035 -5923 -12793 -3714 6239 3949 5362 7105 -5364 -12698 -3763 1379 1915 7494 8079
1509 8079 -163 -6760 -8703 -3186 4780 5845 5581 6905 -3281 -13169 -4554 3653 1510 5432 8680
1524 8680 -1198 -9430 -6880 -3022 1522 6437 6287 3813 -2664 -10669 -6149 3279 3857 5201 8713
1539 8713 46 -10091 -6131 -1009 885 6764 7773 856 -4095 -7366 -7552 33 5785 5857 5659 -21
1555 -21 -8907 -7138 -872 898 6591 9823 802 -6035 -4564 -4703 -2101 6307 8121 3827 -209 -6620
1571 -6620 -8144 -2309 1841 5101 8539 1416 -7663 -5735 -3317 -3289 4773 9623 3202 -2240 -4556
1586 -4556 -6812 -2968 3566 5992 7261 3189 -6537 -8253 -2324 -898 3217 8902 3811 -3886 -4843
1601d843j165J311Q046L978k055k880o838m576N631N116J624M158j481r016l129
1616f119J537O85O458N728l843l540l648n776K747P848K165P67N72p352o199L252
1632d718K869L385O222j390o076l381l277K31P896M510j416r03m882p291K193
1647f028N738J401L937J792o580n445p97L82N788O924j181l105l202o236p3O909
1663B24K575J793K855n926q275J328K684J615N424K715m332m265m206j464N667
1678a588N331R46J101l633q580J78N159M60L644N548m713p578q79j09J509O172
1694B968L113j123l896o627j773N110K572K092N254l402r214k25K276k20N018
1709A923O181k815n323l774k095K723M247K938K449k552q248j744L965j044L199
$$ plain form
1601 -4843 -6008 -4697 3349 7327 5272 2392 -4446 -9022 -3391 1725 3349 7507 6026 -2990 -6119
1616 -6119 -4582 -3897 2561 8289 4446 906 -2742 -8518 -5771 2077 4242 5009 5581 -1771 -7970 -4718
1632 -4718 -1849 1536 7758 6368 292 -3089 -6366 -6135 1761 6271 4855 3952 -930 -8221 -6028
1647 -6028 -290 1111 5048 6840 260 -5185 -5982 -5600 188 7112 5931 2826 -376 -6612 -6685 224
1663 224 2799 4592 7447 1521 -6754 -5426 -2742 -1127 4297 7012 2680 -1585 -5791 -7255 -1588
1678 -1588 3743 4689 5790 2157 -6423 -6245 -1086 -626 3018 8566 3853 -3725 -4604 -4713 -3204 2968
1694 2968 6081 4958 1062 -5565 -7338 -2228 344 2436 7690 4288 -4926 -5151 -2875 -3095 1923
1709 1923 8104 5289 -34 -3808 -5903 -3180 1067 4005 6454 3902 -4346 -6090 -2125 -3169 30
1724C0P922k347q102j537j55p76N384N359j9l142n078k775K299J293K465O959
1740G780j278q951j714J606k634L941Q209j004n942k070j907r21K798M143M007
1755F063o74o841l001J935j717K657R039m46p852j231k30l392L304O895R84k635
1771B858l396l057n41pL128P216K79p571j999J380l698K058R192N21n263p56j907
1788a563l815J476N490L623j09m672k880n05k501J745R064R48o562j59J34o276
1804f562J421Q470K293k696j490k635l097l49L253O002J497n179j681k16n240
1819f209Q09R745J542n015N45j098n976k18O220M046o5k556k402j295l289R51
1835d265Q032K453m780J81m00p066k62Q244K064k062M73j645n084j617K951N325
$$ plain form
1724 30 7952 5605 -2497 -4034 -4189 -4965 419 5778 5759 2617 -2461 -5236 -2937 -1644 821 7780
1740 7780 6502 -2449 -4163 -2557 -5191 -1250 6959 5955 13 -2057 -3964 -4885 -2087 2056 6063
1755 6063 5389 -1452 -4453 -2518 -4235 -1578 7461 7015 -837 -2068 -2298 -5690 -2386 4509 5493 2858
1771 2858 -538 -3595 -4136 -4143 -1015 6201 6480 -1091 -3090 -1710 -5408 -3350 5842 6363 1100 344 -1563
1788 -1563 -5378 -3902 1588 5211 5102 430 -2450 -2955 -5456 -3711 5353 6301 -261 -420 -286 -6562
1804 -6562 -5141 3329 5622 2926 1436 -1199 -4296 -4645 -1392 4610 6107 928 -753 -969 -6209
1819 -6209 -5400 4345 5887 872 1417 319 -5657 -5875 345 4391 4326 1770 -632 -1927 -5216 -4265
1835 -4265 3767 6220 1440 1621 1221 -5845 -6107 2137 4201 2139 2612 967 -4117 -5734 -2783 2542
1851B542K241k931j001p24n608o92Q587K559l360J458o57p518r06N622L161K49
1867C022L43j656l492l651M75O312K709k634J102m2p886j600P727K395j725K546
1883C945o39o142k811L096L688K075k82j93j341o242j562O871K948k442K493M57
1899C919p902k956N805K272K91K559l98m164m108k32M889K738m88J485j94p207
1915c691l189O283K355j679L766Q95o817l386K491J790K081K269R77k221n607
1930c683k129M758K569p77L386J165p394l948M732J071j01M340J303n117m142
1945c967l41K467K513Q51K196L88o436l261L999J316j132N171K662o777m044K068
1961b327Q90P06L634J726k101m534k855K609K252n57L917K188n772m725K807M10
$$ plain form
1851 2542 4783 1852 851 127 -5481 -6173 2414 4973 1613 3071 2414 -5104 -6010 -388 2773 3022
1867 3022 3365 1709 -1783 -5434 -4959 1353 4062 1428 2530 2488 -5398 -6998 729 3124 1399 3945
1883 3945 3306 -2836 -5647 -2551 1137 3212 2930 2737 1396 -4846 -6408 463 3411 969 3462 3919
1899 3919 -3983 -6939 -1134 1138 1429 3988 3590 -574 -4682 -4914 -25 2713 2225 3710 3516 -3691
1915 -3691 -6880 -597 1758 79 3845 4740 -2077 -5463 -2972 -1182 899 3168 4145 1924 -3683
1930 -3683 -5812 -1054 1515 738 4124 5289 -2105 -6053 -1321 -250 -351 3989 5292 175 -3967
1945 -3967 -4308 -1841 672 1523 3719 4107 -2329 -5590 -1591 -275 -1407 3764 6426 -351 -4395 -2327
1961 -2327 -1437 -731 2903 4629 2528 -2006 -4861 -2252 0 -557 3360 5548 -224 -4949 -2142 -1732
1977a732m67N418K404m475l648k56J85J278K428K538P84m471m200J972R59l82
1993a665M711K879n727l423J457q92j80M592K666j634l174k060n29J064J090M169
2009C344K182n002l375J713o84j520N366L484l756k644m72j840k20L643L028N87
2025C834l103l314N20k47m33M534L865m144l298J450k133j648N245L265j648j944
2041H01j885j638K27R53L225K858l003l247O91j376j959N185M068k735k127p9
2057d1k662j035L461K831P83j170k764j056p65o43L670M036k524k717O61k414
2073b349k232M004L883r97r14p80k894j028J374K846K841j074k727l93j513k049
2089d002L509M384j954j356L47l223k196K966L022O65K95j710k260r79p10K650
$$ plain form
1977 -1732 -2199 3219 5623 1148 -2500 -2756 -2571 -1293 1135 3673 4457 -14 -4214 -2242 -1283 -1665
1993 -1665 3046 5925 198 -3225 -1768 -2660 -2840 1752 4418 2784 -390 -2450 -2979 -1915 -825 3344
2009 3344 5526 524 -2851 -1138 -1822 -3342 2024 5508 1752 -892 -1364 -3204 -3424 219 3247 3834
2025 3834 731 -2583 -2063 -2310 -2743 1791 5656 1512 -1786 -336 -2469 -4117 1128 4393 2745 801
2041 801 -1084 -2722 -2495 -1542 1683 4541 1538 -1709 -1018 -2394 -4353 832 4900 2165 38 -41
2057 -41 -2703 -3738 -277 2554 3337 2167 -597 -1653 -2418 -3061 609 4645 2121 -596 65 -2349
2073 -2349 -4581 -577 3306 2309 1395 615 -2279 -3307 -1933 913 3754 2680 -47 -440 -1953 -4002
2089 -4002 -493 3891 1937 581 928 -2295 -4491 -1525 1497 2162 2457 747 -1513 -2492 -3202 -552
2105e52L974m61k406L49k297k985L338L729q25L32k80l663j773J409J755K333
2121A977J090j929j275j823k229K538M169l67n63L86l277k697K304K691M48J416
2137B859n02l092j668l75J041L766Q36j568k60k267k999K312L038Q4J051M54l457
2154g47k583R89J330K247J727p61j625j452k401J001L660O46l82R33k961l499
2170c878J426J821J072K094N86l043j917q16L94K500K369n98m25j430l258L97
2186b706K684R75J294J121k853l038J41O38J220K894L30j743j367k221p10L138
2202b03J622J85J370k268l514P8J917Q36K070J421k704j677j039r92J736L310
2218B148n1m69p43l227j145K323J195J597J583k030k949r1j07O32L199R95j302
$$ plain form
2105 -552 3422 2961 555 904 -1393 -4378 -1040 2689 1864 2196 1916 -1747 -3520 -2111 -356 1977
2121 1977 3067 1138 -137 -1960 -4189 -1651 2518 2151 1588 1974 -1303 -4000 -1696 995 1443 2859
2137 2859 2357 -735 -2403 -2778 -1737 2029 2865 1297 1037 -1230 -4229 -1917 1121 1205 2256 2710 -747
2154 -747 -3330 -2341 -1011 1236 2963 2202 577 -875 -3276 -2275 1385 2031 1649 2582 -379 -3878
2170 -3878 -2452 -631 441 2535 3121 78 -1839 -2655 -2261 239 2608 2010 1585 155 -3103 -2706
2186 -2706 -22 953 2247 3368 515 -2523 -2382 -1744 -524 2370 2700 957 -410 -2631 -3341 -203
2202 -203 1419 1604 2974 706 -2808 -2730 -813 23 2093 3514 810 -867 -1906 -2898 -1162 2148
2218 2148 2097 1628 885 -2342 -3487 -1164 31 1628 3211 1181 -1768 -1859 -1966 -1334 1865 2860 1558
2235A558q05k155j991J793K614O44Q14r10l116q94P95N33K158K316j978j733p85
2252a142j898R35L507Q43l32j23k500k227J309J591P73K124o58k642r16q22mK908
2270G26J718p89l96j789k786Q25K745Q92Q65L83k806j780N89J02J394K719k96
2287B316j185j663k227J2L025J489l50R81k102k987M41J437Q01K000M60k177j549
2304a278o52m21K342K019k22P7j242l184J45K578M12M28J949k022k834j6L5J250
2322f36K450L57j050j061k138p22K570J167m7J682r63l128q54J378L21J713J914
2339B953j386k269r13q07J091K317K53O07n74l158p34J817L16P89K513q57l181
2356a223n70L18L26J966J759p97j315j785q76J267J022L56K195m69l643q62J206
$$ plain form
2235 1558 753 -1402 -3393 -1600 1014 1658 2472 1562 -1554 -2448 -1653 -1120 1038 3354 1376 -357 -1142
2252 -1142 -3040 -2105 1402 2245 1913 1790 -710 -2937 -1628 -37 736 2860 2202 -440 -1356 -2178 -2182 726
2270 726 2444 1655 1259 -530 -3316 -2491 254 1146 2011 2394 -412 -2192 -1603 -1501 -107 2612 2316
2287 2316 1131 -532 -2759 -2747 278 1767 1417 2398 296 -2691 -2250 -813 -12 1988 2448 271 -1278
2304 -1278 -1930 -2351 -9 2010 1788 1865 623 -2561 -2416 162 574 1002 2951 929 -1905 -1921 -1886 -636
2322 -636 1814 2171 1121 60 -2078 -2800 -230 937 890 2572 1609 -1519 -2373 -995 -674 1039 2953
2339 2953 1567 -702 -1615 -2422 -1331 986 1239 1846 1272 -1886 -2620 -803 -487 302 2815 1958 -1223
2356 -1223 -1793 -1475 -1149 817 2576 1779 464 -1321 -2197 -930 92 448 2643 2174 -1469 -2331 -1125
2373a125l49J294K859o13k420o75p65K38J870J098Q06j43k832j592J509Q2P02
2390e6K877q6l459p29K51j121J783K589j50j032j368j675N81J082N21K433K88
2407B729l468r83Q67p69R68L108L97k880k94r68q45J224J808J104R5k285j671
2424a863M21k36O95L203P82l204l90J50j615N52L216N79j305o68j448q76P15J312
2442B0J865O69k650j144N55j242J13L511R14j897l95j019j862R05K179J448Mr86
2460I88j603m76m78K26L010J249k583l63j08k233k95L682J000j160K50j257k023
2477b174L3J497J902J311j393j387p3j859m21L678J459j798L0k82k850J04K364
2494A41J138K47n7j268j352p81j75K915J472j237k96j62k701n35L301J164q71
$$ plain form
2373 -1125 -1474 -180 2679 2066 -354 -1029 -1794 -1556 314 1412 2218 2075 -757 -2349 -840 -758 -56
2390 -56 2821 2735 -724 -1453 -1202 -2323 -540 2049 1899 867 -501 -2176 -1595 -513 8 2441 2729
2407 2729 -739 -1722 -855 -1624 -656 2452 2849 -31 -325 -1293 -2138 -914 894 1998 2093 -192 -1863
2424 -1863 -1442 -1678 -983 2220 3002 -202 -592 -442 -2057 -1505 1711 2290 985 317 -1131 -2007 -1292 20
2442 20 1885 2554 -96 -1240 -685 -1927 -1814 1697 2611 714 319 -700 -2562 -1657 522 1970 1974 988
2460 988 -615 -1091 -1569 -1343 1667 2916 333 -30 -138 -2371 -2666 1016 2016 856 1106 -151 -2174
2477 -2174 -2141 -644 1258 2569 1176 -211 -284 -2143 -2564 1114 2573 775 805 523 -2327 -2223 141
2494 141 1279 1526 1469 201 -1151 -1932 -2107 808 2280 1043 747 585 -2116 -2651 650 1814 943
2511I43L76n43k200q60J120J676J145l65q21o08j873q33L048J665j331L66L90
2528A295l081r51K542J235mQ06q59j488j146j40J987J704p45l77L20k671j432
2545c005K650J426q80J362N5l105p63J039J215R97N11m32n38j638j317K294J437
2562A308o95O54N79l142j467J924R31K00J390k24k063r40k28Q20J455N75L40N6
2580A473k427j707K014J260l63J299N25k701j389J094K89O78J557j00j270j217
2596i85j134R71J493pQ90Q16k903j400J453P92m79J958O43j945j386j48J48J355
2614A32J075J54R2j843j794J077J210o26J586J413k381j753Q41j14L32K063M18
2631A882j015j177j197L12J034L42R17J360k299k125J127L16m63K256J046j814
$$ plain form
2511 943 1319 776 -1424 -2284 -1164 512 1657 1292 471 -137 -2010 -2843 205 1870 539 905 1295
2528 1295 -1786 -2737 -195 1040 1036 1842 983 -505 -1651 -1791 196 1900 1155 778 1098 -1573 -3005
2545 -3005 -355 1071 191 1553 1608 -1497 -2260 -1221 -6 991 1502 1070 532 -1106 -2423 -129 1308
2562 1308 613 1267 1846 -1296 -2763 -839 92 292 1682 1458 -605 -1545 -1773 -953 502 1077 1417 1473
2580 1473 -954 -2661 -647 613 250 1549 2074 -627 -2016 -922 -633 45 1602 1502 232 -985
2596 -985 -2119 -1148 345 338 1228 2044 -859 -2259 -806 -14 -493 1465 2108 163 -1223 -1371 -1223 132
2614 132 1207 1361 1453 -390 -2184 -1107 103 -523 1063 2476 95 -1658 -817 -931 -599 1464 1882
2631 1882 867 -310 -1507 -1195 -161 181 1098 2458 159 -1966 -839 -523 -986 1270 2316 502
2647E02j529j08j25J97J777O21K14j149k030N42N79k02J842J372j729j851N13
2664e64n61K2K031J198j259r25j018l57L23R30J139J001j114k211L91L02o24K022
2682G26J484j059j457j98p50J53J452Q99P6m93j804l73N86k90J434J662j180j623
2700g55J20l78p30K018J674p71p02o64j196J24R87P74J136k88j631n85k68m90
2718a625J537J956q59q27m22r54m50J438J180K80Q7j397r95K7j59J427J646n24
2736A366j336l06q37o35J675J551n36m90L21j880o39R72R73J065L18j652n33m63
2754a066p24J303K224n37p89J37j308r97J065J292L48M85r55j358j44j83O35J464
2772H92O44j292k85p85j141J104J831q5J93K15j788r30N51N15J049J036j119q92
$$ plain form
2647 502 -1027 -1135 -1260 -1063 714 1335 1549 400 -1630 -1088 -509 -711 1131 2503 774 -1077 -564
2664 -564 -1125 -1103 928 2126 867 -58 -1076 -1433 -1110 -180 959 1960 846 -1365 -974 -672 -1296 726
2682 726 2210 1151 -306 -504 -1254 -1101 351 1250 1326 833 -971 -1344 -758 -1048 386 2048 868 -755
2700 -755 -635 -1013 -1743 275 1949 1178 476 -188 -1384 -1260 -273 501 1637 1349 -282 -867 -1135 -1625
2718 -1625 -88 1868 1009 182 -240 -1194 -1644 -206 974 1254 1341 -56 -1051 -1024 -1183 244 1890 1366
2736 1366 30 -276 -1113 -1748 -73 1478 942 452 773 -1107 -1746 -774 199 1264 1582 -70 -603 -1066
2754 -1066 -1790 -487 1737 1200 411 548 -760 -1757 -692 600 948 1433 478 -880 -1024 -1207 -572 892
2772 892 1536 244 -41 -826 -1967 -863 968 883 1076 1291 -497 -1427 -876 -361 688 1724 605 -287
2790b87m88m29K42J806L12k50K5j596j079O95R85N58Q76k98j465m86n2j41J503
2809D31J310p17o85n10j418L40J386N55M65O5j628j109N43K92P12J186J04j186
2827A36n61q27l18J840N46R2M62j175j646K88J072K30Q84N52j602r53K2l97J278
2846g7J318k98m68m20j460j5J128P01M28O35j155j202O0K20K69J309L77j144l77
2865a71o53p38J258J104KJ79l40j694j63N01L04J094P01j133p27n5r45P97J703
2884A024J23m50J17j876l89J076N96K63P09l12j520m35J87r8J588O04o41m27k32
2903i3j611N94J688J91K22J41j442j218P56L52R59O90m20o71n56q15J42J576M06
2922H91l19M72j276j136L33J034L04O72K09j133o74j29k94J351R85n83m05k73
$$ plain form
2790 -287 -775 -1204 -962 844 1156 906 931 -665 -1744 -1049 -64 494 1370 1072 -393 -879 -931 -1072 431
2809 431 1741 1024 339 -171 -1589 -1249 137 692 1157 1222 -406 -1515 -972 -680 32 1218 1322 136
2827 136 -425 -1252 -1570 270 816 908 1370 195 -1451 -1163 -91 139 1023 1575 -27 -980 -958 -1355 -77
2846 -77 1241 943 475 55 -1405 -1420 -292 409 837 1472 317 -885 -825 -605 -336 973 1350 206 -171
2865 -171 -824 -1562 -304 800 802 981 641 -1053 -1216 -715 -411 683 1384 251 -476 -531 -1476 -679 1024
2884 1024 1147 697 814 -1062 -1451 -375 221 484 1193 881 -639 -1074 -887 -985 603 1207 566 139 -93
2903 -93 -1704 -1110 578 769 991 1132 -310 -1528 -772 -420 539 1229 809 138 -418 -1233 -1091 485 891
2922 891 572 1044 -232 -1368 -1035 -1 303 975 1184 51 -623 -752 -1046 305 1290 707 302 29
2940B9j195m6J232N75m9M44p17j359M1L41O07J112P3o40o25q68m89J516P20j21
2960E81O07p42j749K19Q76J04Q08N17q49j045j6k45N11J097K17p9l47j575l04
2979a414J232L57K86Q37l23j597m45M17K36J118L12p0p44j042o83R08Q62K72O86
2998A205l75j508n41Q57o2O60R73P6j421n82j39L31Q27O31K1r7j347j082Q58O36
3018g9K86R28o8j529k06j57k71J070R40J7n45q02q11N84P56J55R10O7j548p64
3038a067N16m5L64J378J10j172n51l82k26P55R07M35L0j125p67K4L58J33J306
3057I81O70j620n63J63m37J60J434Q6m42m28q68l39O11M14Q18M95j249o81L14
3076d81j83j85J790N50j052m40l84m30L01J019L37M5n41p01l26NJ19J093Q53j196
$$ plain form
2940 29 -1166 -1212 20 595 546 990 273 -1086 -1045 -704 -97 1015 1088 448 -177 -1045 -1534 -18 702 581
2960 581 1188 446 -1303 -1084 -208 -104 704 1221 372 -673 -689 -934 -423 674 891 812 465 -1110 -1414
2979 -1414 -182 175 461 1298 975 -622 -1067 -650 -414 704 1016 946 202 -840 -1523 -615 247 519 1205
2998 1205 830 -678 -1219 -362 -424 236 1209 1285 -136 -718 -857 -526 301 932 953 856 -491 -1573 -715 -79
3018 -79 207 1135 1067 -462 -668 -825 -1096 -26 914 931 386 -416 -1227 -643 113 268 1178 1245 -303 -1067
3038 -1067 -551 -596 -232 1146 1256 84 -467 -849 -1075 -320 587 1022 1052 -73 -840 -816 -458 -325 981
3057 981 1651 31 -532 -369 -806 -646 788 874 432 4 -864 -1203 -592 -178 640 1135 -114 -795 -481
3076 -481 -664 -849 941 1491 439 -1 -385 -815 -514 505 842 887 346 -355 -681 -676 -557 536 1389 193
3096A93m99Q5p97K5J507M39m25j99o32o72O0O17Q74O86q49n63j91l66l97J559
3116D55P01p45l88r2r86m5J177K88J11J62p34o57P6o8J142R98p24p64L89j006
3136g10m05J325P42o09Q8k08q74l21M88O17P57j26p05q6p12l19J002J277o59l60
3156B02L47j173l11R59N53j19K82l03r17l07J62N44R70j32l98P0j069p85J416
3175iP74m59M70j55j207l73N56K78P70K07k75m07p39n22P89J046l23n9K64j177
3195e51o61Q70N04R3N15L4q39o65m3M69N17N80o12M09p35j017N93R77j78M57m4
3216F73j039m59J55L29L05Q68m97l77k00q04O38M16M88k3L63r05q27N97L67L5
3236A03M95M70q36o91J19j37N44N06o9j27k39j453O64Q51j06L81M19p76r46L47
$$ plain form
3096 193 -306 -221 -1018 -993 514 953 528 329 -303 -975 -915 -298 576 1262 413 -150 -341 -707 -1104 455
3116 455 1156 411 23 -69 -1055 -1100 77 365 476 638 -96 -753 -677 -745 397 1395 671 -93 296 -710
3136 -710 -1115 210 952 343 431 223 -651 -972 -484 133 890 764 59 -27 -739 -1058 -56 1221 562 202
3156 202 549 -624 -935 24 577 458 740 437 -480 -787 -625 -81 889 757 359 429 -640 -1425 -9
3175 -9 765 306 776 621 -586 -959 -403 -125 645 852 577 170 -569 -1091 -302 744 421 362 626 -551
3195 -551 -1212 -342 162 255 770 804 -35 -700 -743 -274 243 823 211 620 -115 -1132 -539 438 260 717 673
3216 673 -366 -825 -670 -341 -36 832 335 -42 -242 -1046 -408 8 496 473 836 -69 -896 -299 68 103
3236 103 598 1068 232 -459 -340 -477 67 573 504 377 138 -1315 -651 200 94 475 894 118 -828 -481
3256d81K58J39O03J89k43n30o44k63P88K25L87M82q02r62J88L65p4P94P09o89
3276D39o25j82k75O16M91K73k33l74o98l10M96J03J89J000l14j144J7J70j97Q21
3296B63L32k85k58j59o20M80K28N11K25k68j090N2K06j48O61R08q14m72k12j59
3316f19N0P63L17j10l2q75j21K66j39M80Q11l26p72j07L9l01P57P43j32l63l47
3337a8p90L87K75K79N19j12n54n30J30j57M62J139m51o90Q2k42l09N16L96K75
3357F07L58r95p05K93O2J36R05O2p34j80j72m17N06P57J02l04k75o05L0K38K76
3378e5L99L80o06m22k40J48O4J239j56p28J25l65n32L49O70J0L60j88q81m6L8
3399d37J02N08L16K50o57l20l66J08P61K04j04J24n09p24L70K67J91M33j23m55
$$ plain form
3256 -481 -223 -84 519 708 465 -65 -709 -972 -184 41 428 910 108 -854 -666 -301 -375 419 1128 439
3276 439 -186 -368 -643 -27 464 737 504 130 -568 -878 -382 -279 -90 910 596 -548 -531 -361 -558 263
3296 263 595 310 52 -107 -727 -247 -19 492 717 449 -641 -589 -383 -531 130 1038 224 -248 -460 -619
3316 -619 -569 194 511 401 369 -506 -627 -361 -500 -20 791 465 -307 -414 -375 -676 81 824 692 329 -18
3337 -18 -808 -421 -146 133 652 540 -14 -544 -414 -571 -109 1030 579 -111 -29 -271 -580 -64 332 607
3357 607 965 -30 -735 -442 -380 -244 661 723 -11 -191 -363 -780 -274 483 585 281 6 -599 -569 -331 -55
3378 -55 344 724 118 -304 -544 -396 -332 907 751 23 148 -217 -749 -400 270 280 640 452 -429 -475 -437
3399 -437 -335 173 489 739 82 -238 -604 -496 265 469 365 489 -20 -744 -374 -107 84 517 394 -61
3419f1l67o1j10P46N06n05P2j82p86K27Q13K8K13J27p54l56j63J03L61Q40j54
3440E37m93R3r07J56O88N84k01p5l20o25K3L67lO18K87p13j23k20j27M11L70K9
3462C56K3l51n44j9L99K49L52J58n20m60M8j38J71P39j35j35j74l80m84R51J20
3483B26K0M50j33q86k36M58l32P06K43m81j89l76k82L79Q46n5M4j41m07m47N44
3504d9n2M42K19j62o62j45p6r9O41M05l26L5k71m55K11K04K16L55M0o99r4o0r3
3527d75Q03L35k25j86l84l63m3P23K19k9K52p29p53N34J07K55M72Nn02p2q4o70
3549h10Q01N21q2P7m69n12q5P65LM3L51l51n68j42J08K49N31M4l76M0j90p90P29
3572a13K93k65N44j00q05rK40Q5O23J56n46m8k98l40L67L06K89j55J84q46m26
$$ plain form
3419 -61 -428 -489 -599 147 653 148 220 38 -748 -521 292 320 533 660 -94 -450 -613 -510 -149 691 537
3440 537 44 137 -770 -614 74 658 457 382 62 -563 -540 -173 -176 442 729 16 -107 -327 -454 -43 327 356
3462 356 379 28 -516 -535 -136 113 465 623 103 -357 -309 -447 -276 463 328 193 19 -361 -845 106 226
3483 226 246 696 563 -323 -559 -101 -433 273 516 35 -154 -530 -812 -433 413 358 402 261 -146 -593 -49
3504 -49 -101 341 560 398 -264 -409 -485 -584 57 462 136 171 -100 -555 -344 -140 76 431 471 -228 -322 -382 -475
3527 -475 328 663 438 252 -132 -495 -538 185 404 375 627 -102 -855 -321 -214 41 513 518 16 -56 -140 -810
3549 -810 -9 512 430 507 38 -474 -559 206 209 252 603 252 -316 -458 -350 -101 430 474 98 138 -52 -842 -113
3572 -113 180 -85 459 359 -446 -455 -215 -130 493 649 103 55 -243 -583 -216 90 379 224 408 -438 -864
3593h64P08R7K64L34l54n21R6j29J91O01j23q0k36k87m12M36K83M4N39Q4p55j74
3615b58J14j87M54L58k83k29n7k03j7L11K25J38n0l26m86L38K63j51N17j09n93
3636b31R7M3l18N38K94o0j3n52k80K24M38o0K80L47q74k78L52k66J70O82j41k53
3658A39j52n62J62O18j87L73m2j66o17%K67o0O01m1k56j79j52j80L52L79m0J23
3680C80k63m45m3L24k84N50O32o96o36L83o0l92R42J53m98j65k93o6L00j46M59
3701A36M79m24m55k33K67j81P51L51o09k31J0j11k20O81K61j52J56o91Nm3q2M77
3723A42O84m93n10j9O2k69O10l0j25N8j54m65R3M39J14J40j82l10J62k21j28J39
3745b63O48m01j0J07l74J05l1K75J64R1k78n21L60n4J13M84j41n27L09m31p3L93
$$ plain form
3593 -864 -156 -59 205 539 185 -336 -240 -369 -178 423 300 220 -16 -303 -715 -279 4 48 587 671 -84 -258
3615 -258 -144 -331 123 481 198 -31 -88 -291 -308 3 228 366 316 -10 -496 -158 105 -46 471 362 -231
3636 -231 -134 -91 -409 129 423 363 350 -202 -482 -258 180 120 400 747 -127 -405 -53 -319 -149 533 392 139
3658 139 -13 -575 -413 205 18 391 349 183 -434 -434 -167 -227 374 333 77 -102 -254 -434 -82 297 257 380
3680 380 117 -328 -371 -47 -331 219 851 155 -481 -98 -158 -550 392 545 47 -118 -411 -477 -177 -323 136
3701 136 615 191 -264 -497 -230 -411 340 691 82 -149 -139 -250 -470 211 472 320 476 -215 -210 -253 -335 142
3723 142 826 333 -177 -196 -134 -403 207 177 52 110 -44 -509 -416 23 137 277 95 -215 -53 -274 -402 -263
3745 -263 385 -16 -26 81 -293 -188 -219 56 220 311 33 -488 -128 -182 -69 415 274 -253 56 -375 -448 -55
3767e5M08k92J51q2k95j37K39J30J56K67m00k58k8k8L55K69j34%l0l81m19N35
3789b9J39K44Qk57k69m3k35K60K19K24j71J07m0q15N16K23J55j14o8l01j83L44
3811h6j7L49N2jk73l49N0K6N77k44K07K1k68l58K43J17R7J71o3k19l39j50m0N21
3835B4l6K69p5m88M2j05L51j7r2M42m94m1p4K55K14R6l29M5r2j92L7L12L8j57
3859f7K95l76j78J18M50k39K43N4l48j03r5oK39K98j73j62K38l56J0K67j43M14
3881C80J15n08o6L9K00j47J63J7j06J17n73PR9L14J44J35l01l23J73K13j41J75
3903A26J67r9n7j0m99K75K88k52K00j20j23M2R2k19L34J59j75m02J90k08N2N70
3925C31k15m3j1j7j74j28L66j26L21n4k96k50L71j65K68O8j2j67l40n5J99K80
$$ plain form
3767 -55 353 61 212 130 -165 -302 -63 67 223 490 90 -168 -196 -224 131 400 266 266 236 -145 -564 -29
3789 -29 110 354 362 105 -164 -207 -442 -182 37 261 90 197 157 -658 -142 81 236 122 54 -247 -430 -86
3811 -86 -103 246 298 297 24 -325 -275 -249 328 84 291 312 44 -314 -71 46 143 314 251 32 -307 -457 -497 24
3835 24 -12 257 182 -306 -264 -369 -18 -35 -127 315 -179 -220 -294 -39 175 271 -58 -13 -105 -297 -260 52 90 -67
3859 -67 228 -148 -326 -208 242 3 246 300 -48 -151 -246 -252 -13 285 112 -50 188 -168 -158 109 -34 380
3881 380 495 -13 -79 -40 160 13 176 193 87 204 -369 -362 -263 51 195 330 29 -294 -121 92 -49 126
3903 126 293 194 137 127 -372 -97 191 -61 139 19 -104 -62 30 -189 145 304 129 -273 -83 -291 -239 331
3925 331 116 73 62 45 -129 -257 109 -17 304 250 -46 -296 75 -90 178 246 234 67 -273 -328 -129 151
3947A51l3m1m5j15q5o9L76J6RJ27n61M22l80J94j5J61r7j33j56Q1J57p5J64J60
3971B13j73j12j50J61l1j04L35o2j15k29J4J03J17L14j62J40k04j38rJ81l47L78
3993A20N3j51k60K40o1K2L26j77j2r8m0j2qJ51R6p0k23J68j04m0j38L45n1j2O7
4018A31n00j65N27J01J3P8k01j63m6J15P0M0K75k42j33o0J23j07M21k90K32k44
4040b5k66j46K95J81M2j72K83j10j0j16q0J80n0j10lK2J82j82K63J64k98jq5k23
4064b65J21K02j10L20j27k89K6n7J54R2N3n9P7O2l16p6L11mj18n3k3j39K87l47
4088b78M69J1l77L83l16j2m8K24j23Q5J37l93N5j02k5L26O4M7j36j2Kj98L92j43
4112C2L3J4J4j28k6J91l21N74m04J16j87J85j14j03L08O5q1r6k51J27q2L74o4
$$ plain form
3947 151 118 77 32 -83 -168 -237 139 155 164 291 -270 152 -228 -34 -49 112 15 -118 -274 -193 -36 -111 53 213
3971 213 40 -72 -222 -61 -92 -196 139 77 -38 -267 -253 -150 -33 281 119 259 55 -83 -92 89 -258 120
3993 120 173 22 -238 2 -59 -37 289 112 100 2 -38 -50 -58 93 189 119 -104 64 -40 -80 -218 127 76 64 131
4018 131 -369 -534 -7 94 107 185 -16 -179 -225 -110 -40 0 275 33 -100 -160 -37 -144 277 -13 219 -25
4040 -25 -291 -437 -142 39 81 -91 192 82 72 -44 -124 56 6 -104 -107 -85 97 -85 178 342 44 43 -42 -265
4064 -265 -144 58 -52 268 141 -148 -122 -179 -25 67 120 61 138 200 -116 -192 119 115 -3 -56 -79 -218 69 -278
4088 -278 191 202 -175 208 -108 -120 -168 56 -67 18 155 -238 -183 -285 -310 16 80 127 -9 -21 -19 -217 175 32
4112 32 65 79 93 -35 -61 130 -191 383 -21 95 -92 93 -21 -124 184 249 168 72 -179 -52 -134 240 176
4135A76k43J41j83J77R9j64K17l11j16K42J3k15mK60o4L0k14n0qJ19o6L82J92
4158D10m90L11k60o9J38O4L5k17J77k86L3mK97o0Q6j57q3j09M8Q0J35m3O2l1k66
4183a99J67j11K72k57K00j54q7MK31j72L33Pl73J38R6k66K50L58m60K15m5k62
4205a15j43K20P4n2J70j91l40K37K13p2P4N6q1J8k57j90M10J52K7j90p6j3q1J58
4229HJ73n6j6J5k48p1Q9J33j2J15l2q7Rk52J30N0Q6J71pj23j30K07j35k4J00k08
4255a15J81j21j10K39n9M8q6j24N5j16M41Q6n86L83J0j53J70j53p1K44n8k27J03
4278a9j09N7M1j67L23P4r1l16K3J54q9R2J89m4j76J65m09K40R7o9mJ18k23J35
4302hk0J33l6J87O8l90O0j30J73J35M6J7j22J35l33m8N9J74j6J86m26Q7m3m3J42
$$ plain form
4135 176 -67 74 -109 68 167 3 220 -91 -207 35 48 -167 -171 89 25 55 -159 -209 -217 -98 -164 218 410
4158 410 -80 231 -29 -98 40 104 139 -78 99 -187 -154 -158 139 79 165 8 -75 -184 -136 -56 79 36 98 67 -199
4183 -199 -32 -143 129 -128 72 -82 -169 -165 66 -106 227 234 -139 -1 95 -171 79 437 -23 192 147 -115
4205 -115 -258 -38 36 -16 154 -37 -377 -140 73 1 75 131 50 68 -189 -379 31 183 210 20 -56 -69 -150 8
4229 8 181 125 109 124 -124 -195 -106 27 15 130 98 11 20 -232 -102 -52 34 205 198 75 -55 152 17 -7 93 -115
4255 -115 66 -55 -165 74 15 63 -23 -147 -92 -208 233 319 -267 116 126 -27 143 -10 -81 163 105 -122 -19
4278 -19 -128 -71 -30 -197 126 200 109 -207 -184 -30 -119 -27 162 118 -58 107 -302 -62 35 -34 -38 80 -143 -8
4302 -8 -28 105 69 256 324 -66 -6 -136 37 172 218 235 113 248 -85 -133 -74 100 84 270 -156 -69 -112 -155 -13
4327a3J15j3O3j0l97N2J20K59O5J24k03m50O1K76l57O59k16J49n78J19L1M1J88
4350H5o8L51l48l25K40r4K17J76L2j03O5k80j56J66L11k03P5j08o5j9J18k42J23
4373e2J46j43j12Jj07J57K97j75M0k03j6k4J66K00l8K40k73m63J88J26ml2K73
4396A92j49k39o8J42L28J5j01J63Q6l73n4j27J98Q0R5n5k13j7l1j3L07n3m7J31
4420A97m64MK96l34K39K93j94j52k60J91j43L13L70j55k48j90m6J86J76J00RM5
4442B33l60l24L55j5J30M54m40k89K08J74l41J65M37l56J12k18k76n1O32Mj62
4463G2J32k66j94J88k7K04m3K99n06K27l73k5M62j69K59k04n4j57P9K8Q3L43k21
4486A37k08q8J41k99L54L78k97r0J11j58m13K75m9J35L67j83o9j64j48O2K67K65
$$ plain form
4327 -13 102 89 152 142 -255 -203 -83 176 241 365 162 -288 -227 49 -308 351 135 284 -294 -175 -144 -103 85
4350 85 17 368 20 -305 -65 -159 58 234 266 163 228 -52 -208 -42 269 66 141 33 -32 -51 67 -175 -52
4373 -52 94 -49 -161 -160 -267 -110 187 12 52 -151 -167 -191 -25 175 137 377 104 -359 -171 -45 -49 -81 192
4396 192 43 -196 -264 -122 206 221 120 283 369 -4 -58 -185 13 93 188 133 -80 -97 -128 -141 166 113 66 197
4420 197 -267 -263 33 -301 -62 231 37 -115 -375 -184 -327 -14 356 201 -47 -237 -283 -97 79 179 188 233
4442 233 -127 -451 -96 -111 19 473 33 -256 -48 126 -215 -50 387 31 143 -75 -351 -402 230 234 72
4463 72 204 -62 -256 -68 -95 109 66 365 -141 86 -287 -312 150 -19 240 36 -18 -175 -96 -68 15 358 137
4486 137 -71 -159 -18 -317 37 415 118 28 139 -19 -432 -157 -206 -71 296 113 44 -120 -268 -206 61 326
4508C26k48M7r2n22L18K35Q0N6r0k96m8j06J65M40q5J50n42Mj99R4O06r5k87K37
4532A48j8o98N09Q5J53J65l59j63j32K0O1M52m3K2J45m83l11L33J57RO9K38l33
4555B6l04K53J03O0J42R3j77k22j63k08M50M4m8R3j89j88J37r7K00J80O2k03j78
4578a34p5Q1J44K46k15J98j47n22J61K01K08O0kk31m15K87NN5L74j2k01K7j85
4601i2j46K28O0Q5M0k64r6l78M75J11K83l0j1j56m27r8J82L45l8L2J23l88l19
4624d79O34k74J22L40K1m25k6j54J02M16J25j57k17o6l48K99K59R4l3j60k41j77
4646c45J5J53K78L74k27l95K62m98J41J77J81J1J08m21l01K61k4M03J82j33l32
4667a30j08R4K2L2N29m20q2j18k99J73J07K87K38O1o26j30L52j04J14L74k16N5
$$ plain form
4508 326 78 125 33 -489 -171 64 144 200 110 -186 -234 -340 -175 265 180 330 -212 -208 -407 -313 293 198 -89 148
4532 148 130 -568 -59 26 179 344 -15 -178 -310 -290 -229 223 180 202 347 -136 -447 -114 43 52 121 359 26
4555 26 -278 -25 78 138 280 373 196 -26 -189 -397 53 97 49 142 -47 -235 -98 -195 5 185 247 44 -134
4578 -134 -209 -128 16 262 47 245 98 -424 -263 -62 146 206 204 -27 -442 -155 -150 -95 279 267 66 93 -92
4601 -92 -238 -10 50 135 175 -89 -185 -563 -88 23 306 276 265 109 -318 -416 -234 111 73 105 228 -160 -479
4624 -479 155 -119 3 343 364 -61 -87 -241 -139 277 402 245 28 -38 -386 -87 172 266 233 73 -168 -345
4646 -345 -330 -177 101 475 248 -147 115 -383 -242 -65 116 127 235 -186 -487 -226 -250 153 335 202 -130
4667 -130 -238 -144 -122 -90 439 19 -63 -181 -480 -307 -200 87 325 386 -240 -370 -18 -122 -8 366 150 205
4689B05r7j62n72O39K98k40J52k14l43M5K60K23J91l76J44k63J22l35L58L04j8
4710C21p4l91j56pL65p8P4K78l24k49N2m0N6O68L9l56j12l32j5K81K1j26O99m58
4734A36k21k43P9J75L24Ml52o1r8o2j30R01o20K09j81j82k4K2J89J42N37k73l82
4757a11J78k53L3K38L70k74P0l61k86K42R1J98J88J42m93m08K74q4L31M05k92
4778A98k26j05j82J79J47K02j09L66l10o53M12q3O5L21Q9j70m68r4N8L15L23o7
4800B08O6j37n50K72K04mR7K24m75j70K40l1n7M89j71k52J03m62J4K60M20j32
4822A56K02j43l21k17K06R0M04M4l8m83qnk03O07r1K13p4n44k13K34J11J58N71
4845F56o02k73N8j43l1O89j1k20J55m45j10j32Q29k23M00j91o27k1J62l25N36
$$ plain form
4689 205 108 -54 -626 13 311 71 223 9 -334 -289 -29 194 385 9 153 -110 12 -323 35 339 321
4710 321 247 -144 -300 -307 58 -20 54 332 8 -241 -189 -229 -173 495 534 178 66 -266 -281 0 21 -105 594 136
4734 136 -85 -328 -249 -74 250 254 -98 -159 -257 -319 -449 452 -168 41 -140 -322 -346 -324 -135 7 544 271 -111
4757 -111 67 -186 -153 85 455 181 251 -110 -396 -154 -63 135 323 465 -28 -436 -162 -246 85 490 198
4778 198 -28 -133 -315 -136 11 213 104 470 160 -493 -81 -164 -99 222 311 141 -327 -421 -363 -48 275 208
4800 208 274 137 -413 -141 63 59 156 380 -95 -265 -25 -56 -113 376 205 -47 56 -406 -392 -132 288 156
4822 156 358 215 -106 -323 -117 -27 377 421 383 -100 -108 -113 -316 291 200 413 339 -205 -418 -184 -73 85 656
4845 656 54 -219 -161 -304 -335 354 343 123 278 -167 -277 -409 420 197 597 406 -221 -242 -80 -405 131
4866A31J77j95r7N9p07L23L51J51KJ61k90n81N26l9K5L69J6k80N1o84J24P02J85
4889D80l73M5L1m13l8m2K27K75O1l71L2j35j21L59L06j76p0N1l79j97M49J89n
4912A85J70k90l67J43j87K38L72J31m52J5j05l21M62K46j71L09j52l69l31N34
4932F0O5K01O2l49j60j12M4l01P58J74l71o8j82j82J03M39j86N64k18o33kJ98
4954i6j02K64L88k35q9k63j55M6L65J22PJ40k72m86L03j10L7M72j07k59j93l2
4976b55j24M12J58N8j19j03n83J13N43J1K57K1m92p9J12l12J42N56j9j59q2m68
4998d12J3L91J43J61M5k84m6N3l22Q3M41M5n1m6m61r6K57J26O9K80k53l10l61
5021e35L66J12J47K67M0m54q9k64K88J21M89j12p4j26o43L75J62M1M68k60n79
$$ plain form
4866 131 308 113 16 75 -632 -309 42 193 195 356 66 -515 11 -28 -3 366 382 102 153 -531 -407 295 480
4889 480 107 152 183 -230 -268 -310 -83 192 253 -118 -86 -221 -342 17 323 147 77 128 -251 -448 1 190 185
4912 185 355 65 -302 -159 -346 -108 264 395 -57 -42 -147 -468 -6 240 69 378 226 -143 -474 60
4932 60 125 326 388 39 -121 -233 -189 -490 268 442 71 3 -179 -361 -258 181 -5 559 341 -292 -294 -96
4954 -96 -198 66 454 219 130 -133 -288 -242 123 245 252 392 120 -366 -63 -173 -136 336 229 -30 -223 -255
4976 -255 -379 33 191 249 130 27 -556 -443 100 111 368 389 -103 -182 -70 -382 -240 316 297 138 56 -412
4998 -412 -399 -8 135 296 341 57 11 64 -258 -175 266 311 260 214 -247 -343 -86 40 109 389 136 -174 -535
5021 -535 -169 -57 90 357 397 -57 -146 -410 -122 -1 488 376 302 176 -467 -92 70 111 579 319 -260
5042b60j0R9j43M71L74l98j77q9j24j38O34r9m0L96n57k78J23J82K33J39K5m79
5064a16j44J11j87L71L02m26J56l01l54N06j1J83K07m4m82j82K8o4L97P33l53
5085C30k34k7n84jN10L29j56J56j75n25L41j3k36N85j64q3j27j66N8K30k0L45
5107C73k12K01o51N5J89L4J33K64k40m83K01l24K15N31r5n3q0m31k09O20o4L96
5129C70Kk18m08J44r5o3N09J69l25j14M0l85Q8L34J89P3Pl52m33L24J52M8L91
5152D47k51q8j79j48k46Q50k29rK5k57l48J71l0O56m3q3l67j92M3k71O45K06J78
5175D80l91k82k58q6N41K25K20p4o28q6K73j3P8N33m35j63J12l11k68N96O2j96
5197g1M26l06l35j00K19J61K15O3k12p1N8k46K25L88n4r1L9o43k41M11Q0K26L42
$$ plain form
5042 -260 -270 -171 -314 157 531 133 -44 -133 -257 -395 239 140 100 496 -61 -339 -216 -34 199 338 363 -116
5064 -116 -260 -149 -336 35 337 -89 67 -234 -588 -82 -93 90 297 253 -229 -411 -383 -447 -50 683 330
5085 330 96 69 -515 -516 -6 323 167 323 148 -377 -36 -49 -285 300 136 53 -74 -240 -182 48 28 373
5107 373 161 362 -289 -234 -45 -11 122 386 146 -337 -136 -460 -245 286 191 138 58 -373 -582 38 -26 370
5129 370 372 154 -254 -110 -205 -268 241 410 85 -29 11 -374 -286 48 237 310 317 -35 -468 -144 8 56 447
5152 447 196 108 -71 -219 -465 385 156 147 172 -85 -433 -262 -292 364 321 238 -129 -321 -278 -549 96 302 480
5175 480 89 -193 -451 -537 4 229 449 375 -253 -339 -66 -79 -1 532 97 -66 46 -265 -533 63 125 -71
5197 -71 355 49 -286 -386 -167 -6 209 272 60 -11 47 -199 26 414 360 269 308 -335 -576 -165 -85 141 483
5220D83k95l99Jm5j0O11R9l97k03P5k72l6O02j5J08Q6o90J73k12J71K92M46j90
5243C83o24K38k62J20K52Q6l5L30q63j23K30L49j21N59j26l81l72K45l63N99L56
5264D77j68k63l32j15R5L83j11J58M37n18l44K53k39M35J68q4k69m82K55k3L98
5285A11P8K88K6m25m89J44J26J4L86K75n85q8K17l51K79M00j63k1j23m44rM25
5307G1j67L21K67l62m51qJ91QK77j1p4k1m74O5K82L97k52L69j73n57kL01p9N4
5331b8K41J33m52J28l87K66K97m9O9J56n86l36L27K46rL78m5m20j86pr5L68M28
5354D37k78k57p2r7k7L16q7K78R2l70k27j10J69K97J44j74j3j88j97K98K83J10
5376C27l28L19m85k55K23N20k16K73k96k34k68J93j53M84J40j04k2k44k30K3L99
$$ plain form
5220 483 188 -211 -210 -255 -265 346 445 48 -155 -80 -352 -388 214 199 307 393 -297 -124 -336 -165 127 573 383
5243 383 -241 -3 -265 -145 107 193 158 488 -375 -498 -268 81 -40 519 393 12 -360 -115 -478 121 477
5264 477 309 46 -286 -401 -306 77 -34 124 561 43 -301 -48 -287 148 316 232 -37 -519 -264 -287 111
5285 111 189 477 503 78 -411 -267 -141 -127 259 534 -51 -139 78 -273 6 406 243 222 99 -345 -354 71
5307 71 -96 225 492 130 -321 -329 -138 -130 147 136 62 41 -433 -368 -86 311 59 428 255 -302 -304 -3 -82 -28
5331 -28 213 346 -106 22 -365 -99 198 149 218 374 -212 -548 -221 25 16 394 349 -71 -257 -264 -359 9 437
5354 437 159 -98 -170 -267 -294 22 -65 213 305 -65 -292 -402 -233 64 208 34 21 -167 -364 -66 217 327
5376 327 -1 318 -167 -422 -199 321 105 378 82 -152 -420 -227 -380 104 244 140 118 -126 -356 -333 66
5397F6J08PL14m96m25N3L17l7N17P7m06P6m96n9L79K47j0Q4j66n70L41J78l55
5420b56O37n7l10j13m3k63K67L47o2M7R5n76kL61j07L07J47k85k97J2r2JJ94N48
5444E00m21j6k23j89J59L26J32J82p6p42J32J9l7L02L68k73k99Q9l41J01N07k21
5466b1K22J75o01QJ17p7j8M26j02l29J57j08k60M93L53r4K2j88n61J9K92K73J12
5489C10l0k59k18M9j71K88N43j12l78n4l97m8O03J73j13L48l01m00n9J59N6L30
5511C19pk42l2l63j21J70N19M1n3m4n78j99M94M31j72L41m09l87K89k61K79L16
5533C31n1jk39O1l34J53J52j18K48k20r0k36L37m6K03J98l96R5m1m10p9P25J48
5556C90j47Kl57j54J86oq0N00j21k33K6k56k17O62j45n1K89j09q34O38q9P8L43
$$ plain form
5397 66 174 181 495 -1 -426 -373 -56 -93 424 501 95 171 -325 -384 -5 242 232 316 150 -420 -79 99 -256
5420 -256 381 324 14 -99 -142 -405 -138 209 147 194 289 -287 -289 72 -35 272 419 134 -163 -151 -243 -242 -48 500
5444 500 79 63 -160 -349 -190 136 268 450 374 -368 -236 -217 -254 48 416 143 -156 -67 -408 -307 200 -21
5466 -21 201 376 -225 -217 -100 -177 -195 231 129 -200 -43 -151 -411 82 435 341 363 175 -386 -367 -75 198 310
5489 310 280 21 -197 -148 -319 -31 512 400 22 -32 -429 -477 126 299 186 534 233 -167 -226 -67 -11 319
5511 319 312 70 38 -325 -446 -276 243 284 231 187 -391 -590 -96 335 163 504 95 -292 -3 -264 15 331
5533 331 280 279 40 101 -233 -80 72 -46 202 -18 -108 -344 -7 -53 150 348 -48 47 6 -404 -483 242 390
5556 390 243 245 -112 -266 -80 -86 -166 334 213 -20 6 -250 -467 195 50 -1 288 179 -655 -17 -106 -28 315
5579C15K53o06r2q0J04K22L01o19K80p5m71J59L62J67Q9J1l62l64L4L39j53M52
5601B66R1l20K9j84k09K30K74J11PJ0m63l04L67j6K25K59l44k68KJ00L0N22j86
5624B29q0n7k30j00L71N7j23L56j38l77j88J64qL69P4k90M3j69l60K33K17K59
5646B52k4j44k76j42K94J41o0L56n8o52K30j69j26O53l5j42J47m42k01m0M41J68
5668A71J0Qk95NK89m06J77N10k18j64k33k40K02K21J51l2K53k01m57J35N0k10
5690b74L47K64l90K02k54k83K00L94n2K32m72j31K8L5L16J16K3n71O3M3j79K88
5712e5K43j65J15j46k90j24L28L89j23P4j08m53J12j63K34K58L29k10j33j33l19
5733c40n8N37J5p7J40q12K83J99n6K00J93Kl22n2j88j91Q40K54l38l20l00K6Q7
$$ plain form
5579 315 568 -38 -130 -210 -106 116 417 -202 78 3 -468 -309 53 220 309 320 -42 -406 -372 -33 -186 266
5601 266 357 37 66 -118 -327 -97 177 288 295 305 -158 -462 -95 -111 114 373 29 -239 -237 -137 -107 415 229
5624 229 149 92 -138 -238 133 190 67 423 285 -92 -280 -116 -124 245 319 29 72 -97 -457 -224 -7 252
5646 252 228 84 -192 -334 -40 101 41 397 339 -313 -83 -252 -378 275 240 98 245 -197 -398 -438 3 171
5668 171 181 189 -106 -101 188 -218 -41 469 251 87 -146 -386 -184 37 188 156 409 208 -249 -114 -64 -274
5690 -274 73 337 -53 149 -105 -388 -188 206 154 386 -86 -217 -189 -154 162 278 301 -270 -207 -164 -343 -55
5712 -55 188 23 138 -8 -298 -422 -94 295 172 246 138 -315 -203 -366 -132 126 455 245 112 -21 -340
5733 -340 -398 139 154 77 217 -595 -312 -113 -169 31 224 226 -96 -148 -336 -527 313 567 229 -91 -391 -365 -278
5756b78K27L43j09P2m59J26p4k76M35M07n03K13k81r6k7M02K78j87J00n42N4n5
5778b30J77L59J20j30m69Q9n0k57L70L66r0k21j37p6j27J73M64q6P5k91j59J02
5800b8j66K93L64k30k42J81k22j10k9L16K1J89l31k00j5j32J77L48J25n92J62
5821a21M3p1J04K49J5J79r7l72j07P1J85J83L22n80p5j68K2L44K55r0k60J29l80
5844b20j68L58J92Q1j46L42p58J28J58k32N52L19m67jj87j60J20J32J03j60J15
5865A01l91N1J47J9KR9k3k25L2K35p7K59J0o1P6k78k21J98N4k6L59j96j77k08
5889b41P7LJ50M23k47j74J16n77J81L93M8k18L45l37k7P0J8J55j6L7m15Q0k5k33
5913d14N68j53K05J93l85l05O5K87k16L75Mk07j92r9m0M15L38j14m01K71l81j72
$$ plain form
5756 -278 -51 292 183 255 -204 -78 -152 -428 7 414 -89 124 -157 -253 -280 122 400 213 313 -229 -175 -230
5778 -230 -53 306 426 296 -173 -84 -134 -391 -21 345 255 34 -103 -179 -306 -133 331 245 320 29 -130 -28
5800 -28 -194 99 463 233 -9 172 -50 -160 -189 127 148 337 6 -194 -209 -341 -164 184 309 -283 -121
5821 -121 -78 -149 -45 204 219 398 301 -71 -178 -107 78 261 583 3 -72 -240 -218 126 381 291 31 160 -220
5844 -220 -388 -30 162 243 97 439 -319 -191 -33 -265 287 606 139 138 -49 -209 -89 43 146 -14 101
5865 101 -290 -239 -92 -73 -71 28 5 -220 -188 47 -30 229 239 178 254 -24 -245 -47 7 -19 340 144 -33 -241
5889 -241 -164 -161 -11 412 165 -9 107 -470 -289 104 152 -66 279 -58 -85 -15 3 158 142 179 -236 -156 -181 -414
5913 -414 154 1 206 399 14 -291 -226 61 -155 220 224 17 -175 -274 -314 101 439 325 -76 195 -186 -358
5935c58K93L2J19K66N4o62J46k0K4K64j09J18k00j13k15M14J69r6K92k82n01R8
5957b67J33r7K72N6K3k92NP0n9L12K71l63J69m58j32K42J68J37j0J82n17JL0j3
5981a37L81J03k23J20l29j74J31kJ69J44M4k35k21q9J99m9N81k10l16J93l77K36
6003f1K0N53l59o1M1m74K72%J54L04j38j43j35k49o9J10N74j59k22J48m90K31
6025a53mK07m5J61o9j97n4K04j08L88k6k65m8k8j31j44N82j81J83k92q5j06K29
6048A8j65M17m5m8l29L84n03K24N1J75j24j24k0k78J19M04k10J46P1l72O0O9q0
6071a60J39K74j31m6j05k50J55K22j04N3L30m29k96K83K0L42O7l18m4O5j93k32
6093c58N47j90J67J89l68j14K20O2j84L29k70j31K0m0r1K35L51k14j92J17l47
$$ plain form
5935 -358 -65 -33 86 352 406 -256 -110 -130 -106 158 49 167 -33 -146 -361 53 222 126 418 136 -365 -267
5957 -267 -134 -231 41 97 120 -172 -167 -97 -156 156 427 64 233 -225 -357 -115 53 190 180 362 -155 -154 -124 -137
5981 -137 244 347 124 244 -85 -259 -128 -130 39 183 227 -8 -229 -318 -119 -168 413 203 -113 80 -297 -61
6003 -61 -41 512 153 92 133 -341 -69 -69 85 389 251 108 -27 -276 -345 -235 339 180 -42 106 -384 -153
6025 -153 -157 50 5 166 97 -100 -154 50 -58 330 304 39 -9 -37 -168 -312 270 89 272 -20 -105 -211 18
6048 18 -147 270 225 177 -152 232 -271 -47 4 179 55 -69 -89 -367 -248 156 -54 92 163 -209 -149 -80 -160
6071 -160 -21 253 122 76 -29 -279 -124 98 -6 47 377 -52 -348 -65 -45 297 364 46 2 67 -126 -358
6093 -358 189 -1 166 355 -13 -127 93 155 -29 300 30 -101 -81 -121 -212 23 374 160 -32 85 -262
6114b62J48J53M8J3K06k2p81M42j92K13L42o1k81J10k7m74N18%p9L77m17k73J05
6137a94L81k08J03K2l9k30L71l93K32J7J24q3o2k09JL90j37j22K14j88j51O3p2
6160a70J15R7J21j48JJ20m81K94K43q5P7k61K13k77L57l21N38j27l33Lk8j28J02
6183g8N0J05K97l27j47l01N55j07j10K21J44p37K45K04l23L35J46j71K5j32l33
6204d39K95J08N8K17P7n01P5R0k68J17L43p3j95J60pj57N7K27k59J80j14p8J4
6227g3J10Q0R7m7r9k26k03J60R3L22j66Q1j50j97q1K77lK60j24R3k59j0N4j99
6251b10L55L4k77J48j10m51P03n7j9K07n6k78o4j89K95K77j3j78m2p1k60P5K22
6274D1K14l72K28j19p7j71L92j01J18Pl71J11L6j96J55K50j27k8k48J89o5K38
$$ plain form
6114 -262 -114 39 87 100 306 284 -497 -55 -247 -34 308 247 -34 76 49 -425 93 93 14 391 -26 -299 -194
6137 -194 187 -21 82 104 65 -165 206 -187 45 62 186 103 41 -168 -167 223 86 -36 178 -10 -161 -98 -170
6160 -170 -55 42 163 15 16 136 -345 -51 192 107 184 -77 136 -141 216 -105 433 306 -27 -24 -52 -180 -78
6183 -78 -28 77 374 47 -100 -401 154 47 -63 158 302 -435 -190 14 -309 26 172 1 26 -106 -439
6204 -439 -144 -36 22 239 316 -185 -110 -20 -288 -171 172 99 -96 64 57 -100 -43 184 -75 105 -9 -87 -73
6227 -73 37 117 214 167 68 -158 -361 -201 -108 214 48 129 -21 -218 -299 -22 -25 235 111 204 -55 -65 -11 -210
6251 -210 145 179 -98 50 -60 -511 192 135 116 323 267 -11 -75 -264 31 308 295 117 75 4 -256 -181 41
6274 41 255 -117 111 -8 -85 -256 136 35 153 160 -211 -100 -64 -260 -105 145 18 -10 -258 -69 -134 104
6296A04r4K95m00M2r2J23l31K68K05K5j64J65l44J38J77r8RL25k78k32o3J77j06
6319a49J74J50m64K56O4l06L44J03j70k40L25k11j30L09n5O9J71k66J24l07J41
6340f8l5J28P9M9j78j32n9L34k8O2K3n7k46j01J69q7J67L79l01l19J44N5L6j3
6364AJ06J4k3k02j2k5J32j1mK42k66k57K90q1K30J37k63n5n2j48K20R5j58K0M16
6389C46m90K3K62k74R9K08M1j80J16l71QM22K0o1o5o5n30J99K12N6K20M7j36j80
6413g3nMK27oK13k48j10k47Q1P8J02p3K52k86k09K32r1K07K36k43j37J97m15J19
6437a95J49Q2p2L4N5m40L71J66k40P1L19k92N7k09q4K85o3J00P4r9q4l7J12qr7
6462d5J61n3n9m7j90J44R5M8r9o6L06m02k9K53R0m4Mk94M10l55j8K53J01k52Q5
$$ plain form
6296 104 10 305 -95 -53 -145 -22 -353 -85 120 145 -19 146 -198 -60 117 19 28 353 75 -157 -220 -43 -149
6319 -149 25 175 -289 -33 31 -275 69 172 2 -238 87 -124 -254 55 0 69 240 -26 98 -209 -68
6340 -68 -103 25 104 153 -25 -157 -216 118 90 152 175 118 -128 -229 -60 -147 20 399 98 -221 -77 -22 14 1
6364 1 107 121 98 -104 -116 -141 -9 -20 -24 218 -48 -305 -15 -96 134 271 8 -47 -99 -247 -27 68 -90 -70 346
6389 346 -144 -121 141 -133 -34 174 215 35 151 -220 -212 210 230 169 104 39 -491 -292 -80 -24 196 243 107 -73
6413 -73 -78 -74 153 147 360 112 2 -245 -164 -86 16 -57 195 -91 -300 -68 -159 48 284 41 -96 101 -314 -195
6437 -195 -46 36 -36 -2 53 -387 -16 150 -90 -19 300 8 65 -144 -228 57 -6 94 168 69 -15 -52 60 52 -45
6462 -45 116 63 4 -43 -233 -89 6 54 -45 -111 195 -207 -236 17 107 63 67 -227 183 -172 -190 63 164 -88 -3
6487cM1q9K07j05M7p6K07k67l27L02j5Q0q7K71n5r7o1j25R2K74l13J15Lj78m5
6512b04j7Q7K69j10l31NK16K3N6O4M1p5N7k69R7k3LK26p6r4k47K35qL3K99l28
6538g1M2Pj32N1K4J88M4L2J8k98k14K61R1J41l18L5J8l23M04J39j35K46m27M03
6562B26k27k95J63K56q0J6o5k52J53N3N0K83l01J88n1k39k79K27K52k25J11K06
6584A70n3m06J63K44k19M04l50lj03J25J%Q4k42K94p4m29L96K70l67L29j05m18
6607b89M66q1k75N1N16l96j43P5p8N8J40M3k00L27k42k17Q5R5R6K75R9m81K10
6630A34K7m72K91J8J20k95K13l4J7K17m13M18k76J38k82L62r8k45L83k88l7K34
6652A32J94o37N87l29j01O9K80n37L20j36j21M32j59R7P1l61k00L00L91k06j4
$$ plain form
6487 -3 38 -51 156 51 98 22 229 -38 -365 -63 -78 2 -85 186 131 34 -27 -152 -60 214 -99 16 19 -159 -204
6512 -204 -221 -134 135 25 -306 -301 -85 -62 -6 58 99 24 81 -188 -91 -114 -111 115 39 -55 -302 -67 -75 -42 257 -71
6538 -71 -29 -22 -154 -103 -79 109 153 185 203 -95 -309 -48 43 184 -134 -99 -81 -404 0 139 4 250 -177 226
6562 226 -1 -296 -133 123 43 59 -6 -258 -105 -52 -2 281 -20 168 117 -122 -401 -174 78 -147 -36 170
6584 170 117 -289 -126 118 -101 303 -47 -50 -153 -28 -27 -27 57 -185 109 35 -394 2 272 -95 234 129 -289
6607 -289 177 96 -179 -128 388 -8 -151 -76 -154 -96 44 87 -113 214 -28 -245 -160 -65 31 306 405 -76 134
6630 134 161 -311 -20 -2 118 -177 36 2 19 236 -177 241 -35 103 -179 183 85 -160 223 -65 -102 132
6652 132 326 -311 276 -53 -154 -85 195 -342 -22 -158 -279 153 -6 91 162 -199 -399 -99 292 86 72
6673G2j14k81L63Lk15L93k03Q0k52lj05M47r6Q7j42K00n8l40K09k00M33q0k45
6696d7k70K16J8n8L84j08k08J80l04Q0L1J75O0l14J67L4q1o3j0J95K34l27j94
6719b10K24j81J76K0K55r5j19q2q3J14j65J41J87n6j25j88J44r3k8K96L2k72j22
6742b30J94k63M32j34RJ68l90j4K24j41n8K50N0j37J1N8k89L31p1K25j13l03K09
6765A8j33J13n6J94K27j61l68J51j1J06J72k52J08j12lk93J79R5J35M9j92Nq5
6788a14p8K14q6K92l27k9L35k56LJ19J36J40l49m7j33K70k80L91m0k41P3o1m6
6811a14l44N24qk26Q4J2l8P2l7K73K87l79l20J2J67J28jk23P5Q0k28R4OJ22Q6
6836A04j05J66m50K45K20l36J64l8K56k20K12k69j06K76M3l40K69j51N2j49K92
$$ plain form
6673 72 -42 -323 40 43 -172 221 18 98 -154 -157 -262 185 89 176 34 234 176 -164 45 -155 278 198 -47
6696 -47 -317 -101 -83 -141 243 135 -73 107 -197 -117 -86 89 149 -165 2 36 -45 -108 -118 77 311 -16 -210
6719 -210 14 -167 9 29 284 189 70 -12 -95 19 -146 -5 182 126 1 -187 -43 -136 -164 132 164 -108 -230
6742 -230 -36 -299 133 -1 8 176 -214 -228 -4 -145 -203 47 97 -40 -29 29 -260 71 0 225 112 -191 18
6765 18 -115 -2 -58 136 363 202 -166 -15 -26 80 252 0 108 -4 -7 -300 -121 -26 109 158 -34 -29 -114
6788 -114 -192 22 -64 228 -99 -128 207 -49 -46 73 209 349 0 -47 -180 90 -190 201 161 -80 -7 -68 -114
6811 -114 -458 66 58 -168 -84 -72 -110 -38 -75 198 485 106 -214 -202 -35 93 92 -131 -56 24 -204 -110 -104 18 104
6836 104 -1 165 -285 -40 180 -156 8 -30 226 6 218 -51 -157 119 162 -178 91 -60 -8 -157 135
6857A35r2J1q5K8l08L33O5j62J1n7L14k41J28l08J69J15J85k63J96l83J25q0J02
6880f2M0lj56J98k73L52k93J06J72O4p9j43k33M20k29J37j00Q3NN2o6p1J97K30
6904C48m52K39j86Q0J66j56J18k49q6Q3N2o4M1P1K22l28J77k29nJ50r1J03J77
6927A81j06L4k16JK30R8l3pk30m7K9j03J09J40J67k26l7k70K06J85j37J85r9j86
6951a32m9K14o5J71k13J41j75P8j48J16K97Q9k90lJ56l56K09k35N07j20j30l7
6973B5J61k31j14J85R6k59J61N4m1M7j44j5K70j27m8n8K39m86K17J99O8k19j26
6996a46L08m01K00J16K49l6j90j30K51k81LJ50J42o3k25j6j74K10L7o9m1J66J61
7019B21k08M2j32N7L22k46k00J33K6q1K01q5oj78Q2K6J88j42o2K25p0m05K21J3
$$ plain form
6857 135 43 54 -31 -3 -311 22 87 -75 -64 -121 193 -48 80 -228 -59 56 241 -22 174 -209 -84 -164 -62
6880 -62 -22 -25 -181 17 -256 96 -197 -91 81 145 66 -77 -310 110 -119 18 -82 1 6 58 -8 -79 118 348
6904 348 -104 135 -51 29 195 39 157 -92 -178 -95 -43 -107 -66 5 227 -101 76 -153 -158 -8 -99 4 181
6927 181 75 109 -107 -106 124 222 189 182 -48 -95 -66 -169 -60 80 247 21 -16 -286 -80 105 -32 153 54 -132
6951 -132 -181 33 -32 139 -74 67 -108 -30 -178 -62 235 324 34 31 187 -169 40 -195 312 192 62 25
6973 25 186 -45 -159 26 122 -137 24 78 37 84 -60 -75 195 68 20 -38 201 -285 -68 131 199 -20 -146
6996 -146 162 -239 -39 77 326 290 100 -30 221 -60 -57 93 235 172 -53 -69 -243 -33 4 -65 -106 60 221
7019 221 13 55 -77 -20 302 56 -144 -11 15 -66 135 50 44 -134 -52 -26 162 20 -42 183 113 -292 -71 -58
7043e8K50j90q3K06N1l2l60J07Q2K6J38k2o9k20K7K17p8K15k40k36M43m98J74
7066a50L05k09K73k93L47k03j40j25L99k0j74N2k06j66L32j61K93j76o7lkO6m1
7089f9K91n9j45J73k56NQ7j30J32o6P0j91K59p5R9R1j60Lj25J3k44J33J10K42
7113A88L8l44K85n59L40j56J87L9p8L18m55L45P5p9m2jN9k46l8mJ82j22J72L5
7137A39m16J00n3O5M98m16K54k40l06K19R9J13J18p7k21O5K18l27K01N9Qn2J06
7160A54l36P1N7J99k24J10M1k50K68j9k24k1M30k05l7O1j02j00K19j37J42J33
7182B30k13k3k4J02j29J35jJ57l13J19j10J16L6J1Q2l1p7j15k12M31k34J88j80
7205e5J06nk9k33N52l42L7K00l66K19j7r7o4J95J38l27J6J08k92M41o0j64L2P2
$$ plain form
7043 -58 192 2 -81 125 176 144 -216 -109 -27 -1 137 115 46 -174 -147 70 -8 207 -33 -269 174 -324 -150
7066 -150 155 -54 219 -74 273 70 -70 -195 204 184 10 62 -144 -310 22 -139 154 -22 -89 -92 -94 -28 -69
7089 -69 222 163 18 191 -65 -60 27 -103 29 -37 33 -158 101 26 125 216 56 59 -66 -53 -297 -164 -54 188
7113 188 226 -118 167 -392 -52 -208 -21 18 -60 258 -197 148 223 144 102 101 160 -86 -124 -128 54 -68 104 139
7137 139 -277 -177 -230 -165 333 -83 171 -69 -375 -156 -57 56 174 97 -124 -59 159 -168 33 92 100 48 154
7160 154 -182 -111 -54 145 -79 31 72 -178 90 71 -153 -174 256 51 14 75 -27 -127 92 -45 97 230
7182 230 17 -6 -30 72 -57 78 77 234 -79 40 -70 46 82 93 175 144 67 -48 -260 171 -63 125 -55
7205 -55 51 46 17 -216 336 -6 31 231 -135 84 67 -30 -94 101 239 -88 -72 36 -256 185 125 -39 -7 65
7229F5j32j99L61P9n8o7k48r4L65r5J45O8j59J9L4q2n7l2K21j32L3k36k61M85
7253B3q8L4M0J44k93jK0J05n7J33k2k89L10m07K53K22q4pJ71j87k65K45p7M8K29
7278B00q6m7M7j41k45L14r6Q3J1k33ll2L46K0j52O9k89J9K30k22J87Q6RR0j23
7303D2r1q7L93j45r9J36l38K87kj22p0j25M95l66K04j30l8K85j97l31K69m2p1
7326a43L4O5j76L25j85J03O5q9k0J03K14m19K59p8q6O1J35l9r1Q4J21k80R1j24
7350g0kJ30J19k63j15L5P5J46R0N5j26l2j82K01P0j92J06J41j42l20K38J4n9L61
7374B78n05K29l0po6k08K54J7M6J13k11l4L7RP6J94j72KO5k63J48P9L5j50K36
7399A72k57M9l8K1n1K52rl00J21L8j18K13m1j7q1O0qj66N5k12N95j96j83J59k82
$$ plain form
7229 65 -67 -266 95 174 116 49 -199 -293 72 -23 122 190 31 50 84 2 -55 -87 134 2 35 -201 -462 23
7253 23 -65 -31 9 153 -140 -141 -121 -16 -73 60 38 -251 59 -348 -95 127 43 36 207 20 -245 0 -77 -29 200
7278 200 114 67 114 -27 -272 42 -54 29 40 -193 -196 -228 118 138 -14 55 -234 -215 15 -207 -20 66 75 165 42
7303 42 -49 -136 257 112 13 149 -189 98 96 -26 -96 -221 274 -92 112 -18 -56 229 32 -299 -30 -72 -143
7326 -143 -109 -44 -220 105 -80 23 88 -1 -21 82 296 -123 136 58 -28 33 168 129 38 122 243 -37 54 -70
7350 -70 -72 58 177 -86 -201 -166 -91 55 145 200 74 42 -140 61 131 -61 45 186 44 -276 -38 -24 -83 278
7374 278 -227 2 -28 -35 -101 -309 -55 -38 8 121 -90 -124 -87 -78 -2 192 20 22 87 -176 -28 51 86 -64 172
7399 172 -85 -36 -74 -53 -104 148 139 -161 -40 -2 -120 93 52 35 -46 14 6 -160 -105 -317 278 82 -101 58 -224
7424b24L60l5J8kk45J24K9k2nj22K8K18j2j03j24K75k89M80j09j53L5k70J13o8
7448a03L58j95Kj66J36j53J56K07k55p7J76j51k28L9L63J9l4P6k52O7O6J81j85
7471D7R5No8q5M2k61R9J38j56J97l3j4k26K79j9RO3J4k73p9K21j46J90Q8r4j18
7497h5J19M7k53M17l51J88K33j26m60L81j54J33P4j36l9j02L34n96O17l99L21
7518A63l46M15o67N63j06K2Q8J4r4j59Q7m0J29l0J74l68L74j50k19J57J29o4J09
7541A81p4K5o7r7on1rJ68o5J1j07o7L03Q1j40Q6l07K93k93M1L0J33j40R2k6o1
7567f6q2Q9J51m6j63j04J1j6M56K2j74K16l79lJ50j64J32K05m71N0K40j08J3j5
7591e6j82K9M03k92K69k66L09j29m7J12l78L10j33J44l1J07l9l10m6J72J06J94
$$ plain form
7424 -224 136 101 119 117 -128 -4 25 3 -2 -124 -96 122 110 7 -117 158 -131 349 240 87 122 -148 -35 -103
7448 -103 255 60 62 -104 32 -121 35 242 -13 -90 86 -65 -293 -254 109 128 94 170 -82 -15 51 232 47
7471 47 142 147 79 -6 36 -225 -126 12 -144 53 20 6 -220 59 40 49 112 126 -147 -226 -5 -151 39 127 33 -85
7497 -85 34 81 -172 245 -106 82 315 189 -271 110 -44 89 163 27 -12 -114 220 -376 241 -158 163
7518 163 -183 232 -435 128 22 44 132 146 52 -107 -20 -60 69 39 213 -155 219 69 -150 7 136 72 181
7541 181 107 132 65 -32 -38 -89 -98 70 5 16 -91 -158 145 226 86 172 -135 158 -135 -94 -64 69 -71 21 -5 -66
7567 -66 -148 -59 92 46 -117 -221 -210 -226 230 252 78 294 -85 -88 62 -102 30 235 -236 -186 54 -54 -41 -56
7591 -56 -238 -209 194 -98 171 -95 214 85 38 150 -228 82 -51 93 62 169 130 -180 -226 -54 52 246
7613B46j62k8K27k67j91J98l3j79L14o8j51J5L1k0j45K83n3J15j07J9qj11K74
7636A99j11J91j28k20o0m3K4J22J68L0j09j61l8K46M3L2n8P4m43L25k97J63L2
7659a9Q9j65M3j00L5J48P1k11J69qj41Q9k2j34L11k01J08K03j70k51J40k10K65
7682C9j39L21j37k68L18m24L39Q9N1m65K41N9L37n46K26M0j52k05J43J66J5J27
7704A75o5K03l66q8K12j71L65j91p4M8J99k41k06J69K12O8r9k41j12K62j28j13
7726a82o7L41k88n0K27q9J25q4J58rj81J31q9O4L7J12L6k69k0Q1k61K73J81j90
7750a3M0J29k87J96L6%J72k29l33K24k19K33j04J85J41k13o0n2J74j39Q6Q8k8
7773B7K1k02nJ69o3K49j26Q5k14L1j55K00r3J15K6j08P7K1j19J08N1N6j76J22
$$ plain form
7613 246 84 56 283 16 -175 23 -10 -189 125 57 -94 -79 -48 -68 -213 70 17 132 25 44 36 -75 199
7636 199 88 279 151 -69 -129 -172 -148 -26 142 172 63 -98 -136 110 153 185 127 201 -242 83 -214 -51 -19
7659 -19 70 -95 -52 -152 -117 31 102 -109 60 52 -89 0 -22 -156 155 -46 62 265 95 -156 -16 -226 39
7682 39 -100 221 84 -184 134 -290 49 138 189 -276 -35 24 361 -185 41 81 -71 -276 -133 33 48 175
7704 175 110 313 -53 -141 71 -100 265 74 0 48 247 6 -200 -31 181 249 150 -91 -203 59 -69 -182
7726 -182 -249 92 -196 -246 -19 -108 17 -67 91 82 -99 32 -57 7 44 156 192 -77 -97 -16 -277 -4 177 -13
7750 -13 27 156 -131 65 101 101 273 44 -289 -65 -284 -51 -155 30 171 -42 -102 -154 20 -119 -33 55 27
7773 27 48 -154 -159 10 -53 196 70 155 -59 -28 -183 17 -76 39 65 -43 34 55 -64 44 95 151 -25 97
7797I7j78J34L0q3J44j00k83K15r5K23j49R2j11M8j45K44p5J5j35J65J0k33J78
7820Hj62J96k6j78J30J22k70N2j7K27M6l2o5j86K68r2r1L98k03q4k28M0Q2L0K49
7845B14l05O8J15n4j52j4MP5J77q1j88K11j28q2J02o8n3J87k90j0L16l00L61N6
7869A61r4k2R2k82J31l10M84k95K62J3k57J30qk74J68L87j80k90j5K55KKr0J68
7893A38j29Nm33N04j20J64j27J87k16j15K12j04N3K04j55o3K3o0r1J22P4K1j90
7916i6K03k04J20Q6o0K47o5l42J73J46k62K55n2p7j15Q9q3j55J21R1L0J1L8k14
7940a15Lr9K06K25J14l37j09nk16L01O4k6q1J8r7Qr0L52k15J18J08l38K57ok07
7965a67L09j57J01l9P1oj44J93o8J84l09NR0Lr4N2o1R9Ql40J24J14J33p0p2L01
$$ plain form
7797 97 -81 53 83 0 144 44 -239 -24 -119 104 -45 47 -64 -16 -161 83 8 23 -112 53 63 -170 8
7820 8 -154 42 16 -162 -32 90 -180 -128 -145 82 128 96 31 -155 113 21 -70 328 125 41 -187 -147 -65 -35 214
7845 214 -91 -23 92 38 -114 -128 -124 -49 128 47 -141 70 -58 -140 -38 -106 -159 28 -262 -272 44 -256 105 161
7869 161 67 45 137 -145 -14 -324 160 -135 127 140 -117 13 5 -269 -101 286 106 -184 -199 56 58 60 -30 138
7893 138 9 14 -419 85 -35 129 2 189 -27 -142 70 -34 19 223 68 5 28 -32 -123 -1 73 94 -96
7916 -96 107 -97 23 109 49 296 231 -111 62 208 -54 201 149 72 -43 46 -37 -192 -71 20 50 61 99 -115
7940 -115 -112 -211 -5 220 334 -3 -112 -117 -333 -32 32 6 -75 -57 -154 -146 -236 116 -99 19 127 -211 46 40 -167
7965 -167 142 -15 86 47 118 112 -32 161 93 277 -32 -27 63 66 -28 24 -37 62 70 -270 -146 -32 101 31 -41 260
7991B60k98l8J13P6l34L27J7k38P3o8Q7K06j79r1L10k23M3l8l03J32J93J95m58
8014b36J34j15KK90J59j01j85o0L3J17j28O3L60j82k94L6J90l42J61J10L3K8j46
8037g3r8K34P4j16M4j20L6l2j73M3J95j95L53q2l4oL2l73O07p3j95J51l23oN18
8062C88l49N2j15O3j66J03Q1l19K44L47j79j87K1K20k92J23l7J33k03l1Q8n7L5
8085c7K5K86l15r2k5J7L20M5j21m5l4m6j62M25k57j02L49J24m42n4J33n1K81j56
8109F6r6J97k97Q7j81p0M60j13J61k74JJ29J40k81J45k58K27j57NJ3J81j85j2
8132a12L73m45q4L81O5j37K3J09l65K16O9k89P0M15k99J12Q0k62j32K98j53m8
8154a15K70l41J56M7L0k01J85J70j44O0j70j02J3M01k21J98o8l27K84mk23N2J46
$$ plain form
7991 260 -38 -76 37 113 -221 106 123 -115 -42 -110 -23 183 4 -87 223 0 43 5 -298 -166 27 222 -236
8014 -236 -102 -217 -215 75 234 133 -52 -112 -79 38 -90 -27 333 151 -143 -107 83 -259 -98 12 45 73 -73
8037 -73 -171 63 137 21 65 -55 -19 -51 -224 -181 14 -181 172 90 56 50 82 -291 316 243 48 199 -124 -130 388
8062 388 39 91 -24 39 -127 -24 57 -262 -18 329 150 -37 -16 204 -88 35 -2 131 -72 -103 -15 -72 -37
8085 -37 -12 274 -41 -133 -158 -141 179 224 103 58 24 -22 -184 241 -16 -118 231 355 -87 -141 -8 -59 222 66
8109 66 -30 167 -130 -43 -224 -294 166 53 214 -60 -59 70 210 -71 74 -184 43 -114 -109 -96 85 -100 -112
8132 -112 261 -184 -268 113 178 41 64 173 -192 24 93 -196 -126 289 -10 102 182 -80 -212 86 -67 -115
8154 -115 155 -186 -30 17 47 -154 31 201 57 117 -53 -155 -142 259 38 236 168 -159 125 121 -102 -50 96
8177I6l18J24P5o6l1L49k32pl1Q3m7J47J8j08
$$ plain form
8177 96 -222 -98 -23 -89 -120 229 -3 -10 -41 42 -5 142 160 52
8191E2
$$ Imaginary data points
##PAGE= N=2
##DATA TABLE= (X++(I..I)), XYDATA
0@%%%%%%%%%%Qj6J6j6J8k6L2m0M8n6P2q8J04j20J37j61J90k20K54k89L29l77M28
33B27m84N47o17O94p77Q68r69J079j199J331j474J631j802J987k191K414k660
50a395K931l231L563l929M340m806N335n940O643p471Q463r679J1210j3202J5910
65H742j9829K6024l7320O4419k47041k57540N08222J32430k22803q6618J29425
76a889l6045r1991P828Q2444k444L0074J19101n14k17238m7175J63727L7305j4218
89B8965J64284m998k74842o0503K26444N8904j18254J3900J26533k3065j78308
100d0940p6452J06947O5049j1228N2998j7885j70852l7587R9524l0325j9672J47184
112F6761J7332j71825m4063O6947l8972k1971J63516J43429j45009k42501P0175
$$ plain form
0 0 0 0 0 0 0 0 0 0 0 0 8 -8 8 -8 10 -16 16 -24 24 -32 40 -48 56 -64 73 -88 102 -118 136 -153 176 -201 227
33 227 -257 290 -327 367 -410 458 -511 568 -631 700 -774 857 -945 1042 -1149 1265 -1395
50 -1395 1536 -1695 1868 -2061 2279 -2527 2808 -3132 3511 -3960 4503 -5176 6034 -7168 8742
65 8742 -11087 14937 -22383 42036 -205005 -462545 45677 178107 -44696 -131314 -1889
76 -1889 -37934 -129925 -122097 -39653 -42097 -12023 107078 106564 -110674 -157849 5878 43183 28965
89 28965 193249 188251 -86591 -147094 79350 138254 20000 33900 160433 137368 -40940
100 -40940 -117392 -10445 54604 43376 96374 78489 -92363 -129950 -30426 -60751 -80423 66761
112 66761 84093 -87732 -131795 -64848 -103820 -125791 37725 181154 36145 -206356 -136181
123a36181K35527n2449j51920J48517J54302j39931j17036M1551j8751J5204J71448
134A50281N9139j69351j25030N8543O0277n5127O742J48162l298k17515l0185
145a17362J61159o0932j36468J56527J65206j33555j58798J3354L6243J5889O8583
156I846O6258l7494j02835j5423N7526l1084j9327J48647P0233j50600n8101Q1661
168A9307m8889n2716J51227J08380j05475j00637J9276J2628l9465K1808J20167
179A05611L2577j33794o7402N8029l7726m9074J32237P7165j23378n2044M9181
190h618o6581o4917J16146J24916m2183j07549j7107L8623l1972k0809J22241
201D2190P6431j08446m7087O6450o1051p6640J30124J19578o8739o9176M112l2123
$$ plain form
123 -136181 99346 46897 -105023 43494 197796 57865 -59171 -17620 -36371 -21167 150281
134 150281 209420 40069 -84961 -26418 33859 -21268 -14526 133636 130338 -87177 -117362
145 -117362 43797 -17135 -153603 2924 168130 34575 -124223 -110869 -74626 -58737 9846
156 9846 76104 38610 -64225 -79648 -22122 -53206 -72533 76114 146347 -4253 -62354 19307
168 19307 -29582 -82298 68929 177309 71834 -28803 -9527 3101 -36364 -14556 105611
179 105611 138188 4394 -63008 -4979 -42705 -91779 40458 117623 -5755 -57799 -8618
190 -8618 -75199 -140116 -23970 100946 58763 -48786 -65893 -27270 -59242 -80051 42190
201 42190 118621 10175 -36912 29538 -31513 -108153 21971 141549 72810 3634 7746 -24377
213b4377l7945M7703R6026K0392q0160l8736K8270n3777n5568J16939R5151q6608
225B7310m8568L7142o7957p0883R1333J00841j9614m8427j5198k0600m9167o107
237h9895J02653P9646o2820n0770K7858n1432n6651J05601Q9395n5627k1038L4575
249E1495n3335p3514L0168Q5478M8051j7289m0115l1851o0774k4813J08089P8788
261A00378p8547m0518N2100m7989q6596M6684P6327P228P765k242o0753o3186
273h9349K448P8188P3879j8059l7522K140n0733n4153P4818P5169l3492L922M0583
286F7839o7886q5922K9057P3902L9336L311k1963k4825l8683m2649L7167P4058
298D2742M263l384J2679p6960q0433N7057P2816o367P971J3047m9403n3122n058
$$ plain form
213 -24377 -62322 -14619 81407 101799 21639 -17097 11173 -42604 -98172 18767 113918 27310
225 27310 -21258 15884 -52073 -122956 -31623 69218 49604 1177 -14021 -34621 -83788 -89895
237 -89895 12758 92404 29584 -21186 6672 -44760 -101411 4190 93585 37958 16920 51495
249 51495 -1840 -75354 -45186 40292 88343 71054 30939 -912 -61686 -86499 21590 100378
261 100378 21831 -18687 33413 -14576 -101172 -54488 21839 29067 36832 34590 -26163 -89349
273 -89349 -86901 -8713 65166 47107 9585 11725 -39008 -93161 -18343 56826 23334 27256 67839
286 67839 -47 -85969 -56912 16990 56326 59637 37674 12849 -25834 -68483 -31316 42742
298 42742 47005 43621 56300 -20660 -101093 -44036 28780 22413 30384 43431 -5972 -59094 -64152
311f4152K9544M3905J8367K961R657n2559q5838K8611R0078J8188N067J3106o1479
324d544o0306K8951L7428J4350K7580J0522j8935l4748n2090q333O1080M3315
336D4270J1403M471o2803p8384K6986N7791L016J8593K5521l2662m4167k5110
348e1075j1904M3435O5007P184k3447l3029n0199l495M2756J9648K7326L4131
360F6338m4233o8704O65J6986J2588M8565K8781k3415l2287m2482k4150M5426
372a5922N0707Q057O081k0679n7517j4167K0602N804L7243M5387k4829n3619l1630
385d4482j8896L0805O1508Q969j5437m759m1497l8757K4397L1771K2866L7227
397E3715q511n7646l0875j417J9345N2612K4646j9585q959k8319n3145J5077N8629
$$ plain form
311 -64152 -34608 9297 27664 30625 40282 -12277 -98115 -69504 20574 38762 43829 56935 -4544
324 -4544 -64850 -35899 1529 15879 43459 53981 35046 298 -51792 -60125 955 44270
336 44270 55673 60144 -2659 -81043 -54057 3734 6750 25343 50864 18202 -25965 -51075
348 -51075 -62979 -19544 45463 52647 29200 -3829 -54028 -57523 -14767 4881 32207 66338
360 66338 22105 -46599 -45934 -28948 -16360 32205 60986 37571 5284 -37198 -61348 -15922
372 -15922 34785 42842 48923 28244 -29273 -43440 -22838 -17034 20209 65596 40767 -12852 -44482
385 -44482 -63378 -32573 28935 37904 22467 17708 -23789 -62546 -38149 -6378 16488 53715
397 53715 45204 -12442 -43317 -44734 -25389 27223 51869 32284 23325 -4994 -58139 -43062 15567
410A5567J5443P602M494m6651m2629O974J7634L0244L7942m516k9740k9644l7037
423e4317R382N8795J7045q021J5680k9722o4091M668M0672J6528K5807J5182l7241
436A0367m2085j5588R999L9952K7297j298P606k2644o6090j295N8098J4368O862
449B5549L0545k8625o4144o834K5017J8850K6525J5548j0155l0904m7619p105
461e3352M8059K0867R56K8640j8789p3940p051M2538N057J7325M0852j5175n2946
474a6959k4669O002K5559K5387J2780J5394j7452o2973j3220M2175N103Q622N1833
487E7582j3130p5634j2424K8148j002J5328M1602R659l6915m8830j0204L3043
499a2777J5383Q206M0862q661p5151j2978L8249j2852K433O4290R455o2047l3640
$$ plain form
410 15567 31010 38612 43106 -3545 -46174 -39200 -21566 8678 46620 42104 12364 -17280 -54317
423 -54317 -44935 13860 30905 22884 38564 8842 -55249 -50581 -9909 6619 32426 47608 10367
436 10367 -31718 -47306 -37307 2645 29942 28644 36250 13606 -52484 -53779 4319 18687 25549
449 25549 56094 27469 -36675 -43509 -18492 358 26883 42431 32276 1372 -46247 -53352
461 -53352 -5293 15574 16530 45170 26381 -47559 -54610 -12072 -7015 10310 51162 35987 -16959
474 -16959 -41628 -35626 -10067 15320 28100 43494 26042 -36931 -50151 -7976 -2873 5749 57582
487 57582 44452 -31182 -43606 -15458 -16460 -1132 40470 50129 13214 -35616 -45820 -12777
499 -12777 2606 10812 51674 43013 -32138 -45116 -6867 -19719 -17286 47004 56459 -5588 -39228
512c9228N293Q067J6306L1150K8321j8426o0621j3872L4705n305N19O4364R901
525F1174p3535k0391K4578j7898K137N9272K5403l9293m5235j1769J2759N610
537a7188J6116M7210J128o6161j4967K9711k7160p350P9271K8422o3800l2341
549b7109R252r650L33L9390L7413j1560m7297j7374J2463j8052J751P4000K3581
562F7141p1317k4964K4100k6777j0450O6378L4826l7416k9666k191j0336j5246
574c5918K0470N8513J4389n4863k2715J5949l2241j1130P8757L3472o0140k1407
586a6864J8822k9384k2174M4227M6301n529k9204j2720p256k9158L894P3689K9558
599F4202n9438j8084K5425l8688k8623O4133M2495l1065j4050M083l2375l0659
$$ plain form
512 -39228 -33935 -25868 -9562 21588 49909 31483 -29138 -43010 -8305 -13610 -13091 51273 61174
525 61174 -12361 -32752 -8174 -26072 -23935 35337 60740 21447 -23788 -35557 -22798 -17188
537 -17188 -1072 46138 47266 -18895 -33862 -4151 -31311 -38661 40610 69032 5232 -27109
549 -27109 -17857 -27507 -27174 12216 49629 38069 -9228 -26602 -14139 -32191 -30440 43560 67141
562 67141 -4176 -29140 -5040 -31817 -42267 24111 58937 21521 -8145 -10336 -20672 -35918
574 -35918 -15448 43065 57454 2591 -20124 -4175 -36416 -47546 31211 64683 4543 -16864
586 -16864 1958 -27426 -49600 -5373 40928 35399 6195 -6525 -13781 -42939 -39045 34644 64202
599 64202 4764 -13320 12105 -26583 -55206 8927 51422 20357 6307 10390 -21985 -52644
611e2644K6894N8809J4315l9228j4119J0034l8399k1545O9842L9903m4210o506
623C146K1708m9107l9227N1854N1918j0167j9121p46j4899l8081k152O0567K9104
636D4797l8554l717K3332n1328m3722O3224N0544k8123n384J6385l8583m1683
648e2812K6546M9462P933j9202L422M952m8587l2539N7855M4365l0987n43K3949
661C3814n2186m7685M8386M4940j5147j302J8277k1700m7506n336M7799K7741
673C0095j8778O321J8762n4388m8315N4928M6040k9469L596L2064l8860n2968
685e0972J8880L9875M777k349J6478o77m9632l3279M5954L9676k4005N705L4225
698D4656m3866n6564L3090L8437j3585Q890K7800k2797m8377p724L0312J9820
$$ plain form
611 -52644 -25750 33059 47374 8146 -5973 4061 -34338 -55883 13959 53862 9652 3146
623 3146 24854 -24253 -63480 -11626 40292 30125 11004 10258 -4641 -42722 -44874 15693 44797
636 44797 6243 2526 25858 -25470 -69192 -5968 44576 16453 11069 27454 -11129 -52812
648 -52812 -26266 23196 31129 11927 15349 20301 -28286 -60825 -2970 41395 10408 9865 33814
661 33814 -18372 -66057 -17671 27269 12122 10820 29097 7397 -40109 -45445 2354 30095
673 30095 11317 17638 36400 -17988 -66303 -11375 34665 5196 8792 40856 1996 -50972
685 -50972 -32092 7783 12560 10211 26689 26012 -23620 -56899 -10945 28731 4726 10431 44656
698 44656 790 -55774 -22684 15753 2168 11058 38858 16061 -32316 -40040 -9728 10092
710A0092k711J3051J4232m3401m3674L4081L2000j9908J8919L8327m1402n3900
722d4294J9915K6784o701J2991K9607q319m6620k4457K7182K0204j2639K1846
734A5499L4870m5620n6133L1095K8403k4808J8536M7076k3480n4405j915K4564
746f318K450r13K8053K3335m0884n0668K3444L0478k0445J2955M6779k5812n6045
759c3591J0098J9269j3213J3640L8939n69l9730k6530J2027J5795m005J8624L4868
772D5622k6184n0832J1904J8482j9893J9439M6739j6407m3780m338M780o960J3967
785g461L2543J0908k9465l1278Q941R346j7769K2097N0800j9210n0722O912R400
798d958k1958J7814M6061k938l5001j3817K819k766m367K2426L5924j3968m2150
$$ plain form
710 10092 7381 20432 34664 -8737 -52411 -18330 13670 -6238 12681 51008 9606 -44294
722 -44294 -24379 2405 -4296 8695 38302 29983 -16637 -41094 -13912 6292 -6347 15499
734 15499 50369 4749 -51384 -20289 8114 -16694 1842 48918 25438 -28967 -30882 -6318
746 -6318 -3868 -4781 23272 46607 5723 -44945 -21501 8977 -11468 1487 48266 22454 -33591
759 -33591 -23493 -4224 -17437 -3797 35142 34573 -5157 -31687 -19660 -3865 -7870 10754 45622
772 45622 19438 -31394 -19490 -1008 -20901 -1462 45277 28870 -14910 -19248 -14468 -21428 -7461
785 -7461 25082 35990 6525 -24753 -15812 -6466 -24235 -2138 48662 29452 -21270 -14358 -4958
798 -4958 -26916 -9102 36959 34021 -980 -14797 -11978 -14744 -19111 3315 39239 25271 -16879
811a6879J760P422k3393J8884N3432q746m1511p37L040j7605P758L2972J6615
824C3012j4200k4325o709j906j2829J9238M5720o847m0397Q53K158k6459J3993
837a8698M5336O65k2254l205p199j9407k138K8295L3011n790l1772m219J809k3394
851b8960J0070M7413J210k8845L228n068l0511L886L6541J7259p305j4262j1557
864f901q901j0905J2209L7937O155k6495j004p58l0661K324M1299J1259j0972
877A4586j448j5482k4064J911K0832K0287N685j2962q424o580k2837K252L8737
890A2493J1904j4406L837j0121l4271K894L3519J0824j040J068j1328j7703j1985
903b4315N679K6140J4362r762j631o591l2765l109L6747J2385p915P339p480k7818
$$ plain form
811 -16879 -15119 -7697 -31090 -12206 41226 32480 -9031 -9768 -6728 -24333 -16575 16397 33012
824 33012 18812 -5513 -12222 -14128 -26957 -7719 38001 31154 -9243 -8390 -6232 -32691 -18698
837 -18698 26638 27303 5049 1844 -5355 -24762 -26900 1395 34406 28616 -3156 -7375 -5566 -28960
851 -28960 -18890 28523 29733 888 4116 -952 -31463 -27577 8964 26223 18918 4656 -6901
864 -6901 -15802 -26707 -14498 23439 29594 3099 2095 1337 -29324 -27000 14299 25558 14586
877 14586 13138 -2344 -26408 -24497 -3665 16622 22307 9345 921 -5659 -28496 -26244 12493
890 12493 24397 9991 13828 3707 -30564 -27670 5849 16673 15633 16701 5373 -12330 -24315
903 -24315 -18636 7504 21866 12104 10473 3882 -28883 -31992 4755 17140 9225 16564 9084 -18734
917a8734o052J4302J5177J3316O18p803j0750k1105o679K8538J8537p600L248
930A5013m627l0417p841K1410R781P180J0956r685k0731j1103j648J7053K1828
943A7169N49n116m459k3594j1477K1633J2965J401J2289m994k8315r750P265P148
957g286J7576J1586r583j1768j3750j1728J3995J9612K383M989M03k5097j4320
970b2988J1591P898J0560J6968p080k0425q151n853K947K0110J0916k485k922
983A1086j7469j8474R621J4890N652J2694N91k2428j1495J105J070J6330J8265
996B1438n150j0305q263j6694M21J9406R666M289L205j8188j9143L605O489Q623
1010f01J7811O50j4863p995j0814n480K0579J6136k704N34p348k2254k987J4769
$$ plain form
917 -18734 -24786 -10484 4693 18009 18627 10824 74 -21031 -27710 828 19365 11765 15013
930 15013 10386 -20031 -27872 -6462 3319 10499 21455 11770 -8961 -20064 -21712 -4659 17169
943 17169 17718 12602 8143 -15451 -26928 -5295 7670 9071 21360 16366 -11949 -21699 -14434 -7286
957 -7286 10290 21876 12293 525 -13225 -24953 -10958 8654 11037 16026 16429 -8668 -22988
970 -22988 -11397 -3499 7061 24029 16949 -3476 -11627 -17480 -14533 5577 16493 14008 11086
983 11086 -6383 -24857 -15236 -346 5306 18000 18591 -3837 -15332 -14227 -13157 3173 21438
996 21438 16288 5983 -2280 -18974 -18553 853 10519 14808 18013 -175 -19318 -15713 -9224 -601
1010 -601 17210 17860 2997 -4998 -15812 -21292 -713 15423 12719 13253 5905 -16349 -19336 -4567
1024d567P936J0193O339j3969j3656o555m746J3822K0957j240o565l355j8831
1037a4237r924J9034J2427J467Q415n361k1445p865M665R184J6835N487r029p052
1051B601j3754j2409J5633J8991j431K541O48k3014j2672J2364R141O817J2275
1064A7731l278j5829j1865n777J0756J8288K238p57K378j9168j8984J4154J4617
1077D504r03J0857M509k2066j5173M051O497J0608J0501L5n031j5183j5501J0391
1091a1904J7128j009P708R876k2228k1984J0927R810J213J3707O518j4395j5501
1104a0134o784M210J3177O340N289N392j7988k2240R431J3086k818J3531J4237
1117B4729j9476k0649L494M243L170J2665R075k703j5321j6674L447J2254N22
$$ plain form
1024 -4567 3369 13562 19901 5932 -7724 -14279 -19025 -5203 15754 14514 7949 4594 -14237
1037 -14237 -24161 -5127 7300 8767 17182 11821 -9624 -17489 -12824 -3640 13195 18682 9653 2601
1051 2601 -11153 -23562 -7929 11062 9631 12172 12820 -10194 -22866 -10502 -1361 5456 17731
1064 17731 14453 -1376 -13241 -19018 -8262 10026 12264 11507 13885 -5283 -24267 -10113 4504
1077 4504 3601 14458 18967 -3099 -18272 -14221 -7724 2884 13385 13420 8389 -6794 -22295 -11904
1091 -11904 5224 4215 11923 21799 -429 -22413 -11486 -1676 -463 13244 19762 5367 -10134
1104 -10134 -16918 -12708 469 6809 12098 17490 -498 -22738 -13307 -221 -3039 10492 24729
1117 24729 5253 -15396 -11902 -7659 -4489 8176 17251 14548 -773 -17447 -14000 -1746 -1224
1130a224R745J5260j8275k4408P313O811n353J6031J6920j2278j7207m760L78
1143a1047M377P296J1509R448j4406k3637M174R209o085J3640K1360j5225k2756
1156a2143L045O74m942J3499J7245j367j3956j3116o43M605n07J2758K0397j2885
1170A2664k5576M427M954j0582J3222K3110p625j7224k842m088m139P816J4988
1183I105R445r651j7493k98K469q649J3238K5787r411k1413L978j130j3324J1173
1197f174K2396L98j1784p654m780l434q19J3216J8288o863j9252L055o06j6411
1211b0424J2078K9189n391j7631K728l360j3679M881J9564J0155q008j2670o01
1224c169j525j2172R076K6591l097j8771M231k444j9519P857K5999R60j0203j130
$$ plain form
1130 -1224 8521 23781 5506 -18902 -11589 -4778 -10131 5900 22820 10542 -6665 -11425 -11047
1143 -11047 -6670 626 12135 21583 7177 -16460 -12286 -3077 -9162 4478 25838 10613 -12143
1156 -12143 -9098 -8424 -13366 133 17378 16011 2055 -11061 -11704 -7099 -7606 5152 25549 12664
1170 12664 -12912 -8485 -3531 -14113 -891 22219 14594 -2630 -5472 -9560 -13699 -5883 9105
1183 9105 18550 8899 -8594 -8892 -6423 -15072 -1834 23953 14542 -6871 -2893 -4023 -17347 -6174
1197 -6174 16222 16620 4836 -2818 -7598 -11032 -11851 1365 19653 12790 -6462 -3407 -4013 -20424
1211 -20424 -8346 20843 15452 -2179 549 -2811 -16490 -11609 7955 18110 10102 -2568 -3169
1224 -3169 -4694 -16866 -7790 18801 15704 -3067 1164 -1280 -20799 -12942 13057 14017 3814 2684
1238B684m147j0035l556J2630J8344k297j4034J761j310j8468N730K7296m95j2826
1252A277M312m726j8556L092J8560P098l196l724k507q290j1081Q241K3192n11
1266A3181j3111O448k680k3189L884K5472J667q463N181l874j6668m553J2727
1279c978J3912K84o943J532m634j9124L712K5099M45r895R785k608k3933r11K0045
1294B788N643k835K840j130j1090j2644M953J8522K798p826O491k485k3244k45
1308a7464K2255J502n486J0740j851k0052o023J1375R531K449J66K617o554j7887
1322a4682n95K0053K454o470J1088j026k4519l746J7158K648j533R725N94j4490
1336c341j1158L458J2128M556j764P914k226k2054l880J8324O91m197J4915J367
$$ plain form
1238 2684 -1463 -11498 -15054 -2424 15920 13623 -411 1350 40 -18428 -12698 14598 14103 1277
1252 1277 5589 863 -17693 -14601 3959 11057 7861 4137 1630 -6660 -17741 -9500 13692 13181
1266 13181 70 6518 3838 -19351 -15467 10005 11672 3209 8390 4516 -12152 -16705 -3978
1279 -3978 9934 10218 3275 4807 173 -18951 -15239 9860 10305 410 10195 7587 -16346 -17257 2788
1294 2788 8431 5596 8436 7306 -3784 -16428 -11475 7047 9845 2019 8510 6025 -17219 -17464
1308 -17464 4791 6293 807 11547 9696 -10356 -16379 -5004 4527 6976 7142 9759 3205 -14682
1322 -14682 -15277 4776 7230 760 11848 10822 -13697 -17443 -285 2363 830 10555 11149 -3341
1336 -3341 -14499 -11041 1087 5643 3879 11793 9567 -12487 -16367 1957 2648 -1549 13366 14733
1350A4733k1974p924R492M371K493O674L688p545j5227k485J2823K015k268J4396
1364A3262J993k4151p027J4627P62j802J3581L638j4780j0598J174N751L955L398
1378C783P957j000j8310p103J1963M06k183J6934M411k1154q357Q051R32N17J0145
1393F992O165o096j2253n389N432K896R91J2989L674j9188q624R598k302k082
1407g197J6174O289j4246p550Q83j646J673Q121R706Q1j4235q499O522L22k163
1422e765J4959P018j5729p411M454n490j143J4439P432o157q308n431r00J457
1436f575M099J2115M902j4583p564O232m194m340J5553R690j0306o429j169o670
1450i239rJ0594Q832j48q934p015J351k129j981J3879R203j1761o340M015p709
$$ plain form
1350 14733 -7241 -15165 -5673 -1302 1191 7865 11553 4008 -11219 -13704 -881 1134 -1134 13262
1364 13262 15255 -8896 -15923 -1296 -534 -2336 11245 14883 103 -10495 -9321 -3570 385 3783
1378 3783 11740 10740 -7570 -14673 -2710 -2304 -4487 12447 16858 -4296 -12653 -4602 -3670 -3153 6992
1393 6992 13157 7061 -5192 -10581 -5149 -2253 -1262 11727 15401 -3787 -12411 -2813 -5115 -7197
1407 -7197 8977 15266 1020 -6530 -5647 -7293 -5620 2501 12207 12288 -1947 -10446 -3924 -3602 -5765
1422 -5765 9194 16212 483 -6928 -2474 -7964 -9107 5332 12764 6607 -1701 -7132 -8032 -6575
1436 -6575 -2476 9639 14541 -42 -7606 -1374 -5568 -9908 5645 15335 5029 -1400 -2569 -9239
1450 -9239 -9248 1346 10178 10030 1096 -5919 -4568 -6697 -8678 5201 14404 2643 -3697 318 -7391
1465g391m547J3857J0435m560n324m794m344p64L286R105P018p240p801J160n259
1480g163m371J3491J0295p628l863k04q648k650R530P469K219k576o095m092k499
1495f785j604J0204J0084n657n793K48q162m749J2267P696l540Q3j388q723l888
1510i707L886P688O692k051n003j626n885n468J0888J0907m954k786J611r068
1524d876o406P600P119K587L28l358n529l839l001O805J0554r89m730J37o326
1539c924p463P775R174j73R44j352q805l947K556L101O993L778m841m058l996
1554d238n606M720R471Q62l81J93r070o021O071M573J767N278j221p361m124j382
1570f469J769P796M043j778j198o880p421M940P123J64L348J975q704o449K010
$$ plain form
1465 -7391 -11938 1919 12354 7794 2470 -2324 -6668 -7432 -4146 4959 11977 4737 -3064 -1904 -7163
1480 -7163 -11534 1957 12252 4624 761 557 -8091 -10741 -1211 6258 8477 5901 -194 -4286 -6785
1495 -6785 -8389 1815 11899 6242 449 697 -7465 -12214 53 7749 4209 4292 2904 -5819 -9707
1510 -9707 -5821 1867 8559 6508 1505 -121 -6006 -11474 -586 10321 5367 2581 4192 -4876
1524 -4876 -11282 -3682 3437 6024 6352 2994 -2535 -6374 -9375 -2570 7984 6995 2265 2402 -3924
1539 -3924 -11387 -3612 5562 5389 6333 4981 -3824 -7771 -5215 -2114 4879 8657 3816 -242 -4238
1554 -4238 -9844 -5124 4347 5209 4828 5021 -4049 -10070 -3999 574 2341 7619 6398 -963 -5087 -6469
1570 -6469 -4700 3096 7139 5361 4163 -2717 -10138 -5198 1925 2089 5437 7412 -1292 -7741 -5731
1585e731K370M448N797q12l650m421o645J655R473K781k99J390o186q103J970
1600e963M118K112O132J235o647m466l266q29P501O466j325j024k901p955q38
1615g650O255L243L869K428o321o291o25p07M047Q280R1m250k152n526l659O311
1631b657N956J327J445l370p571j363K127K292P408K727n564l713k817m031M471
1646c333Q521R7j110p45o761m562L590L769M032M149m023o630j763j859K617Q205
1662D194K290l003l89n588o151M163O981J080K266l23o485m679O2J798O198M870
1678G284k908l405l668n169K418Q084Q14N1K010n532p395K122M505K337M172N50
1694F270m964m408l287R20P341L323j608Q02m037q669J812O972Q14J920L758n071
$$ plain form
1585 -5731 -3361 1087 6884 6072 2422 -1999 -8644 -6989 2484 5265 4966 6356 170 -7933 -5963
1600 -5963 -1845 267 6399 7634 987 -3479 -6745 -7574 -73 6393 5068 4044 1143 -6812 -7650
1615 -7650 -1395 1848 5717 8145 1824 -4467 -5092 -5799 -1752 6528 6619 2369 217 -5309 -8968 -2657
1631 -2657 3299 4626 6071 2701 -4870 -6233 -4106 -1814 5594 8321 2757 -956 -3773 -7804 -3333
1646 -3333 5188 5285 4175 3430 -3331 -7893 -4303 -534 3498 7647 3624 -3006 -4769 -6628 -4011 4194
1662 4194 6484 3481 3092 -2496 -8647 -4484 2497 3577 5843 5520 -965 -5644 -5582 -3784 2414 7284
1678 7284 4376 971 -2697 -7866 -5448 2636 3450 3501 5511 -21 -7416 -5294 -789 1548 5720 6270
1694 6270 1306 -3102 -6389 -5469 1872 5195 3587 4389 352 -8317 -6505 467 1281 3201 6959 1888
1710A888o937q16J796M238M983K30j673l527o679M1P496J189N33M032l696r340
1726f242j51M339J190M159L261l435n250l306k45M847L236J163K581k925r234
1741f012o84O294L05K107N958l599q419j029J689J252L753K885K96l269o383j818
1757f674M789K088J017O138k367r342j349M352p29K967N873j637n524l165p48
1772d311J664K766K470L803j791q966j608M055o7J415P437j076q361j338J300
1787b608j125K922N503J298l232n113k638K473J149J698O142k79r294j222L106
1802a220k768J337Q430M76o169k907j049j4K172L770L689q87o517k660K475j448
1818c290J370Q591J64p902j812J484l319J320P096K284l328m133k186K02K47K033
$$ plain form
1710 1888 -5049 -5865 -4069 169 5152 5382 3709 182 -6497 -6456 1040 2229 2762 6794 3098 -6242
1726 -6242 -6393 -2054 -864 3295 6556 3121 -2129 -5435 -5680 -833 2403 3566 6147 3222 -6012
1741 -6012 -6696 -402 -97 2010 7968 4369 -4050 -5079 -3390 -2138 1615 4500 4796 1527 -4856 -6674
1757 -6674 -1885 203 1220 7358 4991 -4351 -5700 -1348 -2077 890 6763 5126 -398 -3563 -4311
1772 -4311 -2647 119 2589 6392 4601 -4365 -5973 -1918 -1985 -570 6867 5791 -2570 -3908 -2608
1787 -2608 -3733 -811 4692 5990 2758 -2355 -4993 -2520 -1371 327 6469 6190 -3104 -4326 -1220
1802 -1220 -3988 -2651 5779 6255 86 -2821 -3870 -3884 -1712 2058 5747 4860 -1657 -4317 -1842 -3290
1818 -3290 -1920 6671 6835 -1067 -2879 -1395 -4714 -3394 3702 5986 2658 -1475 -3661 -3459 -3212 -1179
1834a179O282J447p462j749J660l586Q40Q837J600n787j607o22l026M67M900M047
1850E062K0n027k917O71k309N72Q524K114o577j269P67m712P6P911K802l083j710
$$ plain form
1834 -1179 5103 6550 -912 -2661 -1001 -4587 -3747 5090 6690 903 -704 -1326 -4352 -3885 1015 5062
1850 5062 5082 55 -2862 -2191 -4500 -3928 4596 6710 133 -1136 -369 -5081 -5005 2906 5708 2625 915
$$ [...]
8191I2
##END NTUPLES=NMR FID
##END=
