##TITLE=1H_CA-8534-13-3k
 CDCl3, 8 sc, 
 15.2.2019
##JCAMPDX= 6.0         $$ Bruker NMR JCAMP-DX V2.0
##DATA TYPE= NMR FID
##DATA CLASS= NTUPLES
##ORIGIN= UXNMR, Bruker Analytische Messtechnik GmbH
##OWNER= root
$$ XWIN-NMR		Version 3.5
$$ Fri Feb 15 16:42:01 2019 Russian Standard Time (UT+4h)  she@DPX200
##.OBSERVE FREQUENCY= 200.1313
##.OBSERVE NUCLEUS= ^1H
##.DELAY= (6, 6)
##.ACQUISITION MODE= SIMULTANEOUS
##.ACQUISITION SCHEME= undefined
##.AVERAGES= 8
##.DIGITISER RES= 18
##SPECTROMETER/DATA SYSTEM= spect
##.PULSE SEQUENCE= zg30
##.SOLVENT NAME= CDCl3
##.SHIFT REFERENCE= (INTERNAL, CDCl3, 0, 15.7039)
##AUDIT TRAIL= $$ (NUMBER, WHEN, WHO, WHERE, WHAT)
$$ ##TITLE= Audit trail, XWIN-NMR		Version 3.5
$$ ##JCAMPDX= 5.01
$$ ##ORIGIN= Bruker BioSpin GmbH
$$ ##OWNER= she
$$ F:/spectra/data/she/nmr/H-F/1/audita.txt
$$ ##AUDIT TRAIL=  $$ (NUMBER, WHEN, WHO, WHERE, WHAT)
(   1,<2019-02-15 16:40:54.28 +0400>,<she>,<DPX200>,
      <created by zg, POWCHK disabled, PULCHK disabled
       configuration hash MD5:
       00 E9 B6 7A A2 85 ED C7 34 08 36 98 17 FE 4E 26
       data hash MD5: 16K
       CA AA 6C 14 FA C5 46 8C F1 89 51 5E E0 F2 9B 86>)
$$ ##END=
$$ 
$$ hash MD5
$$ 86 3E 73 7B 70 5D 90 D1 56 03 16 22 E7 F7 E6 A9
##$RELAX= 
##$RELAX= 
##$RELAX= 
##$RELAX= 
##$RELAX= 
##$RELAX= 
$$ Bruker specific parameters
$$ --------------------------
##$DU= <F:/spectra>
##$EXPNO= 1
##$NAME= <H-F>
##$PROCNO= 1
##$TYPE= <nmr>
##$USER= <she>
##$AMP= (0..31)
100 100 100 100 100 100 100 100 100 100 100 100 100 100 100 100 100 100 
100 100 100 100 100 100 100 100 100 100 100 100 100 100 
##$AQSEQ= 0
##$AQ_mod= 1
##$AUNM= <au_zg>
##$AUTOPOS= <>
##$BF1= 200.13
##$BF2= 200.13
##$BF3= 200.13
##$BF4= 200.13
##$BF5= 200.13
##$BF6= 200.13
##$BF7= 200.13
##$BF8= 200.13
##$BYTORDA= 1
##$CFDGTYP= 0
##$CFRGTYP= 5
##$CHEMSTR= <none>
##$CNST= (0..31)
1 1 145 1 1 1 1 1 1 1 1 1 1 1 1 1 1 1 1 1 1 1 1 1 1 1 1 1 1 1 1 1 
##$CPDPRG= <>
##$CPDPRG1= <>
##$CPDPRG2= <>
##$CPDPRG3= <>
##$CPDPRG4= <mlev>
##$CPDPRG5= <mlev>
##$CPDPRG6= <mlev>
##$CPDPRG7= <mlev>
##$CPDPRG8= <mlev>
##$CPDPRGB= <>
##$CPDPRGT= <>
##$D= (0..31)
0 1.2 0 0 0 0 0 0 0 0 0 0.03 0 0 0 0 0 0 0 0 0 0 0 0 0 0 0 0 0 0 0 0 
##$DATE= 1550234453
##$DBL= (0..7)
120 120 120 120 120 120 120 120 
##$DBP= (0..7)
150 150 150 150 150 150 150 150 
##$DBP07= 0
##$DBPNAM0= <>
##$DBPNAM1= <>
##$DBPNAM2= <>
##$DBPNAM3= <>
##$DBPNAM4= <>
##$DBPNAM5= <>
##$DBPNAM6= <>
##$DBPNAM7= <>
##$DBPOAL= (0..7)
0.5 0.5 0.5 0.5 0.5 0.5 0.5 0.5 
##$DBPOFFS= (0..7)
0 0 0 0 0 0 0 0 
##$DE= 6
##$DECBNUC= <off>
##$DECIM= 32
##$DECNUC= <off>
##$DECSTAT= 4
##$DIGMOD= 1
##$DIGTYP= 9
##$DL= (0..7)
0 120 120 120 120 120 120 120 
##$DP= (0..7)
150 150 150 150 150 150 150 150 
##$DP07= 0
##$DPNAME0= <>
##$DPNAME1= <>
##$DPNAME2= <>
##$DPNAME3= <>
##$DPNAME4= <>
##$DPNAME5= <>
##$DPNAME6= <>
##$DPNAME7= <>
##$DPOAL= (0..7)
0.5 0.5 0.5 0.5 0.5 0.5 0.5 0.5 
##$DPOFFS= (0..7)
0 0 0 0 0 0 0 0 
##$DQDMODE= 0
##$DR= 18
##$DS= 0
##$DSLIST= <SSSSSSSSSSSSSSS>
##$DSPFIRM= 0
$$ [...]
##$SUBNAM2= <"">
##$SUBNAM3= <"">
##$SUBNAM4= <"">
##$SUBNAM5= <"">
##$SUBNAM6= <"">
##$SUBNAM7= <"">
##$SUBNAM8= <"">
##$SUBNAM9= <"">
##$SW= 20.0189088683792
##$SWIBOX= (0..15)
0 0 2 0 0 0 0 0 0 0 0 0 0 0 0 0 
##$SW_h= 4006.41025641026
##$TD= 16384
##$TD0= 1
##$TE= 0
##$TE2= 300
##$TE3= 300
##$TEG= 300
##$TL= (0..7)
0 120 120 120 120 120 120 120 
##$TP= (0..7)
150 150 150 150 150 150 150 150 
##$TP07= 0
##$TPNAME0= <>
##$TPNAME1= <>
##$TPNAME2= <>
##$TPNAME3= <>
##$TPNAME4= <>
##$TPNAME5= <>
##$TPNAME6= <>
##$TPNAME7= <>
##$TPOAL= (0..7)
0.5 0.5 0.5 0.5 0.5 0.5 0.5 0.5 
##$TPOFFS= (0..7)
0 0 0 0 0 0 0 0 
##$TUNHIN= 0
##$TUNHOUT= 0
##$TUNXOUT= 0
##$USERA1= <user>
##$USERA2= <user>
##$USERA3= <user>
##$USERA4= <user>
##$USERA5= <user>
##$V9= 5
##$VALIST= <valist>
##$VCLIST= <CCCCCCCCCCCCCCC>
##$VD= 0
##$VDLIST= <DDDDDDDDDDDDDDD>
##$VPLIST= <PPPPPPPPPPPPPPP>
##$VTLIST= <TTTTTTTTTTTTTTT>
##$WBST= 1024
##$WBSW= 4
##$XGAIN= (0..3)
0 0 0 0 
##$XL= 0
##$YL= 0
##$YMAX_a= 381799
##$YMIN_a= -465747
##$ZGOPTNS= <>
##$ZL1= 120
##$ZL2= 120
##$ZL3= 120
##$ZL4= 120
##$ABSF1= 10
##$ABSF2= 0
##$ABSG= 5
##$ABSL= 3
##$ALPHA= 0
##$AQORDER= 0
##$ASSFAC= 0
##$ASSFACI= 0
##$ASSFACX= 0
##$ASSWID= 0
##$AUNMP= <proc_1d>
##$AZFE= 0.1
##$AZFW= 0.1
##$BCFW= 1
##$BC_mod= 2
##$BYTORDP= 1
##$COROFFS= 0
##$CY= 11.3945322036743
##$DATMOD= 1
##$DC= 2
##$DFILT= <>
##$DTYPP= 0
##$F1P= 18.9103706918063
##$F2P= -1.10871071338519
##$FCOR= 0.5
##$FTSIZE= 0
##$FT_mod= 4
##$GAMMA= 1
##$GB= 0.15
##$INTBC= 1
##$INTSCL= 1
##$ISEN= 128
##$LB= 0.24
##$LEV0= 0
##$LPBIN= 0
##$MAXI= 10000
##$MC2= 0
##$MEAN= 0
##$ME_mod= 0
##$MI= 1.114404
##$NCOEF= 0
##$NC_proc= 0
##$NLEV= 6
##$NOISF1= 3.799351
##$NOISF2= 2.8
##$NSP= 1
##$NTH_PI= 0
##$NZP= 0
##$OFFSET= 15.70392
##$PC= 1
##$PHC0= -9053.238
##$PHC1= 13.20014
##$PH_mod= 1
##$PKNL= yes
##$PPARMOD= 0
##$PSCAL= 0
##$PSIGN= 0
##$REVERSE= no
##$SF= 200.130013532006
##$SI= 16384
##$SIGF1= 3
##$SIGF2= 2
##$SINO= 400
##$SIOLD= 16384
##$SREGLST= <1H.CDCl3>
##$SSB= 0
##$STSI= 0
##$STSR= 0
##$SW_p= 3612.71676300578
##$SYMM= 0
##$S_DEV= 0
##$TDeff= 0
##$TDoff= 0
##$TI= <>
##$TILT= no
##$TM1= 0
##$TM2= 0
##$TOPLEV= 0
##$USERP1= <user>
##$USERP2= <user>
##$USERP3= <user>
##$USERP4= <user>
##$USERP5= <user>
##$WDW= 1
##$XDIM= 8192
##$YMAX_p= 0
##$YMIN_p= 0
$$ End of Bruker specific parameters
$$ ---------------------------------
##NTUPLES= NMR FID
##VAR_NAME=  TIME,          FID/REAL,        FID/IMAG
##SYMBOL=    X,             R,               I
##VAR_TYPE=  INDEPENDENT,   DEPENDENT,       DEPENDENT
##VAR_FORM=  AFFN,          ASDF,            ASDF
##VAR_DIM=   8192,          8192,            8192
##UNITS=     SECONDS,       ARBITRARY UNITS, ARBITRARY UNITS
##FACTOR=    0.0002496,     1,               1
##FIRST=     0,             0,               0
##LAST=      2.0444736,     0,               0
##MIN=       0,             -465747,         0
##MAX=       2.0444736,     381799,          0
$$ Real data points
##PAGE= N=1
##DATA TABLE= (X++(R..R)), XYDATA
$$ [...]
2158h17p85R75k58k05J298o6r91O97M68J9J107R03j022j11q5j398j0k84j298l86
2178b249N87k22J374J864n45j55P72n24l29N84j96r08L76l19n82K83l98r14J56
2197a345M59j14J109J238p72R8l3j763J98P56j09O26R84k99k54O23m86r49j87
2216b20q94l69P19P5k08P91o35q79J021K19O20J459M11j003j59M67p58j60K23
2235G20k297m95N07K85Q26J283p65n72P68p09%P57n2l64J158n22m17Q57m66q68
2255c66M38K10q93R86P29j255kj59j563L40J263l34Q10P06j318j76J480O2M59
2274A417L72j721j281Q14K7l30N00n23m96J245Q28q18L80l89q95Q36O28n53Q54
2293H95K24j225l92K92j308Q54J640n35l7L98q51l04Q91k39o94q4p13K30K073
$$ y = [-817, -1602, -627, -885, -1090, 208, 142, -849, -152, 316, 335, 1442, 2345, 1323, 1212, 1127, -271, -281, -565, -1863, -2249, -1662, -1884, -510, 1354, 809, 654, 1426, 902, 573, 1157, 961, 53, 429, 110, -472, -189, -587, -1501, -1345, -886, -1000, 109, 1347, 575, 673, 640, -1123, -925, -169, -278, 348, 1332, 1033, 779, 1402, 916, -33, -220, -1114, -1483, -764, -689, -897, -106, -741, -1620, -599, -380, 240, 1699, 2110, 1107, 948, 1415, 657, 497, 720, -1577, -2072, -1565, -1280, -454, 829, 64, -508, 260, -449, -449, 308, 256, -108, 1050, 528, 111, 968, 502, -366, 72, 282, -611, 375, 1104, -151, -153, -312, -1875, -1535, -272, -606, 204, 910, -408, -584, 896, 958, 1417, 1789, 68, -1213, -399, -372, -702, -202, -725, -1221, 24, 852, 34, 414, 25, -870, -34, 594, 41, 895, 1119, -106, -498, -206, -1514, -660, 980, 445, 408, 806, -45, -349, 542, 303, -391, -475, -1188, -958, 1115]
2312A115M70m47l14j163q84R64O74q51k32p2j23J004J323j321n65J9l88N99J522
2331A330m30J69M31j051j033J46r75k11J626j22o76R02J9l80J140j73j556j47
2349i91J000j71J482M83j515o05j29k43P98R93j245p59K99J39M50J111j027j097
2367a027M22j5L18J224R0p64K77K4j123J30K33m50J018j19r32L22R47o0N64k84
2387G95j803n17J584K00N51K40j575q01P51L15m2Q95q38p75J094O45j4L11o94
2406C22j445Q47O33k2Q63%j371M4J99j185K75Q43n80n5N42q19L60J409o6n4j54
2427E86p76k47J479J00l38j48j038j221J209O40r52J11l32k30J055J227o17k20
2445B88J7j322N20J137l02P37K52q54n12M06q18m52J109o62n08R96r2o00J000
$$ y = [1115, 1585, 1138, 824, -339, -1223, -259, 415, -436, -668, -740, -863, 141, 1464, 143, -422, -403, -791, -192, 1330, 900, 1069, 1500, 449, -584, -438, -1413, -1624, 2, -120, -796, 106, 125, -255, 885, 712, -844, -991, 9, -162, 1320, 1803, 288, -317, -446, -689, 109, 1102, -143, -902, -603, -464, -14, 1097, 70, -1027, -605, -620, -302, 922, 1012, 248, 525, 549, -574, -444, -211, -661, 357, 238, -694, -372, 575, 515, 1079, 795, -1008, -1525, 59, 259, 810, 1050, -525, -1326, -575, -260, -302, 593, -245, -1020, 74, 719, 705, 1016, 322, -1123, -276, 357, 335, 1198, 1198, -173, -129, 70, -1115, -840, 3, -577, -632, -90, -909, -549, 860, 794, 740, 586, -190, -437, 1042, 1142, 804, 656, -382, -1603, -394, 246, -706, -595, -927, -1157, -102, 1125, 508, 288, 305, -1017, -497, 640, 338, 1075, 1327, 473, -39, 367, -451, -903, 206, -456, -964, 32, -60, -660, 340]
2464C40Q1j275J70K68j19J443M01p33M0k91j086O92N44j616j91M43L60O49J632
2483A752n42r89K33r92n34Q85K44m9P15k66j192O55m68o40R90m0q2J373O66q53
2503H66q8n35j444p23J048J76Q74J368p84m53L97p17l35O54j270p51J332N78N
2522A98J110n66j638J72L60m31J296R15q00M06J93j208k62k35j142J86R19O3Q12
2541C48J397j037p34O09r26p23J298j05l18J075n20q03O37k20l54N89Ko15O33
2560B33N58l60J19l45j724L18N31l36O21P22n56L55J347p55n91M06o73m63O45
2579E2k82k66O97l31m27P65M2q06J169o2r44N02J17r82L85P17o72J69N45r17J07
2600d22J408n23M4N18r10k50O32p08q03L41l89K63J434M1o93L71m37l76P21L88
$$ y = [340, 421, -854, -684, -416, -535, 908, 1309, 576, 616, 325, -761, -69, 475, -1141, -1332, -889, -529, 120, 1752, 1210, 221, 454, -538, -1072, -187, 57, 8, 723, 457, -735, -80, -548, -1188, -198, -238, -320, 1053, 1719, 866, 778, 243, -1201, -1924, -876, -700, 174, 1542, 758, 305, 702, -15, -350, 304, -966, -1717, -385, 193, 198, 1308, 742, -896, -724, -364, -795, 501, 1416, 616, 1022, 1215, 7, -255, -490, -1632, -1446, -527, -464, 348, 1745, 708, -26, 583, -343, -1066, 232, 127, -191, 884, 364, -439, 198, -22, -376, 213, 215, -400, 233, 791, 431, 550, 205, -1519, -1201, -670, -1006, -385, 337, -219, 136, 1483, 728, 137, 543, -130, -593, 52, -230, -496, 201, -130, -557, 208, 250, -556, 613, 551, -393, 109, 226, -756, -371, 346, -326, -157, 388, -529, -422, 986, 463, 507, 1025, 115, -135, 497, -211, -1014, -673, -1062, -799, 635, 676, -17, 354, -83, -459, 262, 650]
2620F50j209O33J19q45L40L69k28J82N42k23O3M73n08m25R19r61m43N06q93n46
2640a485J055Qm32J018J20k21J264k15j330M44K32l28N17L7j177O3N07n16M60
2659B1N02j257L0J414p40k25R7p92k24J433r9k38R30l16oN63k68p04PJ92r54L20
2681c14L14j037L58O87m95M00K86q88L73J262k74p2K43j007l68Q71k31j21L22
2700C09q15K17J185J00j215l42m58k73J225Q13p86L15N82r92L64L10j033K69P83
2719E58p26L80M86p19j51K35j190l44Q44N45L2J911m45q61J42p91q23O77L75q33
2739f98N60K87m75P22mj301n1L63k37J413R94r89l91M94q35j1O17p75m33J472
2759G22k38l84Q03p31n41L7l89j062P96R15O0J035l3j210J15O27p19M36L42q42
$$ y = [650, -559, 74, 193, -652, -312, 57, -171, 11, 553, 330, 393, 866, 358, -67, 852, -109, -552, -46, -939, -1485, -430, -422, -854, 164, 284, 63, 1327, 1112, -218, 226, 458, 130, 647, 684, -493, -430, 77, -439, 21, 523, -734, -704, 710, -30, -255, -158, -950, -1174, 259, 160, -78, 852, 536, 530, 1093, 825, 121, 128, 320, -634, -314, 0, -1037, -679, 8, -487, -87, 199, -689, -316, 946, 672, 600, 843, -164, -532, 339, 108, -13, 309, -506, -289, 896, 996, -219, -561, -1019, -1292, -67, 746, -40, 275, 857, -135, 229, 539, -494, -225, 558, -168, 212, 698, -21, -172, 63, -1127, -1471, -627, -82, -50, 1861, 1416, 555, 697, -94, -917, -240, 135, -698, -138, 149, -326, 396, 392, -909, -960, -597, -834, 579, 1573, 584, 193, 687, -148, -159, 458, -317, -750, 722, 484, 100, 903, 172, -369, -332, -721, -1783, -987, -72, -12, 1023, 990, -220, -105, 522, -197, 239, 581, -261]
2779b61M69P01n87j40o3r71r43J091K45L78R84p81r32R78j41l73P97q3n96M03
2799A75N38o37N59M78j050j89J63j263M62N92l0k31O10q95L99J142o79k29L16
2818B31m49o0J347m4q61J99p50r47R47O90k90P01j55r11J23N42l41J35k64r38
2838a095M82P51l07K50M64o98p9O29k70j31Q46k86r06M12k83k05J115l00r95M27
2858a79j42n54J548K97j164K04j10j253Q46J018m28J38L26r35O20J092n83n47
2876A94k8r14J46J214k88p21L01p24l40J176J69k94R13n7q36M75q7n23M81R5j149
2897g97L17M56n2P92N92j318l69J46j25K32Q90q63o50Q20m95jJ339l99o94M42
2917B63l27j98J195K72j145n33k86n51J111L81n69M40Q93o85K23N54o70k29K35
$$ y = [-261, 208, 909, 322, 182, 119, -852, -1795, -704, -459, -81, 903, 122, -810, 168, 27, -346, 451, 368, -228, 175, 713, 76, 635, 1113, 63, -126, 37, -1226, -764, -172, -202, -433, 177, -718, -319, 823, 144, -85, 231, -218, -278, 1069, 1025, 164, 363, -387, -1334, -387, 303, 13, 714, 559, -352, -229, 313, -28, 107, -157, -1095, -613, 138, -169, 81, 545, -153, -232, 397, 127, -4, 842, 556, -350, 62, -221, -426, 689, 389, -606, -179, -321, -875, 673, 970, -194, 10, -100, -1353, -507, 511, 83, 221, 547, -388, 232, 1324, 741, 194, 166, -748, -602, 612, 324, -397, -96, -820, -1160, 16, 185, -109, 804, 747, -89, 386, 299, -224, 257, 352, -797, -480, -24, -76, 716, 1308, -10, -379, -233, -358, -126, 764, -99, -749, 71, -424, -425, 914, 515, -179, 263, -64, -262, 933, 1205, 60, -473, -759, -1310, -199, 182, -387, 53, 946, 261, 484, 1038, 368, 139, 374]
2936C74j119k62Q65J91k84M62q11r05Q44Q11M53J143p33j127M31J95o57N17k93
2955I5j177L73O77j35N28Q07j328k84M61n19J96O31q21k43M79m4K59Q71k10l28
2975B88O13n21n44O21L91p65K5j100r11R55R70l80M63K20j073P77J086l23j29
2994F63k70r60L5Q42l30k48N94p64j35J026J94m27M99o91q47M81J51k42O04j03
3014G2p16N39j81l74R82Q98l28j61j60r09J31L92r92l14N82m40O01J623l49o23
3034B73j79n77j2O98K66o71M44k59p06Q21j8r85O85O03n02N93Q02o53J25r5j402
3055g49m30M31k19N42P99l16M0M00l52l18P86k88q91M23J47J6R07k10j272j7O72
3076A01l60P79L94o07k09M39p06k58J32p36M17O18m82N31P73l12p3O93q46m59
$$ y = [374, -745, -1007, -142, 49, -235, 227, -584, -1489, -645, 166, 619, 1762, 1029, -98, 333, 528, -129, 388, 95, -1082, -709, -32, -167, 361, 1168, -160, -444, 17, -502, -306, 325, -496, -739, -260, -304, -45, 826, 616, 288, 901, 380, -164, 457, 848, 83, 108, -992, -1903, -948, 22, -358, 105, 325, -748, 29, 1115, 792, 663, 393, -567, -532, 310, -20, -268, 326, -438, -573, 453, 647, 220, 719, 28, -819, -338, -187, -429, 175, 72, -644, -105, -286, -660, 322, 1220, 892, 731, 571, -338, -207, 185, -807, -1121, -539, -979, -378, 1245, 896, 273, 94, -483, -495, 203, 469, -202, 242, -17, -723, 98, 80, -905, -220, 383, -119, 474, 1276, 623, 748, 653, -749, -1179, -748, -967, -425, 374, 58, 98, 498, 146, -172, 614, 326, -565, -142, 5, 21, 928, 718, -554, -571, 101, -259, 520, 914, 307, 98, 537, -169, -427, -295, -1031, -614, 4, -478, 53, 826, 514, 441, 1134, 288, -171]
3096a71N50J25o90N29m19r26N96J33k16M26K90m40M60M24o28L66J13j559M52O66
3116H1l79K61J004r87m25Q49j73l67M64n49l37Q40l65p78R99l85j51O46j21o70
3136e43J124J57q69K70k81n07K82N50p87L7Q28k48m0O55k54j40O82n99o56P23
3156C84l99l51M58o94o49Q85O4l31P50M24o43O40R0p68M87R1k82j21M40l97m0
3177C8O49j050MN23p26k41J017k27n66O41k48m01P42L2m13P82K67p12Q18k71o30
3198B8J24p0j040N20K24n9J2O56o32J2P44o79k5L78J54m38P18m91j64M07q4r04
3220f09Q57l51k29P72J29o58L43n08o69P51J52o21N99P41n44j21K82p14J15O12
3240C29p84J26O26k14k44N43o58l16P22j83k65O92O9p59Q59n78p78N99L13l84
$$ y = [-171, 379, 504, -186, 343, -76, -1002, -406, -273, -489, -63, 227, -213, 247, 671, 43, 409, 522, -1037, -585, 81, -298, -37, 967, -20, -445, 404, 231, -136, 328, -221, -558, 282, -83, -861, 138, -247, -398, 248, 127, -543, 581, 738, -131, 139, -142, -649, -367, 183, -604, -567, 261, 13, -27, 628, 374, 234, 916, 317, -339, 384, -15, -366, 92, -602, -1251, -366, -302, -633, 117, 541, -102, 538, 628, -140, 347, 438, 156, 35, 475, 78, 38, 687, -363, -359, 164, -562, -803, 214, -13, -579, 62, -186, -587, 155, 187, -226, 556, 823, 111, 929, 658, 28, 152, 82, -958, -438, -214, -273, -261, 395, -237, -225, 519, -160, -185, 193, 347, -91, 627, 136, -28, 379, 295, -609, 248, -103, -332, 440, 569, -89, 254, -254, -923, -172, -20, -641, -42, 699, 155, 34, 316, -398, -283, 329, -455, -329, 297, 83, -161, 382, -276, -592, 130, -53, -318, 374, 443, -316, 543, -35, -813, -214, 99, -285]
3260b85M68j32m56N37P21j029k15K62rL34M04m60k52N22o66K06L88j71n07M51
3280A11k12o94Q58M0n10M43j09m94N50J50k50M70J57r25N61Q1n26L28O59o24o22
3301e58P05m36K16R93r33l44N27k90j09P12o39q03R10j50j88O81M52q28M94K38
3321F50r55N22N07o41J16L37r53k1N44o50j07O94n07M04L67j41j95N82m26m14
3341b87L69j39j75R61j83r64N78L77l61N1M6j161M48N17n71J72M25q80L94O85
3361C02n63L33P48m41k72P67p67o34J010o06m04M12m73k08Q59L26o59M70p9o56
3381e35M94M06n41N21M4r00K27M86l49L89K90p79j53J156m33j65P2o05n02Q78
3401Aj24k23O98q0l03O23n45l41O83J90j127K40m2o8J35L66p43K40N12l51M74
$$ y = [-285, 183, 51, -405, 132, 853, -176, -391, -129, -138, 196, 600, 140, -112, 410, -256, -50, 338, 167, -340, 111, -101, -795, 63, 103, -407, 36, -73, -567, -17, 133, -117, 353, 510, -415, 146, 227, -299, 29, 688, 64, -558, 147, -289, -73, 920, -13, -357, 170, -120, -229, 483, -156, -959, -49, -199, -387, 294, 746, -82, 412, 650, -305, 217, 724, 83, 199, 536, -417, -438, 106, -544, -651, 43, -464, -60, 307, 166, -29, 553, 127, -287, 82, -57, -232, 729, 546, -418, 160, 537, 176, 227, 273, -888, -440, 77, -494, -322, 103, -777, -383, 302, -261, 72, 820, 379, 107, 874, 107, -527, 483, -123, -527, -115, -588, -796, 63, 389, -270, 200, 121, -535, -41, 365, -176, 345, 389, -511, -284, 202, -147, 242, 532, -247, -400, 756, 323, 158, 230, -375, -877, 1, -123, -346, 352, 272, -31, 592, 47, -294, 389, 579, -548, -308, -350, -418, -283, 83, -660, -420, 92, -259, 215]
3422B15J145o78j64L35r17j65K40j41l07K1l32k07Q61M93p14M27J00o36R31L58
3442H65q05m3L93l78j10P12n65K79L63r63Q3L49n06o2Q66j123p29O01K65j18J049
3463D23J73k97K93k41L14R1J69j226K70J37r54O36J50m85l4L44o15P44Q03n94
3483A01j57P59p36Q6N01n67k32N35l83l15N82o1j42Q09o03r73K3J52p0O60K59
3504B28n81N26O14p12J58r4k84J54M95n9l9L54r77o67M84p58K79J383r8l43O00
3525F63j96k25K65J27r31N01j44q01N93j32rM02k86p60J51J267p28M92L52q07
3545b06K99P38l57o56N10p02OO90n0k54M51m65j022L95M9j60N33O17o14L29P1
3566B02k59N31M47p33J62M64q44K63K36r57m00N97n88J97Q72k92M7L03k54j38
$$ y = [215, 1360, 682, 518, 853, -64, -229, 11, -130, -437, -416, -748, -955, -94, 399, -315, 112, 212, -424, 507, 865, 60, 17, 410, 32, -78, 634, 69, 348, 711, -252, -169, 180, -326, -388, 478, -645, -1374, -773, -508, -626, 423, 596, 299, 592, 351, 665, 756, 925, -301, -31, 106, -848, -212, -62, -547, -581, -237, -852, -108, 695, 101, -56, 703, -33, 53, 554, -13, -245, 290, -93, -408, 174, 113, -29, 780, 177, -796, -773, -621, -691, -31, 228, -353, 173, 787, 75, 233, 139, -145, 9, 504, 445, 406, 760, -217, -884, -400, -1158, -879, 504, 406, 63, 663, 467, 242, 507, 634, -297, 204, 60, -741, -148, -280, -289, 113, -173, -933, -782, 485, -243, 249, 601, -206, 93, 831, 474, -182, 328, -374, -368, 322, 272, 18, 469, 4, -1018, -623, -574, -734, -201, 416, -198, 131, 202, -57, 474, 921, 188, 350, 814, -30, 233, 469, -488, -888, -291, -879, -682, 190, -102, -55, 248, -6, -144]
3586a44R06J10p97J88l92j68L92N12m81k67K30o30L49L73n82J74O17l76l58M84
3606A40l03J08L79m19j33Q92n05pL84n78l78M33J26o82Q70R4n69K04N8m24O64
3627C54K77q78K28j65mK99L21o08j32L35p84K63O66k24k3Q00l15p63O57o6j39
3648I9N73o09k22K07j25j30L94l22q64Q91J82o55O55M31r29K05N61k46J02N82
3668G80l29m01J82m80R3P19m58n66K78p1k86M53J2j54L90j1n40L65M73n94M80
3689C35J68n01J02N93j48n47J57p05J1P25l12l14N47m35k07N89j30j2Q89m04p25
3710c24L81K27m10O99J0p66n6K41o64N65J04k78M47N15n93j6N21p73m20O55m80
3731d15O0Q26p8m24J97m42j45N25n0k25M86l53m00N42Q0l33M95k28m42M29K81
$$ y = [-144, 762, 872, 75, 263, -129, -297, 95, 607, 126, -141, 89, -541, -192, 181, -401, -227, 390, 14, -344, 140, -163, -55, 324, -95, -228, 664, 159, 152, 536, -42, -420, 13, 139, -543, 327, 421, -148, 56, 114, -310, 354, 631, -247, -19, -184, -188, 111, 432, -176, -308, 27, -757, -494, 172, -52, -75, 725, 410, -353, 304, 238, 99, 672, 63, -159, 48, -77, -207, 187, -135, -999, -108, 74, -581, 74, 505, -424, -219, 342, 96, 198, 780, 451, 50, 232, -248, -155, 564, 106, -460, -182, -253, -539, -86, -74, -228, 162, 151, -389, -24, 449, -145, 335, 503, 2, 104, 697, 549, 2, 159, -546, -535, 190, -122, -436, 111, -324, -531, 58, -72, -84, 805, 401, -324, 57, 284, -126, 573, 583, -183, -239, 2, -662, -97, 7, -271, 176, 691, 98, 82, 603, -170, -590, 65, -415, -355, 471, 393, -31, 166, -276, -421, 104, 54, -171, 315, -38, -438, 104, 184, -149, 346, 118, -324, 105, 386]
3752C86LoJ02o30k55K12n40j22O29l73L64P74j71j29J88j41o40N78k19m6P32q7
3774F09m98l97m08k52M32N69l51K01N57o53M37M7m20k06M25l08K88O43k86m81
3794e2P94p37j84K84j17n56M01l3n66N79L21n52L26K33n24R39j76l5L05N9m23
3815B86n2j26q73K31N61l87j98P14j15r3N79m65l67J93J31j28L43j37k81L64Q2
3836B62n27M40j73j20J35J4m54K54O28n74J9l2k43K5N22L0j21N04k69k13R8l39
3858a34m32R47p33l77N63J44j66N33j19p78N01O30k80k4K97n08j51L62n76j0J25
3879a86j54M1J64p8j10M37Ol63L45k06m15R80R3m23N30k33n60K52J44m47L70j57
3901C0n40l3K03j59J55m2j76k48J292o34L62P09l60j82L91m57r2j9m04l9K59O7
$$ y = [386, 389, 383, 485, -145, -400, -188, -728, -850, -221, -594, -230, 544, 373, 244, 432, 291, -349, 229, 10, -36, 696, 609, 111, -286, -694, -946, -514, 55, -296, -95, 462, -191, 246, 293, -127, -333, 92, -216, 72, 715, 429, -52, 742, 5, -179, 105, -12, -568, -167, -200, -766, -187, 134, -418, -92, 141, -383, 556, 380, 345, 650, 709, 286, 234, 108, -765, -534, 27, -360, -558, 156, 41, -52, 527, 62, -305, -112, 19, -109, 234, 97, -184, 180, 262, -265, 175, 2, -118, 17, 31, -423, -169, 459, -115, -96, -128, -371, -346, 176, 206, 85, 589, 320, 107, 205, -134, -566, 381, -352, -729, -166, -22, -188, 345, 226, -552, -51, 579, 299, 275, 572, 64, -87, 275, -301, -311, -186, -340, -299, -135, -213, -323, 114, 120, -243, 102, -104, -519, 461, 554, 131, 661, 428, -132, 120, 264, -183, 187, 30, -510, -543, -340, -499, -344, -386, -562, -810, 482, -152, 210, 919, 559, 377, 768, 311, 219, 200, -204, -243, 16, 83]
3923H3o00K82O2l82L38j25k75Q13R7k26K18L77n68m1K54l54o2M45j89J1J16m54
3945a80k21J52n55J18L93K64q2N03k73k17L13J91m13L80rn26K02M75q87K00n3
3966b25l85K03J14l45N88N01n16K57M59l81k21M11n14k55N72k7m07K51j70m17
3986e07J97L9l08L39L70l11M57M29m71J65J64n53j76L77j97k22P33n33o42O18
4006c2n20j22O81l30J28M94K6o66O72K29n22N63p4p32L50J51n82P2Q7j43n4N7
4028b67k80j40N46J91k74O72j55K82J96k21m63K5p7J9K45j03l47J16J6k86o5Q6
4050b84j97K68N67n37J65K20j12p0L46m59L81L00m84j17L09l16l55M52j69m00
4070d92M67M7k78K20J07q3N35l18j21j70j20j18P53k22l01J32l21j18K39K96l35
$$ y = [83, -517, -235, -173, -555, -217, -342, -617, 196, 293, 67, 285, 662, 94, 53, 307, -47, -109, 336, 147, 158, 274, -180, -401, -249, -804, -686, -293, -29, -111, 392, 119, -98, 215, 406, -7, 373, 364, -162, 40, 515, -372, -172, -225, -610, -407, -293, -638, -50, 451, -65, 192, 651, 270, 49, 460, -54, -309, 263, 236, -171, 80, -90, -507, -310, -271, -579, -240, 130, -181, 276, 705, 234, 399, 563, 10, -166, 211, 14, -208, 525, -8, -650, -32, -552, -674, 7, -323, -195, 299, 325, -341, 331, 560, 38, 601, 527, -205, 145, 296, -286, -214, -127, -270, -324, -267, -547, -687, -141, 50, -224, 448, 293, 575, 771, 550, 87, 112, 35, 54, 299, 196, -151, -35, -19, -305, -370, -284, -481, -213, 354, -183, -18, 202, 90, 20, 366, -93, 288, 588, 104, -13, 296, -20, -375, 77, -92, -492, -25, 22, -256, -36, 71, -12, 523, 205, 84, -86, -206, -324, 429, 207, -94, 38, -283, -401, -162, 134, -201]
4091b01L70P5l07J82K01k23j46O47n88j88J38J70l74K86m20k19N81K87n05L29
4111I5K45n92N42J9k94J23L78o46L33O8l54J90M08l79j84j31k62j62M44k12L45
4132b6K63k12j68M45r0o4L41l51j43M33K7m35k70R8l48j36P57l30k6M83k72K72
4154B48k10j77K46M05k16k28L53j80k49K57j46j41j36J16k45N81J18p65J69O1
4174a39k94M37j01j86K41J28K7j47O74m60k54K90m87J76M89l89l44J67R1o5K85
4195A39j79j73P16l98r3j71J95m87O33J09p35L02K32k42K73L78o33J80K34l16
4215c6j49L44l85M5L02J54m29K64n49J61M11n11K97M46j65n86N14o8n30J55K87
4236b8N9J33p5r2L4L72k56LJ64m25o3K97k15O6J13l99J2N49m1k55K90N4o06L57
$$ y = [-201, 169, 244, -63, 119, 320, 97, -49, 598, 10, -178, -40, 130, -244, 42, -378, -597, -16, 271, -234, 95, 340, -252, 290, 309, 15, 138, 516, -130, 203, 271, -83, 107, 515, 136, -48, -179, -441, -603, -159, -371, -26, 237, 25, -143, 302, 212, 148, 489, 138, -5, 428, 455, 20, -250, -152, -500, -636, 121, -209, -235, 248, -24, 248, 38, -139, 107, 512, 296, 68, 421, 241, -8, 249, 103, -38, -174, -58, -303, 278, 396, -369, -200, -139, -433, 4, -97, -283, -42, 86, 113, -34, 640, 180, -74, 216, -271, -95, 394, 5, -339, -172, -81, -146, 139, -40, -213, 503, 105, 12, -159, 36, -451, 182, 291, -444, -142, 90, -152, 121, 499, -134, 46, 280, -36, -185, 159, -226, -181, 121, 275, -154, 110, -439, -278, 133, -378, -81, 365, 200, -386, 128, 60, -470, -315, -28, 31, 164, 89, -3, 31, 403, 147, 150, 314, -111, -174, 123, -92, -26, 87, -312, -300, 249, 208, -47, 243, 297, -309, 48]
4260D8Q4k98N15q6l08L2j11N1L46J99k05k17Nj70P1L39k15k29j56P7j05N56nk85
4284f7L7K54k68N8K45j63Kj86l1L40j94l29L38J19o26M46K19l14K53rj97p4Q3
4307f4p2K85N7J0j20Q1q5n5K57j57l43N68j76m33M93k13n84M56K2j03q7N55m51
4330a59r0K65j73K08O44o69r9M69m36k25N35l74j58L89m26K11K81l44j91N69m09
4351a82l2K49O9R5J06j94l77M10L16j21l22L04o06j11N88l11k18M98k53j8L14
4372B04l50J57Q4J1k27M19l44p0J93J15k77P2j13j24L95L12n30mK03l5k0L61o02
4395a70J8K90m04R4K97L4k51K11m45L3M55k22k94M73J3k62L88k64j84J53J55k51
4417a33l0L21k24Q2K81l64l12M19j14J7L03m37J26J5o6q2M37l42k04O33k71j46
$$ y = [48, 132, -166, 349, 263, -45, -13, -124, -73, 273, 472, 267, 50, 55, -115, -44, 295, 80, -149, -305, -228, -333, 223, 218, -67, -30, 224, -44, 14, 259, 96, 98, -88, -119, 221, 27, -302, 36, 155, -471, -25, 194, -120, 133, 124, -73, -147, -64, -136, 149, 206, 216, 96, 177, 92, 37, 294, 137, -206, 362, 186, -247, 246, 33, -551, -95, -73, -176, -263, 292, -159, -249, 16, -157, 51, 695, 26, -73, 396, -40, -265, 270, -104, -262, 127, -299, -88, 193, -151, -342, 227, -182, -214, 35, 104, 199, 305, 111, -266, 144, 460, 339, 17, 321, -285, -396, 192, -119, -337, 161, -92, -110, 204, -146, 11, 95, 106, -121, 298, -46, -116, 77, 192, -85, -13, -126, -250, 145, 457, -73, -77, 126, 91, 71, 432, -170, -152, 138, -266, -172, 125, 159, -92, 119, -326, -293, 162, -60, -354, 119, 132, -130, 258, -6, -190, -37, 118, -133, -163, 158, -66, 16, 297, -67, -379, 40, -74, -57, 246, -191, -65, -50, -116, -198, 239, -103, -307, 326, 55, -91]
4439i1L17Jk90K21j03m92L23K74l34J03J4l27M83K4n57N85M4n05K12L91l10Q9
4461G2n6j1j57M46p8m73K44k10nN27l20r3o1O1m28O07M6r6R2J5j5J36l2k85M2
4486c2K61o8o4J1k13M9K17j00l00K88o1l59L07K77n31K95j48P0L40l08M9p6J30
4509C4j12K10Q4k26J58k6j26j16K95l32k23M94m33K00o0J82j97K82l01N6M27k67
4531Cp6m0M74m85K15l4K4M6l3m93L30J0J36l54L86l35J16J70k33j32M13j78n3
4554a23K48O7k27J69P2j17l8P4l19J7J92l26M58p9j72QJ51j10J85o7l82QN99l65
4578g7J13j22j6Q0K99j84l3P9j43J17J92k45l31L52k1k68J64P5j59j1J87l00J65
4601h7J24j33j70K66j9J86j1k44M8K14k89o0O26k06j18J76m51l2o3K27k26K22
$$ y = [-91, 226, 227, -63, 158, 55, -437, -114, 160, -174, -71, -57, -384, 99, 123, -434, 151, 195, -310, -98, 293, -17, 72, 16, 5, -152, 294, 216, -257, -13, -223, -228, 299, -21, -114, -175, -114, -542, 65, 111, 15, 107, 122, 107, 243, 211, -74, -32, 229, 161, 97, 108, -105, -56, 161, 61, -239, 49, -12, -371, -64, 213, -318, -23, -171, -101, 239, -69, -20, -96, 34, -78, 132, 216, -10, 148, 122, -4, -120, 175, -157, -380, 114, -319, -119, -179, 3, -194, 88, -213, -157, 270, 3, -73, -113, 361, -124, 91, 57, 81, 127, 94, -399, -69, -59, 77, -277, 109, -226, -110, 60, -173, -305, 108, -70, -123, 125, 192, -35, 134, 206, 89, 51, 125, -194, -177, 15, -311, 147, 68, -104, -96, 55, -55, 130, 63, -319, -311, 288, -77, 36, -86, -102, -22, 277, 93, 60, 139, -4, 113, 305, 60, -271, 81, 60, -208, -44, 31, -128, -139, 48, -252, -87, 37, -96, -266, 0, -19, 167, 156, -88, -40, 174, -115, -175, 451, 245, 127, 303, -148, -180, -243, -16, -242, -20]
4623b0M1m79L85j0L90l36M08o03J91K86o2n8J48n55M3K10k4j35L57l92K56K03
4645B44k79om7K54j56J62j15n17N28K77o6mj65l01J31K61n20J42L89l34LL10n07
4668c16J13J32n8k24M35m3k52L11j59k61L82J6l81L69K24l65N2J98j90J68R2l78
4690a35m4M92m78K04Q8n68L24r5J20J7L48n93K20K60j50J78J27q5k26N0n8l9p3
4713a16L10l74J23L04o33N4L36j84J87j28K3q0J31n0K09j22k39P8N45l82M7J03
4735A42l34R6O8K7o5J78r9k90L96k33P8J28J72m73J24J55k06K50K5n15L51M00
4757C75m95J41PL2j84L28k29MJ04N8j90J47k73P0M5N5j56L2M38l25J46j15Lr8
4781h0p9J9O7K64k89j7J85j09k30M20l31O3L6m6K24n7Q5l27K21K11o34N89L06
$$ y = [-20, 21, -458, -73, -83, 307, -29, 379, -224, -33, 253, 191, 133, 281, -274, -231, -21, -45, -180, 177, -215, 41, 244, -35, -41, -88, 166, 10, 172, 57, -460, 68, 345, 279, 275, 110, -191, -60, 201, -319, -177, 212, -122, -119, 191, -316, -203, -71, -129, -353, 82, 39, -213, 98, -61, -322, 60, 76, -305, 64, 288, -77, -25, 173, -17, 151, 243, -135, -179, 313, -165, 39, 127, -441, -117, -212, -92, -75, 273, -320, -100, 160, 10, 188, 315, 230, 4, 54, -4, -43, -116, 194, -180, -57, 247, -386, -332, 4, -180, 7, -121, -98, -178, -47, -97, 112, -10, -249, -171, 374, -8, 39, 142, -192, -96, -28, -1, -66, 112, 13, -277, 119, -114, -36, 92, 264, -209, -85, 70, -136, 114, 139, -376, -25, 375, -120, 21, 28, 60, -124, 204, -25, -21, 83, 141, -49, 98, -175, -105, -60, -5, -161, -129, 309, -16, 130, 15, 18, -80, -159, -140, -73, 191, -98, -115, 70, -39, -269, 151, -180, -117, -81, -127, 97, 40, 125, -202, 19, 230, -404, 185, 491]
4804D91o93M05j0m03J59m8m8o7L02l22R1K51j56k31N62o64M20j04k56O07Lk03
4826H6k27L04R0n26N17k10p2j3k6j73J44L37j93j4J3k23K69J37k97j94J93%l51
4849d29O83l96l6L50l09l4K08m0j64L18n1j11K71k47k40J82Q9j66L45l30j23O9
4871a61K58l20m9K15k8J22R2l0k39J60m6K29n5q0k28K46L2N2J1k61r3J76J91j58
4895C6J52k11j15Q1K31k96m7J02P2M4M6j77J25J4rJ10k4k25j92N80j3l02J30j2
4919A00j58K75j00l30M42k29j31J26J34j41J19J0n9l6J51k67J01J70l91J14J83
4940H3m20K56J58j93RJ20j52Q7k32L51k14L52k72l16M86j8j14R2j61j9m6K77l37
4963b23K41k7k05J92L2k75k8M26k20J58M3M9j48J61j05r3O4J0k71O6K74k69K46
$$ y = [491, -202, 203, 193, -210, -51, -99, -147, -214, 88, -234, -143, 108, -48, -279, 283, -381, 39, -65, -321, 286, 289, 86, -141, 163, 253, -273, 244, 34, -38, -51, -77, -250, -106, 231, 38, 24, 37, -186, 83, 220, -77, -271, -78, -78, -429, 254, -142, -178, 172, -137, -171, 37, -3, -167, 151, 100, -11, 260, 13, -227, -45, 44, -122, 223, -107, -230, -161, 97, -223, -272, -57, -85, 37, 129, 99, -140, 20, -26, 203, 148, 68, -160, 86, 118, 170, 181, -80, -173, 3, 194, 36, 188, -23, -138, -57, 174, -122, -169, -67, 5, 49, 95, -82, 43, 57, 48, 158, 134, -91, -283, 297, 284, -18, 112, 100, -58, 217, 117, -213, 229, 0, -131, -5, 129, -12, 107, 117, 58, 22, 173, -94, 7, 177, -214, -100, 83, -337, -81, 77, -116, -107, 13, -139, -52, -284, 67, -147, 205, -67, -383, 103, 85, -29, 63, -98, -117, -163, 114, -223, 18, -9, -214, -22, 10, -265, -293, 133, -87, 71, 114, 163, 15, 176, 71, -22, 42, 52, -219, -153, 121, -148, 98]
4986I8k70N5K27Lj07p2p3k04M13J75j77J41K2l55J82j01k48L43K04j02l39M55
5008B70l62q8J31l21J95J17Q9K1o8K46m29Q3J13K03k97Kj78L22J31k40K83k16
5030Gj19J51m1J08l19L80p4n35M80j57J2J03R3k96M21J45l96J04q1q5K27N6l46
5053a62PJ03j66J56j09J07j20K59L7j93L48k33m6J76J48j69j2j28p4O8J82j67
5075A2j9J02l09N04k87j2r3K78q2j61L76j73k43R0KL4q4j22n6n3L69l12K33l16
5099c22K54M12m48R5Q6J13k45M84l06k03J13l89K33L44l06k95K02L01k18p9L08
5120A34j25m5p8K07j83L01M2k91M13n06M9J88j22L5J49Om32K53p4j59L07m0l99
5143c70L01J25O2n2R3j88o1R6J82k11rP2o7m9k08K39P7m2j66M18j88j69P9J43
$$ y = [98, -172, -117, 110, 113, 6, -66, -139, -343, 70, 245, 68, 209, 231, -124, 58, -43, -291, 52, 256, 154, -185, 270, -92, -180, -49, -370, -175, -58, 31, 52, -16, 230, -199, -116, -3, 200, -97, -95, -273, 49, 180, -60, 223, 7, -112, 39, -2, 106, -213, 167, 93, -442, 38, -119, -107, -4, 89, -207, 214, 359, -37, 67, -14, -99, 128, 184, -162, -155, -52, -218, -62, -171, -64, -184, 75, 112, -81, 267, 34, -12, 164, 312, 143, 131, 3, -71, -3, 179, 12, -7, 95, -214, 290, 3, -9, -102, 176, 94, -67, 309, 136, -107, -17, -15, 19, -65, -187, -243, -296, 73, -239, -6, -322, -68, 344, -104, -9, 77, 190, -55, 429, 123, -80, 33, -356, -123, 221, -85, -380, -178, 123, -95, -174, 134, 9, -36, -114, 93, -90, 211, 253, -38, 375, -131, -82, 106, -16, 19, 168, 174, -258, -5, -79, -238, 69, 29, -370, -69, 56, 118, 66, 159, -29, -90, 6, 188, -23, -32, 40, -27, -76, -284, -45, 32, -10, -176, 242, 54, -115, -36, 107]
5167A07j55Q4k1k3J44J1j67N2Mk66L95m1j49jJ14j96K20n8l9R1%M8j88J56J4m46
5193c10N28j63j73J44p6L0J51j13J77j27J22k83P7L50j78l43O4K34j91J81n1j8
5215C2r0O7j96L40n0n02M99j15o1K18j43k48J61J84k40K28o7j53J74K09k01R3
5237A39k19J03k67M32l86J42K53o3m0j5m7J06N3j30m8J0M1l37N83k25j91J79J4
5260H7l41M47j13k37K64j61J3J00L59k08k54K58j84r2n5J91J9j06K72k14M7K50
5282C42n19M8J56l0j3j72J91J15k3j47n2J89l53K79K12p08M20R5Rn9J52kK5Rk09
5307d5J04K88k91l59K34j00M5K34k13R6k5J65k17k16M44j0k6p0Q3j03K60m37J01
5330e8L09k23L3K95m13n7K13k00k83J46J26J80K27k11k99K48J0k8L07K38l70k09
$$ y = [107, -48, 36, 15, -8, 136, 147, -20, 32, 36, -230, 165, 124, -25, -26, 88, -108, 112, 54, 15, 106, 106, 154, -34, 122, 136, -310, 218, 55, -118, 26, -50, -20, 131, 18, 195, 68, 190, -93, -16, 334, 156, -187, -123, 111, -80, 101, 50, 32, -58, 9, -187, 153, 103, -399, 100, -15, -76, 142, -1, -249, -88, 96, -144, 84, 17, -136, 38, 247, 46, 139, -80, 23, -244, 188, -198, -56, 197, 134, 94, 79, 32, 138, 191, 61, 13, 23, 64, -273, 310, 85, -106, 73, 87, -254, 193, 80, -157, 107, -54, -41, 59, 418, 210, -44, 214, 30, -62, -117, 74, 93, -13, 259, 45, 92, 342, -177, -129, 27, -3, -16, -188, 3, 118, 95, -52, -104, 85, -268, 11, 223, -485, -65, 30, 39, -20, 132, 130, 155, 164, -45, 59, 347, 56, -303, -69, -169, -124, 110, -103, -7, -32, 133, -84, -300, 144, 134, 108, 38, 121, 18, 278, -159, -58, 251, 28, 61, 356, -57, -114, 99, -101, -384, -238, -112, 68, 295, 84, -215, 33, 43, 15, 322, 560, 190, -19]
5352a9K45k53J6RJ10k35J0k78K73K49r6M1N8k42k04L50Pm2Q9r8j89L57j98rJ61
5377A12P0k55L06k11j87J71q5n9r0K43p7R2P0j5J57j57r9LL1m5K4L6k98J24K21
5402H2l0k29R8L03m99M24n8l30L41K8k20J23Q9j70R2q7j25K43k9k29K07q3j83
5425b42M2K81j08r1J55J1J40Q4k72j78J9K72m31J41Q1j74P0L30j86L55j59j43
5447cM7j5j00oJ76J54k54J45m00K1M68l31o9K32j62ko8K17j84O6K9j58R1K90j10
5472G4L6M7k21J55pJ16l35K31j2k46L76j90k41M80j59l32J90k9mJ62r7J7J64J3
5496A88m78K22J27k80K49j57M2J2K34k65Q6j30K57J9k57l6J10j69K17j27K8O7
5518d1j95K10j76J00J8N31n92K1J51j02n4K23k96M58j45m6P6m7k7k13J35j84K0
$$ y = [-19, 226, -27, -11, -2, 108, -127, -117, -395, -122, 127, 31, 72, 130, -112, -316, 34, 41, -1, 88, -10, -199, 158, -40, -49, 112, 182, -73, 233, 22, -165, 6, -79, -138, -228, 15, -62, 30, 100, 85, 242, 85, -14, -11, 20, -25, -1, 35, -263, -139, 82, 52, -177, -79, 224, -275, 149, 91, -239, 102, 130, -90, 33, 122, -48, 44, -43, -168, 75, 46, -183, 24, -59, -242, -200, 81, -27, -118, 37, 48, 188, 272, 0, -178, -159, 113, -318, -177, -96, -270, -200, 130, -56, 299, 140, -3, 44, 29, -71, -77, 99, 253, -1, 144, -256, -235, 233, -98, -167, 65, -97, -99, -167, 50, -134, -68, -39, -197, -106, 184, 74, 110, 157, -64, 91, 84, 200, -135, 96, 84, -162, 214, 24, -217, 263, 104, -228, -38, -67, -71, 91, -6, 11, 175, 188, -290, -68, 59, -221, 28, -129, -87, -75, 159, -106, -20, -150, 107, 126, -131, -167, -57, -226, -9, -136, -108, -41, -236, -26, -202, -102, -84, 447, -145, -124, 27, -75, -129, 94, -202, 256, 111, 65, 141, 94, 67, -146, -11, -195, -175]
5541a75K20j70J31J05K7r6J60j24j74Q7k7R5J62k71j77L18j36p1K34k73k79M69
5563C5J4p4r3l4j73M72K97l81k74L02J63l33J36P3m26M14J72l08J09j94k64L11
5585e6K10l38K03L1o5K31Oj40j89J29r3j9L43l37o1L06l24K26l7j82J64K3j23
5608i2K9J42j38o8J82N1j29N7q4j36L66k1m11J05J71j87J26jq6J04K44l36M2L08
5632B38k96j67M41k29K16Kj26l33M66k24kj27K27n1K80k3m6l40L04m09K92K00
5654B93l69J45k8j00J96k67P0j6K50j78k33L21j8j81J54l9n8K01l04R4J79K43
5676C55l22K5j06j35J76K7j28k05K82j05M3K55n17M67n8K2n7J43J37l36K46j66
5698D3j69l7K21k83K20R8l28K28k33P1L70m39J22K68r7j7l2P5j30qM14k69k42
$$ y = [-175, 45, -125, 6, 111, 138, 42, 202, 78, -96, -9, -36, 59, 221, -50, -227, 91, -45, -116, 118, -155, -434, 35, 49, -25, -118, -152, -325, 147, 444, 63, -211, 91, 254, -79, 57, 130, -296, 118, 290, -18, 91, -103, -367, -56, 154, -184, 19, 50, -15, 216, 222, 82, -107, 22, -71, -90, 253, -84, -145, 161, -163, 63, 26, -156, 8, 31, -92, -63, 79, -59, -127, 55, 106, -23, 34, -50, -186, 180, 159, -252, -147, 24, -163, -37, -38, -124, -20, 224, -112, -70, 238, -58, -225, 216, -13, 203, 205, 79, -254, 212, -12, -14, -141, 86, 35, 315, 292, 246, -94, 210, -199, 93, 293, -76, 69, 41, -59, 137, -130, -60, -76, 174, -4, -237, 84, 66, -115, 39, 0, -58, 143, -161, -67, 112, 355, 33, 58, -48, -183, -7, 20, -108, -313, -31, -136, -93, 162, -355, 112, 54, 76, 19, 162, 299, -37, 209, 43, -126, -163, 58, -225, -5, 93, -235, -7, -240, -169, 201, -238, -116, 152, 55, 38, 6, 81, -49, -57, 357, 88, -154]
5721a54L77l32r0L5K23j55J8J57m01L00jk3k3P6n9J01r1J8O0p6P0l7m3j49J71
5746b8j55K37N9J00j96K47P7n00j07J96j88P2N5L73o14L01K75l06J32o6n3q5K55
5769H1k03K45Or3j56K72l4k4o6l88K64J52j56k6j05N2m6L42o2l17N08j79J8j57
5793g2n6J26K03l9k13K08k92J82M2k71K5N5J22K4O0R0l43l5K43k25l5K14m6k55
5817b88N93m3k51L64j07m89M38k32PJ13j45m52N13K9k81J85k32L10k3L07l53Q6
5839D9L9k17P4L42k71k40N61l59k5J37K44l21M0J44l87L35j91m3K03j01k49L29
5861I3k17j31K45J40k99M8L50l65K34j01k37J54L02m10J39L75l70r5L84j52j18
5882c1L8k14Q5M07k87r3q8L50l68L45n1m84L15L03k73L94j41k30k7L00l94l03
$$ y = [-154, 223, -109, -199, -164, 59, -96, -78, 79, -322, -22, -23, -46, -69, 7, -52, 49, -42, -24, 36, -40, 30, -7, -50, -199, -28, -183, 54, 113, 213, 17, 264, 341, -159, -266, -70, -258, -186, -131, 242, -372, -71, 204, -102, 30, -36, -89, -174, 81, -122, 123, 129, 36, -120, 152, 118, 94, 28, -360, -96, 56, -100, -126, -231, -179, -225, 117, 55, -262, 246, 67, 85, -72, -128, -2, 201, 162, -51, 157, -135, 47, 89, -182, -157, -102, 20, 44, 104, 194, -149, -184, 59, -166, -201, 13, -33, -288, 305, 262, 11, 375, 268, -221, 217, -15, -8, 105, -40, -492, 21, 50, -231, -46, -278, 32, 9, 316, -37, 49, 88, -129, -55, 287, 16, -224, 337, -22, -47, 90, 334, 13, 53, 197, -190, 145, -46, -89, 114, 13, -236, 93, -124, -255, -10, 130, -169, -121, 229, -136, 98, -3, -240, -86, 216, -194, -55, 320, -50, -145, 239, 87, -31, 7, -207, -122, 285, -2, -95, -183, 167, -201, 144, 93, -391, -76, 227, -46, 348, 207, -23, -50, 250, -144, -447]
5904d47N93n49M43j02K02l62J42J19k23Q3K28j41q0R5p4J14O8q3P7M6m8p1J65
5927A95k32o2J52p8k12M28l36q3L54l5n6K27j19k45K80k16J82rj48j18J72j68
5949a27J6m7M38n41M38j03k78K49M4j07J64J9j63j32L12l04J28J09r4L8K55k00
5971A14R6l04O3J26pO4k28oO2k1L07J76m99J79n5l52K44R4k14j1L87l17J25K22
5995B45m33nM37j3k53J36l6k75J22m9p8j9O2Q4J83K64m34J88L4k62J42J94o52
6018d18N09j6l7k64J03j44L55o9j44l8L39k98K32ll85Q5l6L36k60L14r9j04J05
6041F3j0m7M49j03n40J33J0k07OL64j37m1J39r1j41J82j88M9K14K72n08J70J05
6064A43k08L30q7j71J84n9m27L55j78n6J10K78l70J65k40J68o8K82j34o7R5m05
$$ y = [-447, 146, -403, 40, -62, 140, -222, -80, 39, -184, -101, 127, -14, -94, 1, -73, 41, 109, 26, 103, 149, 101, 30, 195, -37, -99, 53, -25, -237, 191, -145, -228, 126, 91, 35, 262, 143, -102, 178, -38, 144, 135, -13, -131, 41, -127, -111, -158, 280, -261, 177, 74, -204, 45, 89, -18, 146, 165, 2, -130, 182, -122, 6, 115, 21, 59, 314, 114, 210, -94, -31, 95, 88, 152, -76, -82, -20, -41, 266, 442, -57, 122, 67, -285, -41, 53, -161, -172, 215, -102, 23, 245, -188, -193, 244, 231, -22, 114, 78, -197, -75, -124, -202, -221, -159, -75, 108, 372, -62, 126, 160, -102, 40, 234, -418, 91, 75, 38, -226, -123, -267, 88, 19, -125, -163, 176, -122, 110, 107, -278, -193, -229, 107, -153, 161, 62, -42, 63, 53, 6, 455, 352, -188, -55, -45, -252, -246, 118, -19, -60, 79, -12, -153, 29, -159, -110, 104, 376, -132, 38, 143, -65, 265, 178, 7, 191, 132, -295, 60, -118, -174, -64, 214, -156, 9, -231, -63, -131, 151, 17, -50, 45, -360]
6086c60L52K90j53k81J76r0q1J77m8k33M82k29q9L44l04j57L43j92k46K54O6k13
6108a92M3K56k71K86n5j96P3M51l99J85k9j98r4M41k4j06o3K3j46J19mn15M81
6131F6J74l16o0K91j41j10K86j98O7K44j06M2n4l23J66Q7k44M5L19l72j09J90
6153e6n4j62K57J47j06K47j34l51M20j82j71L57o2m13K18O1l81k4N66l41K07R9
6175A42k08j54L58J55m42L43k3n2Q9k43j7J79l2o8qQ8k01L55q6l49K84J35n09
6198b64M29j64j96K23L4j63j99M01j95j28K18N1k33J75j62j49L93k16j16L97o9
6219F7l6K28J88j99j91k26N4NK88k17m48N01k49j7K21j75j9K44r7P0K44k9j72
6242C5L19k35Nl2J62k44R5r1l17J03N1J20q1J04k44L29Nk13K05J2N4l1K84k18
$$ y = [-360, -8, 282, 129, -152, 24, -66, -147, 30, -18, -251, 231, 2, -87, 257, -47, -204, 139, -53, -299, -45, 21, -192, -149, 107, -164, 122, 67, -129, -56, 395, -4, 181, 152, -46, -140, 301, 277, 171, 108, 131, -15, 104, 100, -415, 66, 240, -76, -136, 155, 14, -96, 190, -8, 59, 303, 197, 239, 185, -138, 28, 115, -129, -84, 235, -137, -246, -56, -110, -272, -15, 132, 26, 273, 139, -212, 208, 26, -145, 212, 150, -263, -45, 16, -365, -389, 177, -164, 43, 142, -66, -220, 138, 293, -149, 194, 171, 119, 208, -35, -52, 127, 95, 27, 19, 107, -94, 261, 175, -174, 110, 245, -264, 165, 1, -195, 28, 62, -101, -300, 101, -94, -222, -4, 47, -186, -11, -173, -322, 71, -145, -261, 136, 67, 31, 259, 447, 248, 57, -169, -115, -110, 178, -39, -487, 14, -235, -252, -31, -206, -225, 19, -78, -8, 236, 207, 35, 354, 119, 124, 92, 254, 10, 105, 14, -303, -200, -149, -29, -110, -6, -250, 79, 84, -129, 76, 88, 142, 111, 395, 177]
6266A77j09J29j90k06M44l49o6j59M6J21K48n6l21L74l28M0K07K77m88J93R9L8
6288A21j98J58l32K86K87n45K49L4k23L3K60j94j31Q1J20k32K28k0LN2P6j14J29
6311A28q3l68L95P2k11o1L95m25K11P2k84N97m59P8J30n1j03n9j12k3j10M62k13
6334b2j89J64J4j07M5J72j77K73K43m14K72l32j53J36L47m21J88q8j9J8P7m86
6356d59Q8M38m11K69L41l29j30L65q1j54L23k65K30N1Q5l64K52k8j96k23J88l59
6378c69K26K42l33L25k0m0o5J09l17M98m8lm51K00j34J33L0O3l09P5K0n9K4J64
6402c9j19L16N9k45J89j44k05l2M10l27O6K07l02L93o7j22mM8k48p5J63L3j16
6425a61K87k20J77K28l35j1J03q5m97M05M04o31M21p1k94J86N1j52M28J26m82
$$ y = [177, 68, 197, 7, -199, 245, -104, -170, -329, -283, -162, 86, 30, -291, 83, -245, -205, 2, 279, -209, -16, 83, 121, -77, 81, -251, 35, 322, -223, 26, 60, -163, -130, 130, -64, -195, -114, 6, -226, 2, -18, -15, 37, 113, -1, 128, 45, -323, 72, 144, -67, -128, 267, -158, 53, 125, -159, 438, -21, 57, 187, 136, 33, -26, -138, -161, -271, 191, -22, -211, -47, -33, -140, -95, 77, -100, 173, 416, 2, 274, -58, -211, -75, 272, -149, 39, -49, -68, -50, 27, -459, -371, 67, -344, -75, 266, -63, -193, 172, 91, -63, 260, -5, 225, 276, 361, -3, 249, 221, 25, -198, -10, -369, -143, 99, -234, 91, 71, 31, -34, 75, -242, 256, 208, 205, -246, -46, -180, -47, -17, 46, -263, -188, -168, -227, -203, -39, -158, 158, 217, -28, 161, 17, -188, -220, 190, -137, -71, 136, -166, 227, 160, 38, 34, 82, -166, -241, -78, -45, -161, 126, -94, 83, 311, -24, -35, 68, -17, -514, -109, 295, -336, 85, 14, -280, -94, -43, -195, 233, 359, -123]
6446a23M2K90l17L63k78r4j29L78k48k50N95l07j86L86j13j77J80o1j07L03K65
6467D12m81J92j80J2J48k44j75J74R3k77L00K17m38L6M10l38J78L04k99J47r3
6488I8K56l77%O6l23J29j4k03M47Q7k87j5K43m02J57K88k14J03L5j46M8L84m66
6511a06O9J70k16j4K96N4k19Q0l25J8L28L9k12qK50k71K36k92rJ75K8o1L1K16
6535B57m28J37J09j45J04R3q2k30L10p0j71K45q1o0K43q4k51L06l11j66J64K39
6557A28m52N11r6k11P8K4q9J1L88k01j08K85j59p5P8j19j06j8N6k90M82l33J83
6580c3k4k67K48l8j02L9L48Q0M7kk79j90mK60j29k1M4m28L00M1j96M2L44k33K88
6605A35n2r6j13L08j19r3K72j88k39J64J3k00J9K28m14L13J91k18j0J60k95L05
$$ y = [-123, -81, 209, -108, 255, -23, -117, -246, 132, -116, -366, 229, -78, -264, 122, 9, -168, 12, -49, -156, 147, 412, -69, 123, -57, -45, 103, -141, -316, -142, -49, -326, -26, 191, -247, -211, 199, -139, 39, 343, 44, 191, 98, 354, -23, -23, 43, -280, -151, -165, -368, 79, 166, -121, -136, 107, -295, -138, 150, -64, 39, 74, -72, -24, 360, -106, -37, 133, -83, -97, 199, 253, 34, 114, -211, -193, 135, 174, -38, -46, 204, -67, 169, -123, -132, 43, 71, 10, 41, 257, -171, -34, 75, -70, 34, 127, 45, -185, 125, 55, -116, 129, 48, -12, 231, 147, -104, 202, -109, -275, -111, 128, -324, 187, 91, -120, -42, -18, -107, -96, 292, 91, -17, 268, 109, 34, 112, -7, -113, -131, -75, -365, 117, -216, -33, -57, -324, -76, -114, -216, -177, 171, 251, 298, 296, 17, -173, -177, 83, -46, -67, -23, -451, -151, -110, -306, -264, 80, -153, 135, 83, -13, -126, 182, 63, -30, 242, 54, -185, -21, -8, -208, -189, 39, -375, -62, 129, -89, -99, 61, -234, 71]
6627G1M3k30L64l21J83j72M49p23L81J03j87R9J21k41l19M73j77j2K70k74p7L32
6649A56k29Q8J7M3r2M0K29j67j41J48l49K97J97k41j4M06n31J72K80j67j87K17
6671A72J16k37q3j67j54L78r6m61N49j11qJ49K1J34k72L23m87K92J98l20Q3L47
6693C66l67O1R4l34r4K44l27K56J68k91M9M05k83r0K70m2M1QJ34l74J50J0j87
6716a33L4L60l23J42j52j12J30j09j62q6N35q9q1L23l87L42k89M6N1R1M7j00j83
6739a05N4j44J71J25k85Q3J74k67l6K46J06j64L10l53j1K02k64J9L99k55R8j46
6761d3m4k03L26Jk4K25l63J64K92m8n26N87l84n1L07K8l57k6K31j9k12K04m1j54
6785a30L07Mk61J63k01n1L19J20k52K89k53k06K67l1l78L55j33l32J32K27l74
$$ y = [71, 114, -116, 248, -73, 110, -62, 387, -336, 45, 148, -39, 60, 181, -60, -379, 94, -83, -95, 175, -99, -176, 156, -73, 15, 32, 75, -17, 23, 252, 85, -56, 92, -257, 40, 237, -4, -18, 388, -143, 29, 309, 142, -45, 172, 288, 51, -32, -199, -353, 25, -71, -532, 17, -94, -102, 47, 68, 202, -70, 253, -234, 58, 256, -64, 19, 366, -1, 60, 154, -180, -274, -30, -357, -101, 67, -224, -175, 230, -53, -143, 127, 85, 126, 134, 268, -106, 44, 54, -133, -99, 261, -62, 80, -72, -184, -54, -163, -325, -411, 124, 35, -46, 277, -110, 232, -57, -11, 40, 131, 178, 78, -105, -51, -195, -24, 101, -184, -101, 73, -194, -230, 16, 122, -42, 268, -85, -96, 106, -158, -139, 260, 5, 103, -43, -87, -290, 36, 37, 13, 238, -125, 39, 331, 283, -243, 344, -40, -91, 216, 244, -113, -139, 92, 73, -139, 65, 24, -130, 177, 181, -80, 83, -118, -169, 150, 270, 18, 307, 54, -152, 115, 84, -294, 61, -72, -404, -272, -45, -419]
6806d19K48K18m7p5L97j77J58R2m02J26K45j10j6k28P5k51K49l39k42J61L51j36
6828a22J9L61n82N33o6N2O5n2j80m1J07j93Q7N9l33L31P1j81k08K94l00m0L04
6851a5Mq1M00o2Pn4k1k27M48m39J18m7K38k03M0qn70J05K67j44K09K43j72j69
6875a33K04k0j09rR5l36L39n1j7Q6K16pj45J40n25J25L00k30J2L15j57j20K85
6898B58j85k6J08j44jR6j76n1J80l03J98J73K44l97J50l22J62M94k66m53N14m12
6920a59L3J76L8r3j71J99k59M7M35m18J04Q9k85K31L10k59j09O9Pr8J21j07P3
6943b6J88n0k39K37k27p7L77k51j48J32J34k14J84J25k36K30N3L3l38M11l10j78
6965a90L11k70J11L16n13J0M00L0k99J77j63l5K88M7m00N1J37o3J55j74m4l2K44
$$ y = [-419, -171, 47, 0, -75, 322, 145, 303, 395, -7, 119, 364, 254, 238, 10, 85, -166, 83, -256, -498, -337, 14, -122, -103, 258, -324, 209, 143, 195, 260, 208, 28, -13, 94, -99, -12, 47, -286, 45, 116, -65, -273, 21, -279, -319, -15, -11, -92, 308, 246, 253, 199, 178, -49, 399, -40, 78, 31, 269, 66, 106, 98, -472, -367, -100, -244, -35, 208, 36, -133, 71, 51, -58, -67, 28, -308, 31, -20, -37, 49, 265, 258, 113, 253, -272, -147, 153, -77, -65, 250, 93, -27, 258, 73, 47, 155, 11, 10, 106, -70, -121, 59, -244, -46, 127, 371, -26, 124, -198, -36, 458, 192, -261, 253, -159, -126, 50, 88, -5, -176, 23, -236, -189, 246, -172, -68, 21, -264, -33, 277, 18, -91, -22, -15, -113, 8, -99, -26, 162, 112, -127, 110, -117, -194, 183, -68, -216, -84, 50, -164, 20, 145, -91, 139, 192, 225, -113, 298, -12, -190, 121, -149, -38, 278, -235, -225, 175, 205, -94, 83, -80, -115, 173, 220, -180, -129, 8, -55, 100, -74, -118, -150, 94]
6988I4l00J91j5j12L05j7j8j59J52l42J23J69p8n3M9j47RK20m5r8K62j20k23J25
7012b8J04j74lK81l20L28k48Mm7J83j01O6K62n00J7L58k74K60J75n74j2L33jm1
7036D8L71l10j8%j90nQQ9k79J82N2k53L02P3k45K7K59Q4k31M31j82n8m3j78J61
7061I5J0l23P1L90j18j47j65j96P3K56q8jJ35K33j80J13M2Nk14J67k13K66j28
7084H3j83lM4j09J44K16m31Q3K08j80K4L82j30l00J76J41j90l2j5l14M02O9j74
7107h9M03j72l24L19k9j81J92n8n9l1M13m90J63K89l16pJ83l14J21J4r1j35l3
7130b32K79q6j01K74k10J56O4k99L20Q4k39j25M21o32K89l6l21M20k07K37j05
7151d9K58l58J95K46l61J25K56k21rK62M3m10k5m7k5Q6j7j76j18R3j05J15J55
$$ y = [94, -206, -15, -30, -142, 163, 146, 128, -31, 121, -221, -98, 71, -7, -60, -11, -158, -149, 71, 26, -72, 190, 70, -153, -28, 76, -98, -101, 180, -140, 188, -60, -56, -103, 80, -21, 45, 307, -193, -176, 182, -92, 168, 343, -231, -243, 90, 89, 48, 419, 109, 91, 91, -99, -104, -96, -7, -286, -104, -52, -305, -3, 70, -175, -148, 111, 195, -36, 395, 213, 155, 112, -66, 95, 105, -218, -147, 243, 125, -22, -187, -383, -310, -54, -142, -143, -8, 225, 45, 158, 200, 205, -9, 158, -55, 211, 83, -100, -103, -59, -168, -24, 192, -239, -156, 52, -128, -104, 278, 148, -152, 24, 165, -25, -57, -72, -386, 16, 85, -89, 314, 142, -182, 137, 108, -73, 119, 61, 2, -29, 384, -106, 57, 346, 30, 23, 206, -108, 13, 27, -64, -199, -232, 47, -39, -140, 134, -76, 80, 144, -155, 165, 249, 10, -115, 306, -326, -37, -73, -394, 26, -181, 56, -49, 209, -149, 46, 292, -69, 56, 312, 91, 82, 344, 387, -23, -48, -95, -120, -34, -51, -227, -345, -252, -357, -242, -87]
7174h7l40L60J65k53M09n9r7o9K12j38k82L78k67Q7R7j53l48K96j86K36J07M1
7196A09l56J22K63l99K94k2k45M86jl75J34M0k45K23K31l58J49P3j30l6J92q5
7218F4j48M03k49n0R7j81k30L75M2k08K38j42l23J79j26J90J27Lj25J27J97l92
7240a32RK88j81R5J55l68J21K63n56K03J66r3k03K31J20k08K84L7k70J66N2K1
7262B00k06J00k09J1M0L29N2j46l01l5J39j58n3K36pj30J54j83J05K47L2j59K07
7285B65j21j43L30k36l18L38j92J23k82o1R7J52P3k13q7M22K2j06Pk1j47J72M9
7308A23j15P6j49P2J2j98J8L8RQ2J35q2l99K42J95J29j07J09n6K21j44k05J14
7331A20j77j68M16j75l3j80L69l20K49j03p4l29M83n6K38k1j30j57J10n0j84J11
$$ y = [-87, -427, -67, 98, -155, 254, 195, 98, 29, 241, 103, -179, 199, -68, 19, 116, -37, -385, -89, -275, -39, 68, 109, -247, -125, 138, -261, 33, 11, -234, 252, 251, -124, 10, 50, -195, 28, 259, -99, 50, 123, -7, -43, 149, 64, -84, 319, 70, 20, 117, -64, -294, 81, 123, -85, 153, 11, -312, -133, -259, -69, 58, 61, -64, 63, 260, -132, -123, 165, -16, 79, 234, -134, -13, 250, -306, -103, 63, -30, -233, -2, 118, -90, 194, 231, -39, 127, 179, 200, -6, 94, -115, -104, -64, 265, 317, 171, -130, -165, -26, -184, -237, -1, -8, -138, 16, -167, -62, 185, 217, 58, 265, 144, 1, 331, 95, -223, 115, -77, 46, -236, -297, -200, -48, 25, -188, -275, 147, 169, 63, 70, 49, -98, 74, 123, 8, 84, -65, 7, 19, -179, -161, -123, -114, -32, 103, 21, -378, -136, 59, 188, 81, 190, 134, 355, 211, 6, 120, -57, -225, 191, 16, -17, -197, 172, -148, 101, -2, -76, -405, 78, 22, 260, 239, 109, -48, 62, 12, -172, -61]
7353f1M8j28J82q8j46K74j48j49K04L26l24R6r3j85O4M61k38j27m4P4j40K16k68
7376a94j37M58J0k46m6K19j84R9j05K55J95l59J90R0k11K19l26K11l35j12K68
7397d1j56J17J71k05RL52l17j6K47j88K15m3k19m3K65r1j05J24j15J00j11n6Q7
7420a9k81L25Q1p8J76l68L11J00j36N8l26Q1L6K31k20K34k67N8j88P7n7l7K37
7443B8k6j82R8K17n1J08j81q7J63J74m01Q2J04k62K77O8p8P3j01r3L5J94q8k57
7467a86l7L20j96K33O1k43pK66l41K29j2k95L72N1k34j47N15l39r3K33j21j26
7489i7L12m98L05j05P8L8K1Qk79J85K3R2p9N2k32K79k2j26q7K73k44K04J99k87
7513A3l6J28k90K36J02k00J04N9j94j20K92k68R4L6K38l23L61j37j97K49M1M0
$$ y = [-61, -13, -141, 41, -47, -193, 81, -67, -216, -12, 314, -10, 86, -7, -192, -128, 333, 95, -32, -76, -2, -142, 74, -194, -331, 127, 137, -109, -155, 64, -120, -21, -126, 129, 324, -35, 155, 245, 34, 253, -73, 138, -197, -309, -41, -197, -80, 91, -114, -105, 247, -70, -86, 161, -27, 188, 145, -74, -117, 148, 57, -48, 76, -39, 61, -50, -106, -19, -300, 25, 106, 28, 204, -164, 147, 247, 111, 169, -157, -76, -40, 191, -29, 205, -62, -4, -192, -115, -172, -209, 28, 2, -180, -82, 135, 84, 192, 11, -76, 87, 261, -140, -58, 46, -216, 61, 129, 51, 124, 23, -70, -35, 159, 71, -186, -223, 97, -99, 134, 195, -48, -55, 211, -130, 99, 87, -208, 164, 215, -19, -166, 349, 10, -83, 150, 29, -97, 215, -283, 22, -83, -5, 33, 54, 62, -217, -32, -9, 83, 4, 56, -176, 103, 81, -45, -132, 141, -103, 101, 300, 13, -23, 105, -185, 51, 153, -47, 57, 116, -78, -198, 94, -174, -80, -44, 194, -129, 232, 95, -102, 147, 188, 228]
7535B28l07m7l2L25j88m4N2j46j19O0J72j04J15K28k15j67M88k52J1K6M9j28Q4
7558H9q1Jj69J51P7m6O8j8k42or4J79J98j01J2R2k05l2J28n0k45K88L8L2J7l31
7584b50L33J13n14O4K87jK9j09J38m5K69j29q4r8q2k6JM17l19R9N3l69L76j86
7608c3Q1p3K23l8l50p8N0K4J28L3P0r6J48l03L30k25m0K75k23J28Q0J06j70j00
7632e3p6J96k94N23m77o8L7L76P5k86K85k09R1k48K46J46l18%L26j99k37J96q5
7655e3l01M90j32nJ07Qj64J27m6o8r8K37nj18L01m72R6K39j79j97L77k44Q6o0
7679g4J45j02M7P4j01L23m54J17M15m29P0P2Q7l67K83j85l44K75L17k61K01J36
7701B45n84M47j5j2q1p1J49J42l0n11J42M30o3j17j01j41k60L06j8j18K00o5J6
$$ y = [228, -79, -126, -158, 167, -21, -65, -13, -159, -278, -218, -46, -150, -35, 193, -22, -189, 299, 47, 58, 84, 133, 5, 89, 8, 9, -160, -9, 68, 22, 90, 72, -170, -176, -270, -91, 107, 6, 18, 110, -95, -127, 1, -49, -294, -6, 32, 64, 81, -250, 83, 196, -318, -254, 33, 32, 61, -48, 90, 45, 314, 185, 101, 3, -79, -105, -104, 313, -6, 93, 146, -223, 153, -33, 48, -25, 198, 160, -190, -268, -218, -194, -66, -33, 37, -59, 89, -214, 116, -109, -149, 126, -97, 31, 111, 217, 47, -53, -129, 67, -227, 296, -181, -249, -212, 164, 239, -47, 238, 29, 120, -128, 118, 264, -54, -54, 272, 73, -164, 32, -53, -354, 136, 4, -1, 106, 114, -50, 77, 31, -37, -135, 102, 97, -21, 280, -192, -96, 143, -36, -233, 144, -100, -14, -74, 71, -31, 16, 90, -11, 312, -142, -25, 390, -39, 31, 103, 190, -177, 106, -79, -423, -148, 169, -92, 109, 245, -339, 108, 93, 81, 0, -71, 78, 220, 190, -321, -179, 251, 188, 71, -30, -171, -431, -125, -143, -261, -61, -126, -110]
7724a10R0K32l41M70l04J51j78L65l89J76r0j06r1J20j06j55L18r9m7L37k12j39
7746a08K98k04m6K88k00N4j33nNj1Q7J42k91j5J00o4K52J8j04K18k93j57K68j12
7770a3qN3M2N7j41K95k15j64K49j62m9L54o26L66J02l05J65j27P3oJ18l2Q5j98
7794h7Q9J9p9J23J7r1L4k39J48Rl11L96R1J7j72J37k00J68P1J2m9K0l13K33j74
7819a31N5RK50m39K20Q8j29O9J70n8j98J73k01J88P1m8k16K35j68N5J97m61K82
7842A3j81K85k42J2J64j61J37q4k23M38o4k71L3M47j89m4M4l10L84k37O5J27Q4
7865B27k09j09K05l40p8K85L6j15l6J20j8q7K44j49K78M6l72O6M7R3j60Q4m3j55
7889a40K75k16j71M55l18K7L64r0r4j31j68P2ML77m71L48Q4k41J4K85o01J94j12
$$ y = [-110, -20, 212, -129, 341, 37, 188, 10, 375, -14, 162, 72, -34, -125, -5, -111, -266, 52, -47, -94, 243, 31, -108, 190, -14, -60, 228, 28, 82, -51, -56, -51, -62, 25, 167, -124, -139, -39, -103, 149, 167, 63, 281, -12, -169, 99, -13, -21, 32, 74, 131, -10, 285, 70, -94, 155, -7, -56, 298, -328, 38, 140, -165, 0, -127, -54, -60, 58, 26, 111, -87, 2, 21, -58, 65, 82, -9, 25, -214, -66, -57, -368, 28, 119, 136, -36, 101, -99, 69, 140, 152, 103, 123, -190, 43, -131, -76, -67, 183, -256, -36, 52, -77, -8, 162, 104, -94, 79, -122, 66, 137, 89, -127, 108, -60, -5, 192, -269, 13, -168, 117, -125, -113, 51, -110, 27, -57, -280, 158, 94, -177, -144, 303, 114, 70, 114, -196, 188, -49, 16, 143, 227, 18, -91, 114, -226, -304, -19, 17, -98, -134, -14, -32, -119, 125, -24, 254, 300, -72, -6, 41, 134, -26, 58, 15, -140, 135, -81, -252, 203, -115, -88, 276, 186, 92, -39, -207, -135, -131, 246, -225, 123, 207, -34, -20, 265, -336, -142, -254]
7912b54J91J08l8k8j15J89O8k52K77j81P0R6o6kJ0p9l7j0K11k67l3K67j49J25
7936A01K3k33K00j01L3N2lj28j13K91j75J17j31%m8K44l78J20J42QJ2j8K3O9j24
7961a7N2j63L4J44j82K27m1j53O4P6k62K32J08ql21L06j65L1K40j30J45k11j87
7984a81J27O9Rk17J13Q7l8QK1k52K57J41l03O4K52l87L24j34k00J27K29l01K37
8007E2j10O9N0R7k08P3n2N7l00L38J00j96O2j32J46M7j9k13K71M3k00jJ27j73
8031g2P7O7l24o0M73m12J64P2J1o0L19l43K17j90l2l04O96l86J64m9j05L01M5
8054B69O2m93L38o4K6r1j57J26l04L59q4r7Q5L00l50J20j97Q7J25k38M19j40p4
8077B7k00J42N4j5J0J18l7P0r9j79K23j43R9k88n2J8J37K44j26O6j65j22K13J20
$$ y = [-254, -63, 45, 7, -21, -136, 53, 121, -131, 146, -35, 35, 131, 65, 63, 73, -6, -43, -53, 158, -109, -142, 125, -24, 101, 124, -109, 91, -10, 23, 75, 72, -56, -169, 122, -53, 64, -67, -67, -115, 129, -249, -129, 13, 21, 33, 15, 38, 107, -17, 35, -128, -94, 50, -132, 95, 54, -99, -35, 41, -221, 11, 119, 111, -210, 96, -69, -38, 202, 72, 217, 6, -181, -54, 15, 24, -193, -80, 7, -31, -23, -2, -254, 3, 144, -159, -95, 157, -230, 94, -40, -240, -113, 116, -185, 52, -58, 11, 61, 158, -50, 23, -29, 28, -272, 66, 166, -30, 32, -100, 46, 93, 74, -139, 132, 175, -25, -26, 101, -72, 5, 72, -252, -312, 161, -251, -87, -15, -4, -64, 255, -88, 129, -61, -93, -397, 299, -87, 77, 28, -77, 224, 269, 331, -162, 176, 112, 138, 47, -110, 16, -288, 71, -13, -110, -25, 275, -75, 45, -152, -65, 60, -178, 241, 101, 27, -173, -31, 23, 8, 18, 136, 99, 169, 70, -109, 114, -29, 70, -218, -270, -252, -115, 129, 3, 69, -96, -218, -5, 115]
8101A15j35J63K8j02q1J74Mj63k3K14o0k65Q6l6J61j35k6j12K67k12J18J90k77
8124a07J45N5K1j79n9J17N9R3k41M8L33k40j40J9L19n70J73O9L9J14n2n7q1J33
8148A1o0J59rj48j56L81q7j97N8P9q7K95k89q9K50j0j28j13K01q9j62K41r7m3
8172h9j51L05m0J58l25QK11l0q8J51j74k4M2j09N0L3K31m85M02
$$ y = [115, -20, 143, 171, 69, -12, 162, 166, 3, -20, 194, 134, -131, -45, -81, 80, -55, -81, -193, 74, -138, -20, 170, -107, 38, 93, 114, -65, -124, -7, 52, 145, -96, -48, 285, 45, -95, -76, 243, -327, -154, -85, -46, 68, 16, -41, -122, 11, -49, 110, 101, -47, -203, 178, 91, -106, -48, 31, -56, 239, -50, -139, 111, 101, -27, -140, 61, -28, -190, 51, -46, -89, -240, 65, 25, 183, -142, -134, 77, 47, -41, 110, -64, -88, -46, -155, -105, -72, 159, -326, 76]
8191G6
$$ Imaginary data points
##PAGE= N=2
##DATA TABLE= (X++(I..I)), XYDATA
0@%%%%%%%%%jJqJ6j6J7k5L2m0N6o4P2q8J05j26J49j75K05k37K72l13L58m09M65
33B46n24N94o72P55q47R46j055J176j307J451j608J780j966K171k396K640k909
50a525L205l531L893m296M743n246N820o476P235q128R194j0493J2121j4227J7072
65I361k1155K7549l9075O6423k54685k54165L28842K27357K01662Q9685o143j27029
77B48627o3427m6169n0875j18125j07763k6008O0055J2439J4527L1509k6485p1038
89a42733J5746M5690M0065P1968O7357N50j2372l1805l6494L7023P1300p934m4476
102G3885l7741m8733j5192M2448J0921o9737j28969j04747K5890J20511R3182
113c8282Q0681P3286j4835k3872P6535M9927o3964o0440k3278m6280m3532j6212
$$ y = [0, 0, 0, 0, 0, 0, 0, 0, 0, 0, -1, 0, -8, 8, -8, 9, -16, 16, -24, 32, -32, 40, -48, 57, -69, 80, -95, 110, -127, 145, -168, 190, -219, 246, -278, 316, -356, 399, -448, 498, -557, 619, -688, 763, -845, 935, -1031, 1140, -1256, 1384, -1525, 1680, -1851, 2042, -2254, 2489, -2757, 3063, -3413, 3822, -4306, 4888, -5605, 6516, -7711, 9361, -11794, 15755, -23320, 43103, -211582, -465747, -136905, 90452, 292114, 381799, 375656, 248627, 185200, 139031, 88156, -29969, -137732, -163740, -103685, -91246, -76719, -45210, -71695, -142733, -126987, -81297, -41232, 30736, 98093, 98643, 86271, 54466, 17972, 54995, 126295, 118361, 73885, 36144, -12589, -27781, 14667, 25588, -44149, -173118, -277865, -251975, -131464, -38282, 42399, 115685, 100850, 76978, 153513, 203440, 139476, 79036, 55758, 9478, -34054, -50266]
125e0266j8857l6603n1400k2701M5026N6756N1596J02571P2973n0361o7770n086
137B5878K973K3349M7505j9861q0400n5849j5684L1978O3670P955n0369l1739
149e0594j1715P527M2634J7303l5909l0125O10L9161P8802L9734k3985n076L504
162G1871k5761R107K7794m6927p5983l3543l6145l8283J4870N5798N8253L1744
174A2795n809M916L2166K0640L1234L9669m1495r2174k2763J3826j2494k325l136
187b4950l7910j5541L2138M0335L2570q22l9772j7524J3499R084K5799K7736k2620
200B2022l0650O960J3847K3264L1438r659l0650j5958l5779l2783J7276J1649
212b9023k1796PR006o623K3032N0179L0423M066j8449j8562J6339J5099j8406
$$ y = [-50266, -69123, -105726, -157126, -179827, -134801, -78045, -26449, 76122, 149095, 98734, 30964, 25878, 28851, 52200, 99705, 79844, -556, -56405, -72089, -40111, 23559, 31514, -18855, -50594, -62309, -54782, -12148, 5155, -30754, -60879, -60269, -21108, 57694, 97428, 73443, 68367, 71871, 46110, 55217, 83011, 36084, -39899, -73442, -109587, -147870, -133000, -77202, -18949, 12795, 6986, 11902, 44068, 64708, 95942, 135611, 94116, 1942, -20821, -6995, -19489, -21814, -24950, -62860, -78401, -46263, -5928, 26642, 25820, -13952, -31476, -17977, -8893, 16906, 44642, 22022, -8628, -1668, 12179, 35443, 66881, 57222, 26572, 10614, -25165, -57948, -40672, -29023, -50819, -50812, -41806, -48429, -25397, 24782, 55205, 59271, 40822, 22260, 38599, 53698, 35292]
225C5292j2313k1545n6555j6759L9828J3125r264J3333L967p409J8893K6147J4146
238D0886R47k8983l0875J915M631O221L1063N446l2438r014R236m493N968N562
252F072j6812n154O440o611Q733J6329j7861j6855J1666O422J4860L9440J7744
265F4413j3958k1823l1836k0660K299j0506j1650J3849J797o346L2832K9937r677
278A8671m217K263j5198J594K5327J2905m29j9478l6233j3450K203j2396J389
291c7049J7965j779P357L4577R544j5014l653q771j3890K922J537L234K4936J1253
305C3169j1515m981j4366k4999M875J5612q178n761K639k775J1951J3122j0933
318b140o922J409p867J4801L5272L378j3608j47j1061j6452N80o188j6855l335
$$ y = [35292, 22979, 1434, -55121, -71880, -32052, -18927, -28191, -14858, -10891, -18300, 593, 26740, 40886, 41833, 12850, -18025, -16110, -11479, -5258, 25805, 31251, -1187, -10201, -965, -5458, 510, 6072, -10740, -15894, -9454, -16065, -7332, 8997, -8864, -25719, -14053, -7631, 7229, 46669, 64413, 50455, 28632, -3204, -23864, -21565, -32071, -43721, -29872, -28075, -34421, -1589, 28348, 18671, 14454, 16717, 1519, 3113, 28440, 41345, 40916, 21438, -14795, -28245, -26042, -38438, -37049, -19084, -20863, -13506, 21071, 30615, 15601, 11948, 3177, -10713, -7791, -6254, -3020, 21916, 33169, 21654, 16673, 2307, -22692, -17817, -2205, -10383, -16144, -13505, -16280, -4329, 8793, -2140, -9062, -7653, -15520, -719, 34553, 37931, 24323, 24176, 13115, -3337, -2757, -8945, -25800, -29135]
332b9135K551R962K1931K21j3663J1022R160j0337M287M411j3620O370K2499k173
346B3486j4726j2519j4534L815J1369j0928p630R086K028J1445K4004n571k1261
359a936O48L254j454Q018j590p766R462L678j0560j844r734j9905P877K0898J
374i53N77N730m972M212J0120q390j0848m059m442J7971K9299n665k1911n388
388A281j0039p440J0798k184j7834J317J2643R845J1243n130j2881R409J1081
401A2109l507P954P067q842M021O262k2853k4798o839j795J2254J6720n393n765
415a3405R638N035Q738J4645j1433k2147L978J2003Q264J0127r380k5127q274
428a7338R53M319J5770K549j5586L730J2668n856k372K129j1805l678J1060J153
$$ y = [-29135, -26584, -16622, 5309, 5530, -8133, 2889, 12049, 1712, 5999, 10410, -3210, 3160, 25659, 23486, 8760, -3759, -18293, -14478, -3109, -14037, -21667, -12581, -10553, 892, 24896, 19325, -1936, -1288, 1966, 512, 8530, 6940, -826, 8636, 12314, 1754, -90, -9824, -29729, -21852, -954, -953, -376, 5354, 382, 4594, 14714, 6324, -4524, -8583, -13025, 4946, 34245, 28580, 6669, 1281, -8758, -16198, -5400, -7584, -25418, -24101, -11458, -1613, 9630, 4500, -8381, 1028, 12109, 8602, 16556, 23623, 14781, 18802, 25064, 2211, -22587, -29426, -31221, -18967, -2247, -7640, -13405, -3767, 1268, 10006, 24651, 13218, -8929, -4951, 7052, 15316, 25443, 16063, -9064, -17338, -16385, -12066, 3704, 6253, -9333, -5603, 7065, 1209, -1163, 966, -10839, -14517, -3457, -2304]
442b304K012R846N097P045K427k1578j6354R648O859q87L101j5355k1279Q430
456b3292J7822N445K446n742p011J8293K3221M767j285j4728l1971j2664P902
469a6797R13L415O965n510m70R403O35K830R243o105l960J1841l88p232Q616L36
485A3735j6534q837n371n57J7524J7424m76o945j7168j6793R934J4153q823p189
499a5923J209j700J6010K9310O464r971r122j3901m669J0199J119n691k566j5554
513a4786j6516L220M469J501J2249O935J423J4422J3549J201L422q344k4176q180
527i611N177r4R502J0345j4040k0150n372J116J2521J8158L10r707n420o648P045
542f868J8501j149j1217L890L867J913J6893N898j7807j4981j0358r956N441J0009
$$ y = [-2304, -292, 9554, 14651, 21696, 24123, 2545, -13809, -4161, 2698, 1811, 4912, -10443, -31722, -23292, -5470, -25, 2421, -3321, -10332, 7961, 31182, 35949, 34664, 19936, -12035, -24699, -16797, -15884, -12469, -5504, -11014, -11484, -2081, -1446, 1384, 10627, 4522, 562, 12403, 12015, 4783, 13399, 13735, -2799, -11636, -17007, -17564, -40, 17384, 16908, 9963, -7205, -23998, -14064, 89, -8734, -15923, -14714, -16414, -404, 28906, 35370, 25399, 16277, 2376, -2293, 7906, 9025, 3334, 768, -14786, -31302, -28082, -23613, -22112, -9863, -2928, -1505, 12917, 26466, 27667, 31089, 22745, -1431, -9611, -4434, -4528, 4974, 15319, 1279, -18871, -24243, -23127, -10606, 7552, 7862, -1845, -7265, -13913, -6868, 11633, 10484, -733, 3157, 7024, 8937, 25830, 31728, 13921, -1060, -11418, -21374, -15933, -5924]
556e924k907m681o478q576J0939K2091Q942N676M194q886j399J0361j971q402
570A2979o505j9551j7240M305P915O945J5003J182j5071l550O935P961J3648L300
584A8256j1334m787J416L267J1354p79k2462j1249N283L528J2005J5060j1625
597G933k3197j0280l531O489J8444J0070J022L018j453L026J3127K07j0792l206
611A0877p696j2194K763M192p698m588o662j4492L266K1406J6098J3835N687j4652
625A0142q827J0389J0157K132p092k1475j3628P509R286P743K964j7233j8191
638b6124O296R483K924R978L691j0588j757O934K372N845N941k364k90q28n943
653E570M115N770j0366j1722r848j6206j185K1336J2876L33j821j0281j269K2249
$$ y = [-5924, -8831, -13512, -19990, -28566, -17627, 4464, 13406, 19082, 23276, 14390, 12991, 23352, 21381, 12979, 6474, -13077, -30317, -26012, -18097, -11152, 3851, 5033, -10038, -13588, -6653, 1308, 14956, 18256, 6922, 2135, 3551, 6818, 18172, 17393, -5069, -16318, -11035, -7507, 4498, 19558, 7933, -15264, -25544, -29075, -22586, -4142, 5928, 6950, 9968, 8515, 11541, 24668, 24875, 14083, 10877, 3181, -9013, -6250, -2058, -9756, -14344, -21006, -35498, -32232, -10826, 5272, 19107, 24794, 10142, 1315, 11704, 21861, 23993, 16901, -4574, -18202, -10693, -1407, 6336, 9300, -7933, -26124, -19828, -10345, -7421, 2557, 6248, -4340, -6097, 837, 3209, 9054, 14995, 12631, 12341, 11513, 5570, 9685, 15455, 5089, -6633, -16481, -32687, -33872, -12536, 340, 673, -1148, -11429, -12698, 9551]
667I551J9028m81q531j5137r682J1273J1357o665j4172j6598r434J1650J5292
680b549J103K018K80q547L064J0460k109p77P501k685o647K066J024J511O505
695A2218l330j1539p760n856M265J6528K586j2568p314n287P55K0522J6484o865
709A2839q642l21J582J0658Q789j3003j8610r592k744P849J0488l892o108K096
723h611p67K783J0270K464J444R114j708j0243q69J15l301M911k310j4945m211
738a5864Q507P826O930k397j5541q363M983R374J4615N843j3091p173P491L455
752F595L934N856r763j3530L728O113j40o84p491r826J302K489j8P467N484J572
768C088P943J597j0446j758O080R96K639k037j3746m155J0144K971k034m147j2433
$$ y = [9551, 28579, 28098, 19567, 4430, -5252, 6021, 17378, 10713, -3459, -20057, -29491, -17841, -2549, -1446, 572, 852, -7695, -4631, 5829, 3720, 2943, 10444, 7759, 1112, 3178, 4202, 5713, 12218, 8888, -2651, -10411, -16267, -12002, 4526, 7112, -5456, -12770, -18057, -17302, 3220, 19704, 12839, 4197, 3876, 5458, 16116, 24905, 11902, -6708, -16300, -19044, -11195, -707, -4599, -10707, -8611, -9378, -6595, 3675, 6139, 7583, 16697, 14989, 4746, 3877, 3992, 691, 5602, 3292, -11653, -15864, -7357, 469, 7399, 5002, -10539, -18902, -13919, -4545, 10070, 15913, 2822, -4351, 3140, 6595, 10529, 16385, 6622, -6908, -3180, 2933, 2793, 2109, -5382, -15208, -13906, -11417, -11435, -3968, 1516, 3088, 11031, 12628, 2182, 424, 6504, 7500, 10139, 8102, -5644, -9799, 345, 3316, 1282, -2865, -15298]
783a5298m700J3714J2648K469j519q832n194O674M633o2K224n362o628P360N869
798G996o097q62L32p709q31N272j485J49M313o42m17P95m972J485R321N70l075
815D143p26p526k622J0405L435o492l563m957k178J0259O317n374j735L38j961
830b237N769M773n713l744j51l132K369M074k844J239L922n994l675M110k480
845c714r54Q704M06n160K311N53k352L885k01n433k76J72Q2P314J859q639l101
862d544n48l389O054P476m207k028L744j413L68L062m824l835L935p5o51N243
878D368j114k951K205l221n375L108K018p81N228j17o067J521J768m823K014M438
894B219l672J117M547j525l48K333m450l631Q33k287K856P546k096l866K367l359
$$ y = [-15298, -19998, -6284, 6364, 8833, 7314, -1518, -6712, -38, 4595, 4533, 6757, 1395, -5233, 2127, 7996, 1899, 1037, 1369, -6340, -7171, -1899, -3384, -3235, 1078, 436, 19, 814, -4158, -2673, 6648, 7218, 4143, 3417, -4109, -6731, 3674, 7109, 617, -2946, -7903, -10081, 178, 6495, 1121, -614, -276, -2237, 3532, 8305, 2592, -1152, -1303, -4435, -2066, 2008, -836, 403, 4325, -1669, -5344, -1234, -3714, -4668, 4036, 4442, -718, 1593, 2146, -206, 3679, 3478, -1955, -2231, -2059, -1977, 5337, 7196, -1443, -4544, -5092, -8481, -2427, 5049, 842, -1186, 2558, 1145, 1513, 4575, -249, -4084, -149, -224, -875, 4368, 3254, 303, 2508, -713, -6088, -2980, -962, -1743, 3485, 3368, -2699, -1178, 590, -4233, -2219, 2219, -1453, -336, 4211, 2686, 2338, 4671, 221, -3410, -2577, -4864, -2008, 5538, 3442, -424, 1943, -1416]
910a416l190N491N43n320K566J667k062K960J204m425N35O21l099M296N418k749
926C040J178J620n526k176J776l721n82M833j766p68L857k477k024N497q96n826
942c961J023Q07N95O643J436n622j265q67j621N503J838n981Q06M054l123M16
958F81J602o839l473M003m31O79M951Q09R06L629l747m746J927k92LN921m36o542
976a395N79N36k025L126l62o813K91N155J837M421R91r006l906L916J480K621
992A446K247l868r32N331L51j724L01n367k237N586p19m927K857J394j789K532
1008D82o49n851K392O143K422K020k883p714O14N173q4J080m00q263j409O318
1024f09J067j134J308l840m65P684K274l156j480n382l928O320L987r80K518M12
$$ y = [-1416, -4606, 885, 1428, -3892, -1326, 341, -1721, 1239, 2443, -1982, -1447, -826, -3925, 371, 5789, 3040, 4218, 5838, 312, -1864, -88, -3809, -4391, 442, -1324, -2092, 1765, -712, -2736, 2761, 1865, -3961, -2938, -2131, -1536, 5107, 6543, 921, -344, -1211, -2832, 2671, 4509, -1472, -666, 3388, 265, 681, 2283, -4556, -8029, -4026, -4457, -3778, 1173, 1982, 2888, 6517, 2770, -1976, -49, -341, -338, 5583, 5147, -1395, -816, -280, -2305, 821, 459, -6354, -6063, -908, 929, 5350, 6341, -2665, -6571, -2655, -1175, 1446, 3693, -175, -1107, 4224, 4575, 2851, 3152, -2215, -4452, 1134, 415, -4512, -1655, -261, -2050, 482, -167, -6018, -3626, 2517, 4939, 6959, 4076, -3638, -3024, 2149, 2065, 3145, 2745, -5518, -6927, -609, 458, -676, 632, -3208, -3673, 4011, 6285, 3129, 1649, -3733, -7661, -1341, 2646, 1666, 4184, 4596]
1040D596l674l69k552o169K157N463Q28L125O93o170Q5O292k179m479p95j287
1056d435M027R790J692n235n124p240k345N785m27l040L807K907Q85O371L34q692
1072i40m041l66q21O560P383Q80J717o7q670p015l441m712M256J0290L526k15
1088D324j68n660l223L013k309l724N337N687N027P135k141j2300o719q50N87
1103e984N552K630l526p2J751k165Q78m1n713L98M796K39K412O080j47j203K014
1120G899m917o490l52K24Q00N296N11l890K34j528k932J559r44k922N437P806
1136E791K476J762k553j0181l875M551J551L276K985m454l624J031k262j619K312
1151b833K40J175M823p60k128K271m82k407K936p51m510K808J913l535k83Q56
$$ y = [4596, 922, 553, -1999, -8168, -6011, -548, 280, 3405, 4098, -2072, -1987, 4305, 2126, -2353, -3148, -4435, -408, 9382, 11074, 5839, 715, -6525, -8870, -3085, -3512, -6552, -2745, 162, 1047, 7418, 7752, -940, -4981, -5347, -6168, 392, 7775, 8655, 10372, 10305, 1635, -5380, -8821, -13533, -9277, 1013, 4539, 4324, 4156, -1504, -4727, -1714, -4023, -7747, -2410, 3277, 8304, 15439, 13298, 998, -5721, -6571, -5984, -432, 2198, -1328, -1400, 351, -1814, -936, -977, -6690, -6292, -1496, -1257, 1155, 7235, 7088, 5885, 7899, 2982, -3508, -3860, -3636, -2836, 2460, 2971, -919, -685, -2213, -5145, -3586, -4530, -7452, -2015, 5791, 8267, 10029, 7476, -2705, -6580, -2029, -478, 2798, 5783, 1329, -2295, -1264, -3526, -5145, -2833, -2593, -1418, 3405, 2645, 517, 2788, 2306, -101, 2835, 2084, -2426, 382, 2295, -1240, -1523, -667]
1167f67k750J873L571k084k229o96k750L141O891J067Q73m21o918l626M096J621
1183I92M17L493k148m605L16j899m398J456K065R0N127M605j575N06q62l827O53
1200D06J758j019K787J975n399l502M67l538K21N351m65k526J829n54p21M507
1216A577K075j68J007k429l370K863J393j438K283p09m914P37J560m279j448R92
1232d268k172K686O415m7j165N45k614q91L912J234rJ763k456l510P98k664j290
1249c733L798p0l664J010J22k833M251M488r74K22L52l092N6K123k279p53P53
1266b23q85L245L791l589n153j568l016J518P098J925k095J829o09l239J599r3
1282E35k865K486K684j31Q65q58l586K12l67m633l75K018K22M467N850k009k690
$$ y = [-667, -3417, -1544, 2027, -57, -2286, -2982, -5732, -2591, 4300, 5367, 6240, 5819, -1099, -4725, -629, 992, 1409, 4902, 2754, -1851, -1535, -3434, -7832, -6376, -4311, -4221, 906, 5511, 3936, 4442, 3580, -247, 406, 2164, 1145, 3932, 5907, 508, -2994, -2527, -6065, -5844, -493, -958, -3484, -1655, -2209, -2930, 1577, 3652, 3484, 4491, 2062, -1308, 1555, 2948, 1510, 3793, 3084, -1830, -1093, 467, -3812, -5260, -4268, -6440, -3754, 2661, 2614, 1449, 1994, -620, -1511, 2401, 3635, 3626, 5389, 2933, -577, 221, -2443, -3733, 65, -5, -3669, -2659, -2537, -5370, -1119, 3369, 2395, 2617, 2969, -123, -67, 2056, -223, -976, -223, -1108, 2137, 5928, 2339, -2814, -4382, -7398, -5880, 1218, 3143, 1048, 2877, 2268, -971, 628, 535, -2330, 156, 2840, 2709, 3574, 2716, -870, -658, -1025, -5658, -6033, -4015, -3793, 674, 6524, 4515, 1825]
1299A825K14k108n85L147j600l500K290J346J118J875l084o325j061R94J654N226
1315A426J566k252J615J232l514l13J56l201K256N256l36j249M38j920j382j0
1331b32l717l105K370K221L113L788k963m043J860J283L04K345j125l784K243
1346E58L053r03k87j926m939j01K987l14Q84J864j993J752K588k287j681Q00j951
1363a896N29L757j589k748L215J428j188Q71k471m486J973L775Q34O21k045l678
1379c098J515K860j389m48l57k493L031M519r70k122j83k840j094L382q74j452
1395b013K192R45o25J861q90k871J961J028r62N39j717k293K439J939k616j088
1411b171p32k097K821N749n33j207Jj490O23K665k029k677k35o28J085L150j991
$$ y = [1825, 2039, -69, -654, 2493, 893, -2607, -317, 1029, 2147, 4022, 938, -5387, -6448, -5454, -3800, 1426, 2992, 740, 2355, 3587, 73, -240, -84, -3285, -1029, 4227, 3891, 2642, 3080, 1160, -222, -232, -3949, -7054, -4684, -2463, 650, 4438, 1475, -2568, -708, 575, 879, 3224, 2099, -1685, 558, 3611, 2708, 2421, 495, -4444, -4545, -1558, -1872, -988, 876, -1117, 635, 3223, 936, -745, 55, -1896, -1367, 2390, 801, -1947, 1268, 2696, 1508, 2379, -92, -4578, -2605, 1170, 2004, 2625, 580, -3098, -1583, 1277, -112, -560, -917, -3410, -379, 4140, 3170, 1048, 865, -1975, -3069, 313, -561, -2013, 179, 1124, 499, 2360, 1470, -1401, 560, 1588, 626, 1165, -552, -2845, -406, 1533, -1083, -2171, -2903, -5000, -2179, 3570, 3037, 1830, 1831, 341, 964, 3629, 1600, -1077, -1312, -1940, -855, 2295, 304]
1428C04k838P43m25m97K895K19j465K931J632k345n55J36k554J490K169j395n69
1445a24J001p79J307J425l532l057N59m85K081M051j023k104J415n46l94K168
1461A963o91k611J592J969k36Q35r17m327j047K41j204J823K428N40K208J944
1477D510k715j681P77j622K9K113j040j352K284J04j668p6l247k254K390K412
1493a036K220K887K12k764k98l32k689M08J024j295K094K795m65l65m43m422k236
1510d705J350n17J374L511Q07l86N61k273j640J821J94L20K817N89r23J053p34
1527C219m425j751j302k163J899L568M91J438R96j865l63J238q42O51J801j137
1543A453m96K175j248j932N83k400k321J947J452Q9J533Q0k487N45P27n72J091
$$ y = [304, -2534, -1791, -2216, -2713, 182, 401, -1064, 1867, 3499, 1154, 599, 735, -1819, -329, 1840, 445, -124, 877, 98, 1405, 2830, -702, -3759, -3200, -3685, -1604, 2447, 1424, -680, 735, 189, -205, 1963, 1272, -1339, 253, 2222, 1986, 2821, 1904, -2423, -3470, -3229, -4433, -2610, -182, 358, 2566, 4510, 1795, 114, 891, -731, -702, 1411, 371, -981, 1303, 1407, -261, -337, -3584, -5838, -3448, -1036, 1184, 4071, 4283, 1519, 1221, 889, -1800, -1392, -368, -1663, 431, 3226, 2761, 2396, 1953, -2469, -4705, -3355, -3872, -2498, 1013, 1820, 1434, 1995, -278, -1918, -97, 97, 417, 3234, 3823, 2900, 3953, 3219, -1206, -2957, -4259, -6422, -4523, -955, -464, 974, 1970, 105, -258, 980, 138, 789, 2590, 1453, 957, 3132, 1884, -48, 535, -1865, -4186, -2239, -787, -698, 835, 915, -1572, -1027, -300, -872, 219]
1560B19K91j139P71J567r03R03J108j604k18Q81k438j260J440j384j060J290n84
1577b120m67K599J146k10O22o03j051K003R18r27j67j206k612P64Q73j673m57
1594b568M81p31K030L656k95n85j45k287o74J227p96k73K241J70j95O16j983k509
1612b620J149N53o49J564K31j202J836Q55k567p23P80p4K718K731j393j456j042
1629F91k005R8J149k178j543J518o8J293K665p48j910J478J133l69J240m01j977
1646F6J309P64j453p31j215k307J375J394p73N59J423l86J009N98k820j586J657
1663a117Q51J695K515j114k556O35j75n89M32j334j738J443J409j016k09j295
1679b163k016K279K536J22J093O59j344J063J421k093k147k78j022k03J703j015
$$ y = [219, 510, -629, 142, 1709, 806, 1709, 2817, 1213, 995, 1876, -562, -1822, -382, -1766, -2826, -1536, -2120, -2587, 12, 1158, 948, 1570, 967, -84, 1919, 2837, 1910, 1743, 537, -2075, -1311, -438, -2111, -2568, -2087, -2818, -788, 2868, 2573, 1988, 1843, -444, -1118, 109, -687, -960, 1281, 1451, 1256, 1872, -111, -2620, -1471, -918, -1567, -3, 228, -974, 862, 1717, -850, -1573, -793, -867, 1851, 4582, 3189, 1733, 691, -1314, -1216, -67, -2245, -3788, -2270, -2338, -1045, 1620, 872, -1038, 440, 1573, 1204, 2444, 2043, 66, 1375, 2139, 686, -45, -1260, -3567, -2192, -798, -1571, -1012, 411, 25, 1034, 1632, -1188, -2774, -1117, -266, 1429, 3944, 2830, 274, 909, 734, 145, 577, -757, -2495, -1052, 357, -659, -868, -2163, -4179, -1900, 636, 758, 1851, 2510, 1166, 2229, 3650, 1557, -590, -868, -1890, -2093, -390, -1405]
1695a405o92J955R33k7K98k186j165K115J704K69O66j195k312L68J089j568m00
1712a553N54n8K580J815j638k525j703j285J484K587L88J08J074p5k9P19k150
1729B93j999J502K35m40Q54o25k222M87J240p43j08Q81L74J940J792r88p16n85
1747A172j299R23N11k372j826J359M29J031J895j971j914M28M04N96J731k96j171
1764c70J103P50p32K92m84j230J174J159p97J46l79j873r6P20j726l07J336L78
1782i36L35J239q17j29J422J047M34N31k302j751J022J20q64M55j265j320J437
1799a342J493r61O31J41j174J283J735n11o12J43j026p3P45q00o8J238j010k31
1817c99R82j020q13J205P3j221Q40J00m99J128J313j371j60m29m86J266O70j189
$$ y = [-1405, -2097, -142, 791, 764, 1062, -1124, -2289, -174, 1530, 1799, 2465, 1270, -1042, -674, 415, -1153, -1553, -999, -1057, 1523, 3338, 1700, -825, -2528, -3813, -2329, 258, 646, 754, 1828, 1753, 1724, 2443, 293, -1706, -204, 31, -409, 445, -180, -2402, -1915, -675, -1418, -1526, -645, -271, 1669, 3461, 2473, 1757, 1172, -127, 796, 1307, -1065, -2891, -1532, -1103, -72, 1823, -148, -2062, -1634, -1230, -634, 1097, 801, -370, 733, 1483, 751, 1043, 559, -671, 503, 1662, 865, 1011, 632, -1241, -1337, -617, -2343, -2650, -1314, -936, -601, 638, -179, -308, 1114, 2161, 2595, 3126, 824, -927, 95, 215, -649, -194, -1459, -2779, -1342, 151, -810, -179, -38, -1212, 71, 1806, 1295, 683, 826, -200, -273, 472, -328, -396, 842, -168, -399, 583, -437, -1250, -45, 28, -1193, -353, -253, -752, 376, 1689, 318, 158, -271, -757, 509, 1179, -10]
1835a0nJ57j284M79J087j174p22J093o88O18K115j76j030Q78r98p25J150l08o46
1854a89N3j24j132M82K23n48J189K68r28Q98P82m56P51N05j430o23P70n88lR50
1874H50j279j018O84k58J37J210m82r78O60J99j21J604Rj309P62qo23R12Q21j807
1894c5k55M10q62K47O27q07o31O14q45Q36J021r8j18J187n58l46J390o68r45N07
1914F71k73j794K31M79m78R87L46j128N23N84J84Q78N12j556k49N45o23O72L20
1933H31j613j156J490m06K65J669q79q11Q70L70n27M82n17p45P96P17q31R24M0
1952I69j166K92K57j646K57J075o30J57P20j850n9J643N14K22R29q62l04J509
1970B027J2p97l58j889j597J294P93m85L87j8r36J068J035l46Q8P26m48L03J024
$$ y = [-10, -15, 142, -1142, -663, 424, -750, -1472, -379, -1067, -449, 1666, 1490, 460, 1338, 340, -385, 765, 457, -189, -136, -260, -1392, -910, -687, -1235, -46, 222, -706, 192, 974, 518, 1269, 1774, 344, -279, 491, -97, -100, 850, -429, -1447, -763, -1021, -884, 326, -156, -1134, -474, -275, -396, 1208, 1217, -92, 670, 662, 39, 951, 1772, -35, -290, 120, -742, -495, 132, -675, -1306, -692, -1537, -701, 320, 222, 104, 1291, 733, 387, 1777, 1109, 164, 671, 398, -1396, -1165, -686, -1164, -177, 169, -959, -436, 148, 332, 1210, 1722, 166, -83, 462, -161, 511, 831, -782, -1938, -448, -854, -589, 1080, 201, -610, 260, 630, 103, 585, 68, -677, 119, 836, 5, 929, 969, -197, 95, 352, -1294, -1037, 38, -592, -435, 285, -1565, -1624, 19, 533, 755, 1684, 822, 518, 2027, 2039, 1242, 884, -1005, -2602, -1308, -515, -1000, -613, -631, -1567, -499, 536, 190, 278, 1004, 556, 859, 1883]
1989A883q53p99K03r65j46N23m24j32J462n58n75j65j306q41J748J036o27P25
2007A89K61l89J653P88j143r77nn30R64L78j866p39p07q93R97J728k99M1J468
2026I19J66K1J046q70r42L13M1j041M93m41p02N77N35j483J55P58j62J642O50
2045A675j918n15R7j28Q91J256j039n35J215N20m12K99j658j738P49K21L17N51
2063a52m75j078J178J81k02J408O87k64J255N02j781n32o33j918j29K05q98O41
2081b005J397L31M82O36j151n6Q78O17N00M62r93j126J012j91j393R6m59o17J523
2100e7R68n27m99q27r65L86Q02l55O83J414p0J022Q40j058p58M24p81j031J77
2119b12o27p84P10n63r10L12L71J45J980J594p8J55K50j044L07k06j803m78q4
$$ y = [1883, 1030, 231, 434, -531, -677, -154, -578, -710, 752, 194, -381, -546, -1852, -2693, -945, 91, -536, 189, 450, 61, 1714, 2502, 1359, 382, 377, -153, 811, 1189, -677, -1416, -2123, -3016, -2019, -291, -590, -549, 919, 1085, 1106, 2152, 1282, 340, 653, 694, -347, 146, -295, -997, -420, 115, -1368, -1213, -455, -617, 1025, 1675, -243, -758, -661, -789, 102, 1358, 319, -216, 999, 1519, 1107, 1406, -252, -1990, -1241, -1020, -703, -152, -627, -1705, -527, -346, -548, 860, 1547, 1283, 2538, 3040, 1259, 727, 94, -1824, -1953, -1748, -2646, -2005, -608, -277, 205, 841, -310, -366, 512, 1129, 1629, 2091, 1098, -28, 984, 793, -600, -504, -963, -1580, -57, 911, 384, -115, -942, -1907, -1521, -719, -1074, -391, 1023, 953, 1975, 2815, 1757, 999, 1423, 642, -389, -212, -839, -1623, -913, -1476, -2386, -2074, -1703, -1558, 422, 2016, 1938, 2093, 2343, 1299, 1606, 1400, -403, -881, -965]
2138i65n02O42J573j011p88N52l96Q7J327j09m33O01km56P36o25n93N92j43j15
2158b8Q00M61r78m2k53j928K83K66j0O78J386n12J90J351l17l3K92p95j104M84
2178A91m74l34M14j201q01N52L83K77J683O05p09Q05M26p83j54k54j555k16Q01
2197c44o2M59J055j079o55L08r03r2J456k14r1P33n98p93R67J01m74Q75N23p84
2217C88J132l0o81j72j081j866L55L66R4R53P40j042M97J425m9K70L92j446n43
2236b98J018N24n54J31j543p33M53J88k09J282j53m10J046m54r38O96N0j005M96
2255d13P99m07O25R40p04l98K06q41l32J037l62q25j87j118k11K054O86l02O83
2274I30r11q97J671O98q15r4l73p23N90K55r96m33J23m67J116J612o30L24J74
$$ y = [-965, -1467, -825, 748, -263, -1051, -499, -895, -808, 519, 410, -23, 578, 576, 120, 856, 231, -362, 230, 87, -28, 772, 1233, 255, 213, -40, -1968, -1685, -1419, -1429, -751, 635, 123, 313, 1664, 1347, 1314, 1606, 811, -293, 191, -283, -617, -203, -1404, -2205, -1653, -1270, -993, 690, 1295, 586, 1391, 1817, 1034, 880, 626, -929, -1145, -344, -406, 53, 1108, 29, -626, -318, -1221, -1313, 143, -71, -162, 571, -27, -820, 147, 248, -226, 649, 1172, 388, 1520, 1490, 809, 637, -444, -2310, -1955, -1589, -1495, -542, 198, -844, -347, 1078, 1029, 1299, 1691, 245, -298, 720, 1244, 690, 821, -722, -1455, -1002, -814, -1023, 259, 106, -304, 742, 288, -650, 46, 96, -909, -413, 386, -21, 604, 1544, 840, 442, 648, -193, -525, 512, 150, -675, -862, -1980, -2191, -137, 549, 247, 930, 19, -878, 793, 1491, 676, 582, 209, -514, 76, 331, -665, -1098, -975, -1442, -326, 1286, 656, 980, 1154]
2293A154j362n63Q02q52K35J502k54q58J04k65k42J069J2q27k32M8J64J662J58
2312A455j215n78m07l51J330J228j470j66O16m79J35R89j734j280M00N18M85J486
2330I62k33l66P38o24r97N10m2J13J108j88j507J72K44p71Q64P1j641K23J651
2349B87M84L91n4j398q23R08J02N13P24j061q51J014L36m8M94r60j635R82M67
2368a28l07Q57J02r97K57Q55j268N55O95l48L22k42j091N6J378n21L6j28j239
2387a156J4J996P16q77q3r68q80J541K66q03O37q85n61J109M90o64k31kq34P57
2407d18R46q0Q7K54j041J31P58n54j40R89p94m75J56p98k73J266j28q50K88l96
2427a072N94J806L22j265P6k54o38J183R61j524o07L49o24O81Q31j148o99K99
$$ y = [1154, -208, -771, 31, -821, -586, 916, 662, -196, -92, -357, -599, 470, 482, -345, -577, -529, -365, 1297, 1455, 240, -338, -745, -1096, 234, 1462, -8, -174, 442, -37, 98, 1087, -647, -1927, -1527, -1009, -524, 962, 729, 363, 1101, 477, -520, -10, -52, 61, 1169, 981, -526, -354, -110, -881, -17, 54, -1587, -1364, 287, 771, 1162, 1108, -290, -1113, -205, -103, 410, 1134, 73, -778, 236, 572, 524, 1018, 58, -1577, -595, -128, -435, 422, 524, -473, -216, 639, -629, -74, 621, 273, 595, 353, -738, -682, 696, 175, 211, 83, -1156, -1142, 854, 1570, 693, 610, -358, -1238, 303, 569, -234, 403, -482, -1043, 66, 556, -108, -339, -341, -1175, -418, 528, 448, 535, 789, -252, -121, 637, 83, -57, 932, 138, -337, -181, -979, -1252, 14, -114, -964, -676, -1072, -478, 1328, 1650, 385, 461, 207, -431, 752, 1713, 189, -418, -69, -693, -12, 819, -329, -1028, -729]
2445g29m43L72J431K2l29M78p88r79J130j95m70J405k03p33O15J61r49L83lj333
2465a157k62Q52O5P03P27j034m11O09o5N23P59j316q24J301J4j34L39q29j353
2484a493O97J71l44J853L58j92q1m58q20j48q5m45O43M91l19Q74N40r41p07L81
2504b5j082L5J733K02k23L38r42r12M73o7KQ73k08m83J148M11r66j15p81j617
2524b206M96J156K3J173R07j007N3L54j269k07O87m48J29P79k48JK89j147j069
2543a554O60k42J41J660M97o89L95o16j071L1N18n35O19M30l41N84R11p19k08
2562D71jj401Q2J374n02j43J93n25n30Q85l09l66J045j32k71J431K25j153N8k90
2582A41j122M65L28l24O25K61n15J87P06r16k5Q43n13o85M19p86PJ142O5o11N83
$$ y = [-729, -1172, -800, 631, 653, 324, 802, 14, -965, 165, -30, -500, 905, 702, -31, 584, 745, -204, 179, 176, -1157, -1419, -567, -502, 201, 928, -106, -517, 92, 27, 550, 1309, -7, -831, 470, 484, 350, 689, -140, -1493, -796, -625, -969, 884, 1242, 1050, 969, 511, -309, -457, -542, -987, -344, 147, -172, 702, 1242, 301, -406, -25, -1107, -1072, 661, 863, 640, 978, 36, -876, -403, -470, -468, 405, 197, -286, 862, 1273, 307, 192, -589, -2206, -1710, -554, -531, 642, 1549, 542, 595, 949, -320, -527, 160, -288, -159, 620, 372, 373, 662, -485, -1554, -894, -1136, -995, 665, 1162, 473, 868, 252, -819, -788, -270, -805, -186, 244, -97, 487, 1398, 679, 471, 470, -931, -849, 525, 23, -120, 73, -452, -982, -97, -406, -772, 273, 141, -130, 1301, 1526, 373, 431, 141, -981, -516, -188, -512, 113, 374, -141, 46, 752, -164, -189, 654, 141, -544, -125, -911, -904, 238, 303, -308, 275]
2603B75l58j52J125k48r54N03m9n04J087l49j428L11M96j70M73Q57j167J91R25
2622H64j135J64K45j002L36O39m22j56Q74r7n64J602l74r75R20l96r34N79J33
2641C01j064K12Q8k63N58K87j098O13Q77P3kL14j386O4O80l68K64O10p96j59J172
2662I77l58j110M31k64n37R28M0q84J11L21o77P04P14m77O69P79o99K51L59j259
2682A9j79M57j148j68O63q65J76J266M48o46K00m91n20J413l6n45M23m42j60J228
2702A093n30j235m4M56m62J195O89r28l32O84j395k23O89m37M30J254q4j99L74
2721I95n28o28J8p33m31J107O12l00Q73l99j564J53L12k09Q43Q10o22N68J72p27
2741C22o0k90j462k09J355K09M82R13j165o55M41k28o94R73L6l08J245J16q66
$$ y = [275, -83, -235, 890, 642, -312, 191, 142, -362, 725, 376, -1052, -741, -245, -415, 58, 915, -252, -61, 864, -271, -107, 138, -864, -528, 111, -311, -467, 407, 310, -254, 1348, 974, -1, 919, 523, -411, 168, 301, -763, -551, -463, -726, -168, 119, -979, -366, 511, 584, 582, 896, -490, -426, 254, -114, 150, 760, -36, -195, 977, 619, -491, -60, -324, -861, 67, 107, -777, -666, -345, -1022, -318, 396, -81, 588, 1367, 668, 919, 1278, 19, -160, 297, -851, -1019, -356, -1221, -1045, 221, 669, 23, 223, -268, -788, 625, 589, 44, 467, 25, -135, 1093, 563, -672, -716, -260, -722, 473, 1162, 234, -98, 586, -809, -1032, -343, -780, -350, 904, 820, 621, 995, 467, -161, -143, -876, -1307, -200, 412, 112, 985, 586, -978, -825, -513, -722, 121, 931, 309, 877, 1049, 322, 262, -28, -1490, -1699, -344, -135, 347, 1260, 95, -560, -119, -347, -1041, -68, -32, -340, 905, 1021, 155]
2760A55Q81k37j201j0O5o70Q98R80n88Q0m68j171k94J253k15PJ265l67J34R07
2780A404n07p87K23j007o17J231P29j82J56o09j108Q44K53o79N35Q2j059J031
2798f7N67m51J23Q01q81m54Q55p29M19P14l18m43n7o36r0P24m39j036Q29J58K5
2819c86J535j2j003j31j79r74J102N87k99K65m42m20J92R62o60N5R0j103N22R34
2839F35o80n16N61p08P7O88j91pQ85k88m82M28mk97M31l14j227M41N45k18Q84
2860F43P48j516K7M98q66L38R54r06m93K05l75M8J107P2q29N08M9j14J389k18
2880A269j094p9o09o54J041n9o09N13J65m80J83P14r7M1M53r65k84Q76k79p5M83
2901D54j281n79J291K43K9R59p83q78O36J43p06J057k54j527L54O37j41J090L28
$$ y = [155, 1036, 799, -402, -412, -347, -1017, -119, 861, 273, 353, -115, -1286, -1580, -327, -542, -535, 730, 363, 497, 1404, 897, 110, 333, -674, -1291, -60, 669, 487, 643, 34, -1074, -230, 23, -656, -121, -39, -1098, -67, 500, 49, 172, 973, 92, -362, 493, -236, 183, 897, 579, 136, 79, -557, -647, 77, -362, -1398, -569, -411, -386, 1149, 1137, 134, 3, -176, -1150, -48, 539, 240, 505, 63, -357, -165, 797, 137, 192, 282, -821, -299, 635, -45, -561, 0, -708, -631, 57, -134, -141, 744, 456, -26, 402, 398, 101, 532, 218, -1009, -568, -23, -241, 643, 1391, -125, -98, 400, -466, -128, 826, -80, -573, -368, -743, -695, 412, 484, -345, 163, 212, 98, 1487, 1269, 175, 96, -513, -1167, -126, -185, -794, -281, -116, -596, -413, 301, 204, 245, 698, -267, -551, 325, 46, -29, 454, -827, -1406, -115, 128, 157, 1116, 333, -545, 91, 234, -472, 585, 331, -1196, -842, -205, -346, 744, 1072]
2920A072j041l35L90k05K99M47q71l46P94n09l45J038m42j00P04l50l86J173l4
2939I53m69l07j131p86R64Q46j51L22j97r36Q26N73m87N40J9r54J17O22l39J75
2959B00K29r34l39J161O9p6N62p88p01L97m12j33N25rn86L49M89k51J078N13p25
2980F18J38l91q44P08P55j001n89l38n79N42J601o33j84N95o16K95J081l74q25
2999d1J64m42o58J009M41n80M06k87p20R14N39l55o9J55j338k00L36k36N43R99
3019E80k83k63N43n79l5J044o07q77K32J11J56P36o60j234M00n2J54J321K22r34
3039b5M95p5o85K09o1p99J01Q59q01N44J075k30j92L46p72l33O70j00J2L90o46
3060a8q03N58l8l86Q52P3p13P72L81m06K72k13j578M7J135j11O46K20n66p6N97
$$ y = [1072, 31, -304, 86, -119, 180, 627, -244, -590, 204, -305, -650, 388, -54, -154, 550, 200, -186, 987, 953, 484, 177, -954, -1740, -776, 70, -81, 241, 44, -892, -66, 507, 20, 560, 579, -375, -258, 364, 25, 200, 429, -505, -844, 317, 386, 310, 872, 84, -617, -220, -632, -765, -240, -249, -835, -486, 3, -248, 830, 1343, 618, 756, 365, -479, 229, 984, -17, -606, -944, -1523, -981, 620, -13, -197, 398, -218, 77, 1158, 784, -41, 123, -319, -977, 32, 473, -107, 299, 12, -708, 206, 745, 390, 321, 476, -862, -1062, -726, -962, -419, 580, 297, 34, 577, -2, -37, 1007, 400, -477, -245, -134, 22, 758, 98, -1136, -736, -788, -634, 687, 909, -25, 470, 395, -290, -81, -142, -941, -840, 19, -782, -238, 837, 607, 415, 761, -11, -344, 326, 226, 238, 628, -18, -821, -263, -301, -687, 165, 238, -475, 297, 678, 272, 544, 331, -1247, -1200, -65, -176, 470, 690, 124, 48, 645]
3081F45l26j69L18n71k48N82n05n90O98l55o94Q05R5j31J023P37n11j63j09q40
3101c09K56J49p23N05K03o69M57L82m88K72M34r15q1J138k77m44N57q80n20P90
3121a63M50o22P27k27j75O86k17n32J81K2n99L9M60p72Q69N87p16J81L17q08K35
3142g7Q17r59j20M05l97n97P99k37j28O33M9j10O88K77o39K51k25j000M71J43
3162D4n18J33L05n70L84L68n96M5O38m06J94N88m60P9N44m97p00O83l23j71J051
3183H15m41m52L35q1j038L87K86o77L62O05n77O67L03k60J30P3j82p9N35l95n42
3204b26O78p78k72O15o46P1O79j02l84N83j27o86P41J47p37M04K74k36R23l87
3224E34q09M8L33q58P78N24o98j24P63o35k99N61j46j56N46j20k47L61j02o34
$$ y = [645, 319, 150, 468, -103, -351, 231, -274, -864, -166, -521, -1215, -410, -315, -446, 577, 1314, 803, 640, 531, -309, -53, 96, -627, -122, 81, -588, -131, 251, -237, 35, 469, -446, -527, 611, 334, -110, 447, -433, -953, -163, 287, -335, 392, 165, -10, 676, 459, -73, 108, 130, -469, -430, 30, -742, 127, 714, -2, 179, 496, -312, -77, 740, -219, -339, 66, -331, -928, -129, -366, -494, 139, 188, 78, 766, 1043, 404, 655, 430, -570, -99, 44, -474, -341, -36, -606, -222, 146, -450, -405, 233, -173, 21, 609, 149, 228, 772, 275, -425, 258, -65, -236, 815, 374, -78, 257, 176, -862, -475, -189, -866, -504, 101, -476, 191, 494, 234, 364, 437, 255, 176, 711, 316, -226, 452, -326, -598, 17, -629, -558, 121, 19, -365, 218, 91, -595, 146, 293, -444, -40, 234, -2, 921, 534, -275, -227, 106, -752, 26, 550, -148, -272, 491, -144, -443, 118, -28, -184, 362, 242, -5, 356, 254, -380]
3244c80K48O1k87Q21Mq45O93N86j027L22L86j075L85O42q48%N69o41J95L18k89
3265a62n81P77k05l2P08m22m54M70k77l06O99P6n48N98M3o72M39N45r78J52J69
3286C9o35M64M88p19J26L47o12R7Q98n25J33R66r00n62M20M1k82O63k44o03N22
3307A22J38m58N87k00j007O89K87n22L95M2p98L89M06o59M98O73m19l2M61m47
3327A45q4L68p6o96L27j72m46Q95k68l25M08l84n78Q72L82n05J10J22q24N81Q26
3348F78j020N10J81m73L52Q44o60n23K55o55p9N58n17j30R22l04n09P35j02j54
3368i1J146k49o92O5l2m28J52K43q64K49N06p40O18M40l32N7M32r10l7R19l66
3389H6o6j17l24m30J347j38m63K71j98m14J010j52q61L80K69q98N55Q0j64M53
$$ y = [-380, -132, -71, -358, 463, 467, -378, 315, 901, -126, 196, 582, -493, -108, 534, -314, -314, 255, -386, -191, 127, -162, -743, 34, -171, -203, 505, 83, -371, 99, -178, -484, 215, 291, -257, 341, 384, -288, 151, 696, -282, -130, 39, -596, -132, 356, -363, -237, 110, -502, -405, 493, -32, 101, 1067, 167, -395, 25, 66, -216, 447, 203, -400, 122, 260, -198, 389, 189, -818, -129, 158, -364, 31, 73, -725, -336, 70, -589, -91, 582, 163, 131, 592, 145, 61, 429, 353, -343, -16, -188, -634, 261, -7, -332, 76, -308, -886, -14, 368, -137, -27, 95, -729, -148, 678, -342, 168, 349, -124, 228, 1072, 412, -111, 144, -511, -590, -32, -549, -679, 243, -61, -570, 165, 63, -91, 1055, 806, 114, 179, 147, -281, -129, 114, -750, -501, 5, -735, -117, 323, -9, 48, 480, -430, -467, 452, 86, 20, -97, -421, -851, 496, 358, -105, 166, -32, -446, 564, 412, -449, -69, 200, -698, -143, -63, -227, 226]
3409B26M75n11k0M33k74k02K08q91n79P90q7j85R39j74n79P09q4j71R37j84m81
3430B95J21m09k08K21J54r86L30K24k65J36J003q57J41J83o98L58K86L4k12O78
3450E29n55k14R73l4l48O41q10r71O78K05q16N56j91r10N70L04j18O65O54m51
3470C57P7O36l10N5P7j179j42K30m53M56M37o75k6M85j28n45Q93K08n28P9J40
3491A44o02O65M04m78J02N8r71O24N40n06M96N8o72m68O16m18k75N72l48L73Q98
3512H12Jp7J27p76r20P31j8k19P72k65q99M06L9m65P19O38o17J34Q22p73K48M00
3534H20o40l85J62r18J48J053m48m0K64k49k85Q60j43p82P48o3k26J237k06o93
3554B14N7j10q34L54O43l45N59Or05l92L98m36J17O63m07K45J137n87R4M17o44
$$ y = [226, 701, 190, 170, 603, 329, 127, 335, -556, -1135, -345, -432, -617, 322, 148, -431, 278, 194, 23, 960, 776, 295, 416, 7, -201, 20, 174, -812, -482, -258, -523, -387, 616, -241, -100, 83, -615, -257, 29, 63, -149, 529, -26, -240, 733, 699, 351, 992, 182, -789, -111, 94, -722, -166, -357, -1267, -697, -393, -511, 154, 808, 357, 434, 1070, 760, 815, 892, -287, -429, -199, -652, -196, 241, -434, -460, 25, -103, -648, 245, 453, -75, 4, 144, -458, 207, 611, 133, 235, 293, -678, -54, 486, -20, 476, 534, -138, -606, 10, -408, -683, -111, -459, -86, 812, 813, 736, 863, 87, -833, -102, -120, -339, 433, 168, -731, -325, -286, -751, -32, 606, -11, 123, 945, 172, 420, 820, 180, -205, -43, -961, -813, 240, -208, -248, 16, -233, -518, 342, 199, -583, 165, 102, -124, 1113, 907, 214, 271, 161, -673, -319, 324, -21, 538, 544, -361, -753, -355, -791, -674, -11, -418, -173, 964, 377, 471, 888, 244]
3575B44m44O41n38k44M22N8o76J51K5m17Q79L6o62L82L27j83O75K93q10o2M13
3596E10r12J01Q49q28J84O92p47n15O32K7m82O92k55l53P17o8n90O33k27n33M99
3617B6L55o09N22k1p28K99K03m53L06N66q48K25K76j53K64P03q97l88M94m11k31
3638e00P14k79l75O34j71q60O02K08k15M48J70n60N93K15n19K00l7p23K65O82
3658D92p50j06O68q85k50R10l59L5N28n53k86N92P5K3P21l54p51M00j81l00P20
3679C89k7o42J87K85p93L26L67n00K09M87l85k0P08k77m51N16k01q6N13m42j61
3700BM31l80n97O24j4m22K52Oo89N7J031M4J56J76p76j28N43n13K6O83n71J27
3722F8L29m79j21L11o82l20J128k56P4O91m5j035p2K55o20J142j09l16M15M0p26
$$ y = [244, -200, 441, -97, -341, 81, 139, -537, -386, -361, -778, 101, 137, -525, -143, 184, 1, 676, 969, 159, 97, 510, -402, -301, 548, -280, -96, 596, -151, -666, -34, -7, -489, 203, -52, -405, 312, 244, -346, 287, 60, -473, 26, 381, -228, 294, 273, -455, -156, 47, -406, -100, 466, -382, -157, 119, -34, 230, 933, 36, -352, 142, -269, -500, 214, -65, -440, 194, 23, -837, -235, -27, -242, 206, 376, -184, 409, 624, 105, 305, 268, -455, -190, 492, -258, -364, 304, -581, -831, 79, -280, -245, 283, -270, -556, 36, 111, 134, 855, 501, -250, 150, -31, -331, 389, 362, -280, -93, 192, -601, -275, 92, -408, -199, 288, -97, -117, 591, 314, -137, 379, 178, 92, 605, 163, 2, 433, 53, -544, 80, 66, -356, -104, -98, -787, -730, 301, 345, 501, 677, -99, -227, 316, -197, -171, 512, -59, 68, 397, -82, -203, 108, -574, -894, 234, -22, 52, 743, 698, -337, -409, -154, -774, 368, 259, -57, 358, 398, -328]
3743c28N41mn97k27O35m09K51O29j50m6L51p89k57Q68n18n93P70m5n22P59k72
3764D7n78K74j60KN65K31k85R19k98q62K88k06m95M60R57n76n90N85o14J71M36
3785B71p75j77O06l04J05Q95n59k79M99K05o30O31K54n06L03J39n77K75J28r93
3805d89j95L76o16M82L58j46K37P30p74j32O26k40P4P12p85n07M04l6m36M80m05
3826b82j43L90n6J46L13J3p76M67N9k47p1M05k42K19o2j56o6O53l37p07N80k24
3848a24l92N75j57j04N79k11o89P17K64l26K70k1n48K62K70o79K30N5p31L52N67
3869A59k41l28P99l10K56J81m11K59K16m99n1L45m79l77Q04o08k57L16%k98O63
3890A39k9l85J09J2j5R3N89m77L37J03l14p6L52j87o15N28n83l37Q06k56m41M53
$$ y = [-328, 213, 209, -388, -615, 20, -389, -138, 491, 341, 295, 646, -143, -400, 468, -50, -643, 127, 82, -440, 319, 47, -531, -257, -417, -415, 150, 381, 96, 1015, 717, -145, 143, -63, -558, -98, 859, 283, -307, 278, -336, -165, 271, -504, -681, -75, -379, -274, 621, 62, -217, 282, 487, -143, 488, 742, 236, 539, 678, 101, 376, 504, -489, -684, -308, -924, -442, -84, -230, 7, 737, -37, -169, 457, 217, 291, 1003, 218, -289, 115, 79, -357, 123, -282, -425, -35, -91, 55, 368, 381, -395, 72, 131, -116, -187, 218, -24, 195, 133, -23, -89, 564, 227, -480, 100, -124, -516, 59, -98, -202, 377, 166, -523, 194, 458, 132, 402, 381, -167, 95, 365, -314, -84, -29, -760, -408, 159, -82, -410, 389, 79, 335, 516, 105, 364, 580, 81, 30, 375, -104, -481, 323, -285, -542, -226, -226, -524, 139, 110, -275, -166, -154, -169, -76, 513, 36, 373, 476, 162, 86, 438, 251, -364, 164, -419, -756, 50, -206, -647, -194]
3912a94n59j4Q37kj10N20L5m21O27j63n87K45K50q50K48k93J28j04N81p15oM77
3934g0j66J06N42k67k67P39l23JL2P4l85Q5j68k99M91K33n29j12L6n34L08N28
3956E5l97K74P82m24l9K10k34k56L83m23k65L75l7o8J18l69n23P59j76J29M77
3977C51j71k63L88L14n21L70l96j57J86Q8m59j27L59j27n6J56l22k3P73o45o0
3998c42Q31l24j03O07o77j96K62j30j70J51J75l97J43o9m32M12K44l18K49N12
4018D28m97J37M81k65J51J40l60j43K38m18l92O48n72qL31m67o7P37m29P7L17
4039F7M01j72K96j36m73J57J05l52J79k5k09K20J59n55l52O19m85L29M02k48k04
4060b77L92O6k20L13j24k66M08j43j97M51j75o51M37Mm11L02L0l66J90N21m81
$$ y = [-194, -753, -767, 70, 68, -42, 478, 513, 92, 719, 556, -31, 214, 464, -386, -138, -431, -303, -407, 174, -541, -547, -70, -236, -130, 412, 145, -122, 617, 294, 295, 327, 401, 16, 101, -67, -366, 125, 358, -171, -283, -247, -781, -473, 55, -342, -68, 714, 290, 251, 461, 227, -29, 354, -69, -334, 41, 4, -64, 54, -315, -838, -79, -255, -126, 351, 180, -83, 305, 619, 98, 468, 72, -85, 101, 189, -270, -397, -38, -165, -221, -65, -387, -410, 363, -282, -342, 489, 165, 62, 669, -8, -204, 58, -72, -242, -91, 84, -313, -170, -239, -671, -259, -15, -333, -84, 428, -69, 68, 549, 284, 435, 575, 215, 72, 310, -108, -500, 148, -424, -432, -101, -568, -635, 102, -327, -250, 67, 468, 296, 592, 456, -17, 140, 245, -107, 72, 47, -162, 58, 217, -338, -690, -71, -556, -227, 175, -73, -277, 115, 181, -39, 274, 150, -116, 292, 149, -48, 403, 228, -423, 14, 18, -393, -91, -61, -427, -237, 284, -197]
4081a97O35k63q1L6K26m52r4L71j71j13M37p59k74M73R7l9M91P7k89K91j9k24
4103A59j62J4k45M06p0l27J29K35k94l30N78l96L73J04m40J55M02j22p1L65l52
4124A11j48J63P9l39L80n3l32J36j69l39j9L28j3L04K15m38N47J17o44L3M57l49
4146B7m2M11k19l81K73n45K53J08j50j80N70j66l3J90j58%J66o8n10K74M06j82
4168D4K27K57n07k35M12k63k64N66m97L11q6k89J48L53k25l78L70P9l3M09j31
4189B68m42J45k8k94R0K19l05L84j23K9K15J80k56P7Mm51P9K82k34M0K74l68k23
4212d38N75n41K48L21j05K65q1K7j70K16j10n52N53k42J5K36J41l57J04nl89N3
4234b36M51j28j86K06l73J23L17q6m0J99l75j40M48O6j54lO7k98K02o1l35J8K33
$$ y = [-197, 438, 175, 94, 130, 356, -96, -190, 181, 10, -103, 334, -425, -699, -226, -129, -168, 323, 400, 111, 402, 383, 159, -3, 11, -234, 172, 102, -225, -96, 139, -155, -485, 93, -303, 70, 174, -266, -111, 291, 169, 98, 463, 111, -37, 126, 205, -134, 246, 193, -139, -3, -172, -511, -530, -202, -215, 89, 304, -134, 413, 530, -114, -81, 376, 27, -15, 396, 177, -204, 69, -476, -223, -115, -265, -445, 125, -41, -74, 116, -42, -42, 124, 56, -454, -180, 226, 44, 271, 528, 21, -214, 198, -65, -329, 237, -260, 51, -35, -324, -176, 177, -48, -426, -56, 23, -10, 399, 268, -174, -29, -57, -351, -261, -42, -347, 37, -86, -57, 158, 338, 82, 159, 163, -288, -209, 73, -161, -121, 153, -215, -438, 137, -404, -156, 165, 60, 325, 244, 271, 101, 317, 207, -345, 208, -34, -19, 217, 358, 1, 105, 100, -289, -236, 215, 87, -99, 107, -266, -143, 174, 88, 48, 247, -128, -268, 180, 246, 92, 89, 156, -142, 60, -1, -336, -318, -85]
4257h5n43P98J19l63K11J24j29j31J17j70q3J80J8K1J5l24J64L20j97m34L15J18
4279F1j99L48l32k17K0Q9j34J07N17m64L72jk45M83j19k57k36K30j82J74L3q4
4301c6n9L61n12k1j4M73m78K90j07m8K69J4j44R8K3m36M39K54j38J75P6o79L11
4324A11p4l9r9K09m13r9L82k78M6L46j33k42M13o3O0K87O3n54R4J29l18K46K01
4347B75n14K26K17n30K58M47m51k0k17J23kK90j13J16J17k25k06O34l46j57K67
4368A89o8J6j7R6n63K85k2J62m44K08O6L19J93m83J56k4l06K32K31m34j8M52n23
4391b97K32J92J79n43N0K08r7M07l29j44J2K85l12P7K81m65K91K47m33K71k08
4412i6k01L23L61o20L36Q0k64J81N6k85j89O56j38j92J11j11j81K32j7l50M10
$$ y = [-85, -628, 170, 289, -74, 137, 261, 132, 1, 118, -52, -135, 45, 63, 84, 99, -225, -61, 259, 62, -372, -57, 61, -138, 210, -122, -339, -319, -230, -364, -257, 260, -204, 168, 167, -78, 405, 286, 29, -207, 23, -159, 15, 48, -36, -95, 266, -246, -267, -281, 192, -286, 4, -103, -151, 118, 132, -12, 86, 109, -327, 112, 366, 228, 403, 479, -200, 111, 37, -2, -101, 108, -305, -404, -22, -300, -254, 92, -41, -283, 130, 67, 127, 414, 477, -77, 17, 146, -172, 74, 275, -239, -13, 204, -326, -68, 379, -72, -92, -309, -186, -188, 102, -11, 105, 222, -3, -209, 425, 79, -78, 189, 121, 137, 120, 216, -347, -62, -84, 78, -366, -158, -92, 227, 420, -63, 93, 69, -237, -5, 226, -208, -226, 226, -297, -65, 127, 306, -237, -187, 21, -76, 331, 2, -142, -130, 155, -157, -80, 201, -264, 27, 274, -159, 112, -96, -297, 26, 387, -233, 103, 183, -81, 100, 156, -129, -318, 338, 200, 8, 119, 8, -173, 59, 42, -308, 102]
4433A02j25k78L63K0r3l5J57l63K71K22l20K12kk27l0K01k99K24j6m9l5J67n1
4456A6l99N79j66j24K59k0l02L35K19m16K88j97k45M48J4l37J1J28j70m0K38l35
4478b16NQ8n4O4L57m28K5N48l40k12M33j66k68L10J37m39J60P7l7M1K08m56J05
4501e8L25m28L09J52l80K14l5k01n9j3j13J96K38j22n2M62n46O7L35k41k48p4
4523b72N1K22K88j66n39L41L52m31J27K09n19K09J71l11K43J23k22p0N63l21k0
4544B8K86k23K2j66Oj62J96K3j86K60k26K8J76o2k74M19J1k41J39J73l80L70j32
4567H5m53O65k63k27K00J78j24j29J60M6l60J53no6n4K90m28P19k24l32K75p6
4589C0j21M5K48m23L12J96m05p0L09k15%K44k43QJ01m0k25J70R7pj53kJ26r0M12
$$ y = [102, -23, -301, 62, 82, -11, -46, 111, -252, 19, 241, -79, 133, 131, -96, -126, 75, -224, 0, -16, -65, -100, 67, 16, -383, 196, 30, -94, 165, 145, -157, 178, 397, -19, 269, 72, -173, 275, 289, -48, -37, 91, -79, -119, 119, -216, -211, -123, -177, -113, 244, -184, -159, 389, 49, -163, 270, 104, -164, 146, 283, -156, 4, 81, 44, 85, 293, -163, -58, 267, -161, 148, 300, -80, 134, 99, -102, -161, -174, -287, -91, 147, 25, -27, 435, -111, -44, 291, 50, -198, -272, -221, 1, 289, 123, -416, -75, 277, -154, -27, 182, -337, -128, 43, -268, -25, 98, -124, -194, 369, 48, 28, 314, 91, 113, -53, -47, -209, -13, 10, -176, 84, -142, -114, 62, 0, -274, 145, 156, -85, 54, 227, -153, 217, 85, -368, 297, 34, -193, 7, 185, 61, -68, 92, 138, -222, -69, -74, -140, -194, 96, -332, 387, 163, -169, 106, 30, -91, -46, 202, -221, 91, 287, -118, -188, 121, -94, -94, 150, -93, -85, 16, -24, -249, -79, 18, 11, -142, -144, -18, -108, 304]
4614C04q3j87l0p9J5J31j45K25k73k07K35M0j37k9M27l87J62L20k01j65j4P9o9
4637f8L02k20m5L03O4m48K35p9q8K17j67j66J75J07l37L04n5j50j68L26q5LL57
4660C17k36j36L50l28J58J54j55o4j72L33k50K77l38k5J53j16r5K98k00j09L41
4681A57r5j13P1j8j78K04J58m8o8J50k23j85M21l25rL79k50j27K33l07j80K83
4703g0J20J69k87N4j82R1J98q4N3k6O4%l4k01K46J24m58OL03r1o6O8j66J60r0
4728i9j31P3J40j01k1L28j35j21j51O27m60M4K99m57L73j46j2j63J99j91K6n3
4750a32J74j77O9J14l65N49l64J78l8nj03K49k39J35K78j37q0J01J26l00K6j87
4772a28j62J21L45k26j18J74l92M87r8j6j65O41k36J7l25K07JJ07k91J72Jj0k25
$$ y = [304, 221, 34, 4, -75, -60, 71, -74, 151, -122, -329, -94, -54, -191, -220, 207, -180, -18, 302, 101, -64, -78, 1, -68, 234, 14, -31, 272, 336, -112, 123, 44, -44, 173, 6, -160, 15, 122, -215, 89, 34, -116, -284, 42, -43, -40, 317, 81, -55, 295, -33, 125, 279, 124, 60, -112, 221, -29, 248, -90, -115, 38, -78, -173, 125, -75, -184, 157, 62, -51, 20, 2, -176, 28, 186, 138, 70, 220, -3, -188, 233, -92, -101, 278, 28, -99, 134, -173, -353, -70, 50, 219, -68, -14, -196, -105, 93, 9, 62, 36, 100, 100, 66, -135, 111, 235, -223, -217, 86, -5, -71, -3, -169, -9, -99, -230, -157, -17, -118, -139, 189, 54, -67, -218, 409, -51, -7, 292, -165, 208, 62, 50, -113, 86, -105, -79, -132, 42, -135, -66, 48, -317, 232, -132, 46, 8, 3, -100, 149, -90, 45, 323, 186, 106, 207, 333, 33, 59, -128, -290, -169, 176, -50, -168, 6, -386, 101, 3, -13, -178, 463, 227, 244, -81, 126, 127, 234, -57, 115, 116, 106, -119]
4795a19K64q6m11N03j24l75K89L21k87O7Q0k28J89K53k08k48L64l53k42N07q4
4816G2l5Q9l14J25J43o1q5J38l70Q7M58m3l89K23M4m17K09J64k67J91J59k4k24
4839a27L6J32j30L11k56j88K91k5j38N30m12j06j9mr2M11k40k66L35Q7l57L30
4861A03M4j88J19O8k45q6J74l4R9L9k11q4M20l03j21L3n8K08j36K20M1J8K8j94
4885d6K18J88l93J76R6k87k6K21k14p9P6m6J34k6k49J57m9j4o1L34Qj78J36L9
4909A15k15K25Q8k74M31o81K12J90q0j21L7N3J7Q1o4p4K2J5L37k99N0k20K69k2
4933I2q9Q2m0P6k98L57k27J3K46Lj14j20L5j29L17l16l2J93j70k7j01L23k33J82
4957B3R8l03Q4L01n8k47K91j12j07J75p6p1J08k90K3L27k05pr8J05q4J69m6K0
$$ y = [-119, 145, 59, -352, 151, 27, -348, -59, 262, -25, 42, 122, -106, 83, 336, 128, -120, 244, -109, -351, 156, 72, 37, 126, -188, -63, 80, 19, -66, 72, -298, -211, 247, 204, -185, 38, 82, -335, -126, 38, -229, -38, 121, 97, -127, -91, 41, -89, 222, -34, -222, 69, 44, -94, 436, 24, -82, -101, -105, -197, 214, -26, -292, 43, 130, -227, 103, 147, -41, 78, 146, -99, -185, -11, -45, 54, 93, -118, -202, 218, -85, -206, -173, -231, -23, -159, 61, 102, 120, 148, -46, 172, 360, -33, 143, 239, -48, -74, 147, -67, -146, -70, -116, 18, -8, -257, -100, -149, -163, -224, 110, 118, -60, 76, 115, -100, 125, 213, -61, 370, -311, -99, 91, 11, -110, -73, -20, -3, 78, 14, -60, -38, -23, 314, 15, 65, -155, 114, 92, 3, 85, 45, 121, -177, 180, -47, -34, 212, 215, 101, -19, 16, -113, 204, -112, -144, 49, -121, -148, -249, 74, -159, 23, 121, -182, -98, 203, 145, -102, 189, 77, -30, 145, 69, -2, 106, -184, -161, 166, -39, -46, -144, -39, -123, 46, 0, 20]
4981B0j22o0JJ70nn3Q3K38j21k21J35k02J75L6l50l2R2k3j10N13m56K03J67KM2
5006A22j77J59j79J36j24J01M0j33Q6j06L22m36O4J48j47J49O7j22nJ48p6l14
5028b77J42L9J7J96K74k82k00L72m56K62l94L34p2P5k49K13L01l34K2K55k35K5
5050B8K44l13P3J4j81J42k54J42j07K97J78k03Rl41J85L7K96k98P5q7j11K9J97
5073E1k20j33N83m20O7L67m12K37n9J11j33p2l7Q6J63j61J56M3k50%K24r4j87
5096i0l5J03r0J57j92N5K05k47J22J52r6N0k73J24Q9J60O8j60Or6l3k31L35j69
5120h6J45Q8L0j81rK3j75K69jk85J86P4j70RN20l99J60M0k64O6J10l74K94q2j17
5145a29M3P7j00j52K17P7p6K44k02k68L33o7k32L88j56q0j6L05m85K98L5j53J88
$$ y = [20, -102, -162, -161, 9, 4, -49, 34, 272, 151, -70, 65, -137, 38, 74, -276, -308, -216, -239, -349, 164, -292, -89, 78, 80, 122, -55, 104, -75, 61, -63, 38, 78, -55, 31, -75, 247, -189, -125, 23, -124, 25, 92, -30, -35, 113, 37, -277, -135, -96, -79, 117, 391, 109, -91, 281, -175, 87, -307, 27, -45, 30, -219, -6, 295, -39, -17, 238, 3, 28, 272, -41, 32, 46, -135, 7, -247, -105, -212, 85, 263, 60, 69, -272, -87, -50, 246, -52, 23, -64, -175, -146, 51, -169, -302, 281, -139, -72, 295, -117, 120, 61, 172, 39, -33, -70, 16, 179, 18, 174, 217, -33, -33, 191, 97, -90, -125, -22, -112, 45, -147, -92, 113, -134, -12, 140, 44, 94, -179, -55, 34, 194, 262, 102, 108, 12, -21, -252, 83, -86, 59, 147, 177, -4, -13, 10, -165, 104, 103, -182, 4, 78, -92, -83, 437, 38, 198, 238, -26, 40, 150, -224, 70, -12, -129, -86, -9, -109, -261, -44, 33, -43, 201, -1, -269, 64, -3, -235, 153, -3, -83, -99, 206, -279, 19, 54, -99, 89]
5168H9p8O9k35L45l11p1K21J92j57R2j0j36o2k80K11L38k49q7L05rm95L18K38
5191B38l29j0P1J61m17K27j31J02K44k14n5Qj1mL28l51K24K82m54r5L50m0k93
5214a69K78j19J13m1k08M1K19J6j12M3K09m02J85m4K0o4P4k00j4M88k97J15J86
5237C17k89l09J07K29k50K66k13j01M20j52k26J40J04j64K86J5l54K45M6q9P2
5258A00j72K81j1J04j47j73J97k52K74l9J04m54L31j85k77L66P1m05K20K60k50
5279e7l6j17J80j65P1L4R8J36k16k02L17j34K20P6k14J79R9m47l4J09M0L25j93
5302F9L4l80N49j27n0k22J45j40K32n6r3L14r7k51r7P2j74P2L22o4o1J91j53m70
5326d35M69k35J53k38K48K96J85k94j8m1k59J92Q9j06L9m6nj89J36J80j14PK72
$$ y = [89, 11, 80, -155, 190, -121, -192, 29, 221, 64, 156, 146, 10, -52, -332, -121, 217, -32, -119, 186, 177, -318, 0, 238, -91, -101, -30, 131, -286, -59, -190, -88, 156, -58, -113, -105, -116, -120, 208, -143, 81, 363, -91, -186, 164, 124, -169, 109, -10, 103, 62, -146, -105, 114, 130, 18, 61, 270, -132, 53, 9, 29, -35, 39, -161, -175, 313, 16, 131, 317, 28, -281, -174, 55, -195, 71, -142, -243, 177, 25, -201, -61, 43, -121, 165, 180, -174, 71, 117, 28, 100, -72, 209, 198, 302, 155, -18, 179, -73, 201, 162, 266, -188, 143, -42, -319, 47, 118, -287, -67, 193, -57, -93, -210, -30, -195, -124, -90, 8, 144, -72, -274, 43, -91, 129, 205, -9, 170, 269, -178, -212, -103, -63, 262, 69, 103, -277, 272, 145, 95, -127, 18, -122, 110, 54, -39, 275, 178, -73, -170, -98, -272, -200, 122, 58, -3, 188, 35, -435, 34, -201, -48, -286, -38, 258, 443, 149, 131, 90, -169, 23, 112, 6, 45, -1, -6, -195, -59, 121, 7, 14, 286]
5349B86k59o4k2L1J57j8r8K3J39m2k50K24J19j57J17m33K11M7K19k45k52O0j3
$$ y = [286, 27, -37, -59, -28, 129, 111, 13, 36, 175, 133, -117, 107, 226, 69, 186, -247, -36, 11, 230, -15, -267, -207, -220]
$$ [...]
8191a78
##END NTUPLES=NMR FID
##END=
