##TITLE=1H_CA-8534-13-3
 CDCl3, 8 sc, 
 15.2.2019
##JCAMPDX= 6.0         $$ Bruker NMR JCAMP-DX V2.0
##DATA TYPE= NMR FID
##DATA CLASS= NTUPLES
##ORIGIN= UXNMR, Bruker Analytische Messtechnik GmbH
##OWNER= root
$$ XWIN-NMR		Version 3.5
$$ Fri Feb 15 16:38:13 2019 Russian Standard Time (UT+4h)  she@DPX200
##.OBSERVE FREQUENCY= 200.1313
##.OBSERVE NUCLEUS= ^1H
##.DELAY= (6, 6)
##.ACQUISITION MODE= SIMULTANEOUS
##.ACQUISITION SCHEME= undefined
##.AVERAGES= 8
##.DIGITISER RES= 18
##SPECTROMETER/DATA SYSTEM= spect
##.PULSE SEQUENCE= zg30
##.SOLVENT NAME= CDCl3
##.SHIFT REFERENCE= (INTERNAL, CDCl3, 0, 15.7039)
##AUDIT TRAIL= $$ (NUMBER, WHEN, WHO, WHERE, WHAT)
$$ ##TITLE= Audit trail, XWIN-NMR		Version 3.5
$$ ##JCAMPDX= 5.01
$$ ##ORIGIN= Bruker BioSpin GmbH
$$ ##OWNER= she
$$ F:/spectra/data/she/nmr/H-F/1/audita.txt
$$ ##AUDIT TRAIL=  $$ (NUMBER, WHEN, WHO, WHERE, WHAT)
(   1,<2019-02-15 16:37:12.07 +0400>,<she>,<DPX200>,
      <created by zg, POWCHK disabled, PULCHK disabled
       configuration hash MD5:
       00 E9 B6 7A A2 85 ED C7 34 08 36 98 17 FE 4E 26
       data hash MD5: 16K
       15 30 7A 40 3D E6 63 D6 A5 73 DE 7A B4 D8 D3 DE>)
$$ ##END=
$$ 
$$ hash MD5
$$ 1F C8 0D BF AA 19 24 EE 52 75 8F 5D E2 E5 6E 7C
##$RELAX= 
##$RELAX= 
##$RELAX= 
##$RELAX= 
##$RELAX= 
##$RELAX= 
$$ Bruker specific parameters
$$ --------------------------
##$DU= <F:/spectra>
##$EXPNO= 1
##$NAME= <H-F>
##$PROCNO= 1
##$TYPE= <nmr>
##$USER= <she>
##$AMP= (0..31)
100 100 100 100 100 100 100 100 100 100 100 100 100 100 100 100 100 100 
100 100 100 100 100 100 100 100 100 100 100 100 100 100 
##$AQSEQ= 0
##$AQ_mod= 1
##$AUNM= <au_zg>
##$AUTOPOS= <>
##$BF1= 200.13
##$BF2= 200.13
##$BF3= 200.13
##$BF4= 200.13
##$BF5= 200.13
##$BF6= 200.13
##$BF7= 200.13
##$BF8= 200.13
##$BYTORDA= 1
##$CFDGTYP= 0
##$CFRGTYP= 5
##$CHEMSTR= <none>
##$CNST= (0..31)
1 1 145 1 1 1 1 1 1 1 1 1 1 1 1 1 1 1 1 1 1 1 1 1 1 1 1 1 1 1 1 1 
##$CPDPRG= <>
##$CPDPRG1= <>
##$CPDPRG2= <>
##$CPDPRG3= <>
##$CPDPRG4= <mlev>
##$CPDPRG5= <mlev>
##$CPDPRG6= <mlev>
##$CPDPRG7= <mlev>
##$CPDPRG8= <mlev>
##$CPDPRGB= <>
##$CPDPRGT= <>
##$D= (0..31)
0 1.2 0 0 0 0 0 0 0 0 0 0.03 0 0 0 0 0 0 0 0 0 0 0 0 0 0 0 0 0 0 0 0 
##$DATE= 1550234231
##$DBL= (0..7)
120 120 120 120 120 120 120 120 
##$DBP= (0..7)
150 150 150 150 150 150 150 150 
##$DBP07= 0
##$DBPNAM0= <>
##$DBPNAM1= <>
##$DBPNAM2= <>
##$DBPNAM3= <>
##$DBPNAM4= <>
##$DBPNAM5= <>
##$DBPNAM6= <>
##$DBPNAM7= <>
##$DBPOAL= (0..7)
0.5 0.5 0.5 0.5 0.5 0.5 0.5 0.5 
##$DBPOFFS= (0..7)
0 0 0 0 0 0 0 0 
##$DE= 6
##$DECBNUC= <off>
##$DECIM= 32
##$DECNUC= <off>
##$DECSTAT= 4
##$DIGMOD= 1
##$DIGTYP= 9
##$DL= (0..7)
0 120 120 120 120 120 120 120 
##$DP= (0..7)
150 150 150 150 150 150 150 150 
##$DP07= 0
##$DPNAME0= <>
##$DPNAME1= <>
##$DPNAME2= <>
##$DPNAME3= <>
##$DPNAME4= <>
##$DPNAME5= <>
##$DPNAME6= <>
##$DPNAME7= <>
##$DPOAL= (0..7)
0.5 0.5 0.5 0.5 0.5 0.5 0.5 0.5 
##$DPOFFS= (0..7)
0 0 0 0 0 0 0 0 
##$DQDMODE= 0
##$DR= 18
##$DS= 0
##$DSLIST= <SSSSSSSSSSSSSSS>
##$DSPFIRM= 0
$$ [...]
##$SUBNAM2= <"">
##$SUBNAM3= <"">
##$SUBNAM4= <"">
##$SUBNAM5= <"">
##$SUBNAM6= <"">
##$SUBNAM7= <"">
##$SUBNAM8= <"">
##$SUBNAM9= <"">
##$SW= 20.0189088683792
##$SWIBOX= (0..15)
0 0 2 0 0 0 0 0 0 0 0 0 0 0 0 0 
##$SW_h= 4006.41025641026
##$TD= 16384
##$TD0= 1
##$TE= 0
##$TE2= 300
##$TE3= 300
##$TEG= 300
##$TL= (0..7)
0 120 120 120 120 120 120 120 
##$TP= (0..7)
150 150 150 150 150 150 150 150 
##$TP07= 0
##$TPNAME0= <>
##$TPNAME1= <>
##$TPNAME2= <>
##$TPNAME3= <>
##$TPNAME4= <>
##$TPNAME5= <>
##$TPNAME6= <>
##$TPNAME7= <>
##$TPOAL= (0..7)
0.5 0.5 0.5 0.5 0.5 0.5 0.5 0.5 
##$TPOFFS= (0..7)
0 0 0 0 0 0 0 0 
##$TUNHIN= 0
##$TUNHOUT= 0
##$TUNXOUT= 0
##$USERA1= <user>
##$USERA2= <user>
##$USERA3= <user>
##$USERA4= <user>
##$USERA5= <user>
##$V9= 5
##$VALIST= <valist>
##$VCLIST= <CCCCCCCCCCCCCCC>
##$VD= 0
##$VDLIST= <DDDDDDDDDDDDDDD>
##$VPLIST= <PPPPPPPPPPPPPPP>
##$VTLIST= <TTTTTTTTTTTTTTT>
##$WBST= 1024
##$WBSW= 4
##$XGAIN= (0..3)
0 0 0 0 
##$XL= 0
##$YL= 0
##$YMAX_a= 479698
##$YMIN_a= -615926
##$ZGOPTNS= <>
##$ZL1= 120
##$ZL2= 120
##$ZL3= 120
##$ZL4= 120
##$ABSF1= 10
##$ABSF2= 0
##$ABSG= 5
##$ABSL= 3
##$ALPHA= 0
##$AQORDER= 0
##$ASSFAC= 0
##$ASSFACI= 0
##$ASSFACX= 0
##$ASSWID= 0
##$AUNMP= <proc_1d>
##$AZFE= 0.1
##$AZFW= 0.1
##$BCFW= 1
##$BC_mod= 2
##$BYTORDP= 1
##$COROFFS= 0
##$CY= 11.3945322036743
##$DATMOD= 1
##$DC= 2
##$DFILT= <>
##$DTYPP= 0
##$F1P= 18.9103706918063
##$F2P= -1.10871071338519
##$FCOR= 0.5
##$FTSIZE= 0
##$FT_mod= 4
##$GAMMA= 1
##$GB= 0.15
##$INTBC= 1
##$INTSCL= 1
##$ISEN= 128
##$LB= 0.24
##$LEV0= 0
##$LPBIN= 0
##$MAXI= 10000
##$MC2= 0
##$MEAN= 0
##$ME_mod= 0
##$MI= 1.114404
##$NCOEF= 0
##$NC_proc= 0
##$NLEV= 6
##$NOISF1= 3.799351
##$NOISF2= 2.8
##$NSP= 1
##$NTH_PI= 0
##$NZP= 0
##$OFFSET= 15.70392
##$PC= 1
##$PHC0= -9053.084
##$PHC1= 13.40014
##$PH_mod= 1
##$PKNL= yes
##$PPARMOD= 0
##$PSCAL= 0
##$PSIGN= 0
##$REVERSE= no
##$SF= 200.130013532006
##$SI= 16384
##$SIGF1= 3
##$SIGF2= 2
##$SINO= 400
##$SIOLD= 16384
##$SREGLST= <1H.CDCl3>
##$SSB= 0
##$STSI= 0
##$STSR= 0
##$SW_p= 3612.71676300578
##$SYMM= 0
##$S_DEV= 0
##$TDeff= 0
##$TDoff= 0
##$TI= <>
##$TILT= no
##$TM1= 0
##$TM2= 0
##$TOPLEV= 0
##$USERP1= <user>
##$USERP2= <user>
##$USERP3= <user>
##$USERP4= <user>
##$USERP5= <user>
##$WDW= 1
##$XDIM= 8192
##$YMAX_p= 0
##$YMIN_p= 0
$$ End of Bruker specific parameters
$$ ---------------------------------
##NTUPLES= NMR FID
##VAR_NAME=  TIME,          FID/REAL,        FID/IMAG
##SYMBOL=    X,             R,               I
##VAR_TYPE=  INDEPENDENT,   DEPENDENT,       DEPENDENT
##VAR_FORM=  AFFN,          ASDF,            ASDF
##VAR_DIM=   8192,          8192,            8192
##UNITS=     SECONDS,       ARBITRARY UNITS, ARBITRARY UNITS
##FACTOR=    0.0002496,     1,               1
##FIRST=     0,             0,               0
##LAST=      2.0444736,     0,               0
##MIN=       0,             -615926,         0
##MAX=       2.0444736,     479698,          0
$$ Real data points
##PAGE= N=1
##DATA TABLE= (X++(R..R)), XYDATA
$$ [...]
2656e70j61k08L286j363l119L365J771j864J030r85m620M36K114k735J725L139
$$ -570 -731 -939 2347 984 -2135 1230 3001 1137 2167 1182 -3438 -3002 -888 -3623 -1898 1241
2672A241j350Q00K888j081m98p17n742p86N163J391M03J337m410j927N454Q39
$$ 1241 -109 691 3579 2498 2000 1283 -4459 -5245 -82 1309 1712 3049 -1361 -3288 2166 3005
2688C005l430L60K30N25L934p69o995j467N25j319J858J354j044N001N412j819
$$ 3005 -425 -65 165 690 4624 3855 -3140 -4607 -4082 -5401 -3543 -2189 -3233 1768 7180 5361
2704E361j437j254l877P83L314l421k197K803r4n50K299l061l938J487O48J189
$$ 5361 3924 2670 -1207 -424 2890 -531 -2728 75 -19 -569 1730 -1331 -5269 -3782 -3134 -1945
2720a945N372K126k559p61l230l057K861J378l353J517L634J001L306J350o865
$$ -1945 3427 5553 2994 2233 -997 -4054 -1193 185 -3168 -1651 1983 2984 6290 7640 775
2735G75l898J138j205r2K051j300J262M064j983m062J13q7J857N375q17k635L758
$$ 775 -3123 -1985 -3190 -3282 -1231 -2531 -1269 2795 812 -3250 -3137 -3224 -1367 4008 3191 556 4314
2752D314K277k316j378m754n753K243M278M20J999R86l712q53J316j789J417K997
$$ 4314 6591 4275 2897 -1857 -7610 -5367 -1089 -669 1330 2316 -1396 -2249 -933 -2722 -1305 1692
2768A692j856L89K983m76J127J355n701l913K647Q64p36K179q63k484K898Q90
$$ 1692 -164 225 3208 2732 3859 5214 -487 -4400 -1753 -889 -1625 554 -309 -2793 105 995
2784I95k734J178J596n00J692o81l861K601M426j975k035k854m266K568N779r03
$$ 995 -1739 -561 1035 535 2227 1546 -2315 286 4712 2737 702 -2152 -6418 -3850 1929 1026
2800A026j212J420j609M21L516k126l223J553p01j486K058J484qJ751j820l717
$$ 1026 -186 1234 -375 46 3562 1436 -1787 -234 -935 -2421 -363 1121 1113 2864 1044 -2673
2816b673K430J404j365J408p67m652J769L679j926o62J067j168M14J611n07J805
$$ -2673 -243 1161 -204 1204 437 -4215 -2446 1233 -693 -1355 -288 -1456 -1042 569 62 1867
2832A867M916j431l480j738l403o18M143o07l678P77J420J728M017j279n165J023
$$ 1867 6783 5352 1872 134 -3269 -3887 256 -351 -4029 -3252 -1832 -104 3913 2634 -2531 -1508
2848a508J918j169K513K227k887n51k8l104M76K948J11P43N0m044J130M451k320
$$ -1508 410 -759 1754 3981 1094 543 515 -2589 -2113 835 946 1689 1739 -2305 -1175 3276 956
2865I56l296J88j151n70L957P97k94K560K59k457K97n05j185L091l85n828j212
$$ 956 -2340 -2152 -3303 -3873 84 881 587 3147 3406 949 1246 741 -444 2647 2262 -3566 -4778
2882d778K287J485K792n93m488P51M225O06J449J145m425k684K007j506k242K485
$$ -4778 -2491 -1006 1786 1193 -3295 -2544 1681 2287 3736 4881 456 -2228 -221 -1727 -3969 -1484
2898a484N12j015R47m7J645M259k20l556m6r42j550L101N41m177n83J193j801
$$ -1484 -972 -1987 -1040 -1087 558 4817 4597 1041 995 53 -1497 1604 2145 -2032 -2615 -1422 -3223
2915c223J134K202m98K919J715l937k030K987K33j014j163m403r46N349L100O49
$$ -3223 -2089 113 -385 2534 4249 312 -1718 1269 1502 488 -675 -5078 -6024 -675 2425 3074
2931C074ql207r46M976Q76l267P7r36l692n80Q30j544J786J228j664N80K595J343
$$ 3074 3066 -141 -1087 3889 4765 1498 1575 639 -3053 -3633 -2803 -4347 -2561 -1333 -2997 -2417 178 1521
2949A521L717K178m019k522J313j872j156J075k180j490K063j311j051M143J138
$$ 1521 5238 7416 3397 875 2188 316 -840 235 -1945 -3435 -1372 -2683 -3734 409 1547
2964A547j485K4j430j279M471L624k843l111k363l74M957K474l691r96Q54j804
$$ 1547 62 86 -1344 -2623 1848 5472 2629 -482 -2845 -3219 1738 4212 521 -475 379 -1425
2980a425J245K565l015j154K301j705j991J346O54J524L134j910k514K281J228
$$ -1425 -180 2385 -630 -1784 517 -1188 -3179 -1833 -1179 345 3479 1569 -945 1336 2564
2995B564j319J15k323k908J919J870o58K152O61l621J30P76j579L045M203k565
$$ 2564 1245 1360 -963 -3871 -1952 -82 -740 1412 2073 -1548 -1418 -642 -2221 824 5027 2462
3011B462l468m02MJ323J835l446k617K677J649K306K482k861l634K183n94l201
$$ 2462 -1006 -1408 -1404 -81 1754 -1692 -4309 -1632 17 2323 4805 1944 -1690 493 -101 -3302
3027c302O39J475L30K739N16l408J256K670j135n02p34l244J638L472j199j747
$$ -3302 -2663 -1188 -858 1881 2397 -1011 245 2915 1780 1278 544 -2700 -1062 2410 1211 -536
3043e36j551l248M75L283K45K038M660j233k922J621o01j805P38k125l302J716
$$ -536 -2087 -5335 -4860 -1577 -1332 706 5366 4133 1211 2832 2231 426 1164 -961 -4263 -2547
3059b547K515O35R11k227l217K858K566j833N97J693j199R89J44m215q10L226
$$ -2547 -32 603 1514 -713 -3930 -1072 1494 -339 258 1951 752 1741 1885 -2330 -3140 86
3075H6K96k33Q34j970M47M787o43m448j507o73L33K875J02j256J828k72j508J892
$$ 86 382 149 983 -987 -540 4247 3604 -844 -2351 -3024 -2691 184 286 -970 858 586 -922 970
3093I70N57k092J681P56l656r6K897j191q89k71j707J978L896n08q50J508j163
$$ 970 1527 -565 1116 1872 -1784 -1880 1017 -174 -1063 -1334 -3041 -1063 2833 2325 1475 2983 1820
3110A820j116O93k875k548K631O92j339N53p45J11M883J356l730p19J829l20J575
$$ 1820 704 1397 -1478 -4026 -1395 -703 -2042 -1489 -2234 -2123 2760 4116 386 -333 1496 1176 2751
3127B751j61m224q66J395m38O81J041j540J817K781k246j252K050j388k108P95
$$ 2751 2590 -1634 -2500 -1105 -1543 -862 179 -1361 456 3237 991 -261 1789 401 -1707 -912
3143i12j375j288L167P91j285J127P04o19K640K2k484J650J250k657j398j251
$$ -912 -2287 -3575 -408 383 -902 225 929 310 2950 2972 488 2138 3388 731 -667 -1918
3159a918k085J986J793l096j18L091Q55J624J897l293k266L209M76j551Mj682
$$ -1918 -4003 -2017 -224 -3320 -3438 -347 508 2132 4029 736 -1530 1679 2155 604 608 -1074
3175a074L4K394o89k824J464J29l98K007o7k271J703J494k729o36L99r84J784
$$ -1074 -1040 1354 665 -2159 -695 -566 -964 1043 976 -1295 408 1902 -827 -1463 -1064 -2048 -264
3192b64J950j861L08K545j443j566K59j033K78K788j947j704J460L0j31J711k182
$$ -264 1686 -175 133 2678 1235 -331 -72 -1105 -827 1961 14 -1690 -230 -200 -331 1380 -802
3209h02k557L769K512j820j82k28j879J461M27k856P5J930K77J261O29l529N01
$$ -802 -3359 410 2922 1102 920 692 -1187 274 701 -2155 -2080 -150 127 1388 2017 -1512 -1011
3226a011K372j276p73R32o63N81K390j421k332J524k81j627J150J26l74J910R2
$$ -1011 1361 85 -688 244 -419 162 2552 1131 -1201 323 42 -1585 -435 -309 -683 1227 1319
3243A319l306N53J131m10J560m29k444K111K922j831n09L18j958J009K360k397
$$ 1319 -1987 -1434 -303 -713 847 418 -2026 85 3007 1176 667 985 -973 36 2396 -1
3259aj919K202L41r15L23k564p32L540P10j462K42n07q1K944l8k548P02J321j072
$$ -1 -1920 282 623 -292 31 -2533 -3265 275 985 -477 -235 -742 -823 2121 2083 -465 237 1558 486
3278D86Q58M72k873O71J061k911l97K323k02K89Q27k226k18L122J7j128J158j357
$$ 486 1344 1816 -1057 -386 675 -2236 -2633 -310 -512 -223 604 -1622 -1840 1282 1299 171 1329 -28
3296b8K1K742j654k719J218Q96j367P69j92j211K824J757l083j511k77N1K409
$$ -28 -7 2735 1081 -1638 -420 476 -891 -122 -314 -1525 1299 3056 -27 -1538 -1815 -1764 645
3313F45J075l326m49J962r8J128R07k353n46K969n15j141J432n74j584J64j386
$$ 645 1720 -1606 -2055 -93 -191 937 1844 -509 -1055 1914 1399 258 1690 1116 -468 -304 -1690
3330a690j785K982J310j344P40l08o73K374O58k619K02R89j729P18M74j857J102
$$ -1690 -3475 -493 817 -527 213 -95 -768 1606 2264 -355 -153 836 -893 -175 299 -1558 -456
3347d56K490k693j590J752N83J263J679k425k848K126Q73m60N26j975j808K997
$$ -456 2034 -659 -2249 -497 86 1349 3028 603 -2245 -119 754 294 820 -1155 -2963 34
3363C4J515k050J294L76k157J242J43k372J342K183j540p05N65j043J532K410
$$ 34 1549 -501 793 1169 -988 254 397 -1975 -633 1550 10 -695 -130 -1173 359 2769
3379B769j857j512J241m04L72J132k137j288J619r83j910K083Q50J19J816r53
$$ 2769 912 -600 641 237 609 1741 -396 -1684 -65 -1048 -2958 -875 -25 94 1910 957
3395I57k878J534K391q46m99j244j777K033K656j569o58M28j444J494J244k224
$$ 957 -1921 -387 2004 1158 659 -585 -2362 -329 2327 758 100 528 -916 578 1822 -402
3411d02l46K126j696j849N28q04K78L058k45k283J856J246N84J732j110k685P62
$$ -402 -748 1378 -318 -2167 -1639 -2443 -2165 893 648 -1635 221 1467 2051 3783 2673 -12 750
3428G50J51k216N30O01j459Q31M75k855R85L379o53o89L66j381J122L354j386
$$ 750 901 -1315 -785 -184 -1643 -812 -337 -3192 -2207 1172 519 -170 196 -1185 -63 3291 1905
3445A905k558M00n26P53K292r41j765J707k95j885K65o06j381K260k7k979J019
$$ 1905 -653 -253 -779 -26 2266 1325 -440 1267 972 -913 -648 -1254 -2635 -375 -402 -3381 -2362
3462b362K691L70J504P52k395M6J578j186m08L82j955q6J651k487p75K243n91
$$ -2362 329 699 2203 2955 560 606 2184 998 590 972 -983 -1069 582 -1905 -2680 -437 -1028
3479a028j219J293N43Q77L749r5l774r75n12n83K224Q29k599N84K170j173l29
$$ -1028 -2247 -954 -411 466 4215 4120 346 -629 -1141 -1724 500 1329 -1270 -686 1484 311 -18
3496a8l66j525J153J372k308K15K765k28j68J059k503j175L061J155j497J53n82
$$ -18 -384 -1909 -756 616 -1692 -1477 1288 1060 892 1951 -552 -1727 1334 2489 992 1145 563
3513E63j017J291r98k687P51k94j781J914K090P68K702R83k833j564R99l78J169
$$ 563 -454 837 -161 -2848 -2097 -2391 -4172 -2258 -168 600 3302 4285 1452 -112 887 509 1678
3530A678R02l040q62K130j458k348L56r94M85L110P84p82J871l7q59Q81j779j880
$$ 1678 2580 -460 -1322 808 -650 -2998 -2642 -3636 -3151 -41 743 -39 1832 1795 936 1817 38 -1842
3548a842L188J895k333p32r5j244J240J232k122q67K7r84R28J770q13M43K048
$$ -1842 1346 3241 908 176 81 -1163 77 1309 -813 -1680 -1653 -2637 -1709 61 -752 -309 1739
3565A739j747j145J950P08J33J048j475j301J849j09k669q6r95j414K298J589
$$ 1739 -8 -1153 797 1505 1638 2686 1211 -90 1759 1650 -1019 -1105 -2100 -3514 -1216 373
3581C73j681M73J901p61J88k04j225K303K518k649j446L4j509J170K567k174k135
$$ 373 -1308 -835 1066 305 493 289 -936 1367 3885 1236 -210 -176 -1685 -515 2052 -122 -2257
3598b257J093M65p4J774j176j199K347M87j877R32O95j466J053k60j602J130J324
$$ -2257 -1164 -699 -773 1001 -175 -1374 973 1460 -417 515 1210 -256 797 537 -1065 65 1389
3615A389j922j90K86j943J228K522k045m22J962n60o60J050l48K93K265j265k323
$$ 1389 -533 -723 -437 -2380 -1152 1370 -675 -1097 865 305 -355 695 347 640 2905 1640 -683
3632f83N00n19j40K505j388l664R78K120k64P33P5j823K016J467j348j21Q88j116
$$ -683 -183 -702 -842 1663 275 -3389 -2411 -291 -555 178 253 -1570 446 1913 565 444 1332 216
3650B16O92J189k230m29J537o41j396j93j378L81L068m64j722J549m76r87K079
$$ 216 908 2097 -133 -562 975 334 -1062 -1255 -2633 -2252 816 352 -1370 179 -297 -1284 795
3667G95P05j278J232N44k007k8P04n71J209n48l272N20K036m43J41M28j537K91
$$ 795 1500 222 1454 1998 -9 -37 667 96 1305 757 -2515 -1995 41 -402 -261 167 -1370 -1079
3685a079K506j136j538J425o09M54K566j377j590J804J45k501j28o38j03K793
$$ -1079 1427 291 -1247 178 -431 23 2589 1212 -378 1426 1571 -930 -1058 -1696 -1799 994
3701I94P22j892l19j71q58J947R09k160P20K024j531k81R56j144n38L10j764m53
$$ 994 1716 -176 -495 -666 -1524 423 1332 -828 -108 1916 385 104 1060 -84 -622 -312 -2076 -2529
3719b529K739K61q1J248j146r13K140n20k217K97N44j72J948p6k201Q11L47l016
$$ -2529 210 471 390 1638 492 -421 1719 1199 -1018 -721 -177 -349 1599 1523 -678 133 480 -2536
3737b536n4J208M36K373J677j965k023J15o41Q98J269j379L23K654j82j322L03
$$ -2536 -2590 -1382 -946 1427 3104 1139 -884 -769 -1410 -512 757 -622 -299 2355 2173 851 1154
3754A154j502j647J634n05j629K212J038j219M55l91j463J834J924j634m54Q48
$$ 1154 -348 -1995 -361 -866 -2495 -283 755 -464 -9 -400 -1863 -29 1895 261 -193 655
3770F55m30J318R05k103p76Q98k049o48J556m8M61K406j025k555O91K44j13M62
$$ 655 225 1543 2448 345 -431 467 -1582 -2230 -674 -722 -261 2145 1120 -1435 -744 -500 -613 -151
3788a51l69n83K415Q11j528K71m78j395J215O59j757Q62R76j388m84L05j535R53
$$ -151 -520 -1103 1312 2123 595 866 388 -1007 208 867 -890 -28 948 -440 -924 -619 -2154 -1201
3806a201K677j266j051Q48M00O82J541j332k038J010j53j198P38n71q47K627J32
$$ -1201 1476 210 -841 7 407 1089 2630 1298 -740 270 117 -1081 -343 -914 -1761 866 998
3823I98k170J088J202j097M61M52j876P86J560n62p89Q6j707M49J700r89k94J879
$$ 998 -1172 -84 1118 21 482 934 -942 -156 1404 842 53 139 -1568 -1119 581 -408 -702 1177
3841A177p12j056P88j133k05J907o64j754J429J242m38J759l91k424L98J164r13
$$ 1177 465 -591 197 -936 -1141 766 102 -1652 -223 1019 581 2340 1949 -475 -77 1087 174
3858A74k61l40j122Q16P85k118l42J622K5M59J712j417M7K972j19j496q2j476
$$ 174 -87 -427 -1549 -733 52 -2066 -2408 -786 -761 -302 1410 -7 40 3012 2893 1397 1315 -161
3876a61o27J390k71j774M52n3r13J189O5j160J420R56j440P70J541o09M55R37
$$ -161 -788 602 331 -1443 -991 -1044 -1957 -768 -703 -1863 -443 513 -927 -157 1384 775 1230 2167
3894B167k272j44J943n24q63P14j002o08R82j799j062P60K79j91J076n30m31K988
$$ 2167 -105 -249 1694 1170 307 1021 19 -589 393 -1406 -2468 -1708 -1429 -1620 -544 -1074 -1505 1483
3912A483R44j982L58K16m83J582R83k653q65O95r96j48j8j891M56K155k55K14
$$ 1483 2427 445 803 1019 536 2118 3101 448 -417 278 -718 -866 -884 -2775 -2319 -164 -419 -205
3930b05Q21l24j16J367j697o48J653N20r46J215o24j683R91j22j852M25P62j029
$$ -205 616 292 176 1543 -154 -802 851 1371 425 1640 1016 -667 324 202 -1650 -1225 -463 -1492
3948a492N12N49n70J253J010j618l60R46J41J264J353j964j207J435m99j377J8
$$ -1492 -980 -431 -1001 252 1262 -356 -716 230 371 1635 2988 1024 -183 1252 753 -624 -606
3965f06j669n85K090P05r91P52L62j03J403k93j438J330J449j205N20l89k382
$$ -606 -2275 -2860 -770 -65 -1056 -304 58 -45 1358 1065 -373 957 2406 1201 1721 1332 -1050
3982a050M69J023j609n36M91q23M35J465l89k98J891o51n94J184j59j60J318q40
$$ -1050 -581 442 -1167 -1703 -1212 -2035 -1600 -135 -524 -822 1069 418 -176 1008 849 689 2007 1167
4000A167j178J372K24j834q9q80j466J435J038j176L97R43j42K84R8j469R71K240
$$ 1167 -11 1361 1585 -249 -338 -1218 -2684 -1249 -211 -1387 -990 -47 -189 95 193 -1276 -305 1935
4018A935M3j52M48j678l84J583j465j721M30p88J58J374n99j427J255Q75n51P50
$$ 1935 1978 1826 2274 596 212 1795 330 -1391 -961 -1749 -1591 -217 -816 -2243 -988 -113 -664 86
4036H6M74m34J178N61o13L26L43j392k48l01k263K19J876p77M9J590r25n67M26
$$ 86 560 126 1304 1865 1252 1578 1921 529 281 -20 -2283 -2064 -188 -965 -916 674 -251 -818 -392
4055c92p84j06K024O19m22O25q70q14J425o43k007M11J167l39R27n75j918K71
$$ -392 -1176 -1282 742 1361 939 1564 694 -120 1305 662 -1345 -934 233 -106 821 246 -1672 -1401
4073a401J581j169K57J027k34M44J752j351q06J003rp00J4j844o79J828r9o43
$$ -1401 180 -989 -732 295 61 505 2257 906 100 1103 1094 394 408 -1436 -2115 -287 -386 -1029
4091a029J046k05j275J883J14j103J468P86q74O36k39j311J38M42j889J12J102
$$ -1029 17 -188 -1463 420 534 -569 899 1685 811 1447 1208 -103 35 477 -1412 -1300 -198
4108a98l8Q8K97j494j86J450m34l00J312k89r2J578n92j611J757P11j013r7q92
$$ -198 -236 -148 149 -1345 -1531 -81 -515 -815 497 208 116 1694 1102 -509 1248 1959 946 849 -43
4127d3j237R38P46j879J00k24n92J552J200j380M79J941m78L57N14j162r02R33
$$ -43 -1280 -342 404 -1475 -1375 -1599 -2191 -639 561 -819 -340 1601 1123 1480 1994 832 -70 863
4145H63q60q15O16J91o04Q17q70j359R61M34J25J014m3o27P13Q6j235Q39J020
$$ 863 3 -812 -196 -5 -609 208 -662 -2021 -1060 -626 -501 513 470 -157 556 642 -593 246 1266
4164A266q83J44N66q22L09N69j029j757P14m24L28J221q21n53J601J69l17M86
$$ 1266 383 527 1093 271 580 1149 120 -1637 -923 -1347 -1019 202 -619 -1172 429 598 281 767
4182G67k07o48J521J51j789P86j02j127O96m35j842N92J876k55N5K26p28L37J414
$$ 767 560 -88 1433 1584 -205 581 479 -648 48 -387 -2229 -1637 239 -16 39 265 -463 -126 1288
4201A288o62m36J247j459j62R17q68k90P43k48j083N69J09j44R71o21j027J137
$$ 1288 626 190 1437 -22 -184 733 -135 -425 318 70 -1013 -444 -335 -479 492 -129 -1156 -19
4219a9P05r24Q05K00r36N50N78r60K16J104r82K57m88j971q1J870j08q77K18j33
$$ -19 686 -238 567 767 -169 381 959 -1 215 1319 337 594 106 -1865 -1946 -76 -184 -1061 -843 -976
4239i76N96J559R0j158N81j04l03J004m01j612J014M03j563k12P57q67N57O17
$$ -976 -380 1179 1269 111 692 588 285 1289 888 -724 290 693 -870 -1082 -325 -1192 -635 -18
4257a8j103K81J559l22J30M19j215l93J023k50K50J192n55o81J33r15k14J380
$$ -18 -1121 -840 719 397 527 946 -269 -662 361 111 361 1553 998 317 450 -465 -679 701
4275G01l46j650M42M33o38J125L52j596J75J203J88M88M33j219N02Q39j244n96
$$ 701 355 -1295 -853 -420 -1058 67 419 -1177 -1002 201 389 877 1310 91 593 1432 188 -408
4293d08P19p18k18Q94j062p45J803L23m18L09j011j129J536P14o40M39k5j191
$$ -408 311 -407 -625 269 -793 -1538 265 588 170 479 -532 -1661 -125 589 -51 388 363 -828
4311h28R06L78o83M44L97q51P20P55j101K89M85j847l27J145k20p2O45n40n03
$$ -828 78 456 -227 217 614 -237 483 1238 137 426 911 -936 -1263 -118 -338 -410 235 -305 -808
4330h08J238m71k83Q87J01m70P19n41j262J197J99o10k32m3p09J184J290j654
$$ -808 430 -41 -324 563 664 194 913 372 -890 307 506 -104 -336 -379 -1088 96 1386 -268
4348b68q4N96n93N82O42r83m65P21q3k92M26l47j90Q46o87o32J070L1m38R83j94
$$ -268 -352 244 -349 233 875 -108 -573 148 65 -227 199 -148 -338 508 -179 -811 259 290 -148 835 641
4369F41j300N87M60n80K42M03r05N0O74o66M25O84j312l9N38l09O13P23j373m89
$$ 641 -659 -72 388 -192 50 453 -452 -402 272 -394 31 715 -597 -636 -98 -407 206 929 -444 -933
4389i33O61L85j01P60n17j148J263P77j247L01Rm77P31J8j379M52N69l88N54o
$$ -933 -272 113 12 772 255 -893 370 1147 -100 201 210 -267 464 482 -897 -445 124 -264 290 284
4409B84j396N80J301o74m05N53o60O9J540l91o44N48n11l85O79j60q66P53o42
$$ 284 -1112 -532 769 95 -310 243 -417 -348 1192 801 157 705 194 -191 488 328 -538 215 -427
4428d27q64P66K95n62O11J83o66P63P58p36K15O97r24J50O45j382l00J172m61
$$ -427 -1291 -525 -230 -792 -181 2 -664 99 857 121 336 1033 109 259 904 -478 -778 394 -67
4447f7l44L68o89N6J667l78r17J83k33J62J146m89j612O18O19m46P98K16r67O69
$$ -67 -411 -43 -732 -676 991 613 -304 -121 -354 -192 954 465 -1147 -529 90 -356 442 658 -309 360
4467C60N62o11m2J56p39J95M64j025l27J157n80j18Q63p33j09J291m14n11J062
$$ 360 922 311 269 425 -314 -119 345 -680 -1007 150 -430 -548 315 -418 -527 764 350 -161 901
4486I01l65j004O01o8n42Q96Or06J39N84j51M57j97j486M42J151n18k53N51r60
$$ 901 536 -468 133 65 -477 419 425 -481 -342 242 91 548 351 -1135 -693 458 -60 -313 238 -722
4506g22J96J279m93p10N75J97k35O71o13q54P89K10n68O76l63p72J251K88j205
$$ -722 -526 753 260 -450 125 322 87 758 145 -709 80 290 -278 398 35 -737 514 802 -403
4525d03K06K15o16M30O37j102Q3Q90o59j80J203n54l38P75n54L3O14k41r07M35
$$ -403 -197 18 -598 -168 469 -633 -550 340 -319 -499 704 150 -188 587 33 66 680 439 -468 -33
4545c3m67n74J376k48j049R07Q70n52K31Jr75Q32L64o59l96K37p78Q68M02p39
$$ -33 -500 -1074 302 54 -995 -88 782 230 461 462 -513 319 683 24 -372 -135 -913 -45 357 -382
4565c82l10R56k92M61P06r57k31Q91n22p09M93p99m53P51M70q66P41k2m33J016
$$ -382 -692 264 -28 433 1139 182 -49 842 320 -389 104 -695 -1148 -397 73 -793 -52 -74 -507 509
4585E09L56q50K93M57p24J70P40j190k11K86q64M53J038n78k56P71m21n4R48q56
$$ 509 865 15 308 765 41 211 951 -239 -450 -164 -1028 -575 463 -115 -371 400 -21 -75 873 17
4605A7j062J109m4k51Qn12p8J395N04j062N91J47q03N27O32r50o52N59o87J31
$$ 17 -1045 64 20 -231 -223 -735 -813 582 1086 24 615 762 -41 486 1118 168 -484 75 -612 -481
4625d81K18q72K4J200L5l1O54n72k49Q30m37p91J193n32m08N99j11j146Q55J07
$$ -481 -263 -1135 -1111 89 124 93 747 175 -74 756 319 -472 721 189 -219 380 269 -877 -22 85
4645H5j031J006M93j157oQ20n94M33N09p98J78O19l64L1N02j041m15J310j13q48
$$ 85 -946 60 553 -604 -610 210 -384 49 558 -240 -62 557 193 224 726 -315 -730 580 467 -381
4665c81L03o93l59J248K06n14M92L09o06O50O7j227L34O24o93O1j99p07N94Q12
$$ -381 -78 -771 -1130 118 324 -190 302 611 5 655 722 -505 -171 453 -240 -179 -378 -1085 -491 321
4685C21p27J32P93n57K19J123p36q02M30k19n49O96k00p30Q27l70l13J169M29
$$ 321 -406 -274 519 -38 181 1304 568 -234 196 -23 -572 124 -76 -806 21 -349 -662 507 936
4704I36j380O45j54q51Q05K27q91L32P36n39Q4O19q54M1J266l98o52N33l06j51
$$ 936 -444 201 47 -804 1 228 -663 -331 405 -134 -50 569 -285 -244 1022 624 -28 505 199 48
4724D8N56j164p48N45L40j04R50l50j042J253O12q57L39R1n98K71N06o10K38K16
$$ 48 604 -560 -1308 -763 -423 -527 423 73 -969 284 896 39 378 469 -129 142 648 38 276 492
4744D92q92J28L72q54j32R18k51o5Q43p86k92P56k00m09R89k75o43R78J96q14
$$ 492 -400 -272 100 -754 -886 32 -219 -284 559 -227 -519 237 37 -372 617 342 -301 677 873 59
4764E9O6l42p06O89Q29n21J16k53p46P24O58j063Q2L76o32J35J334n46m83P82
$$ 59 125 -217 -923 -234 595 74 190 -63 -809 -85 573 -490 -408 -32 -664 -529 805 259 -224 558
4784E58k29l13M23o47k24J217q0q13K65m2r07Q36J58r30K41M07q7O43L87j269
$$ 558 329 16 439 -208 -432 785 705 -108 157 115 -792 44 202 -728 -487 -80 -167 476 863 -406
4804d06j75J092o99L21R31o61p72O03m60J21N45p22l38R68m28k12N95j69p43R73
$$ -406 -581 511 -188 133 1064 403 -369 234 -226 -105 440 -282 -620 348 -80 -292 303 134 -609 364
4824C64L98r76M6Q0n11Q09J92n79m9N51n29J91K86o59l33J103K21j12J99j215
$$ 364 762 -214 -168 -88 -599 210 402 -177 -226 325 -204 -13 273 -386 -719 384 605 493 692 -523
4844e23k43J204j83p52P42k35p43P87L40q95J71K20k19N00N50r42L85O2o79N09
$$ -523 -766 438 255 -497 245 10 -733 54 394 -501 -330 -110 -329 171 721 -221 164 226 -453 56
4864E6M44r16k6R65l51k33L60l76k45J218p07k83j97m04m72J221J27o74J82K8
$$ 56 500 -416 -442 523 172 -61 299 -77 -322 896 189 -94 -291 -695 -1167 54 181 -493 -311 -283
4884b83j13R55J80r44P82K39j076Q39M23j731J91N78k91j73O32p18J66P20n96
$$ -283 -396 559 739 -205 577 816 -260 579 1002 -729 -538 40 -251 -424 208 -510 -344 376 -220
4903b20k87J53l05L17J049r0r90O31k14L6P05k10p94J57K38l75Q91p0j164k00
$$ -220 -507 -354 -659 -342 707 617 -373 258 44 80 785 575 -219 -62 176 -199 692 622 -542 -742
4923g42L79j96K96L31o46L39J012p31J23N43r65k71J008n80l22P40l73J88N82
$$ -742 -363 -559 -263 68 -578 -239 773 42 165 708 -257 -528 480 -100 -422 318 -55 133 715
4942G15k30r61M94m2l87O98j31j246P76O65n72L5L20j240Q04J396m98J05L36j101
$$ 715 485 -476 18 -24 -411 287 156 -1090 -314 351 -221 -186 134 -1106 -302 1094 596 701 1037 -64
4962f4j78O28m34q35N79j85OO93k7m53N06K9l69P06n55r16R75Q1m34r0M94r71
$$ -64 -242 386 -48 -883 -304 -489 -483 210 183 -270 236 265 -104 602 47 -869 106 187 -247 -337 157 -814
4984h14P31Q11m60j46L23l51J9Q78q28n75J29q85K75Q42k94o4P46k71j85Q11m37
$$ -814 -83 728 268 122 445 94 113 991 163 -412 -283 -1168 -893 -51 -345 -409 337 66 -119 692 255
5005B55q21Q21M06p29K76J93j005N00O12n25j6l5j52K68N72j007k90N68k98M8
$$ 255 -566 255 661 -68 208 401 -604 -104 508 -17 -33 -68 -220 48 620 -387 -677 -109 -407 -359
5025c59Q62o16l60O69J21l0P64o93p63Q12l03p68M22J19n95N12P46p05J64K5k78
$$ -359 503 -113 -473 196 317 287 1051 358 -405 407 104 -664 -242 -123 -718 -206 540 -165 -1 24 -254
5046b54M25L78o11K6N63q77m2N73p61j74Q72J21j82O28p29k50O06n8p66Q00m61
$$ -254 171 549 -62 -36 527 -350 -392 181 -580 -754 118 239 57 685 -44 -294 312 254 -512 288 -173
5067a73o23Q26M46p35J72L75o33P48M45j074j20O40n16q2M52o42l61R44j92ML75
$$ -173 -796 30 476 -259 -87 288 -345 403 848 -226 -346 294 -222 -304 148 -494 -855 89 -103 -99 276
5088B76j47j17Q90k03l82L9n30n10N97J24p97K27L64l26P6N26q27M17N68k25M31
$$ 276 129 12 902 699 317 356 -174 -684 -87 37 -760 -533 -169 -495 -419 107 -720 -303 265 40 471
5109D71M00p55j22P05k53l67L09l51l74P95n58l49J46j88n12J046j41o01N87K41
$$ 471 871 116 -6 699 446 79 388 37 -337 458 -100 -449 -303 -491 -1003 43 -98 -699 -112 129
5129A29lO32q2n62K84M30l20j22J23r62J62Q51p29l98M95n18l30J109k60m62Q43
$$ 129 126 758 676 114 398 828 508 386 509 -453 -291 560 -169 -567 -72 -590 -920 189 -71 -533 310
5150C10m05J87M79j51o95N33n4O3M73n0q61K74l7p25J97N41p62L37P62o94k78
$$ 310 -95 92 571 420 -275 258 204 267 740 690 -171 103 66 -659 -462 79 -683 -346 416 -278 -556
5171e56N00n08M64J030l43l52M45n17m9N72q67o64O14N8l34Q75m35p65O40Q31
$$ -556 -56 -564 -100 930 587 235 680 163 114 686 -181 -845 -231 -173 -507 368 -67 -832 -192 639
5191F39n25J01M9p35N37O74o53j90N40q48L79R7n86j94O69l9K25N38o24n08Q55
$$ 639 114 215 264 -471 66 740 87 -103 437 -411 -32 65 -521 -715 -46 -85 140 678 54 -454 401
5212D01j59o09J016k73q02N41M18m70o6jn81L54O73o99L3l2k86K31R33l04l58
$$ 401 242 -367 649 376 -426 115 533 63 -3 -4 -585 -231 442 -257 -224 -256 -542 -311 622 318 -40
5233d0M25m47J72P01l40o46M25P8j51k06m19o30R78J69l64M21j90p77J002K55
$$ -40 385 -62 110 811 471 -175 250 328 177 -29 -448 -1078 -100 69 -295 126 -64 -841 161 416
5253D16j089N66M4l14J114N24o83l96K89l72q8O52q63p03N26j03o6O49l40n33
$$ 416 -673 -107 -63 -377 737 1261 578 182 471 99 11 663 -200 -903 -377 -480 -546 103 -237 -770
5273g70J005N4k62P30m03m63Q32J71q58l5k51n60O09N84q24J20M27n28N58M78
$$ -770 235 289 27 757 354 -109 723 894 36 1 -250 -810 -201 383 -441 -321 106 -422 136 614
5293F14p73k75N77j26J90J99p23k73Q56J85m90M65n66j41M49N97o97n3M6n71N38
$$ 614 -159 -434 143 17 207 406 -317 -590 266 451 -39 426 -140 -281 168 765 68 15 61 -510 28
5314B8K47q21M64M90o26L24M64o68n6N53l53m45P01m04m44P81j95l63K26k57o3
$$ 28 275 -546 -82 408 -218 106 570 -98 -154 399 46 -399 302 -102 -546 235 40 -323 -97 -354 -417
5335d17R91L44m49k55n1m51Q45Q2p91ML75r01N79R5o26j77N59j19M04j04m88M17
$$ -417 574 918 469 214 163 -288 557 639 -152 -148 227 -674 -95 0 -626 -803 -244 -363 41 -63 -551 -134
5357a34Q44k11p6L38n06l66P78k25p04L48j72m59L58k87m75N53J27k43Q80L53
$$ -134 710 499 423 761 255 -111 667 442 -262 86 -86 -545 -187 -474 -949 -396 -269 -512 368 721
5377G21p56l5N63l60M16M19j171K78J64l43L77j15m86l94Q69m95k61N46j26l7
$$ 721 -35 -70 493 133 549 968 -203 75 239 -104 273 158 -328 -722 147 -348 -609 -63 -189 -226
5397b26L45L33p72L73N24o59O80k12q14K45O30j72K46p14p94M36N91k83R2L04
$$ -226 119 452 -320 53 577 -82 598 386 -428 -183 447 275 521 -193 -987 -551 40 -243 -151 153
5417A53m58l20J014l59l27M35J2k8K69o1n30N17k71m98N42l8n55K42O73o24L57
$$ 153 -305 -625 389 30 -297 138 150 122 391 330 -200 317 46 -452 90 52 -503 -261 412 -212 145
5438A45K56o88M94M32o61j47M53n49K60O71m99m58L73m31J62M32o9n45M62J65
$$ 145 401 -287 207 639 -22 -169 284 -265 -5 666 167 -291 82 -349 -187 245 176 -369 93 258
5458B58k06N37n52m38O15L37p76J45K97k70K55j15k75l62P29m60J70L40o68K16
$$ 258 52 589 37 -401 214 551 -225 -80 217 -53 202 87 -188 -550 179 -281 -111 229 -439 -223
5478b23P53l60k52N15k94l84M30J06l29N38k96q09L90L31l61K94L17o86J9P77
$$ -223 530 170 -82 433 139 -245 185 291 -38 500 204 -605 -215 116 -245 49 366 -320 -301 476
5498D76o26P1N0m28O22K72o57J20N49k87K41j9m49j66Q22j96n79l9l7n56R68J62
$$ 476 -150 -79 -29 -457 165 437 -220 -100 449 162 403 384 -65 -231 591 395 -184 -223 -260 -816 152 314
5520C14o55L69j48l07O79J18n06J58M07o15N22J14r41L45O67n33P4K92l01o6J75
$$ 314 -341 28 -120 -427 252 370 -136 22 429 -186 336 450 -491 -146 521 -12 62 354 53 -13 162
5541A62j36k76L04n28k90Q50k26m49O83j98l34P57L65p99K35M4k40N89J36r90
$$ 162 26 -250 54 -474 -764 86 -140 -589 94 -104 -438 319 684 -115 120 164 -76 513 649 -341
5561c41L0N80l44J47N2o52p2J105n41k77J90m55J38J129l63l43J48J12j51J33
$$ -341 -311 269 -75 72 124 -528 -600 505 -36 -313 -123 -578 -440 689 326 -17 131 243 92 225
5581B25K52q46L80M4m2K75l35n71J03O30j34k44N54r07K91P31n85K44K25m99j79
$$ 225 477 -369 11 55 13 288 -47 -618 -515 115 -19 -263 291 -616 -325 406 -179 65 290 -209 -388
5602c88R70l9m74p4k57K33N68m58n10j4K38N3K78n8p71K56N49j80K33q2m96J38
$$ -388 582 543 69 -5 -262 -29 539 81 -429 -443 -205 -152 126 68 -703 -447 102 -78 155 73 -423 -285
5624b85J120n24l77P1m08M72L15k49n79K31O3J39J68j55l58L61J54j24K75j97
$$ -285 835 311 -66 5 -403 69 384 135 -444 -213 -150 -11 157 2 -356 5 159 35 310 113
5644A13l55K47K49l90M68K23p86Q2N36m15J60q3m24P0J092o72l12K69m03L05P05
$$ 113 -242 5 254 -136 332 555 -231 -149 387 -28 132 49 -375 -305 787 115 -197 72 -331 -26 679
5665F79n45n79J17L41j46N37m48r63Q19K07j8K53j54q22P23M41j55L4j28m21J71
$$ 679 134 -445 -328 13 -133 404 -44 -1007 -188 19 1 254 100 -722 1 442 287 321 193 -228 -57
5686e7N94l53m61L40l21L5M13m23l08L32j01jN92m30m52N99K07O5M77n23k77M59
$$ -57 537 184 -277 63 -258 -223 190 -233 -541 -209 -310 -311 281 -149 -601 -2 205 270 747 224 -53 406
5708D06K12l34l12j1p83M01Q35o58q9j77j67P38K43j50n71N86Q9N6K99p88k61
$$ 406 618 284 -28 -39 -822 -421 414 -244 -333 -510 -677 61 304 154 -417 169 258 314 613 -175 -436
5729d36N79N5l90P26o14p6L51M38q84k3K27j26J88J79k71q1K84m86K75N25l87
$$ -436 143 198 -192 534 -80 -156 195 633 -251 -274 -47 -173 15 194 -77 -158 126 -360 -85 440 53
5750E3j69P24o80K05N12p08m85M19ok83N88k75l25J95K75J3J52p9m12O09J07l86
$$ 53 -116 608 -72 133 645 -63 -548 -129 -135 -418 170 -105 -430 -235 40 53 205 126 -286 323 430 44
5772D4O3k70k63M12L42q22K28O37j00k25L85m46j38P20j12m60N2j23l00Q51m82
$$ 44 107 -163 -426 -14 328 -494 -266 371 271 46 431 -15 -153 567 455 -5 47 -76 -376 475 -7
5793gm28N30q1n57P58k72l99N62L42p66J95O31n04O9N72o17J28K74l27l74L47
$$ -7 -435 95 14 -543 215 -57 -456 106 448 -318 -123 508 4 73 645 28 156 430 103 -271 76
5814G6k41l52O61n85j7N96p2m78O86k21k47Q52n2o65N8J34j29R2J56q25MJ014
$$ 76 -165 -517 144 -441 -458 138 66 -412 274 53 -194 658 606 -59 -1 133 4 96 252 -573 -569 445
5836D45l84l1Ll54Q6Q65p95j94K90m27k9O29l30k20O68M92n72L8j4k84M84J71
$$ 445 61 30 33 -321 -235 630 -165 -359 -69 -496 -525 104 -226 -446 222 714 142 180 166 -118 366 537
5858E37p89K89J3p20M98J69l32L11K82m79J35P14n17o3O87r24j89N62j31l68K91
$$ 537 -252 37 50 -670 -172 -3 -335 -24 258 -221 -86 628 111 48 735 -189 -378 184 53 -315 -24
5879b4k27M8O48k76n97O40K50m59J17j97p52O12Q05n94k22J5k96N24N55n54j51
$$ -24 -251 -203 445 169 -428 212 462 3 120 -77 -829 -217 588 -6 -228 -213 -509 15 570 16 -135
5900a35L72m52m1R35q11j65M16J19l82J02q4k66P02j0p75L80J1m46P96On37J65
$$ -135 237 -215 -256 679 -132 -297 119 238 -144 -42 -126 -392 310 300 -475 -95 -84 -530 266 272 -265 -100
5922a00L88l90K16N67o05n8L34q75O40L16n70j91N55j71j7N51n60o30R31l6m29
$$ -100 288 -102 114 681 76 18 352 -523 117 433 -137 -328 227 56 39 590 30 -600 331 295 -134
5943a34N20q51m60O67P16o49R0N8o4O54J89r87K67N34n65L54J10q00l69R36n05
$$ -134 386 -465 -925 -258 458 -191 -101 -43 -107 547 736 -251 16 550 -15 339 449 -351 -720 216 -289
5964b89q1L48k95j78Q70J59l90L40l41l71L80J48j74L9l61k55M98M63n56rm3r1
$$ -289 -370 -22 -317 -495 375 534 144 484 143 -228 152 300 126 165 -196 -451 47 510 -46 -55 -98 -189
5986a89K90P50j104r2K51P4R1K96o57j70O19knK41n83MJ302p03o22J20k27k34
$$ -189 101 851 -253 -345 -94 -20 71 367 -290 -460 159 157 152 393 -190 -186 1116 413 -209 -89 -316 -550
6008e50Q97q6q52J40M87m96L38K90n32J98K89l78L42J95p14L97L08l33K06K53
$$ -550 347 261 -591 -451 36 -460 -122 168 -364 -166 123 -255 87 282 -432 -35 273 -60 146 399
6028C99m31n38P88j49k58N68l38p04O43J85o00J67qJ7P42J65j160r8M53nM24J74
$$ 399 -32 -570 218 69 -189 379 41 -663 -20 165 -435 -268 -276 -259 483 648 -512 -610 -157 -162 262 436
6050D36q79jR71j43n68L60m66nR81Lp53J5l08j05M08k0l07QL86l65L87J08l88
$$ 436 -443 -444 527 384 -184 176 -290 -295 686 689 -64 -49 -357 -462 -54 -74 -381 -373 13 -352 35 143 -245
6073b45L08L36l53P7K16k88l52N46k01n2M82q90J00O41m81M13L93p37m03J059
$$ -245 63 399 46 123 339 51 -301 245 44 -8 474 -416 -316 325 -156 257 650 -87 -490 569
6093E69l20q14k6K41k49R84J53q11K7M67k1J94m23m30M90Q64q00j45k27k76J4
$$ 569 249 -565 -591 -350 -599 385 538 -273 -246 221 200 394 -29 -459 31 895 95 -50 -277 -553 -539
6114e39Q35m68j64N81m79JN01k32k35Q41l97k83M18p0l08K71j9k72N09k72q44
$$ -539 296 -172 -336 245 -234 -233 268 36 -199 642 245 -38 380 310 2 273 254 -18 491 219 -625
6135f25J60K32k24O02J91p25J8O00k31K0J96o25P29Q15n97q88M72kj08L89m39
$$ -625 -465 -233 -457 145 336 -389 -371 229 -2 18 214 -411 318 1133 536 -352 120 118 10 399 -40
6156d0k19L70J45p55K88k8l65N21M35m07K12m9j49J63N21p36K94M45o97K13r7
$$ -40 -259 111 256 -499 -211 -239 -604 -83 352 -55 157 108 -41 122 643 -93 201 646 -51 162 65
6177F5j66j55O39m35m07N56k35k18M81m02m8M76L14l64m8M69o52L72P5p19L27
$$ 65 -101 -256 383 -52 -459 97 -138 -356 125 -277 -325 151 465 101 53 522 -130 242 317 -402 -75
6198g5O79p12%j30m20J02J020m89k56P72l13P3J57m65j47O57N9o93Q3j84m31P56
$$ -75 604 -108 -108 -238 -658 -556 464 -25 -281 491 178 251 408 -57 -204 453 512 -181 -98 -282 -713 43
6220D3%n61K05L77p9J75o5m35M64K80l65K97j94n22M57J28m63j68N81k9l98L68
$$ 43 43 -518 -313 64 -15 160 95 -340 124 404 39 336 142 -380 77 205 -258 -426 155 126 -272 96
6242I6l60j69M16k06k39N31J89p06P65O5o06N29J83m42k9J69k02J92J15q66N8
$$ 96 -264 -433 -17 -223 -462 69 258 -448 317 382 -224 305 488 46 17 186 -16 176 291 -575 -517
6263e17O04l56K05p1k76q9J104j29p99L23k9J96L71k06o11J26K46j23K43m8p08
$$ -517 87 -269 -64 -135 -411 -500 604 475 -324 -1 -30 166 537 331 -280 -154 92 -31 212 164 -544
6284e44J61N20n94L27J3l69N36O6k49K3M85m88L24N24l08k11K33k64n75Q64o35
$$ -544 -383 137 -457 -130 -117 -486 50 116 -133 -110 375 -113 211 735 427 216 449 185 -390 474 -161
6305a61m31N42j36j80N85O1q62L07M22r7L80j68n88K22N00l34K93k51n01K91P94
$$ -161 -592 -50 -186 -366 219 280 -582 -275 147 50 430 262 -326 -104 396 62 355 104 -397 -106 688
6326F88n84m52M32n25J90M75m77m15L67K28N3L08k58p89J050J82n33K10P0m55
$$ 688 104 -348 84 -441 -251 224 -253 -668 -301 -73 -20 288 30 -759 291 473 -60 150 220 -235
6346b35K64J78n60L5L28n10J08M73k49O5L77n29K84M67j69o86L17k08J33O01m29
$$ -235 29 207 -353 -318 10 -500 -392 81 -168 -103 274 -255 29 496 327 -359 -42 -250 -117 484 55
6367E5q65M31M66l05N94l32q05M84Q40m33o0Pl30N08J67m24m02L02j55N18O5p00
$$ 55 -810 -379 87 -218 376 44 -761 -277 563 130 70 77 -253 255 422 -2 -404 -102 -257 261 326 -374
6389c74l41O25j81J38K52k47m27N21M6j4K14P9k38L02J40m48K76m40l08L19K77
$$ -374 -715 -90 -271 -133 119 -128 -555 -34 12 -2 212 291 53 355 495 47 323 -117 -425 -106 171
6410A71l43j40K80m05K55P39n50l37M74k30L49L53o13m38N57K59J7K15o44o34
$$ 171 -172 -312 -32 -437 -182 557 7 -330 144 -86 263 616 3 -435 122 381 398 613 -31 -665
6430f65O66N89j010J64q6k17O45J03o26K61L69l97N33K36l96j69M73k08o19M36
$$ -665 1 590 -420 -256 -342 -559 86 189 -437 -176 193 -204 329 565 169 0 473 265 -354 82
6450H2m04M1K72k53j93N46O2n79O38P0n48M69o4o40M88J22k34L39l14j65N93M2
$$ 82 -322 -281 -9 -262 -455 91 153 -426 212 282 -266 203 139 -501 -13 109 -125 214 -100 -265 328 370
6472C70l04k12M27n69M49L74o41k64M52l1J69K80q45Q2O99m01k10L44m00J9J25
$$ 370 66 -146 281 -288 161 535 -106 -370 82 51 220 500 -345 -263 436 35 -175 169 -231 -212 -87
6493h7k9l73M74R4j34J81M18p02K94L59m88n1M47n41K22l8m30K10J92l43k57O52
$$ -87 -116 -489 -15 79 -55 126 544 -158 136 495 7 -44 403 -138 84 46 -384 -174 18 -325 -582 70
6515G0r2R7K53k00m21L52M45o27M91m55l69P63Pn99K89j38p0J14J65p33J43Q92
$$ 70 -22 75 328 128 -293 59 504 -123 368 -87 -456 307 314 -285 4 -134 -204 -90 75 -658 -515 377
6537C77k84K10m96l10M62N69j79l22M80r4l23J85o11o5O21m7k83J96n2m60M83
$$ 377 93 303 -193 -503 -41 528 349 27 507 413 90 275 -336 -401 220 173 -110 86 34 -426 57
6558E7L8p18N85L57k27J08k69j34L71N33p73L4O48m44l61K88o04J88O71M4m96
$$ 57 95 -623 -38 319 92 200 -69 -203 168 701 -72 -38 610 166 -195 93 -511 -323 348 392 -104
6579a04J39r1l90N47K26m78L29K01n28K68j71n31M68N20n36J2J25Q5J28M3n98
$$ -104 35 -56 -446 101 327 -151 178 379 -149 119 -52 -583 -115 405 -131 -119 6 91 219 262 -336
6600c36l4Q39k16j06K99n62k09M11J91j08M1l16k78K04p5m09N18L03l64L48pl74
$$ -336 -370 469 253 147 446 -116 -325 86 277 169 210 -106 -384 -180 -255 -664 -146 157 -207 141 134 -240
6622b40L92P3l57L94K34n37Q8J57n74j73L97J79m59L95P6p3j01j99L3N96J57k71
$$ -240 152 225 -132 262 496 -41 47 204 -370 -543 -146 33 -426 -31 45 -28 -129 -328 -295 301 458 187
6644A87rk52qL31L24r20J56L02JJ50l02n33K4Q37l72J74l1m50j02R06o41K1M74
$$ 187 178 -74 -82 249 573 -347 -191 111 112 262 -40 -573 -549 288 -84 90 59 -391 -493 413 -228 -207 267
6667B67l88K19K72j16o78N86j58n29O21m4p4j40m2q2N39O6k51j22K78m05K68J95
$$ 267 -121 98 370 254 -424 162 4 -525 96 52 -22 -162 -204 -286 253 319 68 -54 224 -181 87 282
6689B82n05N1L91J21j31J05r60J38Q32N2l30J05k74r7O79l78m04K36J01L57N5
$$ 282 -223 -172 219 340 209 314 -646 -508 324 376 46 151 -123 -220 459 81 -323 -87 14 371 426
6710D26k11q63J42L73k6J75K29n75j9O02k84R4nL12k48K77o7j66L04o21l29O49
$$ 426 215 -648 -506 -133 -159 16 245 -330 -349 253 -31 63 58 370 122 399 332 166 470 -151 -480 169
6732A69j15k77O1k27p5K30K13m97M78j91L87N06k47p40L88O46k49J09j29q28Q7
$$ 169 54 -223 -162 -389 -464 -234 -21 -518 -40 -231 156 662 415 -325 63 709 460 569 440 -388 -301
6753c01L66j85k98L3k06J49R76n51n55M94J31j9M37Qp67O35K8r3K2k82j60J98
$$ -301 65 -120 -418 -385 -591 -442 534 -17 -572 -78 53 34 471 479 -288 347 375 282 304 22 -138 60
6775F0K87o90k01O08m73j6N59j37r7K88k51R5N57k62K6J17n51L17K86k88m64O3
$$ 60 347 -343 -544 64 -409 -425 134 -3 -100 188 -63 32 589 327 353 470 -81 236 522 234 -230 -167
6797a67K1nN05m19n10M87L8j16L78j62l63N02L84l54o2Pl43k1N17m10m88L38J41
$$ -167 -146 -151 354 -65 -575 -88 -50 -166 212 50 -313 189 573 219 157 164 -179 -200 317 -93 -581 -243 -102
6820a02l9P6n5m63Q08k61k1N52q4n45M85R4l17J37L6p41O8K94j41q5J82n38K68
$$ -102 -141 -65 -120 -583 225 -36 -57 495 411 -134 351 445 128 265 301 -440 -372 -78 -219 -304 -122 -660 -392
6843c92O92l65L8K54l01L3Q15l44o15L33j73K1K66l41n82N85Q1k31R3k24j85N21
$$ -392 300 -65 -27 227 -74 -41 774 430 -185 148 -25 -4 262 -79 -661 -76 5 -226 -133 -357 -542 -21
6865b1N13n90j62N13m65N94L90o26k61P79m58l97M34n12k06M05k5m32K09q6m5
$$ -21 492 -98 -260 253 -212 382 772 146 -115 664 206 -191 243 -269 -475 -70 -95 -527 -318 -404 -449
6886d49M32j0j89O72m6m42K74M38n88K04r8m79J86N02l61o84N45n37N74J7k55
$$ -449 -17 -27 -216 456 410 -32 242 680 92 296 198 -281 -95 407 46 -638 -93 -630 -56 -39 -294
6907b94j29M28m2p3N98m85k21O50j23l28J48r6l16N01j59m74K56J41kQN9m06L52
$$ -294 -423 5 -37 -110 488 3 -218 432 309 -19 129 33 -283 218 59 -415 -159 -18 -20 -12 47 -359 -7
6930gL74m93r2M64l29k16N93l96J19K76l17j3K02j82k71N73j08l90K74L07n89
$$ -7 367 -126 -218 246 -83 -299 294 -102 17 293 -24 -37 165 -17 -288 285 177 -213 61 368 -221
6951b21K21J42k74J74R5j88J88j20k40K91P4l26K9L30l03J05R2l17K48L45J2m63
$$ -221 0 142 -132 42 137 -51 137 17 -223 68 142 -184 -155 175 -128 -23 69 -248 0 345 357 -106
6973a06K73k48J17K84n85j88N82p9m49K09J33l67N29J29m24j2M05k17J10P66q22
$$ -106 167 -81 36 320 -265 -453 129 50 -399 -190 -57 -424 105 234 -190 -202 203 -14 96 862 40
6994D0Q6L40m64r9J37k96q7N71m36m65N99m08L24K52ok75M60J91o88K06J09M6
$$ 40 126 466 2 -97 40 -256 -343 228 -208 -673 -74 -482 -158 94 88 -187 273 464 -224 -18 91 137
7016A37j03Rk22K18L41k86l09J39q8J72M31m74m74N42k23M72M8l82j98K95J18
$$ 137 34 43 -179 39 380 94 -215 -76 -164 8 439 -35 -509 33 -190 282 330 -52 -250 45 163
7037A63l56L01k63J0M42r3j68m4K28l28jL89m80J59J90j81j40L81l89o0K26o2
$$ 163 -193 108 -155 -145 297 204 36 -8 220 -108 -109 280 -200 -41 149 -32 -172 209 -180 -240 -14 -76
7059g6n6K81k31l22M07m13L54K82k25m46P10p6j82M18k63k67L62M07n84r1j03
$$ -76 -132 149 -82 -404 3 -410 -56 226 1 -445 265 189 7 425 162 -105 257 664 80 -11 -114
7080a14k75L87L25p68j55M46J2P5K86l04k33O30O9JO2m58j44N71k37l23j81K79
$$ -114 -389 -2 323 -445 -600 -154 -142 -67 219 -85 -318 312 381 382 444 -14 -158 413 176 -147 -328 -49
7102d9l73J32Q9k42K21O3k29M42J03l25J07R5j21K48P37q17j69N64n38R0J91m15
$$ -49 -422 -290 -201 -443 -222 -159 -388 54 157 -168 -61 34 -87 161 898 81 -88 476 -62 28 219 -196
7124a96n74P86O8m35L13n10J32O87L1m00Q9j19j37O44J5l85o1M49k20k03J98p11
$$ -196 -770 16 84 -351 -38 -548 -416 271 302 -98 -9 -128 -265 379 394 9 -52 397 177 -26 172 -539
7146e39O2O47k15j27K78n54J11N99l72J76L24k63k60L29J52n54M59l17k83L86
$$ -539 -477 170 -45 -172 106 -448 -337 262 -110 66 390 127 -133 196 348 -206 253 -64 -347 39
7166C9q6l41N8K15k92M22N67n22p7N96n04J40M59p70k87P67o05Q1q9m70K06M47
$$ 39 -47 -388 -330 -115 -407 15 582 60 -17 579 75 215 674 -96 -383 384 -221 -140 -229 -699 -493 -46
7188d6J43n01L16K74k20O65m66l27L01L60j58j52J22q28K91K14n39L66L08m50
$$ -46 97 -404 -88 186 -34 631 165 -162 139 499 341 189 311 -517 -226 -12 -551 -185 123 -327
7208c27J58L00k93k49P14n16K38O06j59l03K91o34PL69L1j49O1k09n31N82j63
$$ -327 -169 131 -162 -411 303 -213 25 631 472 169 460 -174 -167 202 233 84 145 -64 -595 -13 -176
7229a76m64J34O40k05J83N4o39K10P65j43L4m17l2J87K34k35m18K18k22k18M29
$$ -176 -640 -506 134 -71 112 166 -473 -263 502 359 393 -24 -56 131 365 130 -288 -70 -292 -510 -81
7250h1j49l91M84Q6r2M00j80m22Q82k06k41j2M72m97j39N39r02j5N05l15k16N37
$$ -81 -230 -621 -137 -51 -143 257 77 -345 537 331 90 78 550 53 -86 453 -449 -464 41 -274 -490 47
7272D7j17j22M78k77k77P53k76j06J93L9m54M14k16q12P67kj49J90k99l24L50
$$ 47 -70 -192 286 9 -268 485 209 103 296 335 -119 295 79 -733 34 32 -117 73 -226 -550 -200
7293b00M40l10R0N15k34N5l1m98J04M3j03n5K84m41m2M40j09k74M39l21j99M38
$$ -200 240 -70 20 535 301 356 325 -173 -69 -26 -129 -184 100 -341 -383 57 -52 -326 113 -208 -407 31
7315C1j57r7M42j79P3L62m7m55J75N5m52O5L48k84J36K3l62k2L68Ml81M86j9l8
$$ 31 -126 -223 219 40 113 475 428 -27 148 203 -249 -184 164 -120 16 39 -323 -345 23 27 -354 132 113 75
7339G5L72j45j98M41k23o3K35m35j56J42N9o33O3L1P9K74J02k32J32L83K8k94
$$ 75 447 302 104 545 322 259 494 59 -97 45 104 -529 -466 -435 -356 -82 20 -212 -80 303 331 37
7361C7M86m27J09N34p14j32J60j34r1M46k41m80L02J26j69L5K15k55J10K25j97
$$ 37 523 96 205 739 25 -107 53 -81 -172 274 33 -447 -145 -19 -188 -153 62 -193 -83 142 -55
7382e5K38k0k72N2L46K1j25K85n19n7J21j51R8K8k80l09P97l64k43N02K2j0O02
$$ -55 183 163 -109 -57 289 310 185 470 -49 -106 15 -136 -38 -10 -290 -599 198 -166 -409 93 115 105 707
7405G07k74p59M37J62m00M8J03m51K05K54k43jL08m45M58L51l21m38O23j75j37
$$ 707 433 -326 111 273 -127 -79 24 -427 -222 32 -211 -212 96 -349 109 460 139 -299 324 149 12
7426A2L51k19l70L57j30r6J32l25j30O26n70j73L67K67k80J88N51l55J38R1m44
$$ 12 363 144 -226 131 1 -95 37 -288 -418 208 -362 -535 -168 99 -181 7 558 203 341 432 -12
7447a2J17L75k10l89R0o50M84M09m70j96K61MJ51N73n76m09N53L37k65J34R5o86
$$ -12 105 480 270 -119 -29 -679 -195 214 -256 -452 -191 -187 -36 537 -39 -448 105 442 177 311 406 -280
7469b80M42J08p10M57l9l93L51M03o37j45K26j71L37L10l31p2L77r8o5K83j67
$$ -280 162 270 -440 17 -22 -415 -64 339 -298 -443 -217 -388 -51 259 -72 -144 233 135 70 353 186
7490A86k53L38j56j58Kk06l27M58L05k19P7l11j70N28J69l46J00J57j85K3P13
$$ 186 -67 271 115 -43 -41 -247 -574 -116 189 -30 47 -264 -434 94 263 -83 17 174 -11 12 725
7511G25p93n9J19K8L6J97j77o15N12J72j78K75l12k92P98j18m31M85k98m65M20
$$ 725 -68 -127 -8 20 56 253 76 -539 -27 145 -33 242 -70 -362 436 318 -113 372 74 -391 29
7532B9K49m19N8P6l12L07L63j86m48N74m98L01M34m75Nn3j58K37J94j89n26L62
$$ 29 278 -141 -83 -7 -319 -12 351 165 -283 291 -207 94 528 53 58 5 -153 84 278 89 -437 -75
7554g5L21l55K73j50k06J55L16j19M8J3m67L50J22l41j96L80P3j7K83n71k48O49
$$ -75 246 -109 164 14 -192 -37 279 160 208 221 -246 104 226 -115 -311 69 142 125 408 -163 -411 238
7576B38k81j03N85l92k88L03p7k28N60j92k20N19j73j72N6o5k71L10Qj74J43n2
$$ 238 -43 -146 439 47 -241 62 -15 -243 317 125 -95 424 251 79 135 70 -201 109 117 -57 86 34
7598C4j44j39M82m77k43N16j7m8L18n54J31L81r3m8K5k17k80M19Kj03l2K24k23
$$ 34 -110 -249 233 -244 -487 29 12 -36 282 -272 -141 240 147 99 124 -93 -373 46 48 -55 -87 137 -86
7621h6M13l08l51J03L88r7k1Q6m55K26J11j56J76J17j87J43J76l10j10K80l00
$$ -86 327 19 -332 -229 159 62 41 127 -328 -102 9 -147 29 146 -41 102 278 -32 -142 138 -162
7642a62j38M71p0j20Q7j0m52K75J93K9O5j95l12L97L4k47rK05K10r2j58k05p2
$$ -162 -300 171 101 -19 68 58 -394 -119 74 103 168 -27 -339 58 92 -155 -164 41 251 159 1 -204 -276
7665b76O72n03J87L03n62J62M1k9l63J49K32j55M03j21l85K75j95j27K14L57n60
$$ -276 396 -107 80 383 -179 -17 24 -5 -368 -219 13 -142 261 140 -245 30 -165 -292 -78 279 -281
7686b81L71K71q27L16M41K5k06N6l52J64L28n00k02L55j08j02L09j12k20R0J48
$$ -281 90 361 -466 -150 291 316 110 166 -186 -22 306 -194 -396 -41 -149 -251 58 -54 -274 -184 -36
7707c6q2L91L6l14J77P6n06K78Q2k63J96P4l24k03N38o01J34O13m03N78L0n77
$$ -36 -118 273 309 -5 172 248 -258 20 102 -161 35 109 -215 -418 120 -481 -347 266 -137 441 471 -106
7729a06k76L16P6j55L54j04k52M11l20n33L10J91K69N2J16m79j36N05n51L70N2
$$ -106 -382 -66 10 -145 209 105 -147 264 -56 -589 -279 -88 181 233 349 -130 -266 239 -312 58 110
7750A10R3q9K8l81J27K6p7L81Q9k86l24M68k53m16N38L43l98J57J0m00O39j39
$$ 110 203 114 142 -239 -112 -86 -163 218 307 21 -303 165 -88 -504 34 377 -21 136 146 -254 385 246
7772B46l45l0M88j38k40L47p38J29K34j37J96M92o09L2K75k36m1N10k82J54L21
$$ 246 -99 -129 359 221 -19 328 -410 -281 -47 -184 12 504 -105 -73 202 -34 -75 435 153 307 628
7793F28l61j89m1q0k14M57K5p77M06J27k88N4K18k29K21J58RM3J39n8L5L13l97
$$ 628 267 78 37 -43 -257 200 225 -552 -146 -19 -307 -253 -35 -264 -43 115 124 167 306 248 283 596 199
7816A99J21k36j81m69M19j77o8L23j20j83M93j88m07M05J26j81O09j42n18N9J10
$$ 199 320 84 -97 -566 -147 -324 -392 -69 -189 -372 121 -67 -474 -69 57 -124 485 343 -175 -116 -6
7837fJ47O8j73j97O0M00k31j31j08k73K83L08m0k48N6k54K07M12k63J6O5J18j43
$$ -6 141 209 36 -161 -101 299 68 -63 -171 -444 -161 147 107 -141 -85 -339 -132 280 17 33 98 216 73
7860G3R9j22m14N05K49o96M29m6n10K22L59j42J13O5m56n1L88J30m5jl88j9Q22
$$ 73 172 50 -364 141 390 -306 123 77 -433 -211 148 6 119 184 -272 -323 65 195 150 149 -239 -258 564
7883E64l81l09L45o70K20O07k77l66K53J22l83M85j66l38N02r4j18K82k94k38
$$ 564 183 -126 219 -451 -231 376 99 -267 -14 108 -275 210 44 -294 208 114 -4 278 -16 -254
7903b54rL89n21L38m2j47J48L71k04j64J73o2J24M55n05k19J63j33J1L55j56p74
$$ -254 -263 126 -395 -57 -99 -246 -98 273 69 -95 78 16 140 595 90 -129 34 -99 -88 267 111 -663
7925f63M89P2m2J67j5j73P2L95l13j74L84l89p2O28n32J38N0j74O4L50m31q9L26
$$ -663 -174 -102 -144 23 8 -165 -93 302 -11 -185 199 -190 -262 366 -166 -28 22 -152 -88 262 -169 -258 68
7948F8m7k04L59k39k19M25oj43J81K0k98K77P2j90n3L78p48J34N03m03J2J72l02
$$ 68 21 -183 176 -63 -282 143 137 -6 175 195 -103 174 246 56 3 381 -367 -233 270 -133 -121 51 -251
7971b51o2L11j96k57N50j69j09L62n8k67M00K9m07M21j96k79O2L13k68J31j68
$$ -251 -313 -2 -198 -455 95 -74 -183 179 121 -146 254 283 -124 297 101 -178 -116 197 -71 60 -108
7992a08J4K86R4n68L31J17l56J55K01l84K4L14k40L2M15j55m49M13k03L7M77l50
$$ -108 -94 192 286 -282 49 166 -190 -35 166 -218 -194 120 -120 -88 327 172 -277 136 -67 -30 447 97
8014I7k82K83J67n96M53rl02RK87l54L51O3l74n4M26k25j75N02l14k34O49k65
$$ 97 -185 98 265 -331 122 113 -189 -180 107 -247 104 167 -207 -261 165 -60 -235 267 -47 -281 368 103
8036A03j43P9k3O0M12k04n78N25Qj38o4j39n8R3m9l27K17L07k59L97j46j24oK74
$$ 103 -40 39 16 76 488 284 -294 231 239 101 37 -102 -160 -67 -116 -443 -226 81 -178 219 73 -51 -57 217
8060B17j51J34j27j27n6K91l43J61J16p0m20M51r8n02N34k47j51O02k43j13K48
$$ 217 66 200 73 -54 -110 181 -162 -1 115 45 -375 76 -22 -524 10 -237 -388 214 -29 -142 106
8081A06L06l56j36N14n84j00N79q34J33K23k86L45J58l63J20K27p8o2R4j31j1
$$ 106 412 56 -80 434 -150 -250 329 -505 -372 -149 -435 -90 68 -295 -175 52 -26 -88 6 -125 -136
8102a36N52k07l33K72m9l41L31p7l0J74Q2l47J03K68n06L23j82j04oL23k12L1
$$ -136 416 209 -124 148 99 -242 89 12 -18 156 238 -109 -6 262 -244 79 -103 -207 -213 110 -102 -71
8124g1K18JQ0L65o29k6J69Q9j58J75k99j5Q9K01l28J50L25k90J44r2k85N4M06
$$ -71 147 148 228 593 -36 -62 107 196 38 213 -86 -101 -12 189 -139 11 336 46 190 98 -187 -133 273
8147B73j85L0J78m52J9P5k17J16M7O3K1J79ol86O32k79k70N90j62m72J77j26j61
$$ 273 88 118 296 -156 -137 -62 -279 -163 -116 -53 -32 147 141 -245 387 108 -162 428 266 -206 -29 -155 -316
8170c16M36j0l4N4N0m74J45L29r4l85N25j68k54N88m16j58L52l0j96R7M1
$$ -316 120 110 76 130 180 -294 -149 180 86 -299 226 58 -196 392 -24 -182 170 140 -56 41 82
8191H2
$$ Imaginary data points
##PAGE= N=2
##DATA TABLE= (X++(I..I)), XYDATA
0@%%%%%%%%%qJ6j6J6k4L2m0M8n6P2q6J02j20J41j67J96k29K67l10L56m10M70n36
$$ 0 0 0 0 0 0 0 0 0 0 -8 8 -8 8 -16 16 -24 24 -32 40 -46 56 -64 77 -90 106 -123 144 -166 190 -220 250 -286
32b86O10o90P78q78R89j109J239j383J542j715J903k108K332k574K844l139L460
$$ -286 324 -366 412 -466 523 -586 653 -730 812 -903 1000 -1108 1224 -1350 1494 -1645 1815
49A815l812M197m625N097n622O210o872P624q484R479j0649J2050j3759J5895
$$ 1815 -1997 2200 -2425 2672 -2950 3260 -3612 4012 -4472 5007 -5642 6408 -7351 8544
63H544j8657K2395k7762L6169n1341Q7369l35054l37589M42852K87108K27707
$$ 8544 -10113 12282 -15480 20689 -30652 56717 -278337 -615926 -173074 114034 341741
74C41741J12359K5598j46946p9878l8682n2184j67360j42975k7339M7835l6689
$$ 341741 454100 479698 332752 252874 214192 162008 -5352 -148327 -175666 -127831 -164520
85a64520k075O3174o873q8913P593O8026Q4105J15294Q5153j5847l6692m9711
$$ -164520 -166595 -103421 -110294 -199207 -191614 -123588 -39483 75811 160964 145117 108425 58714
97E8714k8154P4130R5729l6308q6852n3193m8355j3030N9781L0072r9077k11814
$$ 58714 30560 104690 200419 164111 77259 24066 -24289 -37319 22462 52534 -46543 -258357
109b58357j56408O2381J87354J23665R6015Q4605k8751j8352J36577Q2341j10491
$$ -258357 -414765 -352384 -165030 -41365 54650 139255 110504 92152 228729 311070 200579
120B00579j08106j2624k8309n9107m0728l4584o1041q5202l2117N9397O8686P7663
$$ 200579 92473 79849 51540 -7567 -48295 -82879 -143920 -229122 -261239 -201842 -133156 -55493
132e5493J52931Q9027r3783r7657K1306M9082N6477N0454n5992j20958n8604P272
$$ -55493 97438 186465 92682 -4975 16331 65413 121890 172344 116352 -4606 -63210 -55938
144e5938N1473O6339j4425q4766n5746j8547J2653N3362J7483m7121l6568J2838
$$ -55938 -4465 61874 47449 -37317 -93063 -111610 -98957 -45595 -28112 -75233 -111801 -98963
156i8963Q0666J26026M2871n2680j4367J7990r803K9996L2057q4062j17210m7760
$$ -98963 -18297 107729 150600 97920 83553 101543 91740 121736 153793 69731 -47479 -95239
168i5239n0158o3233J3025Q3952P6780J3969l3801J0888P0576O6948P2906M4905
$$ -95239 -145397 -208630 -195605 -111653 -34873 -20904 -54705 -43817 26759 93707 166613 211518
180B11518r0813j24978J3175N4088k9170m1241l0881n6405j5886M8412M5764J3594
$$ 211518 120705 -4273 8902 62990 33820 -7421 -38302 -94707 -110593 -62181 -16417 -2823
192b823k5690m4219M004L9071K9898N1173L6096m8129n1808J8768M1224L8643
$$ -2823 -28513 -72732 -68728 -29657 241 51414 87510 39381 -12427 6341 47565 86208
204H6208K3076l8711n3699k3773m4283l4810L0212J3075l2465L862J5432r724
$$ 86208 109284 70573 16874 -6899 -51182 -85992 -55780 -42705 -75170 -71308 -55876 -65600
216f5600L7002Q3894M0658k7062n3465j0901N6233L1244l6664l3814l9670o4483
$$ -65600 -28598 55296 95954 68892 15427 4526 60759 92003 55339 21525 -18145 -82628
228h2628J3764P8014j345m9786N627J7127m542J6913K9358J4743j1969m8373l0146
$$ -82628 -68864 9150 7805 -41981 -36354 -19227 -23769 -6856 22502 37245 25276 -23097 -53243
241e3243K5737K9123K7781M5778q041o0726j0066K4723o836j2512j4180k5765
$$ -53243 -27506 1617 29398 75176 67135 6409 -3657 21066 14230 1718 -12462 -38227
253c8227J547J1302j2688J1617K2655k6356k1633K6690K9015M1259O3516J2862
$$ -38227 -36680 -25378 -38066 -26449 -3794 -30150 -51783 -25093 3922 45181 108697 121559
265A21559m9052n4593l6961k720Q778l5271l2102K3128J4202J088M4883K7496
$$ 121559 72507 17914 -19047 -21767 -12989 -48260 -80362 -57234 -43032 -41944 2939 30435
277C0435k8009m573J9539n738J0952M1847K0756j6481n3344o1833q282J7703j2219
$$ 30435 2426 -2147 17392 11654 22606 64453 85209 68728 15384 -46449 -54731 -37028 -49247
290d9247Q29K2237J912K2793N2670o78m1419j2943o746j2042N363N541J5010M0437
$$ -49247 -48418 -26181 -24269 -1476 51194 50516 9097 -3846 -10592 -22634 -17271 -11730 3280 43717
304D3717P229l4980j6711q700q861K5135J5062l0464j5468J3604N903L532j0941
$$ 43717 50946 15966 -745 -9445 -18306 6829 21891 -8573 -24041 -10437 -4534 -1002 -11943
317a1943l2164j848K2740O496K8649M8860N51k0309J118j8026k8403J109o012
$$ -11943 -44107 -45955 -23215 -16719 11930 60790 61341 41032 42150 24124 -4279 -3170 -9182
330i182k5262p921P214K0923K5930j5207k6766K1121J8165j4008O562J1710p215
$$ -9182 -34444 -42365 -35151 -14228 11702 -3505 -30271 -9150 9015 -4993 1569 13279 6064
343F064K2991L3650k2270m3877j9515P09J8837M282l4139r391L2055J7512Q646
$$ 6064 29055 62705 40435 -3442 -22957 -22248 -3411 871 -33268 -42659 -10604 6908 15554
356A5554P397l0622k7649K4292K1566m640M179M762P126J8348j1293l5131q010
$$ 15554 22951 -7671 -35320 -11028 10538 5898 10077 14839 21965 40313 29020 -6111 -14121
369a4121m055j4738J8258K1937j3204n146R953n574j368M344j5027o307J3457
$$ -14121 -18176 -32914 -14656 7281 -5923 -11069 -1116 -6690 -8058 -3714 -18741 -25048 -11591
382a1591J8277M2545L3227l5303m8184j169J935o231K613k1575k9482J6212L2128
$$ -11591 6686 49231 82458 47155 -1029 -2198 -263 -6494 -3881 -25456 -54938 -38726 -6598
395f598N350j0917k2269j213M2414K6858j0053R750K0654j178M13j8979o0836
$$ -6598 -1248 -12165 -34434 -35647 6767 33625 23572 33322 53976 52798 53211 34232 -26604
408b6604l4052K0181K2174Q607o239k3311N473L8007J2670n054j261k1226q825
$$ -26604 -60656 -40475 -18301 -9694 -15933 -39244 -33771 4236 16906 11852 10591 -10635 -19460
421a9460L7291K9320n441j3110k8947l0760O439K0119J1047J1338j2541k4767
$$ -19460 17831 47151 41710 28600 -347 -31107 -24668 -4549 6498 17836 5295 -19472
433a9472J8682K2679k3297k2375k259r262O161K2249K122L289K4876J9230L939
$$ -19472 -790 21889 -1408 -23783 -26042 -35304 -29143 -6894 -4772 -1483 23393 42623 46562
446D6562j8398l9946J395M8580J0397l6368l3067l0757q956L6854K0126k8767
$$ 46562 28164 -11782 -10387 38193 48590 12222 -20845 -51602 -60558 -23704 -3578 -32345
458c2345k2192J1529M2236O2911K5198k7425k5008j8751k7568Q42J5924j2463
$$ -32345 -54537 -43008 -772 62139 87337 59912 34904 16153 -11415 -10573 5351 -7112
470g112j3783K98q702r47J2427M54P266J5458m869M887K7743j065j7182Q506p186
$$ -7112 -20895 -20597 -29299 -30246 -17819 -17365 -10099 5359 490 5377 33120 32055 14873 23379 16193
485A6193l7772j6366J2616K7705L8016P696l3004l0142j3125R199L3782m192n9695
$$ 16193 -21579 -37945 -25329 2376 40392 48088 15084 -15058 -28183 -18984 14798 10606 -49089
498d9089k6166L3795L9991L4344J3441k9874k3685J5730J9301J3084Q522j6684
$$ -49089 -75255 -41460 -1469 32875 46316 16442 -7243 8487 27788 40872 49394 32710
510C2710j9982p510k7840l2779K349J0319L332J2156P061P662L2981K3395o077
$$ 32710 12728 5218 -22622 -55401 -53052 -42733 -39401 -27245 -20184 -12522 20459 43854 37777
523C7777p468j8938k5592J7098L6179K492j0842k0428m5575k3832K6555L5488
$$ 37777 30309 11371 -14221 2877 39056 41548 30706 10278 -35297 -59129 -32574 2914
535B914J8650p862l6861j8990K0273J9060Q684k702k7813o841M4992L3212k942
$$ 2914 21564 13702 -23159 -42149 -21876 -2816 5868 3166 -24647 -31488 13504 46716 43774
548D3774k995j2489k4476n18N576r817L341O349k0859k7849j9862m574L2521L6844
$$ 43774 40779 28290 3814 3296 8872 -945 2396 8745 -12114 -39963 -59825 -64399 -31878 4966
562D966j50q301N373J0661L3171L2964k0418m5160k4238j5695M092L3211J2532
$$ 4966 4816 -3485 1888 12549 45720 78684 58266 13106 -11132 -26827 -22735 10476 23008
575B3008j9720j9278k4032j7301K2414L2007O182k300n069R68K5506J7903j3074
$$ 23008 3288 -15990 -40022 -57323 -34909 -2902 3280 980 -4089 -3121 22385 40288 27214
588B7214j8236j9146j4343K7159L9199L27p658n632m3093m7030l407J7978K2289
$$ 27214 8978 -10168 -24511 2648 41847 42174 34516 28884 -14209 -61239 -64646 -46668 -24379
601b4379K4003j749j7338K102J9851L1215K2718k1572l2818Q952K0448M667M362
$$ -24379 -376 -2125 -19463 -17361 2490 33705 56423 34851 2033 10985 31433 36100 40462
614D0462k0429n0365k8241j997L845K6782L2282M90p371K26j653J8356L1385m175
$$ 40462 20033 -30332 -58573 -60570 -56725 -29943 2339 2829 -4542 -4316 -5969 12387 43772 39597
628C9597l1356j9457N37K5724L1351m980k6206k1564k9227j0538L0432J7089j1593
$$ 39597 8241 -11216 -10679 15045 46396 41416 15210 -6354 -35581 -46119 -15687 1402 -10191
641a0191K69o230k5480L815L3274J9234K878o464o025J9233K7822P923o339k7714
$$ -10191 -9922 -16152 -41632 -37817 -4543 14691 17569 11105 5080 24313 52135 60058 53719 26005
655B6005m8174j8294J4575K643L348J1074j5831k3206N798J7018K5945L6173K132
$$ 26005 -22169 -40463 -25888 -23245 -19897 -8823 -24654 -47860 -42062 -25044 901 37074 39206
668C9206k9549p464J5460K0054J6824j6675m6699k6489L474J8565K4471K84k6731
$$ 39206 9657 2193 17653 37707 54531 37856 -8843 -35332 -31858 -13293 11178 11462 -15269
681a5269o954M762q842R945K3400m587j0555N277l634M176K9765J6569j1630j9718
$$ -15269 -22223 -17461 -26303 -16358 7042 2455 -8100 -2823 -6457 -2281 27484 44053 32423 12705
695A2705k0539k525K2536J1296p927j4083l1084k6098J3085K0499Q425J6056J186
$$ 12705 -7834 -10359 12177 23473 15546 1463 -29621 -55719 -42634 -22135 -13710 2346 3532
708C532j9692J1414L9338J7114l102j8867l6903j4285K1428J7580k988k0186l0390
$$ 3532 -16160 -4746 34592 51706 48604 29737 -7166 -21451 -23 17557 14569 -5617 -36007
721c6007p149J8021O533M870J8227L756j561R118n597j0183J6628J0567j7584
$$ -36007 -43156 -25135 -18602 -13732 4495 8251 6690 15808 10211 28 16656 27223 9639
734I639j4212p079O08K7884K1678k2395l4775j8497j738K2674K3219k638j0907
$$ 9639 -4573 -11652 -11044 16840 38518 16123 -18652 -37149 -38887 -16213 7006 4368 -6539
747f539q858q801J9569L0754k604j3229K585o452o27K7705Q565k9591k7746j5421
$$ -6539 -15397 -24198 -4629 26125 23521 10292 12877 6425 5798 33503 42068 12477 -15269 -30690
761c0690m414J1341N981j160J0751O690k509O857N51q231J7116K1769j2469j7274
$$ -30690 -35104 -23763 -17782 -18942 -8191 -1501 -4010 2847 3398 -4833 12283 34052 21583 4309
775D309j905L606J6630P955l3963l5994J739J7682K2864J8769j6084l0095m16
$$ 4309 2404 6010 22640 30595 -3368 -39362 -37623 -19941 2923 21692 5608 -24487 -24903
788b4903J7252J3901O803j0799r108J2150O738K00J3092l063k5373m149P574j0197
$$ -24903 -7651 6250 13053 2254 -6854 5296 12034 12234 25326 22263 -3110 -7259 315 -9882
802i882j012J1788l023o327J241m876k024N414L114J4349J3520j5727j5101J2144
$$ -9882 -10894 894 -2129 -8456 -7215 -12091 -14115 -8701 -5587 8762 22282 6555 -8546 3598
816C598J2154N614K148k4923k9132Q949K3488Q832j390j9841j9461J9004K8127
$$ 3598 15752 21366 23514 -1409 -30541 -21592 1896 10728 9338 -10503 -29964 -10960 17167
829A7167j714j2416q871p361J1487J5487m510n934R67l171M719J212k0342n563
$$ 17167 15453 3037 -5834 -13195 -1708 13779 9269 3335 4302 1131 5850 7062 -13280 -18843
843a8843J9570L409o159M665n743q235J2703Q710p964m605m413n75J7121J3037
$$ -18843 727 4136 -2023 2642 -3101 -11336 1367 10077 2113 -2492 -6905 -7480 9641 22678
857B2678n120p304j7767j8938J1505J9545l638n381q62m939J3296J9043j2282
$$ 22678 17558 10254 -7513 -26451 -14946 4599 961 -4420 -5282 -10221 3075 22118 9836
870I836k0158j277L789J0900J3374r143j2551Q870N451o239n835j2245k089K3649
$$ 9836 -10322 -11599 -7810 3090 16464 7321 -5230 3640 9091 2852 -2983 -15228 -17317 6332
884F332J2083j1850q826p380m480J5641O569j7520l782J2685N414J0016P798j5716
$$ 6332 18415 6565 -2261 -9641 -14121 1520 8089 -9431 -13213 -528 4886 14902 22700 6984
898F984j4489O25j620M022R420m077l188M621n089n98J0207p584j1684J1475Q187
$$ 6984 -7505 -6880 -8500 -4478 4942 865 -2323 2298 -2791 -3389 6818 -766 -12450 -975 7212
913G212m191L885k961j1965M790P207q924n423R60M563J9449R501j8813j4115
$$ 7212 3021 6906 3945 -8020 -3230 3977 -4947 -10370 -9410 -4847 14602 24103 5290 -8825
927h825K808K047Q244N540j6332p576J4723P140K11Q74j4152r187J3069L037q062
$$ -8825 -6017 -3970 4274 9814 -6518 -14094 629 7769 7980 8854 -5298 -14485 -1416 1621 -6441
942f441O021M318m388L120k897r823M696O897N16P771K155q983N465M987j4187
$$ -6441 -420 3898 -490 2630 -267 -10090 -5394 1503 2019 9790 11945 2962 8427 13414 -773
957g73m865L905j2046o028J2737O089M657O463j0609j1617O350O506O026P775
$$ -773 -5638 -1733 -13779 -19807 -7070 -981 3676 10139 -470 -12087 -5737 769 6795 14570
971A4570r208j0076J0874M707q380j404n600q856R180Q160n831M925P263p923
$$ 14570 5362 -4714 6160 10867 2487 1083 -4517 -13373 -4193 3967 -1864 3061 10324 2401
985B401n746m357j1330N742J7233m54m709K093j675O032J2008o202r644L087l205
$$ 2401 -3345 -7702 -19032 -13290 3943 3489 -1220 873 -802 5230 17238 11036 1392 4479 1274
1000A274k132R161n025j2146L459m197j2868Q671J5035L225M601k650j2702K325
$$ 1274 -858 8303 3278 -8868 -5409 -9606 -22474 -13803 1232 4457 9058 6408 -6294 -3969
1014c969J1353K379L612l680j5137N48P407q495k554R187m279k210J2239K125
$$ -3969 7384 9763 13375 9695 -5442 -4894 2513 -5982 -8536 651 -3628 -5838 6401 8526
1028H526l026K489j1487j6606K549P562J0094J7715rj5117j579M77p403K493L750
$$ 8526 5500 7989 -3498 -20104 -17555 -9993 101 17816 17807 2690 1111 1588 -5815 -3322 428
1043D28k384Q199M942j0589l29M677j1136o533k197j1066O784L1986J6908m746
$$ 428 -1956 6243 11185 596 267 4944 -6192 -12725 -14922 -25988 -19204 12782 29690 24944
1057B4944r645j6013p947O412j735n076N369K439N821J7251m748k5953j1551n463
$$ 24944 15299 -714 -8661 -2249 -3984 -9060 -3691 -1252 4569 21820 17072 -8881 -20432 -25895
1071b5895p154J5984K6530J2615J0257j321k2357j6810o149o149R187K0046M726
$$ -25895 -33049 -17065 9465 22080 32337 31016 8659 -8151 -14300 -20449 -11262 8784 13510
1084A3510J832J492j5393j3457L51o710m813Q965N781J1901K5113L34k5601j3643
$$ 13510 15342 16834 1441 -12016 -11665 -18375 -23188 -14223 -8442 3459 28572 28906 3305 -10338
1098a0338l280K783J8693J0209j1839n102N951M703M654j0228k4823p484O273
$$ -10338 -13618 -10835 7858 18067 6228 1126 7077 11780 16434 6206 -18617 -26101 -19828
1111a9828k69Q841J5160P37M029Q898j3660j7220L342P281J0947J8109K02j3335
$$ -19828 -20097 -11256 3904 4641 8670 17568 3908 -13312 -9970 -2689 8258 26367 26569 13234
1125A3234m603p567j2447l414o634o065J3793J6323P030P427r537k6667l518J7584
$$ 13234 8631 1064 -11383 -14797 -21431 -27496 -13703 2620 9650 17077 7540 -19127 -22645 -5061
1139e061J1718J3582O439j8384j2083P462J520l276k006r149j49J2618j773j0513
$$ -5061 6657 20239 26678 8294 -3789 3673 5193 1917 -89 -9238 -9387 3231 1458 -9055
1153i055K84J050M543J1141o981j5138N408R732M485J0331j707j3396P564J3370
$$ -9055 -8771 -7721 -3178 7963 982 -14156 -8748 984 5469 15800 14093 697 8261 21631
1167B1631j1562j6657r175o866J1091K0316L261j0005j4078j6516N945K2628Q951
$$ 21631 10069 -6588 -15763 -22629 -11538 8778 12039 2034 -12044 -28560 -22615 13 8964
1180H964N918J0907p005j0884L995n478j6550k161K663J944R947j113j3646n95
$$ 8964 14882 25789 18784 7900 11895 6417 -10133 -12294 -9631 -7687 2260 1147 -12499 -13094
1194a3094O789O95P207M164n325O921J1698m870j0070q955p312J4174J7297j3191
$$ -13094 -6305 -5610 1597 5761 436 7357 19055 14185 4115 -4840 -12152 2022 19319 6128
1208F128j9357j864p5J0255K2343o54k1375q925J088K599O438q61o74J1928O101
$$ 6128 -13229 -15093 -15168 -4913 17430 16776 -4599 -13524 -12436 -9837 -3399 -4260 -4934 6994 13095
1223A3095k712M907m571j5372L694R848n279q68J892j0204n234R14q923k994J0070
$$ 13095 10383 15290 10719 -4653 -959 8889 3610 2742 4634 -5570 -10804 -9890 -18813 -21807 -11737
1238a1737M964Q987J3993m678j2654K938R120J0517P207j5413k2651m569L98L985
$$ -11737 -6773 2214 16207 11529 -1125 1813 10933 21450 28657 13244 -9407 -13976 -13578 -9593
1252i593J3784k655j6797N142J3572n202o772j037k331R066J6529L985o64l625
$$ -9593 4191 1536 -15261 -10119 3453 -1749 -8521 -9558 -11889 -2823 13706 17691 17027 13402
1266A3402j1279l175O75j0959q76J6783O255j898p26j3738j3648O654M978j487
$$ 13402 2123 -1052 -377 -11336 -12212 4571 10826 8928 8202 -5536 -19184 -12530 -7552 -9039
1280i039O792J420m188J2186J3316l053o206j0204j3887J835J0383M525N653k418
$$ -9039 -2247 -827 -5015 7171 20487 17434 11228 1024 -12863 -11028 -645 3880 9533 7115
1294G115j2804J294P771j1275r546N316O85O454J9326M468o762l50n764j0347
$$ 7115 -5689 -4395 3376 -7899 -17445 -12129 -11444 -4990 14336 18804 12042 11692 5928 -4419
1308d419l243m292J006J7613R978o486o087j0524j0751O504O055o481L815R124
$$ -4419 -7662 -11954 -10948 6665 16643 10157 4070 -6454 -17205 -10701 -4646 -11127 -7312 1812
1322A812J751J0114R602j2717j2642l86m814p38J0912L492j518p39p306m489M208
$$ 1812 3563 13677 23279 10562 -2080 -2466 -7280 -8018 2894 6386 4868 4129 -3177 -7666 -3458
1337c458m490m974P732Q66j440J3023O595p283J400qj0965k349L520r58P950P115
$$ -3458 -7948 -12922 -5190 -4324 -5764 7259 13854 6571 7971 7963 -3002 -5351 -1831 -2789 5161 12276
1353A2276p782o402R6m685j49K326q233k751R272N404P842R227p229q748N108
$$ 12276 4494 -1908 -1812 -6497 -6646 -4320 -12553 -15304 -6032 -628 7214 16441 9212 464 5572
1368E572l531p519Q764N593o029m00j625q743K46K226l464J357J110p67J2973
$$ 5572 2041 -5478 3286 8879 2850 2450 825 -7918 -7672 -5446 -8910 -7553 -6443 -7210 5763
1383E763J1493o333m248o81j0116l045O976k880j453P204k713l926N387j399l334
$$ 5763 17256 10923 6675 5994 -4122 -7167 -191 -3071 -4524 2680 -33 -3959 1428 29 -3305
1398c305N509o97n631N585N244l27K789n408j1557j059j59k413J1374R487o079
$$ -3305 2204 1507 -4124 1461 6705 6378 9167 3759 -7798 -8857 -9016 -11429 -55 9432 3353
1413C353j127L718o666p32O186o935p452L502L531O617P425o937q951K377o00
$$ 3353 2226 5944 -722 -1454 4732 -2203 -9655 -6153 -2622 3995 11420 4483 -4468 -2091 -2691
1428b691K127Q876j877n241N573j194j1412k361k385o022P229O563m017N043J1896
$$ -2691 -564 8312 6435 1194 6767 5573 -5839 -8200 -10585 -16607 -9378 -2815 -6832 -1789 10107
1443A0107L636K454j612j2923n613N253J942L531P14j2675p725M634k345k478
$$ 10107 13743 16197 14585 1662 -3951 1302 3244 6775 7489 -5186 -12911 -8277 -10622 -13100
1457a3100N818k124j713J5374J1923M85M07p993j3362P5L476k794L307L427j903
$$ -13100 -7282 -9406 -11119 4255 16178 16663 17070 9077 -4285 -4210 -734 -3528 -221 3206 1303
1472A303M036P05j1608n480K197j145O411P046n367O71J1859m69q429n649r341
$$ 1303 5339 6044 -5564 -11044 -8847 -9992 -3581 3465 -1902 -1231 10628 10159 1730 -3919 -13260
1487a3260p35J7665J3712K86k569r703q434K591l744j1979j052K505L701J5561
$$ -13260 -13995 3670 17382 17668 15099 5396 -3038 -447 -4191 -16170 -17222 -14717 -11016 4545
1501D545J0177q622n355j028n150M793R344j176J647O492n001q003o441j3050
$$ 4545 14722 6100 745 -283 -5433 -640 8704 7528 9175 15667 10666 2663 -3778 -16828
1515a6828o411Q936N939L029O996P66K392J0993j845j3815n162j404K146J5590
$$ -16828 -23239 -14303 -8364 -5335 1661 2427 4819 15812 13967 152 -5010 -6414 -4268 11322
1529A1322O765j3479r461l64j238N103K079r195k341P738M463M747k26j2007m314
$$ 11322 18087 4608 -4853 -5217 -6455 -1352 727 -8468 -10809 -3071 1392 6139 5913 -6094 -10408
1544a0408Q537J767O51O641j286q71R005p25r915k015j859l653L029l801j2671
$$ -10408 -1871 -104 547 7188 5902 5031 14036 13311 3396 1381 -478 -4131 -1102 -4903 -17574
1559a7574k207M761N513J1019M543o557K370R368L337L811j921j5771n904P856
$$ -17574 -19781 -15020 -9507 1512 6055 -502 1868 11236 14573 18384 16463 692 -5212 2644
1573B644P84k775k922j2170o141R716O867n49L506K389L424R276p00j0652m419
$$ 2644 3428 653 -2269 -14439 -20580 -10864 -3997 -4546 -1040 1349 4773 14049 13349 2697 -1722
1588a722l793k911Q149L562n663N405R814l086m710n871j2321MJ2172M568p84
$$ -1722 -5515 -8426 -277 3285 -2378 3027 12841 9755 5045 -826 -13147 -13143 -971 3597 2813
1603B813k631j0306k760Q581J164p78N212K737O405J3362k84j2995q793j0543
$$ 2813 182 -10124 -12884 -4303 -3139 -3917 1295 4032 10437 23799 23515 10520 1727 -8816
1617h816p726O683K779o657K932P514J619M608L470n569J59O015J214J435n20
$$ -8816 -16542 -9859 -7080 -13737 -10805 -3291 -1672 2936 6406 837 996 7011 8225 9660 9140
1632I140p511N97M669r061j0392j358k527N000J6210N116n295o42k001l495L212
$$ 9140 1629 2226 6895 -2166 -12558 -13916 -16443 -11443 4767 9883 4588 3946 1945 -1550 1662
1647A662k569p093M556Q475L885N695l086j3350n203J422m32N160K828o867n69
$$ 1662 -907 -8000 -3444 5031 8916 14611 11525 -1825 -7028 -5606 -6038 -878 1950 -4917 -5486
1662e486M413n370k893N367n77K213J1804M050k845P12k567k871O78p566q672
$$ -5486 -1073 -6443 -9336 -3969 -4546 -2333 9471 13521 10676 11388 8821 5950 6628 -938 -9610
1677i610J013J80p66O402J273o768L521O636k243J63P98m509N717J0718L02k810
$$ -9610 -8597 -8417 -9183 -2781 -1508 -8276 -4755 1881 -362 -199 599 -3910 1807 12525 12827 10017
1693A0017k500j0103n171O009J746L07L425k160k637K40q204p416L648J899K684
$$ 10017 7517 -2586 -7757 -1748 -2 305 3730 1570 -1067 -827 -9031 -16447 -12799 -10900 -8216
1708h216J3160Q547l591J168R06p426k298J083j676K082J394o801l503j960p074
$$ -8216 4944 13491 9900 11068 11974 4548 2250 3333 1657 3739 5133 -1668 -5171 -7131 -14205
1723a4205J035O882q81O64P865K858L443O926l465p104n2m488m389O339K484n601
$$ -14205 -13170 -6288 -7169 -6505 1360 4218 7661 14587 11122 4018 3966 -522 -4911 1428 3912 -1689
1739a689J439J271m775r47q04m315J945K645J475R706N804o122k510Q59o814M79
$$ -1689 -250 1021 -3754 -4701 -5505 -9820 -7875 -5230 -3755 5951 11755 5633 3123 3982 -2832 -2353
1755b353R349J048l144P98n382n417j8l348k627M664L39Q7P754K280k542K853
$$ -2353 6996 8044 4900 5698 316 -5101 -5119 -8467 -11094 -6430 -6091 -6004 1750 4030 1488 4341
1771D341J086l179M008J684l659K316m06r140k025L001m075L08M844m116m910
$$ 4341 5427 2248 6256 7940 4281 6597 6191 -2949 -4974 -1973 -6048 -5740 -896 -5012 -9922
1786i922K832L005M699N215l179k529L330m54Q62P082l389q543K967L001l723
$$ -9922 -7090 -4085 614 5829 2650 121 3451 2997 3859 10941 7552 -991 1976 4977 1254
1801A254J268k382q589m88J566k744K438L384k196L533O894K46J462M123j572
$$ 1254 2522 140 -8449 -8937 -7371 -10115 -7677 -4293 -6489 -2956 3938 4184 5646 9769 8197
1816H197K18J297o337k997M073l097l827J545p914r288N265P722J625M117M87
$$ 8197 8415 9712 3375 378 4451 1354 -2473 -928 -8842 -18130 -12865 -5143 -3518 599 1086
1831A086j949N613N155j289p45n455o518N690O624m401l512k483o433J378O352
$$ 1086 -863 4750 9905 8616 7871 2416 -4102 1588 8212 3811 299 -2184 -8617 -7239 -887
1846h87k253j323M387q00L39M944k754n057L828K282j945J511j646j138N612J01
$$ -887 -3140 -4463 -76 -876 -537 4407 1653 -3404 424 2706 761 2272 626 -512 5100 5201
1862E201m029k25m178n212P685O223p097m331P24j123M732Q323k831m547R47L17
$$ 5201 1172 947 -3231 -8443 -758 5465 -1632 -5963 -5239 -6362 -1630 6693 3862 -685 262 579
1878E79N841N541o975q228N41l59J28L658m429n778M278K589K72M788q6l132O955
$$ 579 6420 11961 4986 -3242 -2701 -3060 -2932 726 -3703 -9481 -5203 -2614 -2342 2446 2360 -772 6183
1895F183M623o925l039J753j809J097J236o547l528O35R64N864L021r286k913
$$ 6183 10806 3881 842 2595 786 1883 3119 -3428 -6956 -6321 -5357 507 3528 -5758 -8671
1910h671P881K463K345M382n546p785M199N386J028Q37n576o409M757M434k351
$$ -8671 -790 1673 4018 8400 2854 -4931 -732 4654 5682 6519 943 -5466 -709 3725 1374
1925A374k19l957o168K726M482k532K39K135m80O175M700o377j487O825j44k333
$$ 1374 1155 -2802 -8970 -6244 -1762 -4294 -4055 -1920 -2400 3775 8475 2098 611 7436 7292 4959
1941D959P87o871o048N022K877k937l908o201O62J1486N833r85J266l415m582
$$ 4959 5746 -1125 -7173 -2151 726 -2211 -6119 -12320 -11658 -172 5661 4676 5942 2527 -2055
1956b055O635M757o911l554j046l338M361O051m502l165L09k957K141O027j859
$$ -2055 4580 9337 2426 -1128 -2174 -5512 -1151 4900 398 -2767 -2458 -5415 -3274 2753 894
1971H94k145L038o43j490R44m411p60Q063J769k170K278j951l741M833Q14j0900
$$ 894 -1251 1787 1144 -346 598 -3813 -4573 3490 5259 3089 5367 3416 -325 4508 5322 -5578
1987e578n947O65K745P749M371n410k240K228K111P057M887n825k886L183k120
$$ -5578 -11525 -10860 -8115 -366 4005 -1405 -3645 -1417 694 7751 12638 6813 3927 7110 4990
2002D990k861j088p888o893L458J607P88P363K380k310L039R80l408K185K200
$$ 4990 2129 1041 -6847 -13740 -10282 -8675 -7887 -524 1856 -454 2585 3565 157 2342 4542
2017D542n74L767l74n862q48O6l762K677K079p628j541O556Q17j384o61p495l767
$$ 4542 3968 7735 7361 1499 651 717 -3045 -368 1711 -5917 -7458 -902 -85 -1469 -2130 -9625 -13392
2034a3392P834O690M605M791k938k569N000Q1n032j087l702m819K822l00o299
$$ -13392 -5558 1132 5737 10528 7590 5021 10021 10102 5070 3983 281 -4538 -1716 -2016 -8315
2049h315n04n9m861L425O998J948O534Q188j621m018j123n073k415K788j984l74
$$ -8315 -8819 -8878 -13739 -10314 -3316 -1368 5166 13354 11733 7715 6592 1519 -896 1892 -92 -466
2065d66K901l398k474L726k664n321K131k57n75Q210M826m142k118k611l181N228
$$ -466 2435 -963 -3437 289 -2375 -7696 -5565 -5822 -6397 1813 6639 2497 379 -2232 -5413 -185
2081a85N700q73J991K645k348q4j398r570n358k81l397J487P256J158J757N722
$$ -185 5515 4642 6633 9278 6930 6846 5448 -4122 -9480 -9761 -13158 -11671 -4415 -3257 -1500 4222
2097D222j962l297O084L142L09L524j505n802j270l374p198k503k310k768N684
$$ 4222 2260 -1037 5047 8189 8498 12022 10517 4715 3445 71 -7127 -9630 -11940 -14708 -9024
2112i024O615O09N534L821m425j702J936k903J872N537k777m302J737j696r62
$$ -9024 -2409 -1800 3734 7555 3130 1428 3364 461 2333 7870 5093 791 2528 832 -130
2127a30J646l688m657K897Q91N61L844k947n563J261m4j374O888O553k15L564
$$ -130 1516 -2172 -6829 -3932 -3041 -2480 1364 -1583 -7146 -5885 -5929 -7303 -415 6138 5923 9487
2143I487L023l170M40Q3p979n924j469m053j29K838k984q41M547K76J850O720
$$ 9487 12510 9340 9780 9863 1884 -4040 -5509 -9562 -9691 -6853 -9837 -10678 -6131 -5855 -4005 2715
2159B715K446L328P076k202p138m66j444m794p26l178p214L062P036K069J711
$$ 2715 5161 8489 15565 13363 6225 5759 4315 -479 -1205 -4383 -11597 -8535 -1499 570 2281
2174B281k427o488M82M269q71K497L171l363J467N247k005j703K753k384j729
$$ 2281 -146 -6634 -6152 -1883 -2754 -257 2914 -449 1018 6265 4260 2557 5310 2926 1197
2189A197M773M30l314l35n771q486n41j5j274O007O325K802O300J585l775K420
$$ 1197 5970 6400 3086 2751 -3020 -11506 -12047 -12062 -13336 -7329 -1004 1798 8098 9683 5908 8328
2205H328K847l571k526k766q458J15O224k425n396j930k317M126J0230K068j550
$$ 8328 11175 7604 5078 2312 -6146 -6031 193 -2232 -7628 -9558 -11875 -7749 2481 4549 2999
2220B999J675m03P28L573m253p683r3M59r94N915K831l475J629k38o868j373K132
$$ 2999 4674 4271 4999 8572 4319 -3364 -3457 -2998 -3992 1923 4754 1279 2908 2670 -4198 -5571 -3439
2237c439j815K286M143l039j395K643p80L195O344j187k111J444k835n96L363
$$ -3439 -5254 -2968 1175 -1864 -3259 -616 -1396 1799 8143 6956 4845 6289 3454 2858 6221
2252F221n182r978j308J218J784O097j82p223K068P875N210N462n89p664k148
$$ 6221 1039 -8939 -10247 -9029 -7245 -1148 -1330 -8553 -6485 1390 6600 12062 11473 3809 1661
2267A661J426k854j044N61l137K141L536m836l028L281j018n72L648k446k483
$$ 1661 3087 233 -811 -250 -3387 -1246 2290 -2546 -5574 -2293 -3311 -3883 -235 -2681 -5164
2282e164O218L376j209J60l470l712M757M021J8K150k557o837R68L421l087j946
$$ -5164 1054 4430 3221 3381 -89 -3801 956 4977 4995 7145 4588 -2249 -1281 2140 -947 -2893
2298b893l430p451K634J0641M693J890M80o071j935N091q38l013J667j55O83L382
$$ -2893 -6323 -13774 -11140 -499 4194 6084 6564 493 -1442 3649 2811 -202 1465 1310 1993 5375
2314E375l578n358J153q44k204K925N10j169P853M504o940n910k055j335N724
$$ 5375 1797 -3561 -2408 -3252 -5456 -2531 -2021 -3190 4663 9167 2227 -3683 -5738 -7073 -1349
2329a349O854k005j750O6j672K269M345m883n728j19k384J759P262N47l612K0
$$ -1349 5505 3500 1750 1816 144 2413 6758 1875 -3853 -3972 -6356 -4597 2665 3212 -400 -380
2345c80k747n86O679K287m820P61J418k368J858L58m688j082P16l092J216K483
$$ -380 -3127 -3713 2966 5253 433 1194 2612 244 2102 2460 -2228 -3310 -2594 -5686 -4470 -1987
2361a987P84O198M512p180n406K496Q15K012L920n200o338K784L180R56J214n243
$$ -1987 -1203 4995 9507 2327 -3079 -583 232 2244 6164 964 -5374 -2590 590 1546 2760 -2483
2377b483n706L536L507J207M197L81m867J56N23j608M120K385m841o00J670l102
$$ -2483 -8189 -4653 -1146 61 4258 4639 -228 -72 451 -1157 2963 5348 507 -93 1577 -1525
2393a525J385L376m780l828K059j76l70M300J155N81K106m288k757M210K122j326
$$ -1525 -140 3236 -1544 -5372 -3313 -3489 -3859 441 1596 2177 4283 -5 -2762 1448 3570 2244
2409B244J195m106n929N226N896j616k212l640m811M373O124o69L19N09m475p99
$$ 2244 3439 -667 -6596 -1370 4526 2910 698 -2942 -7753 -3380 2744 2075 2394 2903 -1572 -2371
2425b371K793j814J58L307j364r93K766r25j04K623n195o093L389K674m16M080
$$ -2371 422 -1392 -1234 2073 709 -284 2482 1557 1453 4076 -1119 -7212 -3823 -1149 -1565 2515
2441B515P08n020L70J227p66K919K608j984J71q48m797K753M738m284m969j347
$$ 2515 3223 -1797 -1427 -200 -966 1953 4561 2577 2748 1900 -2897 -144 4594 310 -4659 -6006
2457f006k541L281P906K51j299J932j612j244L351k919m145K580J715n93K909
$$ -6006 -8547 -5266 2640 2891 1592 3524 1912 668 4019 1100 -3045 -465 1250 657 3566
2472C566J057l007q56m712o103L528N710P70L271O49o174j054L869j913o05L680
$$ 3566 4623 1616 760 -3952 -10055 -6527 -817 -47 3224 3873 -2301 -3355 514 -1399 -2004 1676
2488A676J419J571L256k003k083M03n584o982m64k75K462P964K138l701Q05J018
$$ 1676 3095 4666 7922 5919 3836 4239 -1345 -8327 -8791 -9066 -6604 1360 3498 -203 602 1620
2504A620j280K743p89n554K396N051p74O99K50n785m040N21j186L557O590J168
$$ 1620 340 3083 2294 -3260 -864 4187 3413 4112 4362 -1423 -5463 -4942 -6128 -2571 4019 5187
2520E187K63l29o292l696K736k919l631M788L478J531M798O63l545Q79o30m301
$$ 5187 5450 5121 -1171 -4867 -2131 -5050 -8681 -3893 -415 1116 5914 6577 3032 3911 3281 -1020
2536a020K24J177j175K705r1o925j985K911R74L288J570l716K462P202R1k549
$$ -1020 -796 381 -794 1911 1820 -5105 -7090 -4179 -3205 83 1653 -2063 399 7601 7692 5143
2552E143j034o593m392L532O24j944L232J517j74K383K5j613L188l77m084R96
$$ 5143 4109 -2484 -6876 -3344 -2720 -4664 -1432 85 -89 2294 2319 706 3894 3517 -567 429
2568D29K82l220J112J142l803P05L482j290L73L177q86J72K207l472k077L810
$$ 429 711 -2509 -1397 -255 -4058 -3353 129 -1161 -788 2389 1503 1675 3882 410 -1667 2143
2584B143k91k886j534l602N4P756L128j606K24k037k263M066j80o889j150L182
$$ 2143 1852 -1034 -2568 -6170 -6116 1640 4768 3162 3386 1349 -914 3152 2972 -3917 -5067 -1885
2600a885j59J558J853k766L63L135j520L89J528k409L39L113l346k429K363r37
$$ -1885 -2044 -486 1367 -1399 -1036 2099 579 968 2496 87 426 3539 193 -2236 127 -810
2616h10k043K498q19j348M383O58j516K978j88n427j793m54j442M479L429k420
$$ -810 -2853 -355 -1174 -2522 1861 2519 1003 3981 3793 -1634 -3427 -3881 -5323 -844 2585 165
2632A65k32J556m92K728J06o492p69N793J27q15j19n431k048M775J390k109J839
$$ 165 -67 1489 997 3725 3831 -2661 -3430 2363 2490 1675 1556 -3875 -5923 -1148 242 -1867 -28
2649b8O49R27L901j707n088P99J93k249J612o79k505L893L233k046J63J355l368
$$ -28 621 1548 5449 3742 -1346 -547 -354 -2603 -991 -1670 -4175 -282 2951 905 1068 2423 -945
2666i45M24L056k143k75K475k224k079J739j454j130R48k266O83O483J837k420
$$ -945 -521 2535 392 117 2592 368 -1711 28 -1426 -2556 -1608 -3874 -3191 3292 5129 2709
2682B709r80l561k936M700J991l888N70K817N19K766j94o523j268K310o34J065
$$ 2709 1729 -1832 -4768 -68 1923 -1965 -1395 1422 1941 4707 4513 -2010 -3278 -968 -1602 -537
2698e37R60j623J519K927l652l494Q86k55J797M640r58k158L600O20l260J26k216
$$ -537 423 -1200 319 3246 -406 -3900 -3014 -3269 -1472 3168 2210 52 3652 4272 1012 1138 -1078
2715a078l365K629K798K76K919M03m884k573j524k157L095L370k333N36M387O25
$$ -1078 -4443 -1814 984 1260 4179 4582 -302 -2875 -4399 -6556 -3461 -91 -2424 -1888 2499 3124
2731C124J001R16n386l228M696J588l03J489j824k628J130l388n121J382K545
$$ 3124 4125 5041 -345 -3573 1123 2711 2408 3897 2073 -555 575 -2813 -7934 -6552 -4007
2746d007J850M892L01k703K822K461m036k381j684l005L974N740j081j205L41
$$ -4007 -2157 2735 3036 333 3155 5616 1580 -801 -2485 -5490 -1516 4224 3143 1938 2279
2761B279l584j492K109m63M66K789j735k249K255o19r46Q81k730k753N577M285
$$ 2279 -1305 -2797 -688 -1151 -685 2104 369 -1880 375 -244 -1190 -309 -3039 -5792 -215 4070
2777D070j001J106l58l379O91R99m194p66J167j564Q12J145j911K636N304j753
$$ 4070 3069 4175 3817 438 1129 2128 -2066 -2832 -1665 -3229 -2417 -1272 -3183 -547 4757 3004
2793C004l050j65j509K158M850k063m252M34j137r24K609q35l048K589J917j448
$$ 3004 -46 -211 -1720 438 5288 3225 -1027 -593 -1730 -2654 -45 -880 -3928 -1339 578 -870
2809h70K084J895j199l00j906l209K636L543j497m0m9l209J147M431k639l537
$$ -870 1214 3109 1910 1610 -296 -3505 -869 2674 1177 1137 1088 -2121 -974 3457 818 -2719
2825b719Q67j317m03K674L49K46M026r41l254J97K82M51L781l61n080j95J365
$$ -2719 -1852 -3169 -3572 -898 -549 -303 3723 2782 -472 -275 7 458 4239 3878 -1202 -1397 -32
2842c2j018J416j763m498J986M789j50J479K671l337k446M57j966O6L772l64j335
$$ -32 -1050 366 -1397 -5895 -3909 880 730 2209 4880 1543 -903 -446 -2412 -2346 1426 1062 -273
2859b73J54j572J361N140j500m535J007N01r40J984K6l660L85M72k419J132J927
$$ -273 -119 -1691 -330 4810 3310 -1225 -218 283 -657 1327 1353 -2307 -1922 -1450 -3869 -2737 -810
2876h10P07L001J482m364m71L530M89j259k105m845j58M315Q23m65J331k868j293
$$ -810 -103 2898 4380 16 -455 3075 3564 2305 200 -4645 -4803 -488 335 -130 1201 -1667 -2960
2893b960M115J231j884K095K57l241n84M24l11K031j037m544J191K581M16K782
$$ -2960 1155 2386 502 2597 2854 -387 -971 -547 -858 1173 136 -4408 -3217 -636 -220 2562
2909B562J354m130j169K580j272n60K303p82j71J598l373k097L787J192k215q95
$$ 2562 3916 -214 -1383 1197 -75 -635 1668 886 715 2313 -1060 -3157 630 1822 -393 -1288
2925a288k347q79N089K367k690j554j542k12N875K733l392m6J384l058o05J708
$$ -1288 -3635 -4514 575 2942 252 -1302 -2844 -3056 2819 5552 2160 2114 3498 440 -165 1543
2941A543k303j344M39k544p72L136J335J739J775l308j520L521P44j495J196q80
$$ 1543 -760 -2104 -1665 -4209 -4981 -1845 -510 1229 3004 -304 -1824 1697 2441 946 2142 1262
2957A262j902J245o58k367K729J635k766m7N86o65L430K195m657m477n70J096
$$ 1262 -640 605 -53 -2420 309 1944 -822 -869 -283 -948 2482 4677 20 -4457 -5027 -3931
2973c931L938K212l619j492L309O44J541L121k233k591J563j827l546R85M53j083
$$ -3931 7 2219 -1400 -2892 417 1061 2602 5723 3490 899 2462 635 -2911 -1926 -1473 -2556
2989b556J002j086j868L223L383j016O67J82j398K101K050k694j156p21m401j279
$$ -2556 -1554 -2640 -4508 -1285 2098 1082 1749 1931 533 2634 4684 1990 834 113 -4288 -5567
3005e567K463M20K434M559k445l558J740K068N09O71l982l168K847K100m7R48
$$ -5567 -3104 -2684 -250 4309 1864 -1694 46 2114 2623 3294 -688 -3856 -1009 1091 1044 1992
3021A992l007k938K738K102k067R95K130n71M32p56m140N71L116j334n08J879
$$ 1992 -1015 -3953 -1215 887 -1180 -185 1945 1374 1806 1050 -3090 -2519 597 -737 -1245 634
3037F34m27J954L834j960l904j528k001m65L042m72p1K886j331l612K374K585
$$ 634 207 2161 5995 4035 131 -1397 -3398 -3863 -821 -1293 -1364 1522 191 -3421 -1047 1538
3053A538m29J009m9k585J669K479j841k229k373k773K850M065j170K2K554p91
$$ 1538 1109 2118 2069 -516 1153 3632 1791 -438 -2811 -5584 -2734 1331 161 183 2737 1946
3069A946l60J12l357j354K857k05j709J026q29N33M150K86l914Q2K320L11J654
$$ 1946 1586 1698 -1659 -3013 -156 -361 -2070 -1044 -1873 -1340 2810 3096 -818 -736 1584 1895 3549
3086C549p70l401o39m52k395J278K109j311J586K357j683L61L688j144k836o86
$$ 3549 2779 -622 -1261 -1713 -4108 -2830 -721 -2032 -446 1911 228 589 4277 3133 297 -389
3102c89j638M02K395j210k986J713O76J43K648k78j507L196J345k735j336r55
$$ -389 -2027 -1625 770 -440 -3426 -1713 -1037 -894 1754 1476 -31 3165 4510 1775 439 -516
3118e16j786K155M58m561n73M001P01J108J347k941l74K678k89o33O14j926N24
$$ -516 -2302 -147 311 -4250 -4823 -822 -121 987 2334 -607 -981 1697 1408 775 1389 -537 -13
3135a3J661j687j790K594K67k263R14N22j130J768L42l361m52J194m92J970P82
$$ -13 1648 -39 -1829 765 1032 -1231 -317 205 -925 843 1185 -2176 -2628 -1434 -1926 44 826
3152H26j669J706K757j569j572L60j118J003J723l556j987K690L40o42J167k705
$$ 826 -843 863 3620 2051 479 839 -279 724 2447 -1109 -3096 -406 -66 -708 459 -2246
3168b246j539M070K027j619k01j23p89J632p49k591J147J552o99J246J206k521
$$ -2246 -3785 285 2312 693 492 369 -420 1212 463 -2128 -981 571 -128 1118 2324 -197
3184a97R55J786l142j575J498o81L38J857k118m29K478m47j928J265R27P29K221
$$ -197 758 2544 -598 -2173 -675 -1356 -1018 839 -1279 -1708 770 323 -1605 -340 587 1316 3537
3201C537j637k691Q97O32j421K94j258j888L159L275k409j053P56r32J324J389
$$ 3537 1900 -791 106 738 -683 -389 -1647 -3535 -376 2899 490 -563 193 -739 585 1974
3217A974k541o20K509r4l16j44l167j74L008m25j699J866J28n29J983p33k583
$$ 1974 -567 -1187 1322 1228 912 768 -2399 -2573 435 10 -1689 177 305 -224 1759 1026 -1557
3234a557J729R04j729J266J096j166R93k09l405p4J909NJ05k70k022J600L133
$$ -1557 172 1076 -653 613 1709 543 1536 1327 -2078 -2152 -243 -238 -133 -403 -2425 -825 2308
3251B308j922j639J215n35O93K767j405k503K153O04j619m36r58q95L366O69k762
$$ 2308 386 -1253 -38 -573 120 2887 1482 -1021 1132 1736 117 -319 -1277 -2172 1194 1863 -899
3268h99j60J98k85J837R5l221O80K665p99L80J287j638n7J867j871n12K809k78
$$ -899 -1059 -861 -1146 691 786 -2435 -1755 910 111 491 1778 140 83 1950 79 -433 2376 2098
3286B098j875m1j865r82K796l4j941P51J81Q6K276l69k925J605K232j668P1N37
$$ 2098 223 182 -1683 -2665 131 97 -1844 -1093 -912 -826 1450 1081 -1844 -239 1993 325 396 933
3304I33j403J484J363l049j833J562R23J528Q31l359j357K247m3m29J063k015
$$ 933 -470 1014 2377 -672 -2505 -943 -20 1508 2339 -1020 -2377 -130 -173 -602 461 -1554
3320a554p25L256O24j868J622M78k107M44l47j390K263J331k446p27K87l77J905
$$ -1554 -2279 977 1601 -267 1355 1833 -274 170 -177 -1567 696 2027 -419 -1146 -859 -1236 669
3337F69Q26k360J52J927n56n21J249j975m51K107j740k749K789J550J3P59j591
$$ 669 1495 -865 -713 1214 658 137 1386 -589 -1040 1067 -673 -3422 -633 917 930 1689 98
3354I8k411K725J966j062o42j754j240K518J415k369J26J078j622Q64J528j655
$$ 98 -2313 412 2378 1316 674 -1080 -2320 198 1613 -756 -630 448 -1174 -310 1218 -437
3370d37R93J851j921k188Q47l59R3J955j678j489K307J166k50J378j109j523J701
$$ -437 556 2407 486 -1702 -855 -1214 -1121 834 -844 -2333 -26 1140 890 2268 1159 -364 1337
3387A337k98k601J363J523j870K21o19k460J717L832j007j641K53r61J761K141
$$ 1337 1039 -1562 -199 1324 -546 -325 -944 -3404 -1687 2145 1138 -503 -250 -1211 550 2691
3403B691k242k030Q89n56O54K343r85p71K333n78k546Q86qq52J115m96l512R52
$$ 2691 449 -1581 -692 -1248 -594 1749 764 -7 2326 1748 -798 88 80 -772 343 -153 -3665 -2713
3421b713K105m0P51J62j689J945K063j071K42J201j787p48K42k629j36K904q31
$$ -2713 -608 -648 103 265 -1424 521 2584 1513 1755 2956 1169 421 663 -1966 -2102 802 -29
3438b9j961P60n4P91K957j555l457Q95J061K73J799p70j396J402J159j352N66
$$ -29 -1990 -1230 -1284 -493 2464 909 -2548 -1653 -592 -319 1480 710 -686 716 1875 523 1089
3455A089Q40j522J087J56l609n86K671p50j425M87j469J61L109O14LJ799j52n73
$$ 1089 1929 407 1494 1650 -1959 -2545 126 -624 -2049 -1562 -3031 -2870 239 853 856 2655 2503 1930
3473A930J255k163k230J390l35k707O33J076J75K450l52m049K03K453J073J537
$$ 1930 3185 1022 -1208 182 -153 -2860 -2227 -1151 -976 1474 1122 -2927 -2724 -271 802 2339
3489B339Q22k946j72J759j259j671J28n47P92J682j093r24K437n88j784L75j412
$$ 2339 3161 215 43 1802 543 -1128 -1000 -1547 -755 927 -166 -1090 1347 759 -1025 -650 -2062
3506b062j404L633J869j774O11N39k50J131j43k885M02M64k004Q00J631j066j1
$$ -2062 -3466 167 2036 262 873 1412 1162 2293 2150 -735 -333 131 -1873 -1073 558 -508 -519
3523e19N5l238o12L119J738J443J600j436r11K279j071k939l06Rl75J869r3k506
$$ -519 -464 -3702 -4314 -1195 543 1986 3586 2150 1239 3518 2447 -492 -798 -789 -1164 705 612 -1894
3541a894O28L84j341O46k25p87L470K577k659j042J130m35Q34J792k201j681J367
$$ -1894 -1266 -882 -2223 -1577 -1802 -2589 881 3458 799 -243 887 452 1286 3078 877 -804 563
3558E63n05k36J130j071j583R03j228j799K078J410p1J361n24p57K539J226k973
$$ 563 58 -178 952 -119 -1702 -799 -2027 -3826 -1748 -338 -409 952 428 -329 2210 3436 463
3575D63j23O12q39Q16J016l020r67J406p36o76M00P2J910K498k220j739J160N21
$$ 463 340 952 113 929 1945 -1075 -2042 -636 -1372 -2048 -1648 -1576 334 2832 612 -1127 33 554
3593E54L72K256j771l017R07J099n01N29o95j668J811P63j897L48J483j068O32
$$ 554 926 3182 1411 -1606 -699 400 -101 428 -267 -1935 -124 639 -1258 -910 573 -495 137
3610A37N12q47Q07J429j495p59L93j046N29K293j980j874K064n82j746J297N10
$$ 137 649 -198 609 2038 543 -216 177 -869 -340 1953 -27 -1901 163 -419 -2165 -868 -358
3627c58J30K039o39k013P96J508R5J368j403l632J227K240j151r21k0j774J168
$$ -358 -228 1811 1172 -841 -45 1463 1558 2926 1523 -2109 -882 1358 207 -714 -734 -2508 -1340
3644a340J928j648p84K041n48K94J723j293o33K301l13j357l2k48n7J806j099
$$ -1340 588 -1060 -1844 197 -351 -57 1666 373 -260 2041 1728 371 339 91 34 1840 741
3661G41l011R21O30j717J309J078j128M36J547j498K8K166j90N3P7k581K58K970
$$ 741 -2270 -1349 -719 -2436 -1127 -49 -1177 -741 806 -692 -664 1502 1312 1365 1442 -1139 -881 2089
3679B089q47j158L40j660r4J831j022j726J645O19j81J484n43k318K000P20k135
$$ 2089 1242 84 424 -1236 -1330 501 -521 -2247 -602 17 -164 1320 777 -1541 459 1179 -956
3696i56J8J213L90J677Q5l041r95O58p18J279J348j848r5K672j095j224J643p27
$$ -956 -938 275 665 2342 2427 -614 -1609 -951 -1669 -390 958 -890 -985 1687 592 -632 1011 284
3714B84q82R81j059m39K246M50j611J37j001j202J895N27j730P53J861j13R16
$$ 284 -598 383 -676 -1115 1131 1581 -30 107 -894 -2096 -201 326 -1404 -651 1210 1097 2013
3731B013K18k804K01O05j767m05K350P35L55Q54k777k629J051O70O47J211p30
$$ 2013 2231 -573 -372 233 -1534 -1939 411 1146 1501 2355 -422 -3051 -2000 -1330 -683 528 -202
3748b02l90K527K6k343M31K7o50J482R88j665J025P55k193j210J07j430J016K233
$$ -202 -592 1935 1961 -382 49 76 -574 908 1896 231 1256 2011 -182 -1392 -1285 -2715 -1699 534
3766E34j531o15J528R31L01J094j975j103J372o47o69J920q3o76R28r09k868J102
$$ 534 -997 -1612 -84 847 1148 2242 267 -836 536 -111 -780 1140 1057 381 1309 400 -2468 -1366
3784a366J277n09Q06k22o39J312P54k285o66O37k94J214J771j276J03J879j591
$$ -1366 -89 -598 208 -14 -653 659 1413 -872 -1538 -901 -1195 19 1790 514 617 2496 905
3801I05j150N40j206J30J924j316k314J458R86QJ239q04j604J497Q79q85L68L89
$$ 905 -245 295 -911 -781 1143 -173 -2487 -1029 -43 -35 1204 400 -1204 293 1172 287 655 1044
3819A044j304Q70L74k524k32J701q23j96J237p25M95K329j150j249K01q49K21
$$ 1044 -260 610 984 -1540 -1772 -71 -894 -1090 147 -578 -83 2246 1096 -153 48 -801 -580
3836e80J815n97j126J571l45j661Q47o9q27J797n60k200O23J823r06M81j2j709
$$ -580 1235 638 -488 1083 738 -923 -76 -145 -972 825 265 -1935 -1312 511 -395 86 74 -1635
3854a635J013K518o88j83L62m45M18L68k235j344J394m84p87O96o26n70K816L27
$$ -1635 -622 1896 1208 1025 1387 942 1360 1728 -507 -1851 -457 -941 -1728 -1032 -1658 -2228 588 915
3872I15j649M31Q23L7J781L44k305L64M28j343L47K06j702N45P93j811L30J635
$$ 915 -734 -303 520 557 2338 2682 377 741 1169 -174 173 379 -1323 -778 15 -1796 -1466 169
3890A69p73o40J123j648J2K703J02p48J144j40o10J294o89j388J048m9j349K60
$$ 169 -604 -1244 -121 -1769 -1757 946 1048 300 1444 1304 694 1988 1299 -89 959 910 -439 -179
3908a79q09j316J157P88k388P6J577O77J775J531k282k32J681l22o36K16j569
$$ -179 -988 -2304 -1147 -359 -2747 -2671 -1094 -417 1358 2889 607 375 2056 1734 1098 1314 -255
3925b55m93J416n73j358M99n31n88J241m38p20K063J371j238N60J78j507Q67O89
$$ -255 -748 668 95 -1263 -764 -1295 -1883 -642 -1080 -1800 263 1634 396 956 1134 -373 494 1183
3943A183j286K77J131j176j96N43j024k50Q34k150n45J804M19O75J301j374r05
$$ 1183 -103 174 1305 129 -67 476 -548 -798 36 -2114 -2659 -855 -436 239 1540 166 -739
3960g39K140M40j049J68o42m87J592J92k429l39j14q73P45R8j026J702K268r95
$$ -739 1401 1841 792 960 318 -169 1423 1615 -814 -1153 -1267 -2140 -1395 -1297 -2323 -621 1647 652
3978F52p8O11j243O63J704j120j061R93p53p05Q07p95j287P12l02j063J115N99
$$ 652 574 1185 -58 605 2309 1189 128 1121 368 -337 470 -325 -1612 -900 -1202 -2265 -1150 -551
3996e51k14J321p0r02K070M85j506%M83j024Q20J238j981r00O87j129o31Q0j381
$$ -551 -765 556 486 -416 1654 2139 633 633 1116 92 912 2150 169 -731 -44 -1173 -1804 -1724 -3105
4015c105R62K860O5j159N57k69M10J937p27j517J240P18q47O63j283j912M29O52
$$ -3105 -2143 717 782 -377 180 -89 321 2258 1531 14 1254 1972 1125 1788 505 -1407 -978 -326
4033c26j381l25R73o25Q21J357o12L40R74m93k62P60j278L12J939o72j353L84
$$ -326 -1707 -2032 -1059 -1684 -863 494 -118 222 1196 703 441 1201 -77 235 2174 1502 149 533
4051E33m49j628K26K80n61J933O83j196k09L25p95J084K64j301Q42J716k29p7
$$ 533 84 -1544 -1318 -1038 -1599 334 1017 -179 -388 -63 -858 226 490 -811 31 1747 1518 1441
4069A441o06j646L9J353j123o59Q13l62j74J301p21q13J569R57r22M76n27r9J317
$$ 1441 835 -811 -772 581 -542 -1201 -388 -750 -924 377 -344 -1157 412 1369 447 923 396 297 1614
4088A614k39j534Q7n52j587R77N72p11P52J137p58J07R07o08M6J007j169l6J602
$$ 1614 1375 -159 -72 -624 -2211 -1234 -662 -1373 -621 516 -242 -135 772 164 210 1217 48 12 1614
4107A614o03o20j67j027n28J325j56o75P74j62q30O25l41j282J909J547p52k61
$$ 1614 1011 391 224 -803 -1331 -6 -162 -837 -63 -225 -1055 -430 -771 -2053 -144 1403 651 390
4125C90O02m46J191O20j533j047L16j089N44J13j588l32J807j35m95J075k64j31
$$ 390 992 546 1737 2357 824 -223 93 -996 -452 -339 -1927 -2259 -452 -587 -1082 -7 -271 -402
4143d02J683rq54J320Mj141L7l79j687O54J156o48J93L52j269M57K82j195P17
$$ -402 1281 1272 418 1738 1742 601 638 259 -1428 -774 382 -266 -73 279 -990 -533 -251 -1446 -729
4162g29J497j077k15J078p0J58R21p30j213J080L70k97J97j494j133J169K37j096
$$ -729 768 -309 -524 554 484 642 1563 833 -380 700 1070 773 970 -524 -1657 -488 -251 -1347
4180a347J91M84m40J571L78p70M91R45o08k49N2j726M90J697q36j205K85o04m6
$$ -1347 -1156 -672 -1112 459 837 67 558 1503 895 646 698 -1028 -538 1159 323 -882 -597 -1201 -1247
4199a247J442k72m73J047o4p21J303j12j160R68o5j296O93N65p12J7m0q06N54
$$ -1247 195 -77 -550 497 433 -288 1015 903 -257 711 646 -650 43 608 -104 -87 -127 -933 -379
4218c79R19j094k64O38o31J22R35p12M13J553m76m81K24q21p4J612n26j901O3
$$ -379 540 -554 -818 -180 -811 -689 246 -466 -53 1500 1024 543 767 -54 -128 1484 958 -943 -880
4237h80P6l34R51k64j391N24R72nJ029K11q68J005R15j688j68P36r99J09O38j367
$$ -880 -804 -1138 -187 -451 -1842 -1318 -346 -351 678 889 21 1026 1941 253 85 821 -178 -69 569 -798
4257g98k85J477l76q63O45r03n34J291P91k06O96k41j038J47L50Q7J019O9j556
$$ -798 -1083 394 18 -845 -200 -1103 -1637 -346 445 239 935 694 -344 -197 153 240 1259 1328 -228
4276b28L97J009j066K69m6j833k61J529J18j23K37r99L84J196n49o10J180L96
$$ -228 169 1178 112 381 335 -1498 -1759 -230 -112 -235 2 -997 -613 583 34 -576 604 1000
4294A000m28M27m49j120J420N36j429l66n12m69J530R69j147l31L52o89M26P71
$$ 1000 572 999 550 -570 850 1386 -43 -409 -921 -1390 140 1109 -38 -369 -17 -706 -280 491
4312D91p29l0O68k89k62J233p07k60N48j119k38J300J87r92K84n52m53J093j60
$$ 491 -238 -268 400 111 -151 1082 375 115 663 -456 -694 606 793 -199 85 -467 -920 173 13
4331A3n88O33O70q02J07J29n65M03R63q20p63J74k64J084Q92j125q32R34l69J52
$$ 13 -575 58 728 -74 33 162 -403 0 963 143 -620 -446 -710 374 1266 141 -691 243 -126 26
4351B6Q90j105n16O52L76o03L05R8n53P30m02p90J146Q28r72K52J71j234L14Q16
$$ 26 916 -189 -705 -53 323 -280 25 123 -430 300 -102 -892 254 1082 110 362 533 -701 -387 429
4371D29o01ON12r15L50P58q60J36P65m87n93J048N5m61N63r56j252J299J89n36
$$ 429 -172 -166 346 -569 -219 539 -321 -185 580 93 -500 548 603 142 705 -251 -1503 -204 -15 -551
4391e51Q23p93p12J220J181j224K82N28m47O0L62j052M2O54n47r4L05j022J66
$$ -551 272 -521 -1233 -13 1168 -56 226 754 307 367 729 -323 -281 373 -174 -268 37 -985 -819
4410h19J453l52q87L74n0j73J306k34j164L55K03l01O93K23n93J23M72p57K97
$$ -819 634 282 -605 -231 -281 -454 852 618 -546 -191 12 -289 404 627 34 157 629 -128 169
4429A69Q66j141J72j23q31L87R02j175k38J140l41m24J335p34j95J324k46p82
$$ 169 1035 -106 66 -57 -888 -501 401 -774 -1012 128 -213 -637 698 -36 -231 1093 847 65
4447F5J28k01j03R69m99j182M54M47j48O16k74j410M64J102n61J69M13q48J04
$$ 65 193 -8 -111 858 359 -823 -369 78 -70 546 272 -1138 -674 428 -133 36 449 -399 -295
4466b95J075o11k15P88m77j29P91j220l04J022m53o84O26j98l67J034K14q19N83
$$ -295 780 169 -46 742 265 136 927 -293 -597 425 -28 -712 -86 -284 -651 383 597 -222 361
4485C61J43j213K58Q34p66R3M00r27n8J094L99k09K36j070O06J432o97r10L29
$$ 361 504 -709 -451 383 -383 -290 110 -817 -875 219 618 409 645 -425 181 1613 916 6 335
4504C35j028k92J243o93q60P18O71j09N61k20o19J018Q06j499L35k2q45P01K96
$$ 335 -693 -985 258 -435 -1295 -577 94 -15 546 326 -293 725 1531 32 367 345 -500 201 497
4523D97j229J01M63m32M68R98q16J38O56q73m00R18o18p32N92j81r2O97M8p96
$$ 497 -732 -631 -168 -600 -132 866 50 188 844 -29 -429 489 -129 -861 -269 -450 -542 155 203 -593
4543e93P82K13l42Q06j65j117P97N24q92m08K38r20N87R57r19O9M15k3L13Q93
$$ -593 189 402 60 866 701 -416 381 905 13 -395 -157 -1077 -490 467 -452 -383 32 9 322 1215
$$ [...]
8191a44
##END NTUPLES=NMR FID
##END=
