##TITLE=1H_CA-8534-13-2
 CDCl3, 8 sc, 
 15.2.2019
##JCAMPDX= 6.0         $$ Bruker NMR JCAMP-DX V2.0
##DATA TYPE= NMR FID
##DATA CLASS= NTUPLES
##ORIGIN= UXNMR, Bruker Analytische Messtechnik GmbH
##OWNER= root
$$ XWIN-NMR		Version 3.5
$$ Fri Feb 15 13:53:27 2019 Russian Standard Time (UT+4h)  she@DPX200
##.OBSERVE FREQUENCY= 200.1313
##.OBSERVE NUCLEUS= ^1H
##.DELAY= (6, 6)
##.ACQUISITION MODE= SIMULTANEOUS
##.ACQUISITION SCHEME= undefined
##.AVERAGES= 8
##.DIGITISER RES= 18
##SPECTROMETER/DATA SYSTEM= spect
##.PULSE SEQUENCE= zg30
##.SOLVENT NAME= CDCl3
##.SHIFT REFERENCE= (INTERNAL, CDCl3, 0, 15.7039)
##AUDIT TRAIL= $$ (NUMBER, WHEN, WHO, WHERE, WHAT)
$$ ##TITLE= Audit trail, XWIN-NMR		Version 3.5
$$ ##JCAMPDX= 5.01
$$ ##ORIGIN= Bruker BioSpin GmbH
$$ ##OWNER= she
$$ F:/spectra/data/she/nmr/H-F/1/audita.txt
$$ ##AUDIT TRAIL=  $$ (NUMBER, WHEN, WHO, WHERE, WHAT)
(   1,<2019-02-15 13:50:48.95 +0400>,<she>,<DPX200>,
      <created by zg, POWCHK disabled, PULCHK disabled
       configuration hash MD5:
       00 E9 B6 7A A2 85 ED C7 34 08 36 98 17 FE 4E 26
       data hash MD5: 16K
       D2 2A CD 41 0C 65 97 28 8C E7 0C 6F 2B 57 AF 13>)
$$ ##END=
$$ 
$$ hash MD5
$$ 58 44 A8 C7 AB 6A C1 4A 7E 25 A8 E4 55 91 C7 C2
##$RELAX= 
##$RELAX= 
##$RELAX= 
##$RELAX= 
##$RELAX= 
##$RELAX= 
$$ Bruker specific parameters
$$ --------------------------
##$DU= <F:/spectra>
##$EXPNO= 1
##$NAME= <H-F>
##$PROCNO= 1
##$TYPE= <nmr>
##$USER= <she>
##$AMP= (0..31)
100 100 100 100 100 100 100 100 100 100 100 100 100 100 100 100 100 100 
100 100 100 100 100 100 100 100 100 100 100 100 100 100 
##$AQSEQ= 0
##$AQ_mod= 1
##$AUNM= <au_zg>
##$AUTOPOS= <>
##$BF1= 200.13
##$BF2= 200.13
##$BF3= 200.13
##$BF4= 200.13
##$BF5= 200.13
##$BF6= 200.13
##$BF7= 200.13
##$BF8= 200.13
##$BYTORDA= 1
##$CFDGTYP= 0
##$CFRGTYP= 5
##$CHEMSTR= <none>
##$CNST= (0..31)
1 1 145 1 1 1 1 1 1 1 1 1 1 1 1 1 1 1 1 1 1 1 1 1 1 1 1 1 1 1 1 1 
##$CPDPRG= <>
##$CPDPRG1= <>
##$CPDPRG2= <>
##$CPDPRG3= <>
##$CPDPRG4= <mlev>
##$CPDPRG5= <mlev>
##$CPDPRG6= <mlev>
##$CPDPRG7= <mlev>
##$CPDPRG8= <mlev>
##$CPDPRGB= <>
##$CPDPRGT= <>
##$D= (0..31)
0 1.2 0 0 0 0 0 0 0 0 0 0.03 0 0 0 0 0 0 0 0 0 0 0 0 0 0 0 0 0 0 0 0 
##$DATE= 1550224248
##$DBL= (0..7)
120 120 120 120 120 120 120 120 
##$DBP= (0..7)
150 150 150 150 150 150 150 150 
##$DBP07= 0
##$DBPNAM0= <>
##$DBPNAM1= <>
##$DBPNAM2= <>
##$DBPNAM3= <>
##$DBPNAM4= <>
##$DBPNAM5= <>
##$DBPNAM6= <>
##$DBPNAM7= <>
##$DBPOAL= (0..7)
0.5 0.5 0.5 0.5 0.5 0.5 0.5 0.5 
##$DBPOFFS= (0..7)
0 0 0 0 0 0 0 0 
##$DE= 6
##$DECBNUC= <off>
##$DECIM= 32
##$DECNUC= <off>
##$DECSTAT= 4
##$DIGMOD= 1
##$DIGTYP= 9
##$DL= (0..7)
0 120 120 120 120 120 120 120 
##$DP= (0..7)
150 150 150 150 150 150 150 150 
##$DP07= 0
##$DPNAME0= <>
##$DPNAME1= <>
##$DPNAME2= <>
##$DPNAME3= <>
##$DPNAME4= <>
##$DPNAME5= <>
##$DPNAME6= <>
##$DPNAME7= <>
##$DPOAL= (0..7)
0.5 0.5 0.5 0.5 0.5 0.5 0.5 0.5 
##$DPOFFS= (0..7)
0 0 0 0 0 0 0 0 
##$DQDMODE= 0
##$DR= 18
##$DS= 0
##$DSLIST= <SSSSSSSSSSSSSSS>
##$DSPFIRM= 0
$$ [...]
##$SUBNAM2= <"">
##$SUBNAM3= <"">
##$SUBNAM4= <"">
##$SUBNAM5= <"">
##$SUBNAM6= <"">
##$SUBNAM7= <"">
##$SUBNAM8= <"">
##$SUBNAM9= <"">
##$SW= 20.0189088683792
##$SWIBOX= (0..15)
0 0 2 0 0 0 0 0 0 0 0 0 0 0 0 0 
##$SW_h= 4006.41025641026
##$TD= 16384
##$TD0= 1
##$TE= 0
##$TE2= 300
##$TE3= 300
##$TEG= 300
##$TL= (0..7)
0 120 120 120 120 120 120 120 
##$TP= (0..7)
150 150 150 150 150 150 150 150 
##$TP07= 0
##$TPNAME0= <>
##$TPNAME1= <>
##$TPNAME2= <>
##$TPNAME3= <>
##$TPNAME4= <>
##$TPNAME5= <>
##$TPNAME6= <>
##$TPNAME7= <>
##$TPOAL= (0..7)
0.5 0.5 0.5 0.5 0.5 0.5 0.5 0.5 
##$TPOFFS= (0..7)
0 0 0 0 0 0 0 0 
##$TUNHIN= 0
##$TUNHOUT= 0
##$TUNXOUT= 0
##$USERA1= <user>
##$USERA2= <user>
##$USERA3= <user>
##$USERA4= <user>
##$USERA5= <user>
##$V9= 5
##$VALIST= <valist>
##$VCLIST= <CCCCCCCCCCCCCCC>
##$VD= 0
##$VDLIST= <DDDDDDDDDDDDDDD>
##$VPLIST= <PPPPPPPPPPPPPPP>
##$VTLIST= <TTTTTTTTTTTTTTT>
##$WBST= 1024
##$WBSW= 4
##$XGAIN= (0..3)
0 0 0 0 
##$XL= 0
##$YL= 0
##$YMAX_a= 427376
##$YMIN_a= -525280
##$ZGOPTNS= <>
##$ZL1= 120
##$ZL2= 120
##$ZL3= 120
##$ZL4= 120
##$ABSF1= 10
##$ABSF2= 0
##$ABSG= 5
##$ABSL= 3
##$ALPHA= 0
##$AQORDER= 0
##$ASSFAC= 0
##$ASSFACI= 0
##$ASSFACX= 0
##$ASSWID= 0
##$AUNMP= <proc_1d>
##$AZFE= 0.1
##$AZFW= 0.1
##$BCFW= 1
##$BC_mod= 2
##$BYTORDP= 1
##$COROFFS= 0
##$CY= 11.3945322036743
##$DATMOD= 1
##$DC= 2
##$DFILT= <>
##$DTYPP= 0
##$F1P= 18.9103706918063
##$F2P= -1.10871071338519
##$FCOR= 0.5
##$FTSIZE= 0
##$FT_mod= 4
##$GAMMA= 1
##$GB= 0.15
##$INTBC= 1
##$INTSCL= 1
##$ISEN= 128
##$LB= 0.24
##$LEV0= 0
##$LPBIN= 0
##$MAXI= 10000
##$MC2= 0
##$MEAN= 0
##$ME_mod= 0
##$MI= 1.114404
##$NCOEF= 0
##$NC_proc= 0
##$NLEV= 6
##$NOISF1= 3.799351
##$NOISF2= 2.8
##$NSP= 1
##$NTH_PI= 0
##$NZP= 0
##$OFFSET= 15.70392
##$PC= 1
##$PHC0= -9053.132
##$PHC1= 14.80014
##$PH_mod= 1
##$PKNL= yes
##$PPARMOD= 0
##$PSCAL= 0
##$PSIGN= 0
##$REVERSE= no
##$SF= 200.130013532006
##$SI= 16384
##$SIGF1= 3
##$SIGF2= 2
##$SINO= 400
##$SIOLD= 16384
##$SREGLST= <1H.CDCl3>
##$SSB= 0
##$STSI= 0
##$STSR= 0
##$SW_p= 3612.71676300578
##$SYMM= 0
##$S_DEV= 0
##$TDeff= 0
##$TDoff= 0
##$TI= <>
##$TILT= no
##$TM1= 0
##$TM2= 0
##$TOPLEV= 0
##$USERP1= <user>
##$USERP2= <user>
##$USERP3= <user>
##$USERP4= <user>
##$USERP5= <user>
##$WDW= 1
##$XDIM= 8192
##$YMAX_p= 0
##$YMIN_p= 0
$$ End of Bruker specific parameters
$$ ---------------------------------
##NTUPLES= NMR FID
##VAR_NAME=  TIME,          FID/REAL,        FID/IMAG
##SYMBOL=    X,             R,               I
##VAR_TYPE=  INDEPENDENT,   DEPENDENT,       DEPENDENT
##VAR_FORM=  AFFN,          ASDF,            ASDF
##VAR_DIM=   8192,          8192,            8192
##UNITS=     SECONDS,       ARBITRARY UNITS, ARBITRARY UNITS
##FACTOR=    0.0002496,     1,               1
##FIRST=     0,             0,               0
##LAST=      2.0444736,     0,               0
##MIN=       0,             -525280,         0
##MAX=       2.0444736,     427376,          0
$$ Real data points
##PAGE= N=1
##DATA TABLE= (X++(R..R)), XYDATA
$$ [...]
2560c232J750L893k232m05L738j640j989J495k385k173L400n43l124J681n80q13
2576c159M548O46l359L171L296j519P55j430n374P61L351k729j234k62l100K564
2592c074N669j052j677K260j833j135K547k754k749L128M7j058M130K74k351K443
2608B815M7l147K083J041l377J46K63l426Q37J311l269J369M257j180O63K345
2624B778k323L82L619k289l341P53j707J46M300j072l159K780J309j626J339j332
2640E57m035K173J718k452J269L07l323J878K567k394J756M090j470l59J743l374
2656F51j578K436k749k058K985p79q37L227j165k247L766L73l071J713J47k437
2672a623K380q8m108J239K256j473J204J480k895K119M306j710j077N77k991j174
$$ y = [-3232, -1482, 2411, 179, -226, 3512, 1872, -117, 1378, -1007, -3180, 220, -323, -3447, -1766, -2346, -3159, 1389, 2035, -1324, 1847, 5143, 3624, 4379, 2949, -2425, -1664, 1687, -1042, -2276, -2538, -5638, -3074, 2595, 1543, -134, 2126, 293, -842, 1705, -1049, -3798, -670, -623, -1681, 2449, 2723, 372, 2815, 2862, -285, 1798, 2839, -538, -392, -129, -3555, -2718, -1407, -4676, -3307, 950, -230, 433, 2778, 455, 837, 4456, 2167, -1174, -421, -2128, -1982, 2318, 1246, -1913, 867, 2176, 550, 1889, 557, -3478, -1305, 413, -2039, -770, -463, -3786, -1908, 659, -1735, 21, 4111, 2641, 2282, 4025, 651, -927, 1509, -1240, -3298, -313, -1092, -1929, 1298, 133, -2114, 1652, 2025, -1046, 667, 814, -1623, 757, 669, -3439, -2200, 56, -1417, -213, 1267, -1628, 491, 4797, 3087, 2010, 2587, -404, -1578]
2688a578K579k611j177L440q96j675K343j282k262K797k18k769L437J861j025
2703I64K095r23m226J504K449k007J074K174k022P63J513m312k116J426k071j08
2719c823K692j372P58M816p32l416M16j244o60N097P72j783K162J24k546P53n64
2736A450m255R56J380k725J750K586k471q42N2l465R08M750M24O21L110n59k64
2753C406K244l313l670J173k97k296K469j5j694L045M77m780N7R91l22M058J995
2770C528l520m31J798k001M99Q97l170L14M084L7O85K051k888k722J256j972j684
2787c239L512n61k856J937n9r62L430K46k582J659J457k553J225J339k546J454
2803I01J920m298j069K498k44J296J980l371j330L915j59j687L0l705k268M786
$$ y = [-1578, 1001, -1610, -2787, 653, -243, -1918, 425, -857, -3119, -322, -540, -3309, 128, 1989, 964, 3059, 2136, -2090, -586, 1863, -144, 930, 3104, 1082, 1845, 3358, -954, -3070, -1644, -3715, -3823, -1131, -2503, -1745, 3071, 2339, -1077, -661, -1905, -2565, 2532, 3304, 1521, 3683, 3807, 1261, 2014, 1450, -2805, -1849, -469, -3194, -1444, 1142, -1329, -2171, -2119, -5584, -4676, 74, 498, 1119, 4229, 3670, 3406, 5650, 2337, -1333, -160, -457, -2753, -284, -299, -1993, 1052, 1529, -3251, -3194, -2203, -2525, 1533, 3528, 8, -423, 1375, -626, -127, 770, -2400, -2086, 1998, 2035, 2720, 4771, 1883, -839, 417, -1555, -3239, 273, -288, -3144, -1207, -1266, -2228, 1202, 1448, -1134, 525, 1982, -571, 654, 1993, -553, 901, 2821, -1477, -2546, -48, -292, 1004, 2984, -387, -1717, 2198, 2039, 352, 382, -3323, -5591, -805]
2819h05J867j515J373n21j619K852K0k845J863P13k790J330J565k427J327K023
2835B411k442k01J334j506P38K036k740j395J654k708j949L027P44r15K381o17
2851a48j49M826J474k780o08k563l010L536J847l927q63O85j089J972J741k317
2867a373K88K593j249M44J537l119o56K608j968k403K481J344L29L284r45k620
2883E75J699n63k111J502r34m091Q67P77j735K877K539k525j58J601m42K864K483
2900E225l980k218J777j776P7K189k632j827L381P07j63J706r43j694K211j378
2916F62m712K013J494j398J738j5l359J815K994o73J414M13k578J115K860k143
2932A640j266J344l294j391K815J98m2J991k362k920K003j89n97K011j140k504
$$ y = [-805, 1062, -453, 920, 399, -1220, 1632, 1652, -1193, 670, 1383, -1407, -77, 1488, -939, 388, 2411, -31, -232, 1102, -404, 334, 2370, -370, -1765, -111, -2819, -4768, -1741, -997, -1912, 469, -148, -297, 4529, 6003, 3223, 2615, 52, -2958, 578, 2425, -1502, -2365, -1680, -2769, -797, 944, -1373, -1085, 1508, 259, 703, 2240, -879, -1535, 1073, -895, -3298, -817, 527, 856, 4140, 3195, 575, 2274, 1711, -400, 1102, 168, -3923, -3056, -2279, -4014, -1137, 1402, -1123, -1281, 320, -122, 2742, 5225, 1245, -973, 804, -972, -895, 1294, -1338, -3165, 216, 923, 760, 2466, 1523, -171, 2040, 662, -4050, -2037, -543, -1941, -203, -218, -3577, -1762, 1232, 559, 1973, 2386, -192, 923, 3783, 1640, 374, 1718, -1576, -2967, -152, 46, 4, 1995, -367, -3287, -1284, -1473, -2070, -59, -1199, -3703]
2948c703K698K871j536J653Q40j705J881Q27l241K59J219k425r06m63l049K55
2964d525M226j066o09J263p38J524M148j147k728O78j271j535K689N41k080J719
2980A089p2k106J548J427j485P98l67l734R10K198k180j96J177j592J207K785
2996A407n99k30K565j152j009J760k113j537K466j147l567M09N35K68L880J035
3012B971k875O15L31j491J107K33l372M98K240k012O39J721j094k05J727j432
3028c99R12L448p74j723L80k346j758K333n89k007J424O26q03K200o8k193J558
3045B21O85l489N70K008k94K016J583l339k64K208m67K03J472l018r12K133j948
3062f32k054P77j517j159K784L80K67L731O07k090J141n95k019J851M16l048P0
$$ y = [-3703, -1005, 1866, 330, 1983, 2823, 1118, 2999, 3826, 585, 844, 2063, -362, -1268, -1731, -4780, -4525, -299, -1365, -1974, -711, -1449, 75, 4223, 3076, 348, 1026, -245, -1780, 909, 1450, -630, 1089, 1017, -1089, 459, 1886, 401, 1199, 832, -2902, -1992, 206, -1974, -2170, -993, -2585, -1378, 1407, 808, 578, 3143, 1991, 982, 2742, 629, -908, 1558, 411, -3156, -2747, -2212, -1944, 1936, 2971, 96, 711, 1042, -449, 658, 891, -2481, -1983, 257, -1755, -1116, 605, -489, -694, 1033, -399, 513, 3961, 3187, 1464, 1844, -502, -2260, 73, -516, -2523, -1099, -473, -1276, 924, 856, -1337, 221, 906, -2583, -2013, -5, -299, 1717, 3300, -39, -303, 1905, 1438, 1641, 3113, 95, -817, 1316, -632, -2686, -1909, -3426, -4585, -1801, -1421, -1154, 2577, 3184, 1094, 2235, 1640, -379, 1472, 1888, -1160, -1090]
3079a090J394j384M59J305k156J032K378j539l31J739j662o56J142k758k314K508
3095a933J120j64K470j177q70L238O20k265O42q26j839J537O11k774N86P40j640
3112a924Q31J239j089J204K546k748q39J764j930r82J612j209j149L300J31p17
3128D0K213O4q98J979j344l123J725N47k165Lr08k164J905J935j881M77J408p46
3146i33J992K269k330j286K218j558j27J469j370n87K508j181k027J335q34j301
3162a743J300k08k543J912Q75j584R74J022j066J949J247j689J210J954j856o66
3178A088L28k430k75K030j558j433J530l50J1K308j985j522K413P25j305J434
3194A009n50j740K401P0k301P93N82q48J952R23k735N96J382j847k73J116j957
$$ y = [-1090, 304, -1080, -621, 684, -1472, -440, 1938, 399, 68, 1807, 145, -511, 631, -2127, -4441, -1933, -813, -977, 1493, 316, -554, 2684, 3304, 1039, 1681, 855, -984, 553, 1164, -1610, -1024, -284, -1924, -1093, 146, -943, 261, 2807, 59, -780, 984, -946, -1928, -316, -1525, -2674, 626, 757, 40, 2253, 2317, 1419, 3398, 2054, -1069, 656, 1203, -962, -959, -1867, -4031, -2126, -191, -2072, -1595, -187, -933, 1059, 3328, 998, -288, 1930, 372, 245, 1714, 344, -243, 2265, 1084, -943, 392, -442, -1743, -443, -651, -3194, -1282, -407, -1991, -1017, 5, -1061, 888, 2135, 446, 1656, 3610, 1754, 1088, 1416, -1014, -1289, 741, -817, -2250, -720, -1070, -1059, 1249, -736, -2258, 155, 880, -425, 1009, 459, -1281, 1120, 1190, -1111, -318, 264, -584, 1368, 2291, -444, 152, 1534, -313, -586, 530, -1427]
3211a427K45K204j686o42J913q86j255J821j007n77L019k37j874J322j21j470
3227f58J859m65k185K030J610j970J17N4j989R54J721k541l09J535o80Q43J152
3244A078k384r55K796n69j15J672p44p91K341n10k140J604p0j566J067m91j793
3261a570J401M59k687M57Q84j076J494J579j878J004K221j568l87J344j560K61
3277C78K044j980j867J949j24r46J538j768j781K427J003j646N03n83j745J915
3293f83J056j898J237J200j195J017J484k001N33K015j846j108J433j692j27J660
3309A085k024j841K278l89j008J949l13j292K284k04k175K018Q41j138J219L98
3325A688k715K071J886j821p37M14k138R99J821k209j013J018j294K9K070j129
$$ y = [-1427, -1182, 1022, -664, -1306, 607, -279, -1534, 287, -720, -1297, 1722, 1485, -389, 933, 812, -658, 1201, 736, -1449, 581, 2191, 221, 338, 392, -1597, -643, 1078, -1463, -1772, -237, -917, -74, 1078, -1306, -2261, 535, -34, -149, 1523, 779, -12, 2329, 1819, -321, 1283, 1213, -353, 714, 223, -1570, -169, 290, -2397, -1940, -1056, -2132, -638, 941, -937, 67, 2288, 720, 333, 1677, 117, 378, 2422, 442, -1425, 524, 400, -546, 992, -776, -2557, -130, 873, -773, -270, -853, -2598, -683, 373, -1525, -288, 912, -283, 734, 2218, 217, 750, 2765, 919, -189, 1244, -448, -575, 1085, -939, -2780, -502, -891, -1899, 50, -263, -1555, 729, 525, -1650, 368, 1209, 71, 1290, 1688, -1027, 1044, 2930, 1109, 372, 786, -1352, -353, 1468, -741, -1754, -736, -2030, -2001, 69, -1060]
3341a060o16L025n33j193J944n03r98J481m87k313J711L13j315P66P75k399J421
3358A9J018j935N84J345j554j79Q61k205M03K582j287j056J539k73N63K788j398
3375A815k226J009j99r63J486r58k234K312N89j724J398M30j691J426O59k649
3391a520M57J726j591OQ99j903J86K725q33K96J814q42n97J711j263j476J375
3408A170p02k511P90P9p53K057j05k689J443J466q94R28R10k094R33K020j965
3425H3K36J466j292K48J880k067r71J940j315j181N03j706j643K503K10j292J877
3442e21J18o45K625P16j874J812J59k061Q71O93j863L17P3k675m9J832m51K17
3460g06J600j930k59K415j175j349J385n17o01K284m26j259K156P22j629P47n52
$$ y = [-1060, -1676, 1349, 816, -377, 1567, 1064, 66, 1547, 1060, -1253, 458, 771, -544, 222, 997, -1402, 19, 1037, -898, -314, 1031, -523, -702, 159, -2046, -1643, 939, -348, -1404, 135, -138, 425, 3213, 1815, -411, 598, 399, -564, 922, -36, -2270, 42, 631, -1093, 305, 735, -956, 470, 1129, -1520, -1063, 663, -928, -922, -23, -1926, -1740, 985, 152, 448, 2262, 1420, 823, 2534, 1271, -205, 1170, 468, -2043, -1253, -1174, -1927, 130, 25, -2664, -1221, 245, -649, 279, 1189, -905, 28, 2048, 83, 319, 1785, 493, 741, 2621, 554, -417, 1523, 208, -973, -470, -2176, -3819, -1316, -1106, -2398, -521, -403, -1048, 1577, 2293, 419, 2231, 2390, 329, 1200, 1893, 30, 347, 420, -2255, -2304, -472, -923, -706, 894, -1036, -1295, 1120, -55, -1404, -19, -536, -1137, 1147, 721, -538, 1618, 2340, 711, 1458, 906]
3477I06j687J602N13k771k86R11j168J240J651k296L1K090j032P78J914j192p66
3494D38J150j926j617J620m09j028K235q7j024K397N06k327P99n32j384J841L16
3511I68j984P75J000k129j00Q98j241J293K115j771p2J628j116N57R73j864j787
3528a857K396j17r04J809j86j449J416p51k408Q01O37j735J577M03j767J797J637
3545A299k061K49J252q87J569J973j416n93R22k260j304J520j759n45K128r18
3561h31j418J396J64n89J795n42j487K042J198j396J281J32j957J182J017j855
3577A32j36J040j458P6R05j977K22J829k032j170J820n88K45K666o01j579J840
3594A234j14r88J562l34j953J854j59k235N18J070j616J095P08k000N82J954j441
$$ y = [906, -781, 821, 1334, -1437, -1723, -812, -1980, -740, 911, -1385, -1354, 736, -296, 482, 2396, 1204, 438, 1588, -338, -1955, -335, -744, -1772, 463, 376, -648, 1749, 2255, -72, 727, 195, -1189, 652, 968, -1016, -241, 759, -1370, -1470, -572, -1813, -520, 1595, -176, -248, 1380, 264, 821, 1794, -70, -1857, 539, 422, -482, 1327, 1141, -308, 1108, 357, -2051, -1250, -613, -2348, -771, -368, -2135, -338, 1299, -762, -513, 739, -148, 1421, 3394, 1978, 1385, 2307, 47, -1257, 263, -1496, -2041, 87, -831, -2249, -853, -689, -1278, 517, -25, -1512, 530, 1728, 332, 1613, 1745, -212, 970, 1987, 132, -4, 1036, -422, -346, 559, -1418, -1196, 633, -1399, -2569, -749, -1337, -1092, 1574, 973, -606, 1234, 1120, 132, 1694, 1360, -593, 1261, 1102, -1133, -615, 455, -1161, -66, 642, -1358, -776, 1178, -263]
3611b63J14Q78k090M88K072j542p88J347o99n00K092q55n31J715m80j578J377
3628G57j11j347J808k09k423R65R34j553O31O14j320P04J206k131P03J470j380
3645f82N62J522j417k1K184o85q43P84j427o36J962n51k058Q08j46j205J273L40
3663b36j760J126O48p35O87R94r58J411J170j999J69J394j412P4P53j426p29J634
3681H05j535j292J692m04j176K114p17j214K415N26j515Q22P8q38J523M69k308
3698e55K93J222j227R41Q64k207p9J630j693o44J449q23L0J991j261j372J538
3715I7l68p60J665l86r61J807L48j561P23k89j631J328Q08j560J384P02j722P1
3733c05J063j943O06J172k090k19J610m01j47J581j602m36K046k43r65J463L47
$$ y = [-263, -149, 729, -1361, -873, 1199, -343, -1131, 216, -483, -983, 1109, 254, -277, 1438, 958, -620, 757, 646, -701, 1107, 898, -1525, -560, 374, -1179, -548, 66, -1254, -550, 656, -1475, -772, 698, -682, -120, 1402, -15, -36, 2148, 1463, 620, 1404, -23, -659, 1303, 752, -1306, -498, -644, -1849, -576, -236, -1996, -870, -222, -957, -270, 724, -234, 1177, 2347, 348, 517, 1911, 499, 573, 1326, -100, -829, 805, -730, -2022, -330, -734, -1910, 204, -513, -1727, 688, 1214, -301, 521, 599, -239, 1284, 1753, -555, -262, 960, -267, 674, 1538, -669, -748, 882, -811, -1455, -6, -829, -799, 1192, -69, -1441, 97, -271, -1031, 634, 248, -713, 1094, 1442, -119, 604, 315, -1316, 12, 820, -740, 644, 1346, -376, -305, 758, -1185, -579, 593, -1497, -1716, -106, -507, -654, 927, -675, -1111, 935, 692, -273, 1190, 1537]
3750A537q64J387m77k381N93K60j494J047J75j424J541J274k082k51N05j293R62
3767i85J911j048P4J564q43n82J775j279n62J779o91j414J094p20j316Q62p96
3784a177j570J641O44j484J496J387r49J237P63j738J77J162j427J9M36j027L06
3801a04J686j680j170J244j009j05J684o13j414J433M4j286J273k59j025J912
3817F11P39j475J020N38j151O09L32k016K19R60j104r2J200j410K2J506p50k61
3835e03J451o24r58J319r32o75J924q47j832J129M20n95J548N0j367J373Q01j249
3853D33J81O2j731R58O37j796J53J045o10j11J238j290p23K269n58k58R91q49
3871D1p13J740j49j411J384L23j080J374j73j565N78K14j768Q1M70j675P77J213
$$ y = [1537, 673, 2060, 1583, -798, -205, 55, -1439, -392, -217, -1641, -100, 1174, -908, -1159, -654, -1947, -985, 926, -122, -48, 1516, 673, 91, 1866, 587, 25, 1804, 1113, -301, 793, 73, -1243, -381, -1177, -2747, -1106, -462, -1946, -450, 937, -12, 1225, 1988, 250, 427, 1589, 162, 181, 617, -410, -104, 1582, -98, -1268, -24, -1033, -1138, 546, -67, -1481, -48, -4, -1290, -17, -276, -1301, 611, 1350, -125, 895, 1433, 282, 891, 1223, -793, -574, 386, -718, -810, 390, -1020, -998, 508, -242, -503, 948, 324, -634, 685, -247, -922, 1002, 155, -1677, -548, -128, -723, 825, 875, -492, 881, 1682, 433, 614, 676, -1055, -97, 540, -1256, -1103, -58, -668, -779, 459, -831, -1554, 715, 157, -101, 890, 41, -672, 1068, 919, -492, 892, 1215, 135, 1509, 1336, -229, 349, 563, -1205, -1124, -654, -2329, -1552, -339]
3889c39j218M45J647o13L49J423r84j91J577q80q05J145o73j308N02r21j301J916
3907b29l2j001N95O0j051J402M25j638Q88J193o86R31J202j660J35J548j427m26
3925B29R12j251o5Q26j603p13R68n90o50J322J45r68J797P26o71R93J40j430Q18
3944I35L10j560P25O51j609J33P17j423L50J126j426K8J544m92n20J193q10p75
3962i03J677p99j042J243K90n61J200k81j918J331M93j120L87J34j472J632Q72
3979A163j223J80N43j020L04Q20j314l92J495j044n21J359j049p78J792m81o71
3996h37J717l7o78J103J75j330P62J71j475O69Q0j439N75K94j434M23J360j467
4014a368J55J202o58N87J866q69n92J329n71o84J150j077j039J462q6j822Q76
$$ y = [-339, -1557, -1112, 535, -78, 271, 1694, 710, 519, 2096, 1216, 411, 1556, 883, -425, 77, -844, -2145, -229, -261, -1262, -667, -607, -1658, -256, 169, -1469, -581, 612, -74, 857, 2059, 399, 534, 2082, 655, 229, 1141, -110, -175, 651, -952, -1665, -697, -1287, -1937, -615, -470, -1438, 359, 1085, 414, 1407, 1547, 117, 935, 1245, -315, 410, 1061, -548, -415, 302, -1121, -771, 355, -1071, -1043, 501, 9, -511, 682, -128, -903, 774, -25, -1067, 176, 466, -95, 1105, 824, -1094, 237, 730, -390, -3, 131, -1341, 291, 1163, -60, 120, 663, -357, -53, 767, -547, -939, 556, -488, -1009, 350, -699, -1477, 315, -166, -837, 880, 843, 165, 1268, 1443, 113, 875, 1046, -429, 240, 320, -1119, -544, -250, -1684, -1261, 99, -1368, -1213, -11, -669, -82, 1784, 915, 323, 1652, 1081, 397, 1547, 470, -569, 893, 807, -1015, -139]
4031a39p49j118J133M37j391Q69J050q60J159O86j316O93J078p86J45P78j001
4048F68m58J006j299k44O86j239p07J040p51l38J351J73p63J330M34j262J021
4065F48J29j001J047N91j320J77N11j260J96Q56j639J60J630o66k06O97j647J00
4083i97J434l52n62P89j51n84J319n16j080P80J42o11Q82o4r87P68L97o78K26
4102A55K73p97L86Q87j045k69R91j375mJ144j453q8J244j032k34J907K97n94O73
4121A066l20q09J328Oj194M67J39j483Q22K83k063N23J116j210P80R18j353N85
4139c99J056r16o9J055o69J86J722n64j007J100o03q37P52o59j342P37m05j190
4157b052J361K08j010Q01P17r17J282J022q43O8Q49r20k70Q44j522l2J064r79
$$ y = [-139, -888, -2006, -873, -436, -1827, -958, 92, -768, 391, 1077, -239, 454, 1532, 746, 891, 1669, 668, 210, 1216, -83, -327, 359, -880, -1587, -547, -1298, -1636, -285, -112, -875, 455, 889, -373, 648, 777, -224, 823, 1414, 94, 271, 782, -478, -282, 574, -1065, -905, 725, 59, -147, 550, -1097, -997, 437, 85, -477, 312, 161, -423, 896, 380, -700, 80, 222, -389, 493, 429, -558, 210, 607, -71, 155, 428, -369, 17, 904, -141, -410, 581, -794, -798, 346, -1107, -1195, 49, -983, -1217, 690, 987, 393, 1066, 746, -63, 1265, 1271, 77, 544, 683, -800, 22, 305, -1758, -1235, -119, -1329, -549, 369, -984, -399, 657, -259, -328, 727, 58, 244, 1966, 1402, 395, 1495, 892, 55, 807, 148, -1194, -457, -862, -2052, -691, -483, -1493, -692, 25, -892, 390, 1412, 569, 637, 1486, 566, 296, 1140, -382, -414, 650, -329]
4175c29j99M78k06l93R30n87j230J103K11o08J270m97j181J262Q37p88O29O2j027
4194b63P17R42j345P4N18j402o0R29j018j68J589p77l64J146n86o01J307m39p14
4213e15Q62l25p02J183L9r03P35L01j199J134M76j185N38J28j331M12J305j397
4231d44m18O94r33P4J189n46k97J243l76o39J179o07q49J525%r12P23k68o08R84
4251G14J4j275N00J84q31O32L75j367J06O62o43K21R39m90j79J162j69m3J093
4270A605r46o20R52n10q24P78j60j105Q07j22p86N56K40r34P83M19r75N47N06
4289B11o13N69L36j257L70J635n29r9Q93j494j28J233j072j127R43n35j92M93
4307c63k69o76N74O02n72O15L86o76R75N52p86J86N51j125K84N38j178J7O66p76
$$ y = [-329, -528, -50, -256, -649, 281, -306, -1536, -433, -222, -830, 440, -57, -1238, 24, 861, 73, 702, 764, -263, 454, 1396, 51, 125, 643, -759, -819, 110, -908, -1076, 513, -264, -628, 518, -68, -669, 638, 199, -515, 347, 22, -680, 503, 542, -361, 374, 675, -524, 610, 1086, -99, 439, 567, -764, -352, 953, -444, -862, -168, -1101, -1027, 162, -384, -681, 562, 186, -453, 726, 119, -730, 795, 795, -117, 606, 338, -270, 714, 728, -547, -47, 137, -694, -62, 313, -1054, -948, -286, -929, -708, 231, -259, -438, 724, 555, 512, 1605, 659, 39, 991, 481, -343, 435, 275, -830, -23, -145, -931, -375, -135, -1069, -286, 133, -842, -295, 211, -402, 167, 503, -754, -384, 1251, 722, 623, 1516, 22, -106, 1127, 55, -1072, -129, -664, -856, -363, -632, -1308, -734, -132, -704, -89, 297, -379, 596, 1148, 362, 548, 1099, -26, 258, 796, -382, -365, 301, -475]
4327d75M8Q19r11k99R50r37l23J294n1p80Q88M5q86J408L3r74Q90M6o71P96j32
4348G78j201M37K93j101J49L86r49N11J023r37l24J107m49J5J205q43l05R04l34
4367C65k74R20m90q20O72L7q56P08R1j254Q07O2n52M50K35r78L93R00q53K42Q74
4388F79q83j84J152o39l85J050m11m31R56n68o88P45k05m69L09N4j317J170L64
4407B99q62K60K50o56O13P33j245M75N45m82M45O43q23mP52o50o46P90o06o07
4427g76J097n86o95R77l90o21J208P4j030R89J55j127P23Q22j071K87O88o47M42
4446E19N41r63j33Q02q80j45P18j000o97J134l98o05P96k31m17J471l1j115J403
4465G69O3p15R34j50j207K95O90j058M37K20j172N03M85l20J01Q85j284p9P38
$$ y = [-475, -427, 392, -519, -818, 132, -805, -1128, 166, 115, -665, 223, 268, -618, 790, 823, -151, 739, 785, 114, 910, 778, -423, 14, 307, -794, -645, -259, -1208, -697, 326, -611, -935, 172, -277, -262, 943, 100, -205, 699, 365, 91, 1011, 521, -299, 373, 410, -446, 262, 353, -901, -94, -32, -584, -134, 101, -877, -484, 416, -437, -195, 679, -204, -388, 764, 125, -260, 790, 379, -52, 904, 336, -352, 393, 188, -281, 28, 82, -1235, -65, 299, -563, -303, -53, -709, -96, 637, -608, -133, 412, -70, 375, 1018, 195, 191, 943, 293, -353, 437, -169, -776, 321, -265, -960, 17, -373, -994, 214, 288, -742, 247, 402, -725, -2, 820, -251, 36, 724, 77, 519, 1060, 97, -36, 766, -114, -259, 459, -541, -1238, -104, -502, -1107, -311, -542, -959, 512, 481, -634, 769, 832, 117, 1051, 901, -306, -11, 679, -379, 58, 278, -894, -391, 94, -226, -125, 760, -524, -603, 135]
4484A35p63l3J014n26n09J255j66k59Q30j06q34R83k16j084N69j64q81O10J20
4503b5j140K29R14p29L68N46o62J25R61m73k98Q07o09j54J049m36n88P83l09m38
4523g9J165n56j496R66j19j051R05o3p29P44M20n20M27O03q58L88Q09p15%M79
4543G20p45j56Q87q39m06Q30m57k02O89l91o83P29k30n30O65R6p07P13K27o26
4563d16P79L83q77P31N39o77j35J81p50Q6R16j145m05O32l80j05Q27o27k47J020
4583C30l65n01R80m17o55J068Oq27O79L77o72N13M81q24J25O21j099J60M51q13
4603c82m67M81m36J25Q75p49k08J031l97j56J231l85n88R37k04m70L58l98p74
4622e76N10N83j010K62M21j046M35P67r70Q3M98q25N56Q28j069M3O97R5J33N20
$$ y = [135, -628, -661, 353, -173, -682, 573, 407, 148, 978, 872, 38, 1021, 805, -279, 290, 126, -755, -145, -25, -1165, -936, -22, -751, -383, 163, -499, -374, 587, 114, -184, 623, 14, -140, 909, 473, -115, 668, 359, -79, 1086, 530, -966, 0, -119, -1170, -265, -328, -1057, -313, 107, -413, 14, 617, -241, 147, 956, 241, 241, 720, -25, -181, 706, -133, -539, 291, -166, -368, 321, -70, -753, -24, -254, -784, -119, -23, -730, -17, 210, -416, 363, 746, -131, 600, 1139, 462, 327, 508, -242, -156, 760, -385, -790, -158, -538, -643, 184, -443, -690, 330, -35, -536, 444, 27, -628, 440, 446, -381, 298, 675, 3, 516, 997, 173, 298, 919, -180, -20, 431, -382, -849, -368, -804, -679, 196, -553, -761, 270, -127, -283, 948, 563, -25, 912, 708, 238, 596, 198, -576, -66, 517, -493, -231, 190, -856, -421, 346, -624, -541, -43, -868, -312, 516, -553, -510, 187, 282, 415, 935]
4642I35p28l13J012m56n50L94l96p06P51k87n73N72j78m60R41L91r08M69M81r08
4662e17P03M90p52r0Q66m63P5N17p73k69O24k55n06O14m02p37R07k73q60P78P9
4683b44m13R81L43p42N09J96n84J99M30r97N32L98j067L72O72p58k0Q46r42l33
4703f22O08l29l66Q08n86k76P54%o60R98K29r85J032O4o08P74R7q26j05L36p79
4724d42N3Q29j265J29Q66m08k02O21n47o1P60m72k90R86k25n11R33j85q87O69
4744C51N27q93M56J47j176P09L10r86J75M14j014L70J026q66J04O95o12M3J225
4763A005m88m55O26n04l54J064l85p12Q86l89q12J026p06n97O69P3p11N61J29
4782g4q37K45J349o94L0P01p67O33K89m84j73M04l17k06P75p75o96O77l31o41
$$ y = [935, 207, -106, 906, 450, -100, 294, -102, -808, -57, -344, -917, -345, -523, -983, -42, 349, -559, -90, 391, -517, 186, 676, -76, -166, 700, 237, 312, 829, 56, -213, 411, 156, -350, 264, -138, -875, 32, -241, -1101, -323, -244, -657, 324, 667, -75, 434, 630, 46, 245, 675, -322, 210, 608, -459, -87, 585, -173, -193, 653, -289, -622, -14, -343, -709, 99, -487, -763, -9, -9, -669, 329, 558, -427, 605, 669, 61, 835, 932, 106, 1, 337, -442, -389, 440, -825, -696, 170, -238, -440, 181, -366, -427, 333, -139, -429, 557, 332, -179, 754, 569, -318, 351, 878, -15, 441, 588, -588, 121, 431, -555, -380, 34, -980, -610, 416, -450, -346, 349, -263, -220, 1005, 517, 62, 688, 184, -170, 894, 509, -203, 683, 294, -518, 508, -198, -795, -126, -53, -764, -203, -74, -911, -666, 683, -11, 19, 720, -47, 586, 875, 391, 218, 622, 305, 99, 874, 99, -597, 80, -251, -892]
4802h92Q17k32o78P93K7n50P30M82q00N10O35p87L16N61r17M83L94r47l8M37p69
4823d25j93Q16n36l91R37o38k58Q04k68p23R02J69n34R39p9q60J124Q2j120J88
4843f4O61p14K75K37j130L90M40m33LK72m94k65J012k67k41N89n55r7Q63l27k98
4864a43O91l07l15N04N06j021O30l11p88P17K03j161N34L76r20L77O35p90K46
4883c37P48l63n56J115l89l08R06j84p63N69m15m65R46j40r66Q12m28j33L73j36
4903a14p08L31L83o56Q12M97r19L75N27l39K32L95n34l14Q48o45m68P10o92l33
4923f12O19j43o99J009k42n83R20l33p50O10M05o32N57M78r88M05P61r25P30P5
4943F62p96K49M20o60k47L75p01J74L89n29j51P97q0k91Q47j43m59M66mm58P03
$$ y = [-892, -75, -307, -985, -192, -165, -715, 15, 497, -303, 207, 842, 55, 371, 932, 15, 498, 892, -55, -93, 344, -425, -618, 198, -338, -729, 208, -430, -688, 116, -152, -875, 27, 196, -338, 601, 522, -338, 786, 868, -252, -64, 597, -117, 158, 395, -735, -345, 95, -338, -335, -63, -557, -822, 190, -77, -318, 271, -284, -381, 482, 155, -143, 548, 241, -74, 430, 936, -85, 545, 234, -554, 163, 366, -795, -261, 115, -805, -428, 207, -583, -337, 411, 48, -508, 607, 218, -90, 816, 632, -131, 438, 23, -442, 504, 364, -602, 210, -218, -351, 22, -114, -822, -491, -108, -764, 48, 545, -374, 1, 528, 189, 421, 816, 282, -32, 816, 171, -297, 413, -279, -612, 7, -136, -835, 174, -68, -651, 269, -64, -814, -204, 201, -431, 126, 604, -384, 21, 782, -143, 587, 662, -134, 115, 535, -125, -372, 3, -698, -524, -135, -664, -815, -18, -98, -389, 458, 315, -144, 322, 318, -140, 563]
4964E63m14n81P01M92o89L89np37K96M72p96j83M52n00O7M50l07k58O93l75L47
4985G7N35j22l39P33m1r28O45k79q64O05J30p44L16K98o00O30J07o41j4P18p55
5006e33J4N71n58K41Q51o08K91N87n15m52Q01j21m41M66l15j071O27Q6p37N31
5026b85r4m36M85N46p10K13O52n50K72O75r09J1R09n12m8N64q74k24O70k06l71
5047b22L12l18o62P63j93o07N99L95o38R71J21o16M27K89n01J25L1n21K04N74
5067E33p01Q5L31n64mO37m56k23O43l25p43R20l31m54P72k48l18J055p7q85O91
5088C38M39j070O95J71p96NL05m31K95k7n56K61Q10o11j2O76r99K42P97o25j43
5109b36L21k96j87N76P7m07Q74l43l05M61N6q24M3J08l18J84m2o85M74M63n81
$$ y = [563, 149, -432, 269, 761, 72, 461, 456, -281, 15, 487, -309, -492, -40, -540, -473, -23, -330, -588, 105, -270, 77, 612, 490, 151, 884, 843, -85, 560, 281, -583, 22, 152, -592, -276, 22, -578, 52, 159, -482, -496, 222, -533, -519, 52, -506, -265, 586, -22, 269, 856, 341, -111, 690, 569, 128, 594, 279, -792, -165, -79, -816, -285, -379, -815, -330, 216, -494, -281, 371, -179, 93, 768, -141, -130, 779, 267, 219, 783, -91, -315, 355, 149, -222, 90, -228, -890, -127, -320, -927, -328, 67, -571, 400, 521, -95, 332, 621, 120, 245, 276, -245, -41, 533, -168, -83, 248, -316, -320, 317, -139, -362, 281, -44, -787, 133, -198, -652, 120, -128, -446, 609, 532, -353, 338, 777, -293, 402, 573, -223, -218, 87, -344, -49, -76, -632, -371, 439, -172, -184, 492, -507, -265, 532, -93, -236, 85, -211, -398, 178, 255, -152, 722, 379, 74, 535, 591, -233, -190, -82, -400, -216, -258, -943, -469, -6, -587]
5130e87J57O92m70r5Q37k33k78O53k40k87M68k56n71O36j98l76K81p8o20J88J9
5151c58k32O6M61m56L34M28o45M39N54o62K3Q41n65m7N10p82R3L06m60m66N66
5172e2n13o2O38o4o27L47L38o55P43l1m38L98L52j97J81L22l81m4O33r81lJ97
5194A01m08j54M49l93k22N53n3k56K92J39o18P33R3l83L46J70j71Q9J35q20O13
5215B35J72m82K85K19n91J46N2k61j34N85l01m80M71j43k22P50n83n8P90k75k16
5236d1O19j31o63P52l12m48K94R9m37M27J46p12L7N59m40O0L70p79j00R53n56
5257c03J05P09m16j73Q71m49l15N41l05m32L09J41p48M60j80k23L15k82m15P85
5277eJ12n95M93K00k35k1M73l50L80J90l84j65M62l23k95L10j90l51M06j84o50
$$ y = [-587, -430, 262, -208, -303, 534, 301, 23, 676, 436, 149, 617, 361, -210, 426, 228, -148, 133, 55, -565, -377, -358, -590, -524, -63, -519, -185, 243, -402, 37, 591, -71, -48, 793, 228, 181, 691, -91, 2, 308, -152, -618, -52, -565, -627, 11, -53, -680, -333, 5, -650, 93, 62, -376, 22, 374, 177, 358, 680, 299, 255, 888, -93, -96, 101, -307, -461, -12, -405, -627, -74, -127, -383, -91, 48, -570, 163, 256, -127, 219, 389, 218, 307, 442, -378, 235, 407, -75, 210, 429, -162, -16, 36, -225, -359, 226, -75, -555, -84, -227, -449, 301, -282, -340, 450, 175, -41, 578, 447, -216, 536, 224, -224, 70, 169, -268, 159, 305, -407, -370, 189, -251, -191, 179, -600, -700, 253, -303, -198, 511, 95, -78, 793, 344, 29, 570, 265, -167, 142, 283, -465, -5, -185, -408, -93, -375, -790, -5, 107, -488, 5, 205, -30, -51, 422, 72, 452, 642, 258, 93, 555, 232, -63, 247, 57, -294, 112, -72, -722]
5298g22P11j25m80M76J70k01M75O1l65L34M9n61L56N82p40J97J82m94lO44m83
5319F3o23O21k74l84N33r8n28O59j89l53P86j82m94O50l2j74N03J4m78J38ml02
5341a48K3L68n04O9M46m48Q2J06l84J64L73l87o9L67j68j00M90l22j66K85K97
5362C74l54L80J37l96L89o0o78K93K18p57K26m6J4l17L83l47J72M29k21k6M88
5383C01j85q5N42k43j48J44J83o13M62o9o74M22j32l08J21j0n20O85J07l61K06
5404a75K87l5j49N70m90r5P15k87j0K31n58l13O80l84k06M16m03k32L23j95r3
5425d03L92n9n28O50L9m00L68K54l57L91K74l90n2K21k00k84K36m28R1L05k51
5446a31j90M47l23l29O96k74k40N00L7o89O23J64l21J78K73l62J25L24m39n8M28
$$ y = [-722, -11, -136, -616, -140, 30, -171, 304, 365, 0, 334, 383, -178, 178, 760, 20, 217, 399, -95, -98, 546, 63, -560, 61, -213, -597, -64, -162, -690, -31, -220, -573, 213, 31, -463, 187, 155, -19, 484, 498, 20, 158, 154, -148, -125, 243, -261, -192, 254, -194, -112, -6, -390, -226, 147, -240, -309, 58, -110, -210, 280, -42, -208, 77, 374, 20, 400, 537, 141, 530, 470, -208, 85, 303, -454, -228, -274, -260, -577, -194, -541, -369, 60, -161, -187, 301, 116, 31, 573, 330, 182, 326, 509, -104, 358, 289, -385, 37, -95, -403, -282, -292, -812, -127, -20, -381, -175, 112, 77, -72, 498, 8, -87, 628, 341, 331, 562, 4, -309, 371, -13, -219, 197, -206, -438, -115, -310, -403, -11, -70, -598, 52, 91, -309, 59, 313, -44, 347, 621, 231, 179, 400, 200, -84, 152, -276, -185, 120, -131, -321, 126, -197, -526, 170, -104, -344, 156, 193, -496, 127, 291, -30, 148, 421, 59, 184, 508, 69, 11, 439]
5467D39n06J51P8n73j41N85j55j50L65o16J11O16k78K6K31n9j24O85j57n38L98
5488C88N8k35oJ01p07K36M10m01k0K11l08q4J75k49N2M73m79J62O81l60j85M21
5510C34J02m98O29p0n82L48l0m91K15O1m49PK28j11o4L00M5j92P64o55q2M24m52
5533b19K18L58l43O3M53m68l38O04k66l20M28l96k41L42k1m77O76l25k09M89J4
5554B2m62N55J48k65J62M3j42j67O80k91P1P5n27k39O44m32Qj12l1p0L79j59n81
5577f91P41l5k83N68k34O5J13O0j67K43%m38K18O1k15k9J39o19L55L44q54J22
5599e36J71o5K41K24J06j41N6J27j64L94J10o50L38j06j6m9qm48L48L20m72m7
5621b67M03m69L7K78q6j44M50l53q6Q31m09k72N58k36k72M66j24j40R8p6m48L92
$$ y = [439, -67, 84, 162, -411, -552, 33, -122, -272, 93, -523, -412, 204, -74, -48, 183, 124, 0, 685, 528, -10, 388, 446, 211, 205, 306, -401, -165, 245, -156, -176, 35, -273, -357, -182, -431, -379, 94, -385, -223, 458, 98, -87, 334, 436, -62, 567, 497, -85, 263, 233, -258, -43, 18, -431, -424, -196, -307, -371, -71, -26, -218, 546, -109, -191, 233, -219, -1, 357, 14, 77, 530, 62, -276, 328, 62, -258, 170, -226, -467, -125, -146, -623, 53, -272, -481, 8, 22, -440, 115, 263, -2, 160, 203, 61, -106, 574, 283, 354, 429, -98, -337, 307, -125, -117, -229, -260, -330, 49, -110, -691, 50, 15, -268, 300, 66, 131, 244, 304, 137, 380, 380, -58, 160, 221, 6, -23, 116, -503, -148, 196, -658, -536, -365, -430, -189, 35, 141, 0, 56, 183, 19, 413, 523, -127, 211, 105, 89, 40, 32, -416, -68, 252, -220, -267, 136, -333, -296, -18, -104, -248, 202, -151, -237, 594, 185, -87, 471, 235, -37, 429, 305, 165, 263, 187, -261, 131]
5643A31L9o49L12J05l95M19k1q5r3L37m4K63P0m16j8L27j12l03N36k71j53K81
5665B60j85l01L55l55l16L84K3j70K42O5m85K70L76l98M03J48n26M12K50l42j80
5686g0L64k95J71L07n11j83L86j71j35K46n46J25J79K03n44K05M13n68O04R1m62
5707a91M02Ql23N05M3n44kP37p90J63L09q08K11K73k64j35M83l77K13L15m05P9
5729i8M19j5m96M90l9l62M99L5n67M12o6k84j25M67n49kK38m40Q7O02m70Q7L36
5752A59j26m59N54M4M1J72m35J28M44m64r4L29n8m45L46k18l85L01J14m88K95
5773b45L06o76P02m2k00K08K96m51K0N48j96p2L33j22n38J12L12m88M52k47o41
5794f29O27Pl01K00Q9l82L42K87p37M80K91m31L26M25o54L30K39l56k6K81m85
$$ y = [131, 170, -479, -167, -62, -457, -38, -59, -144, -237, 100, 56, 319, 389, -27, -45, 282, 170, -133, 403, 132, -21, 260, 75, -226, 129, -226, -542, -158, -135, -305, -63, 2, -483, -213, 163, -235, 168, 316, -210, 202, 452, 110, -70, 294, -1, 170, 477, -34, -217, 169, -2, -137, 109, -437, -312, -133, 70, -474, -269, 144, -424, 180, 271, -191, 211, 219, -104, 401, 444, -100, -102, 635, -155, 8, 317, -491, -280, -7, -271, -406, 77, -300, -87, 228, -177, -98, 321, 306, -190, 300, 261, -101, 398, 433, -134, 278, 212, -72, -197, 270, -279, -281, -43, -483, -396, 206, -264, -177, 159, 33, -426, 128, 172, 213, 385, -50, 78, 522, 58, -36, 293, 235, -210, 136, -82, -467, -166, -52, -540, -245, 61, -615, 87, 45, -155, 53, 349, -102, -82, 466, 270, 198, 531, 409, -129, -17, 295, -193, 259, 12, -629, -2, 5, -296, -96, -7, -389, -47, 240, -497, -17, 274, -157, 169, 594, -60, 270, 509, 153, 127, 408, -77]
5815g7k54O03l84J6r5k20j47M18K66n06M25J04l91L24Oj77J24M38m60J85M94m18
5837B74k19K44k11j29K73m46n7M80n79o7P05p45LM40J00k67L71qm21L28M60n37
5859hJ83K35n85M44p6m36J6L33l93J48K05k66k18M78n28L3O30j79k51L32mq7L42
5882C48j38m7L08q8l82K19j70k24L5L04o51J43M25j82l8L11n40J30L53j05k55
5903b44O51l34k90P17m34q0N27n45q9M05m3m60M40l81n11O38j74l17J93K4j77
5924d84L43N43m85J50N0l5L5L48m27k28N68l78p3M14o16k93Q56n13K9N34l84o11
5946f57N48P7n97M92J46l85M56J34k84K16L19n90L83L36l13l00J74l11M3K10l42
5967b45n2M58m09J22K32k58k09K81J43j07J95j38k77K89L65l90K60q1m94O33J9
$$ y = [-77, -331, 272, -112, -96, -191, -411, -558, -140, 126, -380, 45, 149, -242, 82, 88, -89, 35, 473, 13, 198, 692, 274, 55, 299, 88, -41, 232, -214, -271, 209, -370, -437, 268, -477, -474, -34, 66, -201, 170, 162, -259, 69, 529, -8, 175, 410, -175, 269, 193, -243, -227, 106, -287, -139, 66, -200, -418, 60, -468, -435, 195, 16, -235, 97, 93, 6, 348, 210, 163, 471, 383, 1, 220, 50, -174, -139, 165, -486, -343, 82, -100, -138, 173, -367, -237, 116, 11, -244, 407, 73, -217, 500, 66, -14, 513, -32, -121, 284, 241, -219, 221, -160, -671, -33, -207, -524, -331, -307, -484, -141, 402, -83, 67, 117, 82, 117, 465, 38, -190, 378, 0, -73, 341, -275, -568, 288, -225, -196, 338, -46, -657, -109, -32, -629, -137, 9, -376, 80, 214, -70, 146, 465, -125, 258, 594, 281, -19, 155, -156, -113, 97, -245, -297, 161, -248, -126, 106, -152, -361, -80, 63, -44, 151, 13, -264, 25, 390, 0, 260, 179, -315, 318, 337]
5988C37l64L0j4j70J18N9n24J62L83k75J7O13m67m2K41R1r9K45k28k02O11l29
6010A93m00M27L4n92N17q1o54N80K25n17K60J84n66L99J77l87K5L60o4j43L57
6031C34j69r5L99m69k37M18N3l94L41k02m14N24j86m03N34j85k17M29K09l35j31
6052a96J79l18K93M43l97LK21j33k33K69k8l12M45m26j31L17j91l31M58k36k36
6073e40P23k10k91M17L44k47n8J45j43J50L8j91j95M65n41O8R0k16j03K37j69
6094b27J50K01r0o15P83l03O1M9J79k98M54j49j30L05o7k24K48M6o28K44J80p04
6116e35O07r8j19j06K59m30L8O96o13K81J36o8k25O56k81m20O72j56j3J66m44
6137Cl00N41k07k22J27O5k30k57N86k93O8K62l38j97O11l07j71O84k76l10N94
$$ y = [337, -27, 3, -11, -181, -63, -4, -528, -366, 17, -258, -241, 372, -95, -137, 104, 195, 96, 341, 113, -89, 522, 193, -207, 220, 254, -338, 179, 98, -556, 24, 249, -268, -8, 176, -390, 9, 186, -201, -176, 184, 120, -23, 334, 165, 70, 469, 0, -237, 181, 234, -160, 181, -21, -435, 89, -97, -500, 34, -151, -368, 61, 270, -65, -196, -17, -335, -42, 401, 4, 7, 228, 95, -138, 131, 103, -209, 236, -190, -321, -4, -195, -526, -68, -304, -540, 183, -27, -318, 99, 443, 196, 138, 283, 140, 290, 328, 137, -58, 407, -134, -66, 24, -192, -295, -58, -227, -77, 124, 34, -581, 202, -101, -40, 9, 188, -110, 344, 195, 65, 370, 303, 79, 327, 373, -255, -11, 169, -535, 72, -26, -145, -251, 8, -422, -384, 312, -301, -20, 116, 48, -177, 479, 198, -222, 450, 294, 281, 447, 3, -297, 244, 37, -185, -58, 7, -223, -480, 106, -187, -119, 143, -195, -392, 219, -88, -259, 425, 149, -161, 433]
6158D33j86l77M78k72q3j9Q4l88L51j9k40m4M48n34L29l0k35K20L93m80K97K82
6180D08j5k87J54j54j72K61l40p5K85l82M1M98k72n03K62J55L2K04j37k72M06
6201I7K72l80M33m13K8J09K31l82RK36l65M5R1Qm16O40m05j76L15k27K8j0J78
6224e4j6L73k30l08K74L27k52L81l70k06J33R2l64K15J95n34LL79k04j41K71l40
6246c76M1O47l99j22J19J10k66P33m32J00K03l4m97M90k29l08K79Jo20M55K45
6267A40m65K61L76m07J03j82p2K80M39k60l65N56l50k3M39k74j76L16p2l17K9
6288b4J52l89Q1L0r2J87j4l80J03M69l7r9K19k52L88J34j36k13J28k5Q3kk89j24
6312a02K75l1o08M22q4m46L77J99k51K27o3k18L86P7k12M50j06l06K42J92m39
$$ y = [433, 247, -130, 348, 76, -7, -26, 58, -330, 21, 2, -238, -282, 166, -368, -39, -69, -304, -84, 309, -171, 126, 408, 393, 106, 260, 106, -66, 195, -145, -220, 65, -317, -276, 222, -50, -553, -291, -136, -104, 100, -37, -309, 97, 369, -11, 422, 9, 37, 146, 377, -5, 4, 240, -125, -80, 11, 19, -397, 243, -162, -338, -23, -250, -222, -232, -54, -70, 303, 73, -235, 39, 366, 114, 495, 125, -81, 52, 144, -220, -5, 190, -344, -341, 38, -166, -307, -36, -376, -335, 312, -87, -209, -90, 20, -246, 487, 55, 155, 358, 324, -173, 317, 88, -220, 59, 60, -560, -105, 140, -325, -64, 312, -95, 8, -174, -246, 34, 473, 213, -152, 404, 54, 31, 470, 196, 20, 336, 264, -53, -24, 128, -261, -180, -150, -242, -55, -69, -449, -346, 123, 86, -13, 206, -46, 342, 476, 340, 127, 255, 230, 313, 311, 22, -102, 173, 142, -466, -44, -128, -574, -197, 2, -249, -22, -85, -303, 83, 160, -52, 398, 292, -14, 228, 420, -19]
6333a9J11J27m85K94J02k91j93L52k04M0J86P0l78L60Ol55N13J6l69L81N0k84
6355C0K51r0m35K84M11n54L0K70l29r2M42m17j27K13j97O5L21l01K47J42p8m2
6377D4J51j08k75M02k71j36M45j1l70J49J31k74K57p3n91M23J30k8k64j24J03
6398b90J11N45m88L27M2p2j38N14o28J53J22k15l92O89m66l55N37N8k40K00j11
6419i7k15J30K21j57J66K07n61J45M98r0j18M21m88o8M91l93k67K22o6QO5j24
6441g0M4k71L11k00K87l7n31Q32j43j66O6L51o23J14L71j08n2M0l28K4L02k16
6463ck78K97k40o3M28l27j52L26m08J83N96l81J6J27M32p25K03K79k29J66m8l40
6485a41k7M00n67K21K97j06j57r2k13J91K11p8k25O18k91n2L62l6m94L11r9k11
$$ y = [-19, 92, 219, -266, 28, 130, -161, -354, -2, -206, -166, 20, 90, -288, 72, 78, -277, 236, 252, -117, 264, 314, 30, 281, 191, -244, 40, 451, -103, -73, 197, -132, -224, 218, -199, -326, -113, -310, -245, 76, -225, 22, 164, 86, 44, 195, 87, -188, 214, -57, -193, 252, 241, -129, 20, 151, -123, 134, 61, -530, -107, 23, -5, -269, -393, -290, -179, 366, -122, 205, 247, 175, 37, 551, -77, 76, 198, -17, -409, 280, -186, -541, -4, 54, -186, 14, -97, -312, -182, 39, -118, 48, 255, -306, -161, 337, 247, 129, 550, 62, -6, 485, 92, -175, 47, -19, -11, 54, -70, -26, -297, 14, -186, 101, 64, -467, 365, 222, 56, 122, 473, -150, -36, 335, 227, 175, 215, -113, -89, 213, -3, -281, 16, -224, -287, 141, -186, -338, -12, -420, -237, 359, -22, -6, 121, 553, -172, 31, 310, 81, 247, 199, -141, -168, 232, -335, -114, 183, 77, -80, -172, -385, -194, 17, -61, -286, 332, 41, -11, 351, 315, -179, 132, 33, -178]
6507a78M64m56K24m2J33p09O01M6m52J24M22l79p2J97j41J92K19j02oK34j87R1
6529B23Q1J26p12N42j99k73M37m68l15M82Jl55L95j62l44K97J49o2P2K29l10N5
6551a11M86k95q2O6k40o3P66k98p72O70k24j07J92k34k9K08o5O1R8j62j76L20
6573IL53m95M20m8l93K91J2j3K29j51k82m8N23l66n8j08p9l49L68M3L6K28j14
6596Hj95M45J25m91M04j32k66M16j48k62J90P4k85J48K8k20n1K19k0J02n8m13
6618c82J85P9J31lJ32k86J14M77l75m0j6J36m7R4k02k45J63P7j46O1j77qJ29J77
6642B8m3m7K36k31j02J92k8L5K47k03k0P5J50l52K26Q1m64M66M5o30M05l18q4
6665c36L59k4k62J27J67k6K89j19j72R7K42j17j43K56m55m9L87k22j26L24m21
$$ y = [-178, 286, -170, 54, 12, 145, -564, 37, 83, -369, -245, 177, -202, -274, -77, -218, -26, 193, 91, 85, 319, 132, 223, 304, 430, -282, 260, 61, -212, 225, -243, -558, -76, -75, -430, -35, -197, -541, -244, -95, -157, -85, 144, -166, -111, 375, 80, -2, 64, -176, -239, 527, 229, -543, 127, -97, -204, -12, -246, -275, -67, -132, -71, 27, -135, -311, 9, 362, -133, 287, 239, -154, 137, 149, 136, 365, 214, -68, -116, 407, 41, -17, -125, -204, -553, -185, -142, -106, 122, 8, -187, 258, 383, -108, 296, 164, -102, 314, 166, -96, 94, 168, -117, 31, 59, -161, -212, 7, -13, 89, 31, -382, -197, -118, 13, 10, 142, -144, -30, 447, 72, 32, 16, 152, 105, 199, -3, -248, -85, -8, -154, -93, -270, -278, -149, 28, -15, -62, 174, -57, -159, 33, 5, 40, 287, 84, 64, 139, 289, -63, 163, 244, -220, 246, 291, -339, 66, -252, -336, 23, -1, -263, -136, 31, 5, 294, 175, 3, 100, 342, 225, 82, 338, -117, -166, 221, -1, -127, 197, -224]
6686b24K2M09M3k94Q0j57j38M23J27m64P8J58j58K69K95o27o1M43l28J95J47n21
6708b83J95L38k02l0L7l67j13M22J61m33K06K30k77N14j05n03L36J49k92N72k26
6729C29m03N8j1j17K50p4k69k7L81j78J16Rl60j89K29M09k20K33j85Q0J63j04
6751A20k55L16ll32M44j16l09K00R1l83L3M25n65K82j10J75l45M27k57j52N51
6772B37r8J16Q7j86j95N57n27n1J88k00j20L00j07k82K42j9j63K30N5m81J88Q4
6794a45J0K84J95k31k19K7J33J18O3m90k2N73p5k06p8j20J35k2L8j83J11M2mP2
6818FJ29l57J44J66j49K50K93o35L7K32K4Q8j5j52j05K3k68N8K34j78l2K29j14
6841i2p3K13j56J00J24K25l95OJ74j20K39j75O7j25J5k62L15K9j96r2L50n23K83
$$ y = [-224, -202, 207, 250, -44, 36, -121, -259, 164, 291, -173, -95, 63, -95, 174, 469, -158, -219, 224, -104, 91, 238, -283, -88, 250, 48, 18, 55, -312, -425, -3, 158, -275, -69, 161, -116, 398, 293, -210, 126, 275, -17, 555, 329, -74, -16, -27, -144, 106, 32, -237, -264, 117, -61, 55, 64, -296, -485, -256, 153, -67, 166, -19, 61, 224, 120, -135, 181, 178, -154, 290, 174, -135, 65, 156, -227, -194, 231, -334, -52, -162, 13, -332, 95, -162, -314, 237, 139, 255, 342, 156, -39, 518, -9, -60, 128, -72, -192, 108, 1, -281, -39, -58, -221, 9, 64, -417, -229, -145, -135, 149, 344, 113, -106, -79, 54, 172, 235, -255, -277, 296, 221, 15, -63, -183, -48, -70, -32, -215, -104, -62, -66, 6, 135, -222, -78, 88, -61, 189, 482, -153, -116, 116, 140, 228, 213, 61, -44, -21, -289, -231, 3, -175, -207, 22, -92, -165, 48, -108, -8, 116, 341, -54, -48, 126, 6, 245, 70, 137, 12, 27, -235, 80, 109, -87, -179, 171, -352, -69]
6864f9k5m12K86j8K18LO8j8j18M54J23l17R6k05l51P10l47j17j41L8j73J95J85
6887F5l39J42J63k0J23Ol87M17j04j45K05O5k28M9J90R5m10K70j89j38L62P4l42
6910g6J1j18q3J90j12P0O8L52m95K71O8k24J40J4l00M17J49l47L9l1Q3j17K76
6933B45j86k91j5K53j64R6k51J8M13J41l80q7K74r0J72J67l98O0j1O7M1J13l02
6956a15n3K20l5Q6j04k59m0N45m21P1K8j0l4K09J82l09R9p4p6K87O8j25l22M82
6980C00l01J16M6r5j63M3j56K49L2m20r1L76O6K40Rm81K36N6J80j35n7p3r5L15
7004A97m6l2j50K21m30J31jr6J63J02j72j9M73m94o8K98j37j27M97j81l62K97
7026F4O2pK77m32j16R8J23k20k7J21l03L61M1j10j40P3J65k7K80k58l40O37m98
$$ y = [-69, -94, -506, -220, -238, -20, -17, 51, 33, -85, 369, 492, 175, 271, 66, -285, 425, 78, -39, -180, -142, -315, -120, 65, -274, -132, 31, 11, 134, 140, -247, 170, 66, -79, 126, 191, -37, 12, 202, 297, -113, 157, -32, -170, 192, 266, -76, -65, -183, -266, -76, -188, -118, -50, 302, -193, 78, 146, -78, 62, 76, -224, 193, 342, -5, 34, 3, 86, -31, 245, 59, -232, -247, 6, -158, -62, -313, -295, 118, 259, -121, -208, 66, -24, 148, 315, -83, -23, -34, 33, 74, 187, -115, -168, 52, 17, 103, -1, -260, -300, 245, -176, -105, -77, -87, -121, 88, 270, -39, 60, -14, -90, 197, 265, 140, -182, 300, -1, 115, 161, 66, -97, -54, -210, 39, 71, -349, -440, -64, 2, 242, 251, -230, 6, 62, 242, 107, 50, -23, -118, 197, 151, 119, -31, 190, -240, -109, -110, -206, -43, 59, -113, -132, 341, -153, -221, 77, -60, -187, 310, 129, -233, 64, 126, 119, 396, -36, -152, -54, 69, -151, -178, -57, -360, 1, 42, -68, -208, -135, 30, 3, 283, 25, -315, 322, -176]
7049a76L73J98l50M4OJ37k29L20k75l77L35P4l52J88j13j86K92L6J23j86K07l22
7071b33L62L66j71j51R3k01KL95o94M7L4Q2J68n5l48j88M86m4p2K38no3p0J58
7095A36k40N9o4J94O9J93m53R9N8j25J57J50m49O9K61k67J2J15j27k22M91j24
7117hJ10J10l78m6M18j5k42J44K5j42K91j23k26J31Jm04J42M10m76q0K17n4J43
7140e2J51k90k0O24l54j95O46n03n7L23J05j99q3j0k69J51K69k08q0M2l04J51
7162a62K12L9k28K6LP4J10j13N3K03l26K15J25M6o01L67J31o7O0J28o54M50j73
7185h2q6N5j63m1L66P1j95k7j18K98O4K10j44k55L76j18l84L35k82j39O04m17
7207g2NJ56P2m02K56k20j4K69J10o03K41K33L06k87O6j85J72K23l38J98k10J7
$$ y = [-176, 197, 395, 45, 89, 95, 232, 3, 323, 48, -329, 6, 80, -272, -84, -197, -383, -91, -55, 68, -118, 89, -233, 129, 495, 324, 173, 266, 65, 67, 462, -232, -185, -151, -69, 99, 44, -304, -492, -6, -50, -122, 116, 111, 48, -22, 136, -104, -45, -109, 85, 154, 347, -106, -7, 51, -74, 83, 233, -216, -147, 114, -153, -141, -26, -153, -375, 116, -8, 102, 212, -166, -212, 206, 191, -51, 93, 118, -24, 267, 144, -82, 49, 50, -354, -212, 198, -278, -358, -141, -195, -52, 99, -191, -211, 413, 59, -136, 510, 7, -50, 273, 378, 179, 96, 86, -183, -32, 237, 29, -51, -9, -313, -162, 50, 89, -139, -113, -110, -36, 74, -39, 14, 217, -109, 106, 231, 277, -324, 43, 174, 107, 167, 295, -359, 91, -82, -168, -113, -276, -317, 49, 120, -75, -102, -220, 78, 142, 352, 208, -47, 329, 211, -173, 162, -120, -259, 345, -72, -67, 89, 161, -241, 15, -205, -219, 50, 160, -443, -202, 31, 337, 50, 116, -69, 103, 326, -12, 186, -24, -7]
7229gj07N27n64j3K20k04j21L00q6j45L39j42M1J10j21j05L02k98J33M4n8l54
7251c09M80J25l63L38l24K26k02K50k94k55K29J65p8J12k95J35J07Q8Q2K0p7k55
7273i5J66L4M2o4j28n4J98N3l99J04j22J15L35j9m09L47k38j7j4L56j15r9P7l1
7297B3N8L73o07m4L21k68L31r3L2m65K46J4j33L11j43k84J88K06j63j74K76j9
7319a4J12K33J41n58R9k40J04K13o0j20j14O2J62k7p4k99L11M7l11N54m88n0K63
7342e4R6O6n4J13m40N5N97k48O2j08k55R4J45j59j21O4j69K42L23j63j92k69K14
7365a61J06L63j92l01M73l29K78k2p1n90K78M58j36j75r0k35K55K09j54J76p3
7386F7j41j02N03l46j5J15P2j5J07j89k43L38j46R5N6k26j66lK97M2k23J05l70
$$ y = [-7, -114, 413, -151, -164, 56, -148, -269, 31, -55, -200, 139, -3, 38, 148, 27, -78, 224, -74, 59, 103, 45, -309, 171, 296, -67, 271, -53, 173, -29, 221, -73, -328, -99, 66, -12, 100, -195, -60, 47, 135, 217, 237, 160, -95, 71, 105, 147, 83, -45, -99, 99, 152, -247, -143, -265, -150, 185, 166, -243, 104, -134, -151, -165, 191, 76, -23, 54, 23, 81, 454, -153, -197, 124, -144, 187, 94, 126, -339, -93, -79, -212, 99, -44, -328, -140, 66, -97, -271, 5, -14, 98, 331, 472, -86, 13, -227, -123, 90, 30, -90, -204, -142, 20, -7, -81, -380, -69, -22, -333, 221, -267, -317, -54, 42, 108, 54, 167, -273, -218, 379, 131, 193, 85, -170, -76, 69, -90, -211, -147, -316, -74, 249, 86, -106, -375, -161, -55, 308, 116, -185, 288, -41, 237, 215, 144, -446, -168, 290, 154, -21, -111, -346, -91, 118, -36, 140, 67, -74, -176, 327, -19, -34, 81, 153, 138, 245, 56, -187, 151, 5, 100, 156, -70, -236, -239, 58, 100, -123, -18, -388]
7409c88L82j55N9j07M5r3K59J41l49j8K78P8J77n7p9j04j07K99j12K38n89p3K38
7432c7N0K7j30k11j6K28m2J45j02J0j37Q6L75j16L4p1j64J52N41m43j09jr2j99
7456b22K66k35m1pK7K98j30q2K1O7L2Q0J56m05j8L26J21j45r3l1q5m5M95k90k78
7481b18J62j42J32J88l93mL24j26k4j32N36m81K6M55l13J92k15Q0P0K95m37k92
7503c17M42q7l35M11l0j49k5n6J41K82l71j66K12n3m0M44m07K37L05l27p8L80
7525D13k13k2j50j07m1K3J09l25K41K52l85K68j10o4j74M77m8j67K54k04J10J44
7547B81j13k82J97p6L6m4K7k50J16Q2j76J91j10q2J5K50m8J48k56l27L13P3J77
7570A42o6J35k19R7M3j87r5J13J9L6J00k58l1K9Mr8J83J23O3k04Q8j42M7L75k75
$$ y = [-388, -6, -161, -102, -209, -164, -257, 2, 143, -206, -224, 54, 132, 309, 252, 173, 69, -38, 261, 149, 387, -202, -275, -37, 13, 40, -90, -301, -317, -89, -131, 14, -88, -78, -215, -129, 246, 130, 164, 93, -71, 81, 622, 179, 70, 69, -23, -222, 44, -191, -232, -239, -212, 86, -44, -126, -105, -38, -6, 74, 230, -175, -193, 133, 254, 109, 16, -15, -100, -145, 350, 60, -218, -56, -198, -66, 122, -271, -275, 49, -77, -101, -233, 303, -178, -152, 303, -10, 182, -33, 47, 117, 412, -25, -317, 125, 38, -297, 114, 84, -65, -90, -146, -5, 277, -94, -260, -48, -101, -141, 303, -104, 133, 438, 111, 33, 413, 200, 178, 28, -79, -120, -97, 12, -313, -72, 180, -205, 63, -47, -111, -285, 192, 144, -23, 231, 27, 137, 281, 168, -114, 83, 7, 43, -1, 26, -224, -108, -26, -202, -11, -121, -203, -188, 62, 14, 162, -94, -421, -108, -35, 142, 76, 211, -8, 89, 132, -55, -150, -37, -18, 18, 118, -140, -171, -142, -138, -236, -53, 70, 133, -71, 17, -125, -78, 297, 22]
7595B2J72j04J65k80J14n51L14K52k20K49j34l66K92J77j39J25k14P6j68J34J21
7616C7J50j05Q5j72K51p7n31J60L78PJ41l16j18j27K88P3j00j76J15K1J0L14k11
7639I7l84J52J58J55j3j68J41r8k33K73J85l24M1J73J32l85M18o31K71J33j5M6
7661A24p7%j14OJ68r3nn9K91p5J12l81O1j03N5K79q3j98r4o6mK78L49m80J60j87
7687a36K72l66K85k55J14N09j76M8k09l28J14M55k53o6J21l28L6L74n01K16r8
7708a72k4J94L71m78k72Q8L30K15l9J49l21N0k02j82J43L63m00L5K02k8j51M7
7730h2m09K45L22J5p6k57k1Q7K20o0l7O2J81j99J71J14m34p2L96L5K70k29n11
7753b69j57M06R8o0O9j38J2k83L80k12L1j35K01K77J84m77K22j87R5J10K95o29
$$ y = [22, 194, 90, 255, -25, 89, -462, -148, 104, -116, 133, -1, -367, -75, 102, -37, 88, -126, -50, -218, -84, 37, 187, 82, 167, -5, 246, 169, -362, -202, 176, 183, 324, 8, -110, -237, 51, 124, 24, -152, -37, -16, -6, 308, 97, -287, -135, 23, 178, 165, -3, 138, 40, -193, 80, 265, -59, -18, 155, 287, -98, 320, -311, -40, 93, 78, 124, 47, 47, -67, -61, 107, 14, 9, -50, 241, 166, 278, -103, -42, -145, -90, 189, 106, -92, -186, -252, -256, 22, 371, -109, 51, -136, 136, -230, 55, -200, -86, 423, 247, 295, 86, -242, -128, 327, 74, 8, 129, -199, -163, 211, -290, -74, -172, -196, -2, 369, -109, -381, -293, 37, 252, 213, 362, 41, 91, -111, -293, -150, 213, -187, -152, 50, 22, -129, -82, -491, -246, 76, 91, 15, -242, -263, -176, 44, -16, -53, 9, 190, -9, 162, 276, -158, -230, 166, 201, 471, 242, -269, -426, -20, 78, 18, 87, -51, -39, -322, 58, -154, -123, -258, -57, 220, 404, -73, 149, -38, 57, 167, 462, -167]
7775a67o4m7K32o0l3J5M9J77l17R4r8j77K95L11R2Q1k34j07k08L46M9l53K37j5
7799I8j36M28m92l7j55K47Q0J66j07k06k06Q6p8N34k12l9N0M65m02k7J1k97J08
7822a21K29%q7k2l57K97L0K6j45J11j75lL77J1j73M2p6K35N3l2l92Q6K37P5np3
7848A48k3j82K01j44j76J63J2m9L09l10l35J94J18m4K10K50l37l9JM5K44l05l8
7871h7K63k53J81k1J62m17L7j9J64j60K98k59r2K65j71K72j30m7k6O0j14J92l8
7894F0J9qK01P3m05M8L1l87L96kj22k18M94j32J95m09l11K30o1L46j05J01Jj27
7918i2K69J72k00J14j87M7J24k22k81L0Rk23M74M4j59j86J70r3K20K37j60j89
7940h2J88j04L25k0k37j4l1J15k51L27l55K5J40o4J04N8j78j15M68j60j24j37
$$ y = [-167, -231, -278, -46, -106, -139, -124, -75, 102, -215, -121, -219, -396, -101, 210, 302, 383, 149, 42, -166, 180, 229, -124, 113, 98, -38, 390, -102, -139, -294, -47, 33, 199, 92, -114, -320, -234, -312, 222, 10, -29, 21, 486, 84, 57, 68, -229, -121, 108, 108, 21, -1, -358, -61, -31, -5, -150, -39, -214, -217, 160, 171, -2, 40, -36, 199, 252, 220, -172, -86, 151, 226, 221, 148, 125, -57, 144, 0, -176, -13, -1, -50, 259, -51, -386, -192, -74, -118, 92, 342, 5, -34, -33, 12, 256, -49, -87, 176, -77, 104, 83, 245, -172, -135, -154, 10, -150, 148, -111, -203, 62, -109, 163, 33, -14, -40, 20, -94, 98, 60, 79, 71, 272, 345, -60, -12, 19, -368, 28, 26, -96, -314, 180, 48, 243, -166, -477, -247, -308, 38, -67, 34, 35, -92, 177, 349, 149, 263, 76, 123, 247, 25, -256, -226, -217, -440, 34, 78, -81, -267, -97, -190, 30, 267, 107, -82, 106, 2, 327, 307, 70, 56, 25, 140, -111, 216, -139, -114, 26, -38, 66, 124, -54, -169, 299, 139, 15, -122]
7962a22l8j20K77J98l55R4N6J65P2q9k70nL0pj66J55J0j4J8J48j02L0p3p9O21
7987D34k85k32j12n2J09J80J63J42l78J43k62N5L69j92j46p2K02jj03J1Q1j93
8009a39k37K68m3J93O4k72J62k7P1M5k28K84k24K24k39o0P5m2L99l82j94J5J80
8032a07r1N14l19n6K04j62J08J98k59m1J21J82k57L2J96n39K38K89O8m06q6j44
8054c17M74k11J02j16k82M21j36K95l4m7l28P4K50J9j04pR2M9q5j13j38k32J31
8077b43L61n2l02R9j33Q9L35j58n0J13o6R5J48k8j77M1J14l31L89l03k40P2K33
8100Fk04l8K54j9p4O0j59K01j8j52M65j28N0m82K53j80N32k17j14j19M6J9m2K73
8124B13j18k54J0L24o7Kk69kK72q5R1j65n7j54N24j87k84L38j9l55L50K50k48
$$ y = [-122, -160, -280, -3, 195, -160, -66, -10, 155, 227, 138, -132, -137, -107, -114, -280, -125, -115, -129, -111, 37, -65, -35, -108, -187, 434, 149, -83, -195, -247, -138, 42, 205, 347, -31, 112, -150, -95, 274, 82, -64, -136, 66, 65, -38, -27, 54, -139, -376, -108, -151, 42, 106, -166, -4, -31, 40, 85, -143, 141, -83, 141, -98, -158, -83, -125, 274, -108, -302, -287, -107, -198, 316, -3, -59, 145, -17, 91, 289, 30, -11, 110, 292, 35, 67, 263, -276, -38, 251, 319, -87, -173, -317, 157, -54, 48, -68, -350, 71, -65, 230, 196, 149, -179, -105, 145, 164, 60, 53, 145, 194, 109, -4, -142, -374, -243, 118, 66, -236, -137, -270, -181, 154, -4, -54, 59, -7, 88, 236, 208, 31, 72, 186, -145, 244, -59, -299, -227, 6, -198, -236, 18, -1, -75, -15, -174, 27, 9, -143, 322, 194, 244, -238, 15, -165, 367, 150, 36, -83, -37, -18, -60, 213, 95, -159, -149, 175, 108, 110, -159, -161, 111, 26, 117, -48, -105, -259, 265, 78, -206, 132, 113, -242, 108, 358, 110]
8147A10j07l06R2O6L34j52l28R1L14n1J27l32J4J65j6oO1M1l59J33L20j57j16
8170f2P5j39O1RP4J40k70o8J04J61l15J18J34k49J30L74l39jJ84k27L22
$$ y = [110, 3, -303, -211, -145, 189, 37, -291, -200, 114, 63, 190, -142, -128, 37, 21, 15, 76, 117, -242, -109, 211, 54, -62, 13, -126, -65, -56, 18, 158, -112, -180, -76, 85, -230, -112, 22, -227, -97, 277, -62, -63, 121, -106, 216]
8191B16
$$ Imaginary data points
##PAGE= N=2
##DATA TABLE= (X++(I..I)), XYDATA
0@%%%%%%%%%qQqJ6j7K5l2M0m8N6p2Q8j04J21j40J65j95K27k61L01l46L96m54N15
33B73n83O58p42Q35r37J049j170J301j444J603j776J967k176K403k649K921l221
50a688L546l905M304m748N245n805O437p160Q001q990J0169j1605J3403j5730
64h526J8873k3380L0437m3161P3378k82980k89921L41597K78314K63359O9386
75D27376m6492r9646j4273o6657q6872j19007j17436n7377N6739J6503j2546P600
87a12088q819m4665J7283L9147N7847J00196P7707m091j7429m2388m0174N2162
99G4688Q7884m088n3228p1695p7444P372P9774L612j00603j56817j43253J5718
111c38080J80860J54009O2848K5785m988K5587R5835L9601o5312p3653n3731k9590
$$ y = [0, 0, 0, 0, 0, 0, 0, 0, 0, 0, -8, 0, -8, 8, -9, 16, -16, 24, -24, 32, -40, 48, -56, 65, -75, 90, -105, 122, -139, 162, -184, 212, -242, 273, -310, 348, -394, 441, -496, 553, -617, 684, -760, 843, -933, 1034, -1142, 1261, -1388, 1533, -1688, 1858, -2047, 2257, -2491, 2754, -3051, 3386, -3774, 4227, -4763, 5406, -6199, 7204, -8526, 10347, -13033, 17404, -25757, 47621, -235359, -525280, -183683, 94631, 357990, 427376, 380884, 281238, 266965, 200308, 113436, -5571, -123007, -180384, -123645, -107142, -119688, -112088, -120907, -165572, -148289, -109142, -51295, 48901, 126608, 122517, 105088, 62700, 22526, 74688, 162572, 158484, 105256, 33561, -43883, -36511, 43263, 46875, -53728, -210545, -353798, -338080, -157220, -3211, 59637, 85422, 80434, 106021, 201856, 241457, 176145, 102492, 48761, 19171]
123A9171O006l6667q9528m6530k3024l9328J8177P4556Q0715J09745P7283m1764
135A08812p7537k5362K0230P5844O2317o1450j12168n3031j0112M2538P9455p35
147D8801p8971n3459j7372K5069O7394P270o5923k9028K2431N4616R9172N3410
159A33410m3957l3558J6807J9278K5513l440p0320o6690m7664p5478m2740K8503
171a60336M3244N9907O0016j4780l0717N1006Q6372O7357K3086p0698r6957j4383
183C117K0961k855r926m8708p0999M058N3603K9381K0816o758m8775j0364L7262
196b9187L1145M2860K7591m3105l8387K1739K5866K8391L1922k4129m9631k5448
208c73l7723l1556J4478N443j2236R186r650j6352N3086P1346J9295n418k6363
$$ y = [19171, 25177, -11490, -101018, -147548, -170572, -209900, -191723, -117167, -36452, 73293, 150576, 108812, 31275, 5913, 26143, 101987, 164304, 102854, -9314, -62345, -72457, -29919, 49536, 48801, -30170, -83629, -101001, -75932, -8538, -1268, -67191, -96219, -73788, -19172, 80000, 133410, 89453, 55895, 72702, 91980, 117493, 114053, 43733, -22957, -70621, -146099, -188839, -160336, -117092, -57185, 2831, -11949, -42666, 8340, 94712, 162069, 185155, 114457, 17500, 3117, 24078, 21223, 11297, -37411, -108410, -104352, -50749, -21368, -552, -7310, -56085, -66449, -29187, 1958, 44818, 72409, 29304, -9083, 12656, 38522, 66913, 98835, 74706, 25075, -373, -38096, -69652, -55174, -49731, -61967, -52781, -62431, -78783, -25697, 45649, 64944, 59526, 33163]
221C3163k9566L2718M8747j4769m1749m3499m6480R872M6565n62j7087K362j3020
234c3305J60L4263J4996M264R122l4553m3906J4623L3355K7288L5662q368m7759
247E842p251J2390n461L429r101l1024K631J6575j2440N936J5219k2719j4797
260d0771J5515J2463M1043O1263N146l3884k9385m2219k1787J4253j3134k7704
272e9201R343R315L924L4388K1537q347N243m868j6964L0062M4347M811j0786
285F2804l7976o5245j7798K2279m959q098R462O906L3998M5839q165k9628n375
298D044j3125q062J4797l661l54M0416J9174k3269k0583k2686j3066K9352J6790
311A9767k5660j1417L52p693J6218R580l1221j5860J3730J1375L5627M4955r73
$$ y = [33163, 3597, 36315, 85062, 70293, 28544, -14955, -61435, -51563, -4998, -5560, -22647, -20285, -33305, -33145, 1118, 16114, 20378, 29500, -5053, -48959, -34336, -981, 26307, 61969, 53601, 5842, -1409, 10981, 5520, 8949, -152, -31176, -28545, -11970, -24410, -18474, -3255, -25974, -40771, -25256, -12793, 28250, 89513, 94659, 60775, 31390, -10829, -32616, -18363, -31497, -59201, -49858, -40543, -36619, -2231, 19306, 10959, 16202, 11334, -5630, 24432, 68779, 73590, 62804, 24828, -40417, -58215, -35936, -40895, -48993, -39531, -32625, 1373, 47212, 39047, 9419, 4044, -9081, -17143, -2346, -6007, -6361, 34055, 53229, 29960, 9377, -13309, -26375, 2977, 19767, -5893, -17310, -16958, -24651, -8433, 1147, -30074, -45934, -32204, -20829, 14798, 59753, 58780]
324E8780j5973n426k2237r773J1272k4505l5194M509J2815J3690K2527j3787k9965
337c3267J5435K3604r89J120r536q532L9715L5268k4544l5653k0334j0086K4886
350b913J9715l3151k5416J8591K2065K4165R788l8223k8969K1326J7721N159R870
363A9728j1397q349K5318N584k6253j5179j8020j2775K8320K5706r517l930l349
376d113j1195J7898J7223k6248k1484P796J8418M3895L4218l2210m7527j0253
388a3582K435J2027P565l7103l2030K5536L0496O346l674k6063j2207M1874L5806
401C7426m772r63L007L754K0380j1418o2682l7660P245J5589K4590O436l4712
414c3780j2425K9834K1550J3298J448l2381j3083L6372K9766Q771k848m0837m0801
$$ y = [58780, 42807, 37381, 15144, 5371, 16643, -7862, -43056, -38547, -25732, -12042, 10485, -3302, -33267, -17832, 5772, 4783, 5903, -3633, -12165, 27550, 62818, 38274, 2621, -17713, -27799, -2913, 16802, -16349, -41765, -23174, -1109, 23056, 32844, -5379, -34348, -13022, 4699, 9858, 19728, 8331, -18, 25300, 30884, 4631, -10548, -28568, -41343, -13023, 12683, 3166, -764, -4113, -15308, 2590, 19813, -6435, -27919, -20123, -1705, 42190, 76408, 44198, -3329, -13582, -11147, 880, 8445, -28658, -60688, -35152, -4656, 1690, -1984, -28047, -40254, 1620, 37426, 32654, 31691, 34698, 38452, 58832, 47414, -15268, -52928, -45683, -30094, -5504, 932, -33780, -46205, -16371, 5179, 18477, 19925, -12456, -25539, 10833, 40599, 49370, 46522, 5685, -35116]
427c5116J2086K4001P948N372j6234j9994K1630J9806j8793j7573j2671j0310
439c9848K2871K1430j6282l387K7004K0224J1954j0455m2861q512M3251K4252
451D9641j3222l2323n0375j6408L8966K1040k0119j8769p924K4390O5966L7501
463G8364j7078k3167k6756k6758R953J4504j5876q436p82j2835M600J2957q204
476a9514L274J9854L589Q787J7391j0762r980J2840j0484k9917j6345r358J9503
489b1122N4411K0181l1278l1403k0055L184L7029P461m6585l0630J0981L1185
501a6641M6147J8090l0383j8703R361P537J8233J7132j6956j8482m452k8244l0664
514d8025k091l63M957J9591L358L683L1335K1562J260M847j5923k8979P137K4109
$$ y = [-35116, -23030, 971, 8919, 14291, -1943, -21937, -307, 19499, 706, -16867, -29538, -39848, -16977, 4453, -11829, -15216, 11788, 32012, 43966, 33511, -9350, -17862, 25389, 49641, 36419, 4096, -46279, -62687, -23721, -2681, -22800, -41569, -49493, -25103, 40863, 78364, 61286, 38119, 11363, -15395, -5442, 9062, -6814, -15250, -16032, -28867, -24267, -11310, -19514, -16240, 3614, 7203, 15990, 33381, 22619, 12639, 25479, 14995, -14922, -31267, -40625, -21122, 33289, 53470, 22192, -9211, -29266, -26082, 10947, 18408, -28177, -58807, -47826, -16641, 29506, 47596, 17213, -1490, 7871, 15408, 33641, 50773, 33817, 15335, 10883, -17361, -48025, -50116, -50479, -45522, -25931, -22573, -18890, 12445, 34007, 35267, 40114, 24191, -4788, 2349, 26458]
528B6458R965O748j9409n0748k5027J1405K0783L2104R231l8319k5214J5894J6532
541i597J1900N584k3057j0569K8836K4359J2089Q583j7990k1316M476m798j2225
554c725J4320O040k4652k3757k3228j4319K7285L5105N339J151J886M88L0613
567C2546L4417j0686k6810j9701k6020m781K3496Q967m429r655l3140k1668K0236
580c7228K3476J4225J5776q734j6088J7490K0959l781r107k0224k1557J4551K8767
593A8525J2094J2703p145m5309l5159n881K430K5126L0026p223j7153L367R122
606d477K1611K4971j1960k0239P914O958J468R581j4533l6388k2327j8917j1620
619f7958K5822L4798J2644N330j0615j8615K1763L9327L759j7253k2653k2461
$$ y = [26458, 36423, 43171, 23762, -26986, -52013, -40608, -19825, 12279, 21510, -16809, -42023, -26129, -9597, 2303, 7887, -15170, -25739, 3097, 27456, 39545, 48128, 30138, 8822, 13298, 8500, -3725, 10595, 16635, -8017, -31774, -55002, -69321, -42036, -6931, -1592, -441, 1445, 1933, 32546, 66963, 56277, 29467, 9766, -16254, -21035, 2461, 11428, 6999, -2656, -35796, -57464, -37228, -13752, 473, 16249, 7515, -8573, 8917, 29876, 26095, 16988, -3236, -24793, -10242, 18525, 30619, 43322, 36177, -9132, -44291, -50172, -47742, -22616, 7410, 187, -16966, -13599, -4477, 17134, 42105, 30145, 9906, 17820, 24778, 26246, 35827, 21294, -15094, -37421, -56338, -67958, -42136, -7338, 5306, 10636, 21, -18594, 3169, 42496, 46255, 29002, 6349, -16112]
631a6112J4292L6344M804k0389k5358l3572p759K7548J4826K14M333j3793j7863
644c2485J0962J4399P237J4719n4r847J5575J8362J283N854p799l4551k2719p933
658b6997q714J4367K0706j1531k3075j3556l970L3127N2283P402k4419j2664Q50
671C809K5106L5447j0372m7704k9851q208J2215K9508J018k7487p023L655l043
684b2930J1487J0574n155N013O919j1087J722J5767M954Q546L969k5320j7298
697a2839J3527J2073R123M548k9160l8416o794J1932K2615K6026j0280k9254O577
710b0322K9375K6191J9793j5861m4493j2275K0079J5057M351j8595l6086n667
722c8453J7776J355K136J3224M222J0508J5445j2615j6577R547J0435K417m586
$$ y = [-16112, -1820, 34524, 39328, 18939, -6419, -39991, -47750, -20202, -5376, -5162, -829, -14622, -32485, -21523, -7124, 113, 14832, 14778, 4931, 20506, 38868, 40151, 46005, 38206, 3655, -19064, -26997, -35711, -21344, -638, -12169, -35244, -48800, -52770, -19643, 32640, 40042, 15623, 2959, 3809, 28915, 64362, 53990, 6286, -23565, -31773, -19558, 9950, 10968, -16519, -23542, -19887, -22930, -11443, -869, -6024, -1011, 5908, -5179, -3457, 12310, 17264, 25810, 29779, 4459, -12839, 688, 12761, 21884, 26432, -2728, -41144, -47938, -36006, -13391, 12635, 2355, -26899, -20322, 9053, 35244, 55037, 39176, -5317, -17592, 2487, 17544, 21895, 3300, -32786, -38453, -20677, -19322, -17186, -3962, 260, 10768, 26213, 13598, -2979, 6568, 17003, 19420, 14834]
735A4834k6309j5277K6477K4023m891j5182k8958k4216K1374L5460R438n229j9791
748h247k0507J5284L0452N632l445q490j7617J0269L2027J811k1976k0498k2024
761b7329k912J6134l328r039J1367Q987M389R009j1001j4200K2472K8083P23j1133
775B2222j8002r140K3135J7242k4180l1967j8602j987L2004L2553j3093k6928
787a6743p454K302J8100K0967q383j3596N570M278P555J6016q659k1121j49J527
801B10n037O694j202j0982O613M851j1312m200k801l836K1368K1769j1889j5626
815e380J064N940J9651J3412k5742k9043l09J1104J8227J2133k3400k4457J3022
828a3778J9524O035J718j5566j6164J3272J3273l553N76l516p966R741M364j7182
$$ y = [14834, -11475, -26752, -275, 23748, 18857, 3675, -25283, -49499, -28125, 7335, 16773, 11544, -8247, -28754, -13470, 16982, 22614, 19169, 10679, -6938, 3331, 35358, 37169, 15193, -5305, -27329, -30241, -14107, -17435, -26474, -15107, -6120, -1731, 7278, -3723, -17923, 4549, 32632, 33355, 22222, 4220, -4920, 18215, 35457, 11277, -20690, -39292, -41279, -9275, 23278, 10185, -16743, -24197, -21895, -3795, 17172, 8789, -4807, 763, 5041, 12596, 28612, 19953, -1168, -1317, 210, -4827, 1867, 665, -10317, -3704, 1147, -10165, -14365, -17166, -21002, 366, 22135, 10246, -5380, -4316, 1624, 21275, 34687, 8945, -20098, -20407, -9303, 8924, 21057, -2343, -26800, -13778, 5746, 11781, 13499, -2067, -18231, -4959, 8314, 4761, 5337, 1821, -6145, 3596, 7960, -9222]
842i222m505R680K209Q021P109j4185o846P895o9L090N794j3506q508J6715J1362
857A5034J860J157k1199k3417P083J3893M966N190q773j1540J6423J5967q870
870G774p479m234o789J4073J5428j0653p309M258l523O61J14j7622l222K0700
884B177P305l148j186j3670p904J4005L530q080M201O51k26J6059N095j1967j572
899E270l239j2598N671J1045m509R96J432j1976M7Q472o545k299P860k427K917
914A17J0792p341q691P586j577o571L385l884j178J8497O234j1426l395m156o272
929g880J0785M692j2665M18O220m393L456K778j1287L31P833p766j437J1706J429
944D220K356N558j3419j0801J1061M043j094P290m177n790J1163J347j2009j410
$$ y = [-9222, -13727, -4047, -1838, 6183, 13292, -893, -7739, 156, 87, 3177, 8971, -4535, -13043, 3672, 15034, 16894, 18051, -3148, -26565, -19482, -5589, -623, 4567, -4206, -15746, 677, 16644, 7774, 295, -3939, -10728, 3345, 18773, 8120, 811, 5069, 1546, 2207, 2321, -15301, -18523, 2177, 9482, 6334, 5148, -8522, -16426, -2421, 1109, -6971, -2770, -2119, -2345, 13714, 18809, 6842, 5270, 2031, -10567, -4896, 6149, 1640, 2636, 4068, -7908, -7861, 611, -5934, -8233, -373, -2800, 117, 10909, 3568, -5123, 2463, 886, -5685, -2300, -6184, -7362, 11135, 17369, 5943, 2548, -1608, -7880, 2905, 7597, -5068, -4650, 1570, -2823, 633, 3411, -7876, -7545, 288, -7478, -8915, 2791, 4220, 6576, 12134, -1285, -12086, -1025, 3018, 1924, 9214, 5037, -753, 10410, 11757, -252, -1662]
958a662l794r816O486M478n883P998Q693q776k241K023n805P623J4567k614k029
973I248L752r547m871P143n829n950M507n819l976J5361O586p306m014j2694r557
988b2966J5639J3071m878n60j267m458J3996R651j2740n618N413o83M750L132
1002A2482j4892m574Q236o917q693R97m658O862K2062J021j4151k381q36M673
1016g69J8174Q33j6068m302j796l114J2358M305j4732j795P012J345R795L167
1030A4413k0262j3120L125K045J2660J4022q890o315Q813l073p388J251m000M319
1044b400K0888K658j5507o951n684j771J0978n746k1641K926K1210J6731J4098
1057B9789p468k9154r693J0167M157N523R71j2329L984J9414q54j1912j0042j8646
$$ y = [-1662, -5456, -15272, -8786, -4308, -10191, -2193, 6500, -2276, -4517, -2494, -8299, -676, 13891, 11277, 9248, 13000, 3453, -1418, 5725, -104, -6054, -1547, -7366, -11342, 4019, 10605, 3299, -715, -13409, -22966, -7327, 5744, 866, 306, -961, -5419, 8577, 18228, 5488, -130, 5283, 4600, 9350, 12482, -2410, -6984, 1252, -5665, -14358, -13361, -18019, -11157, 10905, 11926, -2225, -4606, -5442, -769, 17405, 18238, 2170, -2132, -3928, -7042, 5316, 9621, -5111, -6906, 106, 1451, 11246, 14413, -5849, -18969, -15844, -13799, -1139, 12883, 3993, -2322, 6491, 3418, -3970, -2719, -6719, -2400, 18488, 21146, 5639, -1312, -6996, -8767, 2211, -3535, -25176, -22250, -1040, 15691, 29789, 22321, -6833, -16526, -6359, -2202, 3321, 4292, -8037, -4053, 15361, 14507, 2595, -7447, -26093]
1071b6093l825K0771J4803Q818J1965m572j2713k713j2915j8389N825J5659J2013
1084H634J6474k583k5201j1777O38k468N760J672r289J3029K8709N383j2108j8239
1098a366k2758L125K9097J2435m421n064j0487O3J4272p323k2703o451j74K477
1112a9278J4917M992o980Q114Q817n209k285n521j0165J3577K2742K501m078o724
1126A5420j9301o958N906p250p738L146K332J3298K1781p011k4928j0263j688
1139b3254J2838K9705R332j4492o805k360k736O849m756j6655M941J3707k121
1152D193k955n983j3356M643J5484k971o589K93j412J1267J6486p392j1821N706
1166E593K547R60L965j3836j8412N075J1867Q099Q333j1234k3503j298R874O869
$$ y = [-26093, -29918, -9147, 5656, 14474, 26439, 21867, 9154, 6441, -6474, -24863, -19038, -3379, 8634, 25108, 22525, -2676, -14453, -13815, -16283, -10523, -8851, -18140, -5111, 23598, 28981, 16873, -1366, -24124, -20999, 8098, 20533, 16112, 11048, 561, 624, 14896, 7573, -15130, -21581, -21755, -19278, -4361, 631, -6349, 1765, 10582, 5373, 3088, -2433, -12598, 979, 23721, 26222, 22144, 15420, -3881, -10839, -4933, -12183, -19921, -16775, -14443, -1145, 20636, 13625, -11303, -21566, -23254, -10416, 19289, 28621, 14129, 7324, 4964, 2228, 9077, 4321, -12334, -7393, 6314, 4193, 1238, -4745, -18101, -13458, 2026, -945, -7534, -7241, -8653, 2614, 19100, 11708, -113, 5593, 8140, 9100, 13065, -771, -19183, -14108, -2241, 5858, 14191, 2957, -20546, -21844, -11970, -5101]
1180e101J6850R385j0451k499L815q396p217l989q827P263J6412k554p083j00
1194b492p525p76J3077q44n699R980Q318R37l14j5647j5797J0421J2821j366M6
1209E140q722j4654Q582J6863l54l134n463j2558J885R177l127L710J1439j867
1223F917J161R528o187r360K934k952l143P290k618p550J440p535j2511L713K460
1238a6413k101J6554J6235k289j382k165o030R533J0845p568r064p136j3407K631
1252a1757J3426m784o445N123k107k238N474l609k794J0478K833J06J0232o48
1266A3290r940J436m907j2476O085J3506M194N710l394j6998o571n15p960M153
1280a4387J0120l532L288J2073o23n51N758o384q174K130k665K266J2842j900
$$ y = [-5101, 11749, 21134, 10683, 8184, 11999, 3603, -3614, -7603, -16430, -9167, 7245, 4691, -2392, -2492, -10017, -10793, 2284, 1440, -4259, 5721, 14039, 14976, 14662, -985, -16782, -6361, 6460, 5094, 5140, -3582, -18236, -9654, 7209, 6855, 3721, -1742, -14300, -12415, -3238, -6365, -2655, 8784, 6917, 8078, 17606, 11419, 2059, 4993, 2041, -1102, 6188, 3570, -3980, -2540, -10075, -22586, -18873, -16413, -18514, -1960, 14275, 11986, 10604, 8439, 2409, 11942, 22787, 15219, 6155, -981, -14388, -11757, 1669, -3115, -9560, -4437, -6544, -8782, -3308, -6917, -9711, 767, 3600, 3706, 13938, 13290, 3350, 4786, -121, -12597, -6512, 6994, 11188, 16898, 13504, -3494, -10065, -10580, -18540, -14387, -4267, -7799, -4511, 7562, 6939, 6388, 12146, 5762, -2412, -282, -2947, -681, 12161, 10261]
1294A0261j0929J29n599r978O100N176k094P546P388j537P080K653j2485p477
1308c766n190j1220P348J9004K986j158J48j0226m972N185m965l275Q675K600
1322A174K874R621m376j1431M107n37q077K506K735J093J2127M001j3884q247
1336f314m810p449Q294R689p204p21R706L562P278O972j0645r134K421k023K175
1351A797R475o188j0185L112j466o317K712l282o021R515Q833k85N912J106o036
1366B682O467L131j4374o346M281K529J0303O912j3569j0375L510P35M640L709
1380D235j2458p147J4174Q227m20K89j0817r797R339P251j510M106j329m542Q742
1395H343L054j2659l639J708k897N792N889q764j687O952j11K256M88j4161m982
$$ y = [10261, -668, -539, -6138, -16116, -10016, -4840, -6934, 612, 8000, 6463, 13543, 16196, 3711, -3766, -8956, -20176, -12828, 6176, 9162, 8004, 8152, -2074, -7046, -1861, -6826, -10101, -1426, 1174, 4048, 13669, 9293, -2138, 1969, 1432, -6645, -4139, -1404, -311, 11816, 15817, 1933, -6314, -11124, -18573, -10279, -590, -7794, -8515, 1191, 4753, 12031, 19003, 8358, -776, 1645, -378, 1797, 11272, 5084, -5101, -1989, -3455, -9772, -7060, -10342, -16363, -6848, 1985, 1700, 7612, 8718, 2682, 9149, 12280, -2094, -8440, -4159, -1630, 8673, 15585, 2016, -8359, -4849, -4114, 526, 4235, -8223, -15370, -1196, 7031, 6611, 6900, -3917, -13714, -4375, 2876, 1366, 5472, 4143, -399, 8343, 11397, -1262, -4901, -3193, -6090, -298, 5591, -3173, -4860, 2092, 1981, 4237, 4725, -9436, -14418]
1410a4418J3825P521J777K6j2987r568J0735P113l352p42o909j653J7780R814
1424A8962r606o803n532n353R773O852r508l579L559j788L077n68j4012k511J3022
1439d015M891K940L779o676m22J3145J577r106n221q108L06J6371N338j1184p169
1454c554p590n212R721N619r874k030O213N759J3564N733j4214p932L731P09N711
1469F354N887q206l242Q503j935r317o780j0504o59J6388O453m274J769l7M10
1484H10J0102k776j6278l199P482Q422J4193K206j7155r307J094l162K425K626
1498b517q953J908J4663M711j102k512j4069o873J0046M709J430P780m24k191
1512F606N856n804j6561m217J380L050J2938M171r437J89N585j032J292k883j1957
$$ y = [-14418, -593, 6928, 8705, 8731, -4256, -13824, -3089, 4024, 672, -70, -6979, -8632, 9148, 18962, 9356, 2553, -2979, -8332, 1441, 8293, -1215, -4794, -1235, -3023, 54, -514, -14526, -17037, -4015, 876, 3816, 7595, 919, 497, 13642, 15219, 6113, 892, -7216, -6910, 9461, 14799, 3615, -3554, -11144, -16356, -6635, -1016, -10890, -12920, -6707, -948, 12616, 18349, 4135, -3797, -66, 643, 6354, 12241, 4035, 793, 9296, 7361, -1956, -8736, -19240, -19899, -3511, 2942, -1332, 437, 400, 810, 10912, 8136, -8142, -11341, -3859, 4563, 18756, 20962, 3807, -5500, -4406, -7568, -5143, -2517, -11470, -9562, 5101, 9812, 8710, 6198, -7871, -14744, -4698, 11, 1441, 9221, 8797, 6606, 12462, 6658, -9903, -14120, -12740, -9690, 3248, 7419, -2018, -1829, 3756, 2724, 4016, 1133, -10824]
1527a0824L088J6591O822J53m984j6551o546P914m52l840J782k561K166J3181
1541E939J617q128K63j208j282R800K977n865K809K251n287L3k692j0789J071
1556h491P154k967j167k08p731K882J2316J095j847J622m209K314J2235M19p365
1571F052n40l421j754Q087j903j2620k946j415k877O814L659m674M547O416k346
1586A079K396J671p030J703P398k978j043M851k643q99L031q412q556K447j23
1601g108K642R717j236q989k18k395l956O911M531j390Q120O793j545K870k948
1616A1799j3436m164J905m168K303O346m676k003L162l668L03P912R25J642P362
1631A1544k690m669L808l923q640r44l568n043O784O156J11O501K374n930J611
$$ y = [-10824, -7736, 8855, 15677, 15830, 10846, -5705, -12251, -4337, -4789, -8629, -6847, -9408, -7242, 5939, 7556, -572, -309, -1517, -2799, 7001, 9978, 4113, 6922, 9173, 3886, 3919, 1227, -9562, -8491, -1337, -4304, -5471, -5679, -13410, -10528, 1788, 2883, 1036, 2658, -1551, 763, 12998, 13417, 6052, 5512, 2091, 337, 8424, 6521, -6099, -9045, -10460, -13337, -6523, -2864, -7538, -2991, 3425, 1079, 3475, 5146, -1884, -181, 7217, 4239, 3196, 8047, 5404, 4505, 7536, -876, -9432, -6985, -7108, -4466, 5251, 4015, -4974, -5192, -7587, -11543, -4632, -101, -1491, 6629, 13422, 11877, 14747, 11799, -1637, -5801, -3896, -8064, -5761, 585, -4091, -6094, -2932, -6600, -6297, 1615, 2540, 4182, 11544, 8854, 4185, 7993, 4070, -4570, -5514, -9082, -14125, -7341, -1185, -1074, 5427, 7801, 1871, 3482]
1646C482O15p409O83N289k609J674M887m311k131R76o720k572O253Q50K614O888
1662H459n828j0644j80j131p39Q258M232n35P405M174k595K278l480j0961J50
1677a137K737o054j352m7p277L58O297j312J849N247j079M530R849j457l560L957
1693A1549k970n900J47o154o954N629N707J612M229n697j1260J541L018m135K177
1708g461L759j261O859R068l935m357k031l215P523J1799k841o286j902q734o372
1723i387J662n186n706N570O681N571Q554j201n132N451K994m575K79j736o771
1738b932L274N340o240n192k548l044O433Q528m135k011N403R10L253M773r721
1753B091j1852J270L699N430P277m104o957M097J912k989J977l726p354O040P334
$$ y = [3482, 4097, -3312, -2629, 2660, 51, 1725, 6612, 2301, 170, 1146, -5574, -8146, -1893, -1043, 1571, 8459, 2631, -8013, -8193, -9324, -10063, -1805, 2427, 1892, 9297, 13471, 10876, 13154, 9674, -1287, -1137, 1600, -4454, -5806, -5853, -13130, -12772, -6475, -7787, -5938, -691, -1770, 2760, 12609, 11152, 7592, 11549, 8579, 2679, 2826, -3328, -10282, -4653, 1054, 2666, 6895, 1198, -10062, -8521, -5503, -9638, -7461, -3702, -4963, 1896, 10964, 7029, 2672, 641, -2574, 4949, 16748, 13907, 7621, 5719, -3015, -9387, -7725, -12911, -18617, -13047, -6366, -795, 7759, 6558, 1426, 6877, 9871, 5296, 5575, 3839, -2932, 342, 5682, -558, -5750, -8298, -11342, -4909, 3619, -516, -2527, 2876, 3786, 7039, 11812, 2091, -9761, -8491, -4792, 638, 7915, 3811, -3146, 951, 2863, -126, 1851, -1875, -9229, -3189, 4145]
1768D145k940k148k944m130O353P826k688J54L751k047K279L103j0409r252K246
1783f701J626Q95J628p877n493Q907P675L490M567l662o004Q567P193m056l848
1798F907n971o679M774M792o189m038j772m429N657Q566m575k786M421J632L056
1813C366M441n544l911O040K268l38K136o141n730P038L043o666m780n474l596
1828a3848Q774O574m226k055n67r24R495P786o678m383K989J307M803L037r005
1843C079p920J176m65P28M275n211m602P010L229k228J383j910k358O892L038
1858F116m576m52j149k752O274L174q745l148L709P01M851L065q663m951L757
1873b789J911L636L038q405n152P370L825q93J448m978m787N958L407l120l14
$$ y = [4145, 1205, -943, -3887, -8017, -1664, 6162, 3474, 3628, 7379, 5332, 7611, 10714, 305, -8947, -6701, -5075, -4180, -2552, -10429, -15922, -7015, 660, 4150, 8717, 5055, -949, 7618, 14811, 10755, 6907, 936, -5743, -969, 3823, -2366, -6404, -8176, -12605, -6948, 1618, -2957, -5743, -1322, 310, 3366, 7807, 2263, -1648, 4392, 6660, 6322, 8458, 2317, -3413, 3625, 6668, 2, -4778, -10252, -13848, -5074, 1500, -2726, -4781, -5348, -6272, 3223, 11009, 4331, -52, 2937, 4244, 9047, 12084, 3079, -4841, -3665, -4130, -3402, 873, -4338, -8940, -1930, 1299, -929, 454, -1456, -3814, 3078, 6116, 1540, 1088, -61, -2813, 3461, 6635, -2110, -5258, -1549, -848, 4003, 7068, -1595, -6546, -2789, -878, 2758, 5796, -2609, -7761, -391, 3434, 2541, 3989, -989, -5776, 182, 3589, 469, 155]
1888A55k805l894N748L306n217J388L764j119K957K929n828j000L603j734j30
1903B123k10q563l051O604J08j986K242l258j018Q972M923r01J228l963l092O513
1919F671K321o640j944j858n424L591M147m829j602J932j941K850L845l808N88
1934b101O142j936j336L218k615j459N905k20l903J094k007j717M513k602p930
1949f954L76L72k069O353M475m230M15K291j252M302M261m605j122J599m269L2
1965b5L551n754m752K564o31Q81O624J8j769L098k127l825L116L12l287M029R25
1982B948n592J645K357k954J205N53m682K129M544k153J123K107n969j916M382
1997b73l87K019O582p28l063J033l591l084K168m232o737K114J908l19N956J032
$$ y = [155, -2650, -6544, -796, 2510, -2707, -1319, 2445, 1326, 4283, 7212, 1384, 384, 3987, 2253, 2123, 1913, -6650, -9701, -3097, -2989, -4975, -2733, -5991, -7009, 1963, 6886, 5985, 7213, 3250, 158, 6671, 8992, 2352, 408, -1450, -6874, -3283, 864, -3965, -5567, -3635, -5576, -2726, 1119, -2689, -2101, 4041, 2105, 769, 3987, 1372, -87, 5818, 5598, 1695, 2789, 782, -935, 3578, 976, -6954, -6578, -6206, -8275, -1922, 2553, -1677, -1262, 1029, -223, 4079, 8340, 3735, 2613, 4212, -57, -25, 3526, -2228, -6980, -4416, -5047, -4166, 2458, 2476, 707, 3805, 1678, -2147, 969, 1281, -2006, 2023, 2948, -2644, -999, 1358, -1596, -391, 162, -4520, -2391, 2153, 0, 1123, 3230, -2739, -4655, -273, -660, 1359, 7941, 7213, 4150, 5183, 1592, -1492, 676, -3556, -10293, -8179, -6271, -6590, -634, 398]
2013C98m972K695M341J118O162K921n210m42L51o989k677M43n353p22M144j271
2029e063L64M229j678j848L505j620j783N759J452p53M532j421n644J829K703
2044D563k68L697j048q038n69J439n034j910k234p033K960J0451L623K542K748
2059E889l139R68O661q26l166J654l110l570J702n157q107M57J027N2O073K704
2075A12j977N027L114m008q45j236n177L362P033r10o21j4n286M71N427k211l907
2092a646M72l149N54O849l020p731o79L83L032R642L375l374L354K195k886l84
2108F987n383r914k12L657k159P26J703k816L913P596j970p67M211N84L215M989
2124A4360o447q671k101l070j397M011k335m211M972M605J533M408k763p750Q70
$$ y = [398, -4574, -1879, 2462, 3580, 9742, 12663, 7453, 7011, 7362, 373, -2304, -1861, -7214, -7936, -3792, -5063, -4699, -470, -2148, -3996, -491, -2111, -3894, 1865, 3317, 2564, 7096, 5675, 31, 1860, 4563, 4295, 7992, 6944, -1094, -1663, -224, -5258, -7168, -9402, -16435, -13475, -3024, 599, 3141, 5889, 2750, 3718, 10379, 9553, 6387, 8041, 4931, 1361, 3063, -2094, -10201, -9744, -8717, -8665, -2592, 112, -1865, 3162, 6276, 2268, 1423, 187, -4990, -1628, 5405, 4495, 3874, 3860, -1426, -955, 4472, 2261, -1646, -1174, -4323, -3769, 3080, 60, -7671, -8350, -7967, -4935, 4707, 8082, 4708, 8062, 10257, 7371, 6987, 1604, -8310, -8522, -4865, -7024, -6298, -4595, -7411, -3498, 4098, 2128, 1361, 5572, 6156, 9371, 14360, 7913, -758, -2859, -5929, -7326, -3315, -5650, -9861, -4889, -284, 1249, 5657, 2894, -4856, -3986]
2139c986M958N72L314J21o341K129N584j485j359j60m723J346M914m280o180j272
2155f848l612m44N033k079j804Q200P220M020M886l288o610K805K592m714k442
2170B915n605p584K887M738l676j850J63k835N749R746N72m87J448l268k74L788
2186F427m280m892J735J42J526O310j427o486O81p20l709J107j717l734N497N594
2202B054k428p00r35k632O507Q374k492k620J17k931J334J953q617p568J069P29
2218h786L740P152j011l055M899J714j000K554k808n631J992J328l067K181l24
2233a22m635J509K540l311J736L985r17K982L825n885m287R09j960K133N464l184
2249G82l433M622J710j70J504o026o930L441L417r47J222k540m790N184O306m18
$$ y = [-3986, 972, 1544, 4858, 4979, -1362, 767, 6351, 4866, 3507, 3347, -1376, -30, 4884, 604, -5576, -6848, -10460, -10904, -5871, -7950, -9754, -1554, 5666, 9686, 14572, 11284, 4674, 7479, 10071, 5357, 2915, -2690, -10274, -7387, -2649, -6325, -8175, -8012, -10847, -5098, 4648, 5220, 4733, 6181, 2913, 2639, 6427, 2147, -2745, -1010, -868, 658, 6968, 5541, -945, -264, -984, -4693, -3586, -5303, -9037, -3540, 2054, -374, -1074, -2009, -4641, 1866, 10240, 7748, 5128, 5245, 2314, 3648, 5601, -3016, -10584, -9515, -8786, -5046, 2106, 1095, -1960, 2939, 4653, 3653, 6207, 3399, -2232, -240, 1088, -1979, 202, -122, -4757, -3248, -708, -4019, -2283, 1702, 785, 3767, 7592, 1707, -2580, -1671, -3631, -1498, 3966, 782, -2651, 1971, 3681, 3511, 5015, -1011, -7941, -4500, -1083, -2030, -808, -3348, -8138, -2954, 3352, 2934]
2265B934J979J724l888J483K268m797r44K133m229k150J139m569j648M983r1M26
2281c247M940k53j019M696o60l967R17k066l268N796L881j982O11k247n748K404
2297a212M073l944j547p72l725K669O074k388k062J749j922R19O241o12J55M239
2313G935j732m024O26l029m128K772n61m023L574L263p00L011q81o316J41K832
2329a240j552L900M226l487j350J062l618M58M455k108j830K282j570P24N148
2344E500k709n877K89n79q99N668J253l543J656K53l246K409P84l978J459J651
2360I1m383K948N203j348k87J491m522p1M778j709q11J966m299k986K932k019
2376c026k298M096l70l355K687K426P53N425o19o622l18J447o44M400J480o621
$$ y = [2934, 4913, 6637, 2749, 4232, 6500, 1703, 759, 2892, -1337, -3487, -2348, -6917, -8565, -3582, -3673, -3247, 1693, 1440, 421, 5117, 4457, 490, 1407, -659, -3927, 1869, 5750, 3768, 4379, 2132, -3616, -1212, 2861, -1083, -2630, -3402, -7127, -4458, 1616, -772, -2834, -1085, -3007, -2088, 4153, 3541, 3696, 7935, 6203, 2179, 2805, -224, -4352, -1580, -2141, -6164, -2590, 673, -27, 2984, 2103, -4213, -4072, -1240, -2792, 1108, 5334, 1847, 497, 1559, -2059, -1601, 2854, 746, -1084, 1198, -372, 352, 5500, 2791, -3086, -2797, -3376, -4275, 1393, 2646, -897, 759, 1012, -2234, 175, 959, -3019, -1560, 91, -4292, -1344, 3859, 2511, 2224, 3715, -807, -878, 3900, 2191, 1380, 3346, -953, -3939, -1007, -3026, -5324, -1228, -1598, -4953, -2266, 160, 913, 6338, 5719, -903, -1221, 226, -418, 3982, 5462, -1159]
2392a159r04L235j309N15P18m411r76L394j210o0L699k922k167L388p74o94N322
2409C685R52k291J556j691l204K579J71l820J812J28n235J811M142o84J860R48
2425B719o365k85M162P38J244O76n184j137O279L84k539Rl059j215N950J465l074
2442G68P53k412l076L052J36k966M379L784k699M58K15m448J024K559l731r83
2458c187J208l000J918N794j334j491K419k353l29N714O69l001l3l613k115M171
2474A437j207o523j141M59P66P337M311l531K28Q37k804M12j8m219K111N878j349
2491B984j177J237l512j084M065k660l275K572P70J23K896m121o747J333J008
2506e588N71O364L139k232K946K512k143M22k073p660j828K621k5L184K967m871
$$ y = [-1159, -2063, 1172, -137, 378, 1096, -3315, -4291, -897, -2107, -2167, 1532, -1390, -3557, -169, -943, -1637, 3685, 4637, 2346, 3902, 2211, -993, 1586, 1757, -2063, -251, -123, -5358, -3547, 595, -89, 1771, 2719, -3646, -3931, 231, 969, 2213, 2889, -2295, -3432, 2847, 3231, 692, 701, -2358, -3573, 2377, 3842, 768, 1521, -891, -3967, -915, -779, -3745, 634, 4418, 1719, 2177, 2392, -2056, -1032, 1527, -2204, -3187, -1979, -4979, -3061, 2733, 1399, -92, 2327, -26, -355, 5359, 6028, 3027, 2994, -619, -2734, 1437, 230, -6293, -7434, -6975, -6209, 1128, 5439, 1908, 2136, 2973, 169, 581, 563, -3656, -1545, 4333, 2984, 1807, 3044, -468, -1552, 2513, -147, -3422, -850, -80, 43, 2939, -1182, -7929, -6596, -5588, -5017, 1347, 4486, 2254, 5200, 7712, 5569, 5991, 3918, -3742, -5570, -2949, -2974, 210, 3177, -1694]
2522a694j927L440j540r12K199j396J398N787j299m169j5k080j603M422J39l418
2538b668M499M202m61N03m048p138N50L640j814O07R54l119K292N196k207j324
2554c36J070k494O99M281p90j507J608l083k781M061n2k755K948J065j333L699
2570D300l39m924k57J36l178J937M63l972K450N906j655M41Q47k376J724M931
2586F434k813m100j53k369R68M821k176l903K516O02p81L085n63l308K474N97
2602A331l015J127qm139J705K546j329K802L636j884j20J991k726r94J200l873
2618a750j081L205j755k528K131o12k32M656n50l477J582J223k76K924j518m594
2634b652J819K514k106J069N18k862K543L756l008j365M86l673j71L104k347n34
$$ y = [-1694, -3621, -181, -1721, -2633, -434, -1830, -432, 5355, 4056, -113, -128, -2208, -3811, 611, 750, -2668, 1831, 6033, 5572, 6075, 2027, -5111, -4561, -921, -2735, -2128, -1174, -4293, -2001, 3195, 988, -336, 734, -1760, -1061, 3220, 2430, 923, 2531, -552, -3333, 728, 676, -2079, 869, 1934, 601, 4300, 3961, -963, -1220, -1084, -4262, -2325, -1862, -5834, -3384, 2522, 867, 1308, 2155, -221, 1503, 6434, 3621, -479, -632, -3001, -2033, 2788, 612, -3291, -775, -173, -954, 2131, 1568, -1740, 734, 1331, -1684, -557, -565, -4704, -2999, -453, -1782, 1020, 4656, 2772, 2652, 4643, 1917, 923, 2123, -1750, -2831, 374, -1381, -3909, -1778, -2390, -2622, 2034, 1484, -1993, -411, 812, 536, 3460, 1942, -2652, -833, 1681, -425, 644, 1162, -1700, 843, 4599, 1591, 226, 712, -2961, -3132, -28, -2375, -2909]
2650b909M345j276j791K750j165j253L419r65j877K651l01k641J501m35k688K888
2666B53J597k776J351K281k058Q25N25m911r8L481k295j015J960j594J167M902
2682C595j327k824J514j009n25L219j042k487K767r3l019J340o2k735K575J625
2698A512k496K366J791l128j053m38m255R17M252j256R61L738l31R1K683l029
2714B325k446L240r05k095J466j499k253K398j794n082P21K139O04M897K304l390
2730F30J382J147l064m6J133l167Q49L984j395O32K214k755l387R74k384J34L819
2747G00m95k511J972r09j924K604p96k369L775K924j053K226Q41k561Q32m87n388
2764b619j100K592M8J977J281m334j173L456j155r45J647k041K26M974O8j756
$$ y = [-2909, 1436, 160, -1631, 1119, -46, -1299, 2120, 1155, -722, 1929, 1628, -1013, 488, 53, -2635, 253, 1850, -926, 425, 2706, 648, 1473, 1998, -2913, -3011, 470, -1825, -2840, -880, -2474, -1307, 3595, 2268, -556, 958, -51, -576, 2643, 1601, -886, 1881, 1788, -1231, 109, 47, -2688, -113, 1512, -984, 1382, 3173, 45, -1008, -1446, -5701, -4784, -532, -1788, -827, 2911, 2580, 2671, 5354, 2325, -121, 3119, 2214, 119, 1585, 86, -2167, 231, -1563, -6645, -5924, -3785, -3181, 1716, 4020, 630, 2012, 3159, 95, 49, 1182, -1985, -1136, 2848, 1453, 2085, 4299, 1544, -1843, -869, -3253, -3119, 700, 205, -2306, -334, -1243, -3167, -563, -1359, -3728, 47, 2971, 1918, 4144, 4985, 2424, 3256, 2769, -2619, -3719, -1127, -1079, 898, 2179, -2155, -3328, 128, -1027, -1972, -325, -2366, -2140, 2834, 2902, 1146]
2780A146J313j921k623K716O94j841K803K36l673P53Q40k237J339Q00k940P54
2796a841K767k055O81K637k033k05J925l472k198L458M66k11J559k191q14N019
2812C492N11l313j00j840j552M191J737l939q72q7j674K448J738k744J266K628
2828A890k111O78K086k723k65J845k394j793K952m53L28L057j477j382J965j124
2844A079k593K327K21l694M84j32j404L446J548l318o0J398j98M135K997m479
2860A757j993J803j247n9J378l267o84L031m30r98J533j516j519K655j316l193
2876d065K631J546p66J870l91k369K461K243j486J533M91m126Q2J458k361k37
2892a486J527l457p84L111O78J549K860l258k224K953n5j297P87k380k770K745
$$ y = [1146, 2459, 538, -2085, 631, 1325, -516, 2287, 2523, -1150, -397, 443, -1794, -455, 345, -2595, -1841, 926, -1129, -448, 2189, 156, -49, 1876, -1596, -3794, -336, 130, -81, 1478, -713, -1527, 3492, 4003, 690, 590, -1250, -2802, 1389, 3126, -813, -1685, -1772, -3446, -998, 740, -2004, -738, 1890, -221, 457, 2543, -180, -445, 1400, -994, -2787, 165, -288, 40, 3097, 1620, 238, 2203, 1079, -1514, 813, 1034, -2660, -2176, -2308, -3712, -266, 1282, -2036, -2096, -698, -896, 3239, 6236, 1757, -236, 1567, 320, 261, 1639, -1628, -2312, 719, 289, -709, 824, -692, -2211, 444, -872, -4065, -1434, 112, -654, 1216, 825, -1544, 917, 3160, 1674, 3207, 3698, -428, -346, 1112, -1249, -1486, 41, -3416, -4200, -1089, -411, 1138, 3998, 740, -1484, 1469, 1414, 117, 904, -1476, -4246, -1501]
2908a501K015j806J595R41q47K919N54l332J137K142k993j288r68m004J56L796
2924a484n77k02J834p39J292M409j569k275J415j940j851L146N3j772P28j623
2940a155j738K924K278j098J076m84l793J328J456l217j321J139j222J535K727
2955D35j007J264M043q55j049J036k227j101K526j648m042J4m92j5L167n60l377
2972c888J913J897l04K634J142k957j05Q61k637R94J896j310K26J315k301O95
2988G1K976j935k205R13j474q43K409j070j860K388M92q95K019M74r09K259k72
3005B538l856m0J614m81J714k60l945M83K505k80J317J846k716k19K283k083j782
3022a362P63j876j735K406k64k4M243R1k242J646pj232K060M10l074M34J050k272
$$ y = [-1501, 514, -1292, 303, 1244, 397, 3316, 3870, 538, 1675, 3817, 824, -464, -1432, -5436, -5280, -1484, -2061, -2263, -429, -1168, 124, 4533, 2964, 689, 2104, 164, -1687, 1459, 1512, -260, 468, -1155, -2893, 31, 2309, 1211, 2287, 1803, -1990, -662, 794, -2423, -3744, -2605, -3827, -2292, 435, -572, 692, 4735, 3880, 2831, 3867, 1640, 539, 3065, 1417, -2625, -2611, -3103, -3118, 49, -511, -3888, -1975, -78, -382, 2252, 3394, 437, 332, 1193, -1444, -450, 1446, 136, 362, 1677, -624, 71, 3047, 1112, -1093, -180, -1654, -2497, -88, -1158, -3018, -630, -138, -1033, 986, 1460, 551, 2810, 2538, -1318, -1358, 256, -225, 1489, 1229, -2716, -2233, 272, -8, 1309, 3155, 439, 220, 2503, 420, -1362, -599, -2475, -4210, -1804, -2068, -2092, 2151, 2242, 0, 1646, 1639, 407, 2467, 2877, -197, 237, 1287, -985]
3040i85L38L91k278J382J891k483P16K796p62k2j02l453j608L179P94k29K150
3057A715j012n23L521l9k887P01l98k069J193J50k456J097J77k525L15J561q22
3074b301K651K491k206j05K049j323j263J022k208k15K310q47r91K740o06j099
3090I9J207j716k039K546J198k172M65j040j372K515J496k639P93J606q24J500
3106A623J304k663p72J667j819n63J816j238M30K733j801j438K058n65j796J227
3122B03q89j814J626n2k204J660J248j224K215R43j795K467K070j934j196J78
3138A502k235L3J731k989r37J972j015P45K288k232j261K857K31j351J454l09
3154D84j109K086m77j686J535R44j372J473O03k747P95Q43k807m35R81j839K47
$$ y = [-985, -647, -256, -2534, -1152, 739, -1744, -1028, 1768, 1006, 984, 882, -2571, -4179, -1000, -206, -435, 1715, 703, 180, 3701, 3662, 775, 1476, 1078, -991, 202, 352, -2104, -1007, -830, -3355, -3040, -1479, -2301, 350, 2841, 635, 530, 2579, 1256, -7, 1015, -1193, -1408, 902, 55, -936, 1804, 1198, 99, 1306, -410, -2449, 97, 1295, -877, -412, -1452, -2824, -309, 1187, -1452, -659, 947, 123, 1623, 2927, 264, -508, 1159, -660, -1223, 593, -645, -215, 2518, 717, -721, 1337, 772, -1024, 203, -686, -2500, -874, -926, -3130, -1470, -222, -1446, 769, 1712, -83, 2384, 4454, 2520, 1324, 1502, -733, -700, 1031, -1958, -2895, -923, -1938, -1193, 1095, -1137, -2398, 459, 690, -661, 793, 484, -625, 1461, 984, -702, 833, 1777, 405, 1878, 2481, -266, 529, 1372, -1435, -1870, -889, -2728, -2481]
3171b481J787j707O12L103j213p42K136m25o9K429j294k511J273K72j823J486
3187H33j703k185K357J860k096J106q4j647J570J238k782R8J936o19R25J090k561
3204f64k95K393j433m48J768j050l59K262j717j893J872k80j923J620K70j147
3220a024J789N97k973N99J320j551Q34P25j683J447K091j816l03J367j792P93
3236D20K254k224j323K043n57j085P79k180j356K763K72j641J816k76j371K315
3252F49N27k220J602R33j390R53Q56j675Q78R50k463l43J545j664j44J660k149
3269a495m17K217j302j229K051l73j0J982p98k100K317J058j749J004m39j661
3285i44K101J345k201l4P5j919J370J117k715J0J551j449m6J837j131qK566o36
$$ y = [-2481, -694, -2401, -1789, 1314, 101, -641, 1495, 1070, 1001, 3430, 2136, -375, 898, 1170, -653, 833, -870, -3055, -698, 1162, -934, 172, 88, -1559, 11, 1249, -1533, -1435, 501, -118, 807, 1897, -664, -959, 1434, 1, -447, 1321, 271, -88, 2174, 457, -1436, 436, 156, -1767, -147, 123, -1024, 765, 1362, -1611, -1012, 308, -1243, -409, 316, -1367, 80, 2171, 355, 52, 1419, -373, 420, 2674, 450, -873, 1170, 613, -472, 307, -1873, -3229, -466, -194, -1835, -19, -295, -1666, 649, 1176, -1044, 558, 1491, 101, 1054, 1910, 235, 1113, 2063, -400, -743, 802, -862, -1006, 654, -1495, -1912, 305, -997, -2226, -175, -548, -558, 1424, 626, -1474, 843, 1901, 152, 1156, 717, -944, 1157, 2502, 301, 267, 342, -1577, -207, 910, -1805, -1795, -244, -1693, -1739, 98, -1033, -1041, 1525, 889]
3303H89j120K199n39j012J619j474j518J548N12k042J151L77k088J291J76j996
3319b027J150J672j564K8P51j900J139K374j782p63J670l28Q25K020j680j803
3335b18J546o98j564J342j091j652J952rk055J452Q05q96J735M45j913J279J803
3352B263j983L64O29k078K9K053j677j90K351j802l94J634j534m74K240j650k134
3369b353J495O3k47K139q90k121J811J410j142R95k40j911J370J305k291J0J186
3386E89j231L22J628j802j50K680j249r36P05j995r12K423j058j169J898k20j133
3403a610K574N36j193J853K67k345J251R00k036M87j21l068O29K047r93M03P40
3420C21j678N4K293j610j017J632p07j46J929p01j205K813O91j782J111p01j301
$$ y = [889, -231, 1968, 1429, 417, 2036, 562, -956, 592, 1104, -938, 213, 590, -1498, -207, -31, -2027, -877, 795, -769, -741, 10, -1890, -751, 1623, -159, -922, 748, 420, 1245, 3265, 1585, -218, 1328, 630, -934, 408, -683, -2335, -383, -392, -2447, -995, -190, -1086, 649, 1094, -819, 460, 2263, 280, 644, 1273, -805, -776, 1277, -400, -590, 1761, -41, -435, 1199, -335, -809, 1431, -219, -2353, -858, -795, -1042, 1097, 207, -1914, -103, 1307, 165, 1160, 920, -991, 379, 1684, -607, -597, 589, -642, -320, 1308, -494, -644, 2036, 787, -149, 556, -1439, -2351, 72, -986, -2155, -257, -477, -1610, 964, 1500, 307, 2160, 2427, 82, 1333, 2233, 197, 684, 563, -2505, -1876, 171, -822, -419, 321, -1357, -1303, 990, -620, -1637, -5, -712, -858, 1071, 370, -835, 1978, 2669, 887, 1998, 1297, -4]
3437dJ846j40l352J21K20j631P36J163j716R41K211r61J039K215j114m15J153
3454B312j811q00K055p24j724J157j123r57K091m74j724J317O69j590J333o7k069
3471b129J747J210j920M50J361o95J475J578k672n72J658j006k90O91k408j054
3487b576K040l03m41K542r90q26J700o94j835K008J51j504J268R2j957J336N77
3504E88k192Q08J581p76J146J512k200o3R59j851o69R75q27M0J818j685q96J818
3522H6l72k95J253j028j931K566P64j278J276M44j804J176O63k214J247J367j605
3539C15M87N82k254k32P99k205p31J714J42N79K175r37j031K135n89n76K102o05
3557A870j377J952j080k702J005N67j920P53J06j742J575J929k004L09R53j423
$$ y = [-4, 1842, 1702, -1650, -1529, -1309, -2940, -2204, -1041, -2757, -1816, 395, -566, 473, 2688, 1574, 1159, 2312, 501, -299, 1756, 1032, -692, 465, -658, -1615, 476, 2, -1722, -405, 264, -1326, 7, -60, -2129, -382, 828, -1092, -642, 719, 24, 1499, 3077, 405, -167, 1491, 485, 195, 886, -1522, -2576, -536, -839, -1280, 1262, 272, -554, 1146, 452, -1383, 625, 776, -728, 540, 632, -1325, 11, 588, -1604, -796, 785, 9, 1155, 2667, 467, 404, 1363, -488, -1157, -182, -1009, -969, 849, -836, -1732, 86, -286, -581, 672, -356, -2287, 279, 1043, -235, 1041, 1485, -319, 857, 1520, -694, 553, 1920, 315, 802, 1384, -870, -1102, -303, -2508, -3239, -1525, -1383, -804, 1371, 434, -597, 1538, 949, 373, 2475, 1870, 493, 2445, 1365, -1337, -332, 235, -1685, -932, -826, -2568, -993, 936, -1068, -759, 194, -1229]
3573a229P10J986j454j75K008r25j67J144j088q80J747j078k087J322j95r55J325
3590Ik83k284J605N46q84J457N20j317J432J052k057K28J381j347k08J052j670
3607g68k98K391r96j078R28q64J01J884q49j850J667k28j169J244M9j477J441
3624A28L95j729J138J207j279J030P49k509P23J588j275JJ019j324q8J146j503
3641e83q68J807j124r89J468q45p71K374K05j606J000L89m85K110J57k349R20
3658H10Q60j900J007M01k379J87J056j526l00J619j181M06J534j910j82K301q5
3675G18n86J874p27j139J713l09j947J205k64j495R88m7j694J463L84k028N95
3692a296J262p36Q44J114k382M46J848p79J23J160j502p96J887p96j249J713l54
$$ y = [-1229, -519, 1467, 13, -162, 1846, 921, 754, 1898, 810, -70, 1677, 599, -1488, -166, -361, -1316, 9, -274, -2558, -953, -407, -1291, 166, 686, -631, 801, 1853, -204, 24, 1405, 58, -150, 902, -768, -1066, 1325, 329, -749, 179, -685, -584, 1300, 451, -1399, 268, 40, -1129, 115, 164, -1313, 128, 523, -1206, -68, 1139, -140, 890, 1639, -870, -147, 1441, 166, 167, 1186, -138, -226, 920, -583, -1451, 356, -768, -1757, -289, -1134, -1905, 469, 674, -932, 68, 457, -28, 2082, 2239, -110, 810, 1670, -230, 777, 1178, -1201, -1014, 42, -1484, -1784, -165, -1346, -940, 594, -1316, -1498, 803, 718, 132, 2006, 1279, 140, 1853, 1544, -403, 802, 538, -957, 31, -16, -1710, -247, 137, -1891, -1296, -34, -770, 74, 1188, -1194, -748, 1100, 321, 444, 1604, 102, -694, 1193, 397, -852, 861, 507]
3709E07o17J500j087k213J281L85j122J588Q4j653J708N23j660K12P89j323Q80
3726b18J505j456J88J408j741k63J534o75m23J568j030q66J439k30j343N57p68
3743h14j548J525K03j343J487J210o09P99M24j949R62J322j101L18O78j745Q35
3760F54R19j907j352J005k64P7J752j159r18R51n68j098J803m57n30K003P16j287
3778C40J271O90j790P49R3j841M70O93k456O22J265j649R0J305j365K28K044o19
3796A40k11J343o57k17J422j281j692J300K26n37J562n70j659J263L70j699N79
3813c18J01j553J109J239j702L22J290q07K37J488j602j9J869j239o69J285j122
3830i1r16J275n83q41J183k81o47J436J04q93J269o0k171M59J015j255O41N94
$$ y = [507, -110, 1390, 303, -1910, -629, -244, -1366, 222, 306, -1347, 361, 884, -776, -564, 225, -1098, -218, 1287, -169, 19, 1427, -314, -577, 957, 282, -141, 1427, 397, -469, 970, 740, -603, -46, -814, -2362, -837, -634, -1977, -490, 720, 111, 910, 1334, -615, 347, 1669, 568, 886, 1564, -181, 654, 1573, -334, -1686, -681, -945, -868, 884, -275, -1193, -242, -810, -1908, -105, -562, -1092, 911, 1627, 340, 1611, 2301, 511, 1260, 1353, -488, -18, 675, -1781, -1159, 106, -1543, -1453, -148, -1513, -1285, 759, 140, -71, 1272, 615, 398, 1820, 539, -1153, 147, 373, -164, 1398, 828, -831, 432, 802, -897, -318, -217, -1770, -661, 578, -1124, -802, 488, -319, -82, 1406, -196, -215, 1654, 415, -254, 1031, -91, -1007, 268, -315, -1156, 27, -254, -901, 535, 639, -254, 1015, 955, -1216, -757, 258, -997, -356, 238]
3848B38j521M60J856j429K90J114r06L94J361j605o70J613q68q38R28r67q41J966
3866E75k55j051P38l44q36J294K88j861P52J395j494J053J256j344R27Q41j341
3883E93R5J321j654l17R04j655j175J491j171o80J200J77o14K091k15r15J761
3900A237N33j196Q05J1j332J341N41k172o6Q33j420M95N35j711r9J442o89j59
3918a071J153j146m1J923m19o33J573J02o79J533j081j313R40j20j605P26k92
3935d50j454J075N36j255N87Q18j165R92J335j032P36J207j442o00J208j138l41
3952c83J261j017p37J656m76r58R74o68j027J609j25j549J358Q11j353P44Q41
3969I61j922Q67J007j207J90O08j083N16J333j669n91J363p79L4J560o58o24J499
$$ y = [238, -1283, -823, 1033, -396, -106, 1008, 102, 496, 1857, 252, -418, 1195, 327, -511, 417, -550, -1391, 575, 320, -731, 7, -337, -1173, 121, 409, -1452, -700, 695, -799, 254, 1510, 166, 1093, 1934, 593, 688, 2009, 355, 38, 942, -713, -1888, -397, -1568, -2248, -1048, -871, -1485, 606, 391, -524, 1237, 1770, 574, 1379, 1390, 58, 1399, 1940, -232, -298, 535, -885, -390, 145, -1566, -1665, -223, -912, -1071, 82, -1064, -1105, 818, 399, -234, 1339, 1441, 762, 2295, 1214, -99, 841, 721, -884, -158, -450, -1904, -829, -293, -1548, -961, -143, -1308, -316, 1019, -13, 723, 1930, 488, -112, 1096, -42, -383, 878, -139, -876, 780, 304, -654, 320, -348, -1375, 234, 109, -1440, -82, 729, -624, 120, 961, -961, -94, 913, -294, -104, 504, -579, -63, 1270, -399, -990, 373, -406, -372, 1188, 530, -94, 1405]
3987A405n60j390J077p46r96J195J0j586J304J98j057J174K63j328J219J017q62
4004C37K09J118p49l92Q13j367k30J103j504p09R97q87l8J068l92r91J255J68
4022a91n91J388K33j078J858N35j490K20M87j485N40M83j590L8N35r41Q6M82j327
4041a808j05J779k28j6J339n06k89J471n41o37J367q20j086J073n74j058O98Q
4059F7j681Q67M36j117N58P09p71Q96J333j312j54J038q10k01J198j219k22J846
4077A461n20j043M96p31p56J506L9j242R61Oj132J152J46j685J046R18j111O84
4095A95N11j463P59P25j262J41Q99p60j2J197l86o45J550p63q29J234q99j193
4113a001J180n46r24J167O0j602N77N65q10J568R21j232P62Q91q45j15P19j546
$$ y = [1405, 845, -545, 532, -214, -1210, -15, -5, -1591, -287, -89, -1146, 28, 291, -1037, 182, 1199, 337, 546, 1664, 915, 523, 1336, -31, -261, 842, -662, -1371, -374, -1261, -1299, -231, -623, -1614, -359, -191, -782, 606, 839, -239, 1619, 2154, 664, 884, 1371, -114, 426, 909, -681, -643, -108, -1049, -963, -481, -1808, -1913, -134, -362, -378, 961, 455, 166, 1637, 1096, 459, 1826, 1006, -80, 993, 419, -639, 59, 67, -1614, -747, -311, -1428, -870, -161, -932, -36, 1297, -15, -169, 869, 59, -142, 1056, -163, -385, 1461, 941, -102, 394, -337, -1093, 413, 452, -790, 171, 177, -955, 197, 343, -1342, -296, 622, -489, 195, 706, -757, 2, 727, -535, -394, 505, -255, -267, 930, 544, -101, 1449, 686, -143, 1091, 192, -1001, 179, -367, -1291, -124, -64, -1666, -1089, -524, -1334, 234, 1155, -77, 685, 1576, 731, 616, 1335, -211]
4131b11L5J314j143l77O35j285j31J144p70p43J054J02o14J084m18m83J080P52
4149A025o80Q41J41q66O99L72j182m8L12j604l80P82j198O38P83n51m5J328m53
4168h6k11J281o95k55J336k56j202R86m77o91P83j96j259J087M00q97M90k12j277
4187a351O80Q32j017J5Q40r15R89J187r17n25J251p29j32Q15p89r27J371n75p30
4206f27P77k50p76J189k02o01Q65P5r44O23J81j042L12O93j134P14R03j072L46
4225C0O45q18N37J358j163r06J128q96l63J143j072j130J328o6p46Q18k6r24J428
4244C05M12j152M50O76j139P96N71j069p2J297q27J49N96j344JJ070r07k96Q89
4263D06j339m58J060k96n02J434l77p92J430Q6l79P95K35j022L37L57j256L83
$$ y = [-211, -176, 1138, -5, -382, 253, -1032, -1163, -19, -789, -1532, -478, -376, -990, 94, -324, -807, 273, 1025, 345, 1186, 1327, 461, 1160, 1532, 350, 302, 614, -990, -1370, -588, -1786, -1148, -365, -916, -961, 367, -86, -297, 984, 289, 34, 1370, 1114, -88, 898, 421, -270, 513, 317, -942, 145, 545, -352, 138, -74, -1351, -671, 161, -856, -841, -1, -916, 73, 1260, 343, -182, 1069, 340, 208, 1023, 234, -693, 678, 103, -627, 150, -100, -876, 313, 111, -490, 375, 450, -494, 129, 310, -732, -420, 273, -861, -147, 756, -316, 30, 675, -143, 394, 1752, 589, -317, 811, -85, -448, 695, -377, -1507, -179, -245, -991, -173, -199, -1123, 305, 717, -435, 15, 691, -448, 348, 919, -150, -222, 1075, 248, 397, 993, -351, -350, 720, -187, -483, 406, -933, -1391, -331, -627, -1129, 305, -72, -864, 566, 652, 273, 1068, 1303, 281, 618, 975, -281, 102]
4281A02M34j045J37P62j165O0J133r73l15Q36q29k29J502k49n48P78n96j78J439
4300A056Qj068O82K60r08P26l21j192N45M15j188K32N48j273Q04J183j477N15
4318d53Q87m21j63J404q02n37J016m02k44Q47m01j146R57m27p88R95J38j475K31
4337g84K19p66J096J87o24J14J121n40L70N76q10l2J145q00n12N72p00j97J140
4356G75q81q18J074l95n40P30j71j021J246Q9p42R38L4r78O69O03o92N48N14r66
4376A6K50O22q33j06N00p51m21J057p65m63Q02m58l68J233l35o66R13J35n26Q79
4396G15l67p86J001O6n90K21Q4o56J84J104j398K51M88q68L97O39j153k24P73
4415a19n65n6J004o04l41J175j93l68Q00r5o22J142k31j187L80N27j306N55K78
$$ y = [102, 536, -509, -372, 390, -775, -715, 418, -555, -870, -34, -863, -1092, 410, 161, -387, 391, -205, -383, 1056, 1064, -4, 678, 938, 30, 756, 435, -757, -212, 203, -985, -753, -205, -1478, -674, 509, -968, -453, 434, 13, -150, 1254, 452, -85, 931, 529, 285, 1132, 731, -415, 542, 115, -673, 322, 460, -1015, -784, -565, -1331, -235, -48, -672, -558, 563, 23, 393, 969, 159, 127, 1272, 472, -40, 532, -168, -365, 775, -106, -924, 150, -245, -785, -55, -226, -1247, -1, 88, -654, 284, 318, -660, 9, 612, -80, 468, 982, 16, 266, 888, 55, -51, 449, -302, -723, 334, -431, -894, -92, -550, -918, 315, -20, -686, 227, 362, -164, 715, 348, -438, 563, 629, 39, 260, 344, -312, -128, 976, -422, -171, 317, -551, -154, 485, -668, -892, -119, -684, -740, 264, -340, -681, 494, 301, -67, 733, 638, 16, 1158, 927, -260, 120, 647, -659, -104, 174]
4434A74j090O4Q10j034M51R77j065J30O46m50Q7R55m80n99J088k01k73P35l49
4453E76q43P85J29r63M27l49p56R85K58j164J70P45q93R01K44j049M78J219o14
4472B86J49M60j040J26J057n01n37M82n03m07P94m31n53L82k06p89J146k61o86
4491a032P75N52r49J269L33r26M84N32p25q6Q04j279J02P03p86l44P84p63j34
4510f86J234m48p52O74l15n22J318p85m65Q13K20q42J306R5q82P08N27j025M39
4529F12lr34j00N55r43k19R63p81MJ280p03l71J343l32n40P35l16n42R52j02p70
4550b12R66k02j110P59N5o18L34N87j202L21P92j354L48M51q70M93J311q35m66
$$ y = [174, -916, -852, -42, -1076, -625, 352, -713, -583, 63, -387, -300, 655, 175, -424, 664, 463, 190, 925, 576, -267, 518, 647, -316, 111, -238, -994, -9, 249, -915, -745, 0, -893, 8, 252, -797, -319, 900, 286, 435, 895, -145, -19, 1038, 537, 0, 482, -21, -428, 366, -65, -618, -236, -442, -1231, -85, -346, -1032, -257, 295, -654, 615, 948, 22, 506, 1038, 313, 227, 1031, -248, -146, 557, -229, -573, 211, -552, -686, 548, 100, -652, 22, -293, -815, 503, -282, -747, 66, 286, -556, 750, 845, -37, 671, 1198, 173, 612, 609, -325, -425, 130, -813, -1032, -69, -850, -846, 434, -269, -640, 703, 371, -169, 566, 250, -292, 660, 558, -212, 754, 552, -558, 201, 256, -362, -28, 559, -643, -322, 470, -884, -536, -85, -955, -462, 849, 14, -452]
$$ [...]
8191C10
##END NTUPLES=NMR FID
##END=
