##TITLE=1H_CA-8534-13-1
 CDCl3, 8 sc, 
 13.2.2019
##JCAMPDX= 6.0         $$ Bruker NMR JCAMP-DX V2.0
##DATA TYPE= NMR FID
##DATA CLASS= NTUPLES
##ORIGIN= UXNMR, Bruker Analytische Messtechnik GmbH
##OWNER= root
$$ XWIN-NMR		Version 3.5
$$ Wed Feb 13 14:18:49 2019 Russian Standard Time (UT+4h)  she@DPX200
##.OBSERVE FREQUENCY= 200.1313
##.OBSERVE NUCLEUS= ^1H
##.DELAY= (6, 6)
##.ACQUISITION MODE= SIMULTANEOUS
##.ACQUISITION SCHEME= undefined
##.AVERAGES= 8
##.DIGITISER RES= 18
##SPECTROMETER/DATA SYSTEM= spect
##.PULSE SEQUENCE= zg30
##.SOLVENT NAME= CDCl3
##.SHIFT REFERENCE= (INTERNAL, CDCl3, 0, 15.7039)
##AUDIT TRAIL= $$ (NUMBER, WHEN, WHO, WHERE, WHAT)
$$ ##TITLE= Audit trail, XWIN-NMR		Version 3.5
$$ ##JCAMPDX= 5.01
$$ ##ORIGIN= Bruker BioSpin GmbH
$$ ##OWNER= she
$$ F:/spectra/data/she/nmr/H-F/1/audita.txt
$$ ##AUDIT TRAIL=  $$ (NUMBER, WHEN, WHO, WHERE, WHAT)
(   1,<2019-02-13 14:17:42.84 +0400>,<she>,<DPX200>,
      <created by zg, POWCHK disabled, PULCHK disabled
       configuration hash MD5:
       00 E9 B6 7A A2 85 ED C7 34 08 36 98 17 FE 4E 26
       data hash MD5: 16K
       BD B3 CC 63 CE 4A 2D 76 E9 19 35 40 68 27 E0 88>)
$$ ##END=
$$ 
$$ hash MD5
$$ D3 59 CA 52 04 E2 D6 C0 60 26 DB 5D 08 DC EC C6
##$RELAX= 
##$RELAX= 
##$RELAX= 
##$RELAX= 
##$RELAX= 
##$RELAX= 
$$ Bruker specific parameters
$$ --------------------------
##$DU= <F:/spectra>
##$EXPNO= 1
##$NAME= <H-F>
##$PROCNO= 1
##$TYPE= <nmr>
##$USER= <she>
##$AMP= (0..31)
100 100 100 100 100 100 100 100 100 100 100 100 100 100 100 100 100 100 
100 100 100 100 100 100 100 100 100 100 100 100 100 100 
##$AQSEQ= 0
##$AQ_mod= 1
##$AUNM= <au_zg>
##$AUTOPOS= <>
##$BF1= 200.13
##$BF2= 200.13
##$BF3= 200.13
##$BF4= 200.13
##$BF5= 200.13
##$BF6= 200.13
##$BF7= 200.13
##$BF8= 200.13
##$BYTORDA= 1
##$CFDGTYP= 0
##$CFRGTYP= 5
##$CHEMSTR= <none>
##$CNST= (0..31)
1 1 145 1 1 1 1 1 1 1 1 1 1 1 1 1 1 1 1 1 1 1 1 1 1 1 1 1 1 1 1 1 
##$CPDPRG= <>
##$CPDPRG1= <>
##$CPDPRG2= <>
##$CPDPRG3= <>
##$CPDPRG4= <mlev>
##$CPDPRG5= <mlev>
##$CPDPRG6= <mlev>
##$CPDPRG7= <mlev>
##$CPDPRG8= <mlev>
##$CPDPRGB= <>
##$CPDPRGT= <>
##$D= (0..31)
0 1.2 0 0 0 0 0 0 0 0 0 0.03 0 0 0 0 0 0 0 0 0 0 0 0 0 0 0 0 0 0 0 0 
##$DATE= 1550053062
##$DBL= (0..7)
120 120 120 120 120 120 120 120 
##$DBP= (0..7)
150 150 150 150 150 150 150 150 
##$DBP07= 0
##$DBPNAM0= <>
##$DBPNAM1= <>
##$DBPNAM2= <>
##$DBPNAM3= <>
##$DBPNAM4= <>
##$DBPNAM5= <>
##$DBPNAM6= <>
##$DBPNAM7= <>
##$DBPOAL= (0..7)
0.5 0.5 0.5 0.5 0.5 0.5 0.5 0.5 
##$DBPOFFS= (0..7)
0 0 0 0 0 0 0 0 
##$DE= 6
##$DECBNUC= <off>
##$DECIM= 32
##$DECNUC= <off>
##$DECSTAT= 4
##$DIGMOD= 1
##$DIGTYP= 9
##$DL= (0..7)
0 120 120 120 120 120 120 120 
##$DP= (0..7)
150 150 150 150 150 150 150 150 
##$DP07= 0
##$DPNAME0= <>
##$DPNAME1= <>
##$DPNAME2= <>
##$DPNAME3= <>
##$DPNAME4= <>
##$DPNAME5= <>
##$DPNAME6= <>
##$DPNAME7= <>
##$DPOAL= (0..7)
0.5 0.5 0.5 0.5 0.5 0.5 0.5 0.5 
##$DPOFFS= (0..7)
0 0 0 0 0 0 0 0 
##$DQDMODE= 0
##$DR= 18
##$DS= 0
##$DSLIST= <SSSSSSSSSSSSSSS>
##$DSPFIRM= 0
$$ [...]
##$SUBNAM2= <"">
##$SUBNAM3= <"">
##$SUBNAM4= <"">
##$SUBNAM5= <"">
##$SUBNAM6= <"">
##$SUBNAM7= <"">
##$SUBNAM8= <"">
##$SUBNAM9= <"">
##$SW= 20.0189088683792
##$SWIBOX= (0..15)
0 0 2 0 0 0 0 0 0 0 0 0 0 0 0 0 
##$SW_h= 4006.41025641026
##$TD= 16384
##$TD0= 1
##$TE= 0
##$TE2= 300
##$TE3= 300
##$TEG= 300
##$TL= (0..7)
0 120 120 120 120 120 120 120 
##$TP= (0..7)
150 150 150 150 150 150 150 150 
##$TP07= 0
##$TPNAME0= <>
##$TPNAME1= <>
##$TPNAME2= <>
##$TPNAME3= <>
##$TPNAME4= <>
##$TPNAME5= <>
##$TPNAME6= <>
##$TPNAME7= <>
##$TPOAL= (0..7)
0.5 0.5 0.5 0.5 0.5 0.5 0.5 0.5 
##$TPOFFS= (0..7)
0 0 0 0 0 0 0 0 
##$TUNHIN= 0
##$TUNHOUT= 0
##$TUNXOUT= 0
##$USERA1= <user>
##$USERA2= <user>
##$USERA3= <user>
##$USERA4= <user>
##$USERA5= <user>
##$V9= 5
##$VALIST= <valist>
##$VCLIST= <CCCCCCCCCCCCCCC>
##$VD= 0
##$VDLIST= <DDDDDDDDDDDDDDD>
##$VPLIST= <PPPPPPPPPPPPPPP>
##$VTLIST= <TTTTTTTTTTTTTTT>
##$WBST= 1024
##$WBSW= 4
##$XGAIN= (0..3)
0 0 0 0 
##$XL= 0
##$YL= 0
##$YMAX_a= 368729
##$YMIN_a= -392258
##$ZGOPTNS= <>
##$ZL1= 120
##$ZL2= 120
##$ZL3= 120
##$ZL4= 120
##$ABSF1= 10
##$ABSF2= 0
##$ABSG= 5
##$ABSL= 3
##$ALPHA= 0
##$AQORDER= 0
##$ASSFAC= 0
##$ASSFACI= 0
##$ASSFACX= 0
##$ASSWID= 0
##$AUNMP= <proc_1d>
##$AZFE= 0.1
##$AZFW= 0.1
##$BCFW= 1
##$BC_mod= 2
##$BYTORDP= 1
##$COROFFS= 0
##$CY= 11.3945322036743
##$DATMOD= 1
##$DC= 2
##$DFILT= <>
##$DTYPP= 0
##$F1P= 18.9103706918063
##$F2P= -1.10871071338519
##$FCOR= 0.5
##$FTSIZE= 0
##$FT_mod= 4
##$GAMMA= 1
##$GB= 0.15
##$INTBC= 1
##$INTSCL= 1
##$ISEN= 128
##$LB= 0.24
##$LEV0= 0
##$LPBIN= 0
##$MAXI= 10000
##$MC2= 0
##$MEAN= 0
##$ME_mod= 0
##$MI= 1.114404
##$NCOEF= 0
##$NC_proc= 0
##$NLEV= 6
##$NOISF1= 3.799351
##$NOISF2= 2.8
##$NSP= 1
##$NTH_PI= 0
##$NZP= 0
##$OFFSET= 15.70392
##$PC= 1
##$PHC0= -9045.781
##$PHC1= 7.400141
##$PH_mod= 1
##$PKNL= yes
##$PPARMOD= 0
##$PSCAL= 0
##$PSIGN= 0
##$REVERSE= no
##$SF= 200.130013532006
##$SI= 16384
##$SIGF1= 3
##$SIGF2= 2
##$SINO= 400
##$SIOLD= 16384
##$SREGLST= <1H.CDCl3>
##$SSB= 0
##$STSI= 0
##$STSR= 0
##$SW_p= 3612.71676300578
##$SYMM= 0
##$S_DEV= 0
##$TDeff= 0
##$TDoff= 0
##$TI= <>
##$TILT= no
##$TM1= 0
##$TM2= 0
##$TOPLEV= 0
##$USERP1= <user>
##$USERP2= <user>
##$USERP3= <user>
##$USERP4= <user>
##$USERP5= <user>
##$WDW= 1
##$XDIM= 8192
##$YMAX_p= 0
##$YMIN_p= 0
$$ End of Bruker specific parameters
$$ ---------------------------------
##NTUPLES= NMR FID
##VAR_NAME=  TIME,          FID/REAL,        FID/IMAG
##SYMBOL=    X,             R,               I
##VAR_TYPE=  INDEPENDENT,   DEPENDENT,       DEPENDENT
##VAR_FORM=  AFFN,          ASDF,            ASDF
##VAR_DIM=   8192,          8192,            8192
##UNITS=     SECONDS,       ARBITRARY UNITS, ARBITRARY UNITS
##FACTOR=    0.0002496,     1,               1
##FIRST=     0,             0,               0
##LAST=      2.0444736,     0,               0
##MIN=       0,             -392258,         0
##MAX=       2.0444736,     368729,          0
$$ Real data points
##PAGE= N=1
##DATA TABLE= (X++(R..R)), XYDATA
$$ [...]
$$ plain form
2111 -2908 -3774 -3900 -1752 208 1982 2257 1342 321 573 1322 1739 1755 -197 -2148 -2022 -127 1547
2128 1547 2286 978 -1704 -2686 -2100 -1448 -430 -719 -1696 -1378 1568 4011 5798 5571 3175 -47 -2140
2145 -2140 -2448 -2958 -2644 -3410 -4254 -3907 -2435 -450 1511 2615 1854 1772 2443 2946 4047 4241 2851 715
2163 715 -1144 -2196 -1499 -845 -1898 -3289 -4091 -4296 -3216 -396 1345 1578 1120 140 281 1613 2258
2180 2258 2509 2677 1781 1472 2411 3409 2152 229 -2030 -4796 -5458 -4537 -3710 -2542 -2143 -2477 -1303 756
2198 756 2588 3844 4596 3529 2227 2296 2760 2246 1376 -455 -1846 -2598 -2979 -2622 -1855 -1901 -2411 -1574 -245
2217 -245 328 1126 1984 1680 679 -543 -1212 -152 1070 1549 2218 2227 1045 775 870 71 -1921 -3469 -3922
2236 -3922 -2827 -1033 443 1412 1351 468 -264 1321 1992 1033 122 102 74 -298 -432 -377 -1293 -1596 -1567 -776
$$ packed form
2111b908q66j26K148J960J774K75r15j021K52P49M17J6j952j951J26J895J674
2128A547P39j308k682r82N86O52J018k89r77L18K946K443J787k27k396l222k093
2145b140l08n10L14p66q44L47J472J985J961J104p61q2O71N03J101J94j390k136
2163G15j859j052O97O54j053j391q02k05J080K820J741K33m58r80J41J332O45
2180B258K51J68q96l09R39R98j257j923k259k766o62R21Q27J168L99l34J174K059
2198G56J832J256P52j067j302O9M64n14q70j831j391p52l81L57P67m6n10Q37J329
2217b45N73P98Q58l04j001j222o69J060J222M79O69Rj182k70R5p99j992j548m53
2236c922J095J794J476R69o1q83p32J585O71r59r11k0k8l72j34N5r16l03K9P91
$$ plain form
2256 -776 -328 -301 441 2359 2808 2271 2291 1959 777 -11 -1494 -2497 -3443 -4031 -2359 227 711 98 273
2275 273 446 215 696 1258 434 -359 -176 1280 2819 2606 1467 713 1003 -258 -958 -994 -2570 -3837
2293 -3837 -3177 -1768 -974 -560 -413 616 1683 1568 794 1578 1716 1393 2377 2545 1608 404 -106 -195 -689
2312 -689 -2451 -3941 -3962 -2587 -1294 427 1661 1047 464 1534 1917 1002 -453 -1634 -1442 -112 1768
2329 1768 2433 2808 1997 371 902 138 -1646 -2491 -2558 -2121 -724 78 338 267 412 -174 249 226 -847
2348 -847 -765 358 949 1002 1164 729 585 1229 885 306 -446 -1481 -925 462 969 211 -433 -564 -353 -131
2368 -131 -782 -1833 -2818 -2447 -635 1427 2286 1377 1265 1329 1777 1752 1325 -61 -1476 -1061 -130 412 868
2387 868 -19 -725 -691 -972 -1540 -1482 -1615 -1534 -888 -265 163 1321 2372 2342 2319 1528 43 -202 291 613 828
$$ packed form
2256g76M48K7P42J918M49n37K0l32j182p88j483j003r46n88J672K586M84o13J75
2275B73J73k31M81N62q24p93J83J456J539k13j139p54K90j261p00l6j576j267
2293c837O60J409P94M14J47J029J067j15p74P84J38l23R84J68r37j204n10q9m94
2312f89j762j490k1J375J293J721J234o14n83J070L83r15j455j181J92J330J880
2329A768O65L75q11j626N31p64j784q45o7M37J397Q02K60p1J45n86M23k3j073
2348h47Q2J123N91N3J62m35j44O44l44n79p52j035N56J387N07p58o44j31K11K22
2368a31o51j051r85L71J812K062Q59r09j12O4M48k5m27j386j415M15R31N42M56
2387H68q87p06L4k81n68N8j33Q1O46O23M28J158J051l0k3p91j485k45M93L22K15
$$ plain form
2408 828 34 -1593 -1747 -488 -205 -79 -1392 -2610 -2514 -975 972 1886 1877 635 13 436 568 388 14
2427 14 -385 -550 586 1566 1374 853 443 -1051 -1480 -1467 -1085 -205 229 -7 -447 -507 -683 -160 990 1349
2447 1349 480 -725 -961 -855 162 422 65 -355 -305 707 2196 2634 733 -895 -1386 -1104 450 796
2465 796 389 -1078 -2458 -3106 -1939 -392 8 97 793 1088 1592 2431 2153 959 94 -668 -823 211
2483 211 728 167 209 -980 -1876 -1225 307 923 459 -750 -2027 -2658 -2135 -481 936 1177 627 389
2501 389 1789 2368 2226 1315 -476 -1560 -814 961 2534 2057 -621 -3293 -3984 -3468 -2095 -232 860
2518 860 536 330 933 1367 1608 723 -730 -1001 -938 323 1893 2949 1404 -43 -959 -1172 -357 706
2536 706 598 -463 -1918 -3063 -2529 -965 110 713 917 666 218 798 1375 1021 413 -455 -843 431
$$ packed form
2408H28p94j627j54J259K83J26j313j218R6J539J947R14rj242o22M23J32j80l74
2427A4l99j65J136R80j92n21m10j494m29J3L82Q80M34k36m40o0j76N23J150L59
2447A349q69j205k36J06J017K60l57m20N0J012J489M38j901j628m91K82J554L46
2465G96m07j467j380o48J167J547M00Q9O96K95N04Q39k78j194q65p62j55J034
2483B11N17n61M2j189q96O51J532O16m64j209j277o31N23J654J417K41n50k38
2501C89J400N79j42r11j791j084P46J775J573m77k678k672o91N16J373J863J092
2518H60l24k06O03M34K41q85j453k71O3J261J570J056j545j447r16k13Q15J063
2536G06j08j061j455j145N34J564J075O03K04k51m48N80N77l54o08q68l88J274
$$ plain form
2554 431 1868 1825 1222 -506 -2474 -2413 -596 435 919 783 -175 -787 -926 -528 -559 -815 -1057 -1116 -88
2573 -88 562 988 1469 1761 1271 1286 1428 1334 1239 322 -1195 -2205 -2439 -2276 -861 474 1024 453 53 -760
2593 -760 -897 -359 -448 -235 11 406 1022 1879 1783 555 -447 -391 -4 501 963 730 246 -519 -1015 -1124
2613 -1124 -1037 -2085 -1702 -1153 -924 -333 -65 307 908 1758 2241 2244 1771 374 -290 -530 -1322 -1565 -840 75
2633 75 -126 622 548 -263 -811 -1168 -1332 -726 -556 -374 88 688 668 593 483 131 14 951 1211 834 471
2654 471 -137 -854 -642 -659 -751 -585 -793 -614 115 342 289 60 -160 131 493 423 -159 -435 -707 -941 -725
2675 -725 -402 -458 268 1370 1837 2239 1573 261 -223 -531 -968 -900 -1048 -1146 -694 -35 377 -96 -519 -495 -574
2696 -574 129 753 506 423 -58 337 805 974 703 423 698 709 877 888 34 -745 -823 -1395 -1967 -1923 -1871 -1698
$$ packed form
2554D31J437m3o03j728j968O1J817J031M84j36r58o12j39L98l1k56k42n9J028
2573h8O50M26M81K92m90J5J42r4r5r17j517j010k34J63J415J335N50n71m00q13
2593g60j37N38q9K13K46L95O16Q57r6j228j002N6L87N05M62k33m84p65m96j09
2613a124Q7j048L83N49K29N91K68L72O01Q50M83Lm73j397o64k40p92k43P25R15
2633G5k01P48p4q11n48l57j64O06J70J82M62O00k0p5j10l52j17R37K60l77l63
2654D71o08p17K12j7r2J66k08J79P29K27n3k29k20K91L62p0n82k76k72k34K16
2675g25L23n6P26J102M67M02o66j312m84l08m37O8j48r8M52O59M12m73m23K4p9
2696e74P03O24k47q3m81L95M68J69k71k80K75J1J68J1q54p79p8n72n72M4N2J73
$$ plain form
2718 -1698 -504 93 356 886 1220 1693 2367 2377 1340 849 740 15 71 -144 -949 -1330 -1879 -1492 -891 -518
2738 -518 -639 -529 -541 -225 -164 374 192 -205 446 732 1212 1501 1417 886 676 460 -247 -222 -337 -951 -892 -925
2760 -925 -1176 -1406 -1251 -1150 -719 -134 235 900 1427 1240 1128 841 218 -257 100 437 407 245 95 114 221
2781 221 -165 -231 -812 -1349 -1517 -545 -71 178 102 -132 -296 275 656 734 469 -15 -441 -164 675 578 713
2802 713 368 -224 -565 190 219 408 584 -539 -672 -318 -288 -71 -128 -752 -1427 -1287 -858 -54 860 1151 1028
2823 1028 538 829 1143 1046 973 -331 -1037 -1357 -965 -58 1009 406 -488 -1112 -1122 -523 551 725 -288
2842 -288 -793 -1245 -664 583 1346 1022 878 487 211 565 1348 1288 156 -879 -1265 -893 42 139 466 -398
2862 -398 -1525 -1647 -723 471 750 952 242 -620 -694 105 1216 1165 125 -843 -583 265 1512 2405 1851
$$ packed form
2718a698J194N97K63N30L34M73O74J0j037m91j09p25N6k15q05l81n49L87O01L73
2738e18j21J10j2L16O1N38j82l97O51K86M80K89q4n31k10k16p07K5j15o14N9l3
2760i25k51k30J55J01M31N85L69O65N27j87j12k87o23m75L57L37l0j62j50J9J07
2781B21l86o6n81n37j68R72M74K49p6k34j64N71L81P8k65m84m26K77Q39r7J35
2802G13l45n92l41P55K9J89J76j123j33L54L0K17n7o24o75J40M29Q04R14K91j23
2823A028m90K91L14r7p3j304p06l20L92R07J067o03q94o24j0N99J074J74j013
2842b88n05m52N81J247P63l24j44l91k76L54P83o0j132j035l86L72R35R7L27q64
2862c98j127j22R24J194K79K02p10q62p4P99J111n1j040r68K60Q48J247Q93n54
$$ plain form
2881 1851 96 -1479 -1072 -200 -60 -719 -1629 -2528 -2339 -1031 658 1940 1233 299 308 528 1002 1399 1604
2900 1604 420 -720 -1191 -560 581 778 293 -149 -775 -1252 -376 631 694 -146 -1239 -1914 -1017 -173
2918 -173 638 638 -89 -1017 -234 1829 2705 2265 1773 540 -668 -435 -254 -145 -858 -2352 -2550 -1650 -668
2937 -668 166 924 537 90 -61 725 909 728 426 16 74 -169 268 1235 1439 579 -41 -482 -583 -407
2957 -407 -195 -102 -765 -1555 -1727 -760 125 439 113 355 559 718 1568 2001 1297 -172 -544 -442 -64 149
2977 149 -559 -579 -782 -865 -288 708 575 7 -23 -243 -379 -547 -737 -843 -626 -317 -134 254 397 608 1091
2998 1091 1116 500 309 218 274 160 -756 -1110 -1482 -1264 -597 40 913 251 -117 206 149 -37 -275 -683 -879
3019 -879 -413 -291 650 446 420 323 927 1107 839 900 565 92 -338 -679 -1347 -1160 -1197 -1228 -709 -193 -334 175
$$ packed form
2881A851j755j575M07Q72J40o59r10q99J89J308J689J282p07r34RK20M74L97K05
2900A604j184j140m71O31J141J97m85m42o26m77Q76J007O3q40j093o75Q97Q44
2918a73Q11%p27r28P83K063Q76m40m92j233j208K33J81J09p13j494j98R00R82
2937f68Q34P58l87m47j51P86J84j81l02m10N8k43M37R67K04q60o20m41j01J76
2957d07K12R3o63p90j72R67Q85L14l26K42K04J59Q50M33p04j469l72J02L78K13
2977A49p08k0k03q3N77R96j33n68l0k20j36j68j90j06K17L09J83L88J43K11M83
2998A091K5o16j91r1N6j14r16l54l72K18O67O37Q73o62l68L23n7j86k38m08j96
3019h79M66J22R41k04k6r7O04J80k68O1l35m73m30l41o68J87l7l1N19N16j41N09
$$ plain form
3041 175 589 1170 914 915 794 387 300 38 -17 -104 -894 -345 93 354 276 281 22 -362 -253 -567 -791 -848 -1018
3064 -1018 -1031 -399 100 165 552 1110 1311 1020 892 620 105 -150 -488 -279 -282 -466 -354 223 65 -168 141
3085 141 -245 -477 -375 32 -145 -254 -477 -471 -376 219 242 452 916 996 1077 1386 689 561 201 -381 -680 -715
3107 -715 -1128 -1414 -1028 -1015 -698 -403 26 218 591 1033 809 421 76 -58 98 361 519 564 528 15 101
3128 101 100 -25 -105 -358 -529 -645 -846 -1201 -1016 -398 -198 410 479 538 813 700 989 615 662 300 75 248
3150 248 300 47 -276 -697 -1220 -853 -156 338 419 -168 -540 -325 -461 192 115 150 -131 -273 545 472 704 450
3172 450 127 35 238 361 617 774 -16 -796 -1008 -966 -542 61 412 513 -144 -617 -679 108 246 -34 -7
3193 -7 -203 25 333 669 697 242 -202 -49 257 816 836 334 -368 -946 -861 -590 -66 -86 -11 -233 -466 -464 -252
$$ packed form
3041A75M14N81k56Jj21m07q7k62n5q7p90N49M38K61p8Nk59l84J09l14k24n7j70
3064a018j3O32M99O5L87N58K01k91j28k72n15k55l38K09lj84J12N77j58k33L09
3085A41l86k32J02M07j77j09k23OR5N95K3K10M64Q0Q1L09o97j28l60n82k99l5
3107g15m13k86L86J3L17K95M29J92L73M42k24l88l45j34J56K63J58M5l6n13Q6
3128A01jj25q0k53j71j16k01l55J85O18K00O08O9N9K75j13K89l74M7l62k25J73
3150B48N2k53l23m21n23L67O97M94Q1n87l72K15j36O53p7L5k81j42Q18p3K32k54
3172D50l23r2K03J23K56J57p90p80k12M2M24O03L51J01o57m73o2P87J38k80K7
3193gj96K28L08L36K8m55m44J53L06N59K0n02p02n78Q5K71N24k0P5k22k33KK12
$$ plain form
3216 -252 216 370 312 400 525 794 648 989 615 -141 -355 -296 -77 292 155 -178 -830 -701 -733 -385 216
3237 216 24 -405 -337 -35 -188 407 864 354 586 829 869 482 259 -321 -607 -512 -90 -308 44 -98 -519
3258 -519 -216 -569 -586 -417 -206 -216 -131 250 254 574 520 258 773 559 404 245 13 -134 -382 -611 -562 -408
3280 -408 205 -3 -316 -302 -851 -384 -229 72 -28 -97 21 437 961 756 528 -190 -521 -291 450 928 637
3301 637 346 -239 -814 -693 -91 34 -377 -873 -980 -651 -54 525 587 647 62 4 200 720 526 424 -272
3322 -272 -771 -463 -85 433 822 437 -524 -606 -592 -285 272 223 -431 -794 -685 44 544 644 222 -250 -458
3343 -458 52 785 1241 827 3 -106 -329 -22 574 426 -55 -637 -1067 -540 68 559 158 -5 -419 -673
3363 -673 -505 126 250 16 -108 -169 34 941 1041 1259 960 -51 -267 32 -88 -111 -283 -716 -1019 -1231
$$ packed form
3216b52M68J54n8Q8J25K69j46L41l74p56k14N9K19L69j37l33o52J29l2L48O01
3237B16j92m29O8L02j53N95M57n10K32K43M0l87k23n80k86R5M22k18L52j42m21
3258e19L03l53j7J69K11j0Q5L81ML20n4k62N15k14j55j59k32j47k48k29M9J54
3280d08O13k08l13J4n49M67J55L01j00o9J18M16N24k05k28p18l31K30P41M78k91
3301F37k91n85n75J21O02J25m11m96j07L29N97N79O2O0n85n8J96N20j94j02o96
3322b72m99L08L78N18L89l85r61q2J4L07N57m9o54l63J09P29N00J00m22m72k08
3343d58N10P33M56m14q24j09k23L07N96j48m81n82m30N27O08M91m01j63m14k54
3363f73J68O31J24k34j24o1K03R07J00K18k99j011k16K99j20k3j72m33l03k12
$$ plain form
3383 -1231 -709 32 252 6 -321 -234 411 262 1051 794 447 237 399 520 639 156 94 -78 -325 -570
3403 -570 -208 -75 -194 -573 -862 -733 -755 -232 124 402 454 88 601 820 987 965 685 189 -420 -84 235
3424 235 -35 -323 -575 -823 -768 -610 -304 -43 114 144 -75 497 98 230 108 182 79 217 -52 101 160
3445 160 -229 -28 264 272 -104 236 110 -269 -431 -304 -339 -206 460 234 373 56 -261 33 -244 -496 -213
3466 -213 105 -7 -1 339 25 68 234 -90 183 148 488 64 38 174 -184 -568 -272 -630 -868 -351 -432 -286
3488 -286 -381 -492 47 603 742 1079 1031 584 354 181 -102 -251 9 -161 -339 -40 -71 -361 -543 -450 -1040
3509 -1040 -715 -596 -439 99 431 518 428 631 434 403 719 583 487 -153 -512 -663 94 15 -97 -432 -845
3530 -845 -1203 -682 -405 -145 119 483 389 451 698 1054 649 427 -374 -423 -274 -264 282 406 11 -394 -464 -291
$$ packed form
3383a231N22P41K20k46l27Q7O45j49P89k57l47k10J62J21J19m83o2j72k47k45
3403e70L62J33j19l79k89J29k2N23L56K78N2l66N13K19J67k2k80m96o09L36L19
3424B35k70k88k52k48N5J58L06K61J57L0k19N72l99J32j22P4j03J38k69J53N9
3445A60l89K01K92Ql76L40j26l79j62J27l5J33O66k26J39l17l17K94k77k52K83
3466b13L18j12OL40l14M3J66l24K73l5L40m24k6J36l58l84K96l58k38N17q1J46
3488b86r5j11N39N56J39L37m8m47k30j73k83j49K60j70j78K99l1k90j82R3n90
3509a040L25J19J57N38L32Q7r0K03j97l1L16j36r6o40l59j51P57p9j12l35m13
3530h45l58N21K77K60K64L64r4O2K47L56m05k22q01m9J49J0N46J24l95m05p0J73
$$ plain form
3552 -291 -27 62 33 -185 -332 -561 -111 264 333 139 -113 -98 97 331 247 189 -110 -428 -18 481 502 334
3574 334 134 79 -421 -250 -209 -70 -129 108 -199 -208 189 -185 -18 -60 -515 -504 -385 355 549 701 748 361 269
3597 269 332 246 162 103 -527 -605 -568 -902 -513 -153 -270 -305 -316 23 173 47 166 264 537 356 690 978 381
3620 381 476 261 93 -168 -489 -417 -376 -248 -341 -148 -178 -393 -410 -297 15 -18 210 349 241 682 727 261 343
3643 343 244 -170 8 -161 -32 -118 -10 -327 -635 -598 -366 -170 153 -75 -417 23 -43 -46 459 373 162 369
3665 369 -99 -166 84 116 -45 -288 61 -426 120 443 461 27 -270 -387 -606 -88 106 278 278 -355 -502 -152
3687 -152 -103 108 430 357 -160 178 108 652 563 294 4 -257 -213 -111 -56 -166 -348 -656 -570 -214 216 167 -13
3710 -13 -567 -378 -394 170 674 967 582 307 305 384 388 385 -61 -287 -660 -496 46 -4 -266 -627 -526 -792 -412
$$ packed form
3552b91K64Q9k9k18j47k29M50L75O9j94k52J5J95K34q4n8k99l18M10M99K1j68
3574C34k00n5n00J71M1J39n9K37l07rL97l74J67m2m55J1J19P40J94J52M7l87r2
3597B69O3q6q4n9o30p8L7l34L89L60j17l5j1L39J50j26J19R8K73j81L34K88n97
3620C81R5k15j68k61l21P2M1J28r3J93l0k15j7J13L12l3K28J39j08M41M5m66Q2
3643C43r9m14J78j69J29q6J08l17l08L7K32J96L23k28l42M40o6lN05q6k11K07
3665C69m68o7K50L2j61k43L49m87N46L23J8m34k97j17k19N18J94J72%o33j47L50
3687a52M9K11L22p3n17L38p0N44q9k69k90k61M4J02N5j10j82l08Q6L56M30m9j80
3710a3n54J89j6N64N04K93l85k75kP9Mlm46k26l73J64N42n0k62l61J01k66L80
$$ plain form
3733 -412 20 387 537 412 15 282 731 667 413 393 6 -517 -15 323 111 -208 -173 -619 -277 -253 293
3754 293 19 -342 -931 -667 -32 186 480 457 192 154 465 24 518 272 -29 -450 -315 -65 -23 447 154
3775 154 -224 -326 -331 -476 158 233 -10 -181 96 -94 325 428 203 -178 -182 -260 -228 230 358 506 363 174
3797 174 242 473 140 -15 -417 -785 -570 -319 -311 64 -180 -292 -119 113 84 162 171 208 24 106 129 343 427 384
3821 384 326 291 -115 -282 -24 -324 -453 -233 -190 -351 -350 -281 -371 -432 -167 -88 469 688 534 684 727 187 408
3844 408 441 49 -531 -443 -717 -564 -664 -552 -297 -315 -197 -45 210 -134 -22 -247 247 158 259 459 542 436
3866 436 625 139 156 -195 -273 -302 -636 -52 -143 -38 -228 -94 -138 -83 -235 162 389 373 429 417 381 130 295
3889 295 102 -136 -71 -189 -349 -142 -279 -2 98 -10 126 -21 -25 -256 317 -10 -261 -25 -159 -299 -312
$$ packed form
3733d12M32L67J50j25l97K67M49o4k54k0l87n23N02L38k12l19L5m46L42K4N46
3754B93k74l61n89K64O35K18K94k3k65l8L11m41M94k46l01m21J35K50M2M70k93
3775A54l78j02nj45O34P5k43j71K77j90M19J03k25l81mp8L2M58J28J48j43j89
3797A74O8K31l33j55m02l68K15K51QL75k44j12J73K32k9P8RL7j84Q2K3K14Q4m3
3821C84n8l5m06j67K58l00j29K20M3j61JO9r0o1K65P9N57K19j54J50M3n40K21
3844D08L3l92n80Q8k74J53j00J12K55j8J18J52K55l44J12k25M94q9J01K00Q3j06
3866D36J89m86J7l51p8k9l34N84r1J05j90J34m4N5j52L97K27j6N6j2l6k51J65
3889B95j93k38O5j18j60K07j37K77J00j08J36j47mk31N73l27k51K36j34j40j3
$$ plain form
3910 -312 98 72 -162 -43 355 185 412 362 378 206 138 239 0 379 -49 79 -305 -317 -154 -147 -393 -253
3932 -253 -230 -577 -383 -186 -129 0 187 237 516 472 423 478 207 392 -101 34 -517 -497 -366 -504 -447 -370 -168
3955 -168 -181 -392 -397 -153 131 293 390 636 703 555 518 596 365 -87 -217 -491 -269 -283 -103 -257 -294 -615 -364
3978 -364 -232 -450 -192 -114 21 60 468 486 841 562 395 127 -35 -220 -110 -134 -261 -551 -684 -373 18
3999 18 -149 77 -391 -390 -370 -87 438 692 572 -1 78 -36 -59 372 159 -205 -312 54 135 154 247 280 187 -120
4023 -120 -313 -22 377 -53 -2 -495 -609 -334 -21 461 399 78 -420 -211 54 230 332 484 -21 79 300
4044 300 441 243 314 -256 -272 -353 -416 -134 159 -37 -421 -476 -456 -384 73 135 223 18 170 -17 342 770 632
4067 632 495 229 106 -92 -291 -346 -379 -651 -610 -273 -255 305 -112 -405 -331 -375 236 315 397 619 462 208 248
$$ packed form
3910c12M10k6k34J19L98j70K27n0J6j72o8J01k39L79m28J28l84j2J63Pk46J40
3932b53K3l47J94J97N7J29J87N0K79m4m9N5k71J85m93J35n51K0J31j38N7P7K02
3955a68j3k11nK44K84J62R7K46O7j48l7P8k31m52j30k74K22j4J80j54l7l21K51
3978c64J32k18K58P8J35L9M08J8L55k79j67k68j62j85J10k4j27k90j33L11L91
3999A8j67K26m68JK0K83N25K54j20n73P9j14k3M31k13l64j07L66Q1J9R3L3r3l07
4023a20j93K91L99m30N1m93j14K75L13M82o2l21m98K09K65J76J02J52n05J00K21
4044C00J41j98P1n70j6q1o3K82K93j96l84n5K0P2M57O2Q8k05J52j87L59M28j38
4067F32j37k66j23j98j99n5l3k72M1L37J8N60m17k93P4m4O11P9Q2K22j57k54M0
$$ plain form
4090 248 115 177 182 197 -237 -332 -341 -396 -320 -14 -276 -151 -96 -191 -111 -97 -368 97 90 395 460 235 482 293 65
4115 65 -142 -71 -621 -407 -271 -129 59 377 -41 -262 -570 -424 -24 258 104 -28 -374 -84 154 -16 66
4136 66 177 3 -48 278 440 234 311 -18 -120 -201 68 265 192 -129 -539 -785 -633 62 331 314 172 -168
4158 -168 -136 -194 66 177 129 -22 3 54 290 672 97 -198 -427 -490 -274 198 22 48 -514 -740 -536 -356
4180 -356 67 -9 195 312 229 29 488 272 296 333 152 152 -45 72 -43 -203 -531 -421 -136 100 332 386
4202 386 -161 -564 -587 -57 -28 247 172 248 259 428 168 399 429 1 -45 -53 105 259 0 -167 -322 -341 -228
4225 -228 -58 157 224 62 -144 -15 -145 90 273 339 263 10 299 -57 -130 -46 54 -85 83 272 246 83
4247 83 -161 -429 -333 -302 -169 -361 -23 63 -93 112 240 55 347 305 298 77 236 177 -50 70 -131 -42 -179
$$ packed form
4090B48j33O2NJ5m34r5rn5P6L06k62J25N5r5Q0J4k71M65pL05O5k25K47j89k28
4115F5k07P1n50K14J36J42J88L18m18k21l08J46M00K82j54j32l46K90K38j70Q2
4136F6J11j74n1L26J62k06P7l29j02q1K69J97p3l21m10k46J52O95K69j7j42l40
4158a68L2n8K60J11m8j51K5N1K36L82n75k95k29o3K16M72j76K6n62k26K04J80
4180c56M23p6K04J17q3k00M59k16K4L7j81%j97J17j15j60l28J10K85K36K32N4
4202C86n47m03k3N30K9K75p5P6J1J69k60K31L0m28m6qJ58J54k59j67j55j9J13
4225b28J70K15O7j62k06J29j30K35J83O6p6k53K89l56p3Q4J00j39J68J89k6j63
4247H3k44k68R6L1J33j92L38Q6j56K05J28j85K92m2pk21J59n9k27J20k01Q9j37
$$ plain form
4270 -179 -144 -330 -239 -51 -90 -289 -299 146 175 363 87 55 -29 70 13 267 240 32 297 189 298 108 -22
4293 -22 -118 10 -384 -334 -285 -167 -274 -112 -108 11 -24 123 -11 73 -37 145 268 246 35 59 478 117 -63
4316 -63 13 210 164 -179 -96 -23 -60 -385 -74 133 -174 -72 -233 26 -173 -33 190 68 372 308 341 -16 89
4339 89 102 134 88 263 -132 -33 -188 -97 -58 -82 -110 -273 -260 -479 -63 -121 25 44 -102 -33 127 355 559 563 470
4364 470 -10 140 147 -26 397 218 -281 -584 -329 -180 -223 -249 -241 -412 -207 -200 124 501 244 60 115 62 187
4387 187 298 264 252 -3 -384 -149 -219 -98 -55 -316 -141 -312 -395 2 -181 82 54 -62 80 129 250 531
4409 531 226 15 -71 130 192 67 290 -323 -168 -209 -214 -370 -39 -43 -312 -24 1 -221 204 -28 52 -239 -254
4432 -254 -194 76 187 338 165 58 43 104 125 234 -76 -267 -179 -50 -56 -30 -152 -430 -346 -168 159 27 29 198
$$ packed form
4270a79L5j86R1J88l9j99j0M45K9J88k76l2q4R9n7K54k7k08K65j08J09j90j30
4293b2r6J28l94N0M9J18j07J62MJ19l5J47j34Q4j10J82J23k2k11K4M19l61j80
4316f3P6J97m6l43Q3P3l7l25L11K07l07J02j61K59j99J40K23j22L04o4L3l57J05
4339H9J3L2m6J75l95R9j55R1L9k4k8j63J3k19M16n8J46J9j46O9J60K28K04Mr3
4364D70m80J50Pj73M23j79m99l03K55J49m3k6Qj71K05PL24L77k57j84N5n3J25
4387A87J11l4j2k55l81K35p0J21M3k61J75j71q3L97j83K63k8j16J42M9J21K81
4409E31l05k11q6K01O2j25K23o13J55m1nj56L31mk69K88K5k22M25k32Q0k91j5
4432b54O0K70J11J51j73j07j5O1K1J09l10j91Q8J29oK6j22k78Q4J78L27j32KJ69
$$ plain form
4456 198 28 272 163 440 77 226 220 -67 -226 150 -38 63 263 -63 -163 -191 62 21 -114 -417 -131
4477 -131 -68 -106 52 -177 181 -42 151 56 192 71 215 184 351 223 140 53 69 -200 -413 -423 -392 120 -182
4500 -182 -199 -42 60 56 -9 -14 156 129 -117 -46 -21 212 504 67 24 123 266 209 0 -81 -95 -354 -216 -301 -57
4525 -57 -41 -298 -102 -184 282 -12 419 221 128 125 82 212 49 -53 -150 -126 6 17 167 -41 -101 20 -97 -45
4549 -45 -222 -289 -49 125 -12 -148 107 283 443 297 -52 136 298 180 194 86 -183 -371 -157 -83 150
4570 150 -185 -377 -154 56 33 93 -286 -260 -123 21 228 1 118 -8 59 140 203 328 -55 240 283 210 -194
4593 -194 -181 99 30 23 -275 -285 -166 -368 38 386 17 74 -136 83 95 470 -132 -201 29 16 194 197 198 91
4617 91 -151 -103 -177 50 -262 -226 8 -310 -262 -39 -45 174 365 135 78 175 196 376 117 269 181 77 -42 -55
$$ packed form
4456A98j70K44j09K77l63J49ok87j59L76j88J01K00l26j00k8K53m1j35l03K86
4477a31O3l8J58k29L58k23J93r5J36j21J44l1J67j28q3q7J6k69k13j0L1N12l02
4500a82j7J57J02mo5nJ70k7k46P1K5K33K92m37m3R9J43n7k09q1j4k59J38q5K44
4525e7J6k57J96q2M66k94M31j98r3lm3J30j63j02r7K4J32J1J50k08o0J21j17N2
4549d5j77o7K40J74j37j36K55J76J60j46l49J88J62j18J4j08k69j88K14P4K33
4570A50l35j92K23K10k3O0l79K6J37J44K07k27J17j26O7Q1O3J25l83K95M3p3m04
4593a94J3K80o9pk98j0J19k02M06L48l69N7k10K19J2L75o02o9K30j3J78LJj07
4617I1k42M8p4K27l12L6K34l18M8K23oK19J91k30n7R7K1J80k59J52q8j04j19j3
$$ plain form
4641 -55 -60 -273 -374 -440 -122 -107 188 78 -75 77 -97 -79 72 -62 -3 136 96 53 118 317 168 90 285 107
4665 107 -60 60 -266 -218 -265 -185 -396 -197 37 -4 -296 -78 -10 74 19 105 210 67 59 137 270 -85 -77 -66 0
4690 0 -95 188 56 -232 -222 -185 -41 -250 -121 -287 -70 -165 -180 270 193 86 156 113 14 187 103 217 146 178 -39
4715 -39 -40 24 -197 -188 -49 -173 -31 -249 -51 54 299 -38 -185 -31 -104 -13 263 182 43 -32 -69 87 98 189
4739 189 -76 132 -15 -50 -305 -50 -242 -298 -25 -246 -317 -40 237 31 -65 84 95 -205 97 171 67 -34
4761 -34 -21 86 61 149 -197 -268 -88 -37 65 -159 -244 -192 -211 -157 184 -205 -135 -12 45 18 -55 187 -33 120 116
4786 116 64 145 91 141 52 282 72 -62 -85 -159 -10 -430 -195 -178 153 61 272 158 112 -55 87 41 -17 171
4810 171 27 -178 -104 174 321 88 -229 -272 -271 -84 71 -35 -181 -201 -298 -75 185 178 166 -40 160 62 122 35
$$ packed form
4641e5nk13j01o6L18J5K95j10j53J52j74J8J51j34N9J39m0m3O5J99j49p8J95j78
4665A07j67J20l26M8m7Q0k11J99K34m1k92K18O8Q4n5Q6J05j43qP8J33l55QJ1O6
4690@r5K83j32k88J0L7J44k09J29j66K17r5j5M50p7j07P0m3r9J73q4J14p1L2k17
4715c9jO4k21RJ39j24J42k18J98J05K45l37j47J54p3R1K76q1j39p5l7J56J1R1
4739A89k65K08j47l5k55K55j92n6K73k21p1K77K77k06r6J49J1l00L02P4j04j01
4761c4J3J07k5Q8l46p1J80N1J02k24q5N2j9N4L41l89P0J23N7k7p3K42k20J53m
4786A16n2Q1n4N0q9K30k10j34k3p4J49m20K35J7L31r2K11j14m6j67J42m6n8J88
4810A71j44k05P4K78J47k33l17m3JJ87J55j06j46k0r7K23K60pj2k06K00r8O0q7
$$ plain form
4834 35 179 -179 108 -153 -191 -131 204 58 -53 -171 -407 -66 -152 343 6 110 -77 -12 -11 234 150 151 115 -275
4858 -275 -25 350 143 -38 58 -59 -139 -46 -136 -87 152 -45 -252 -411 -62 -43 287 22 2 -267 93 113 308
4881 308 186 -19 84 37 220 147 149 13 34 -254 52 -27 108 -331 -10 -109 -260 -275 -342 -75 -55 -141 64 48
4905 48 336 215 214 30 89 199 238 -122 89 87 -19 49 43 -161 -24 -12 60 114 -261 -58 22 -63 39 103 186 74
4931 74 265 -42 93 -32 206 141 134 16 61 -197 -129 -185 -288 -150 -88 -140 -259 71 310 272 126 129 11 -164
4955 -164 180 -1 -33 219 28 -67 -65 6 24 -42 113 -188 -186 -218 -129 -51 121 -446 -67 -84 272 100 -76 -171 -116
4980 -116 226 65 340 -129 23 9 46 106 -133 189 114 -151 -182 -178 -253 92 58 60 -211 -173 -35 -166 83 102
5004 102 114 148 -111 -136 182 88 263 236 -128 178 97 124 63 -12 -274 -245 -194 -165 15 26 -175 -100 111 -102 -65
$$ packed form
4834C5J44l58K87k61l8O0L35j46j11j18k36L41q6M95l37J04j87O5JK45q4Jl6l90
4858b75K50L75k07j81R6j17q0R3r0M9K39j97k07j59L49J9L30k65k0k69L60K0J95
4881C08j22k05J03m7J83p3Kj36K1k88L06p9J35m39L21r9j51j5o7K67K0q6K05j6
4905D8K88j21jj84N9J10L9l60K11kj06O8ok04J37J2P2N4l75K03Q0q5J02O4Q3j12
4931G4J91l07J35j25K38o5pj18M5k58O8n6j03J38O2n2j19L30K39l8j46Lj18j75
4955a64L44j81l2K52j91r5KP1J8o6J55l01Kl2Q9P8J72n67L79j7L56j72j76r5N5
4980a16L42j61K75m69J52j4L7O0k39L22p5k65l1Mp5L45l4Kk71L8J38j31K49J9
5004A02J2L4k59k5L18r4J75k7l64L06q1K7o1p5k62K9N1K9J80J1k01P5K11k13L7
$$ plain form
5029 -65 -43 93 59 200 297 -193 305 118 -119 -47 6 -201 -149 28 -230 -348 -282 -255 -307 -110 2 -249 191
5052 191 110 -32 214 205 97 227 -17 144 32 -260 24 -80 -125 -258 -180 -202 68 -185 -128 146 -99 127
5074 127 79 188 -111 -129 18 169 232 345 -87 114 62 50 194 162 184 -159 -213 -95 -175 48 107 -43 -226
5097 -226 -149 -35 -201 -2 5 71 -174 -206 138 138 -44 -231 -81 82 -64 188 54 47 -70 29 60 8 -68 50
5121 50 -180 -12 -192 -133 -18 298 12 107 266 96 394 168 77 -39 5 122 202 47 67 -168 18 -365
5143 -365 -27 32 68 96 -258 -161 31 -114 11 33 262 202 33 278 344 177 101 346 21 -37 -198 -125 -88 60
5167 60 -203 -51 -177 103 -84 -149 10 -183 -53 63 240 62 216 -42 47 126 125 32 15 -309 54 -3 244
5190 244 22 -140 -72 -266 -59 -149 -247 -38 -201 -36 -153 -15 93 108 301 96 -44 128 40 -82 167 149
$$ packed form
5029f5K2J36l4J41R7m90M98j87k37P2N3k07N2J77k58j18O6K7n2J97J12k51M40
5052A91q1j42K46rj08J30k44J61j12k92K84j04m5j33P8k2K70k53N7K74k45K26
5074A27m8J09k99j8J47J51O3J13m32K01n2j2J44l2K2l43n4J18q0K23N9j50j83
5097b26P7J14j66J99PO6k45l2L44%j82j87J50J63j46K52j34pj17R9L1n2p6J18
5121E0k30J68j80N9J15L16k86R5J59j70K98k26r1j16M4J17Q0j55K0k35J86l83
5143c65L38N9L6K8l54R7J92j45J25K2K29o0j69K45O6j67p6K45l25n8j61P3L7J48
5167F0k63J52j26K80j87o5J59j93J30J16J77j78J54k58Q9P9jr3j7l24L63n7K47
5190B44k22j62O8j94K07r0r8K09j63J65j17J38J08J5J93k05j40J72q8j22K49j8
$$ plain form
5212 149 68 -87 199 208 52 92 -23 -238 -54 14 -81 -39 -72 -140 202 -69 303 16 67 147 49 10 -6 113 24
5237 24 -72 129 -241 -81 27 216 -36 -133 -160 -285 37 78 75 -219 -66 -224 66 39 295 342 -127 181 -94
5260 -94 166 410 187 224 -176 -157 -205 -260 -175 -190 -16 -298 -170 80 180 109 83 7 -221 34 3 121 171 125
5284 125 204 23 42 241 50 4 -118 -1 -72 -285 -112 -369 -162 -166 -34 55 87 33 -110 -41 150 199 268 200
5308 200 90 -7 -42 42 -204 -199 -281 17 219 -143 26 -20 10 241 47 -96 -52 -179 -46 50 -34 -86 -44 137
5332 137 283 153 293 83 104 167 -93 96 -232 -163 -33 -150 -44 43 -81 50 -153 -123 -21 -67 25 -178
5354 -178 59 -58 106 -59 198 339 190 101 100 -68 53 183 -35 -328 -86 -290 -204 -115 -120 16 111 -180 53
5377 53 -87 275 157 197 27 243 76 -41 -115 92 -88 -42 -44 39 -70 -413 -33 63 -72 -109 -128 -22 -219
$$ packed form
5212A49q1j55K86Rj56M0j15k15J84O8r5M2l3o8L42k71L72k87N1Q0r8l9j6J19q9
5237B4r6K01l70J60J08J89k52r7k7j25L22M1lk94J53j58K90k7K56M7m69L08k75
5260i4K60K44k23L7m00J9m8n5Q5j5J74k82J28K50J00p1k6p6k28K55l1J18N0m6
5284A25P9j81J9J99j91m6j22J17p1k13J73k57K07mJ32Q9L2n4j43O9J91M9O9o8
5308B00j10r7l5Q4k46Nq2K98K02l62J69m6L0K31j94j43M4j27J33R6q4n2M2J81
5332A37J46j30J40k10K1O3k60J89l28O9J30j17J06Q7j24J31k03L0J02m6R2k03
5354a78K37j17J64j65K57J41j49q9jj68J21J30k18k93K42k04Q6Q9nJ36R5k91K33
5377E3j40L62j18M0j70K16j67j17p4K07j80M6kQ3j09l43L80R6j35l7j9J06j97
$$ plain form
5400 -219 -34 -186 150 199 -27 211 179 371 -67 126 55 -26 -141 -184 35 77 -78 37 -83 -10 -148 32
5422 32 -128 -18 -76 116 -164 -62 124 120 223 -109 13 57 -109 -15 137 161 113 -25 -400 -262 168 0 -302
5445 -302 -180 -191 -85 -21 112 108 35 -124 160 499 180 236 37 19 -21 -67 93 53 -104 -141 -233 -240 -184 -140 -14
5470 -14 -72 -304 -85 101 -256 141 -24 -90 -51 -143 -204 335 339 101 43 112 229 144 -5 -85 -228 -146 -203 -387 46
5495 46 -106 -116 -220 15 45 105 108 -51 -78 183 200 253 -2 85 55 -56 114 -45 113 28 78 153 12 190 101
5520 101 -225 -111 -328 -336 -326 256 183 22 77 43 -56 53 209 135 45 -155 -155 47 175 96 175 -190 -106 -142 56
5545 56 -21 95 -209 -11 60 -144 16 138 201 64 219 70 100 283 288 13 236 -5 80 111 10 2 5 -72 -81
5570 -81 121 -29 -28 -38 -36 28 165 -108 -70 220 23 15 24 41 -12 -70 67 64 -111 -69 28 -155 -134 -292 -65 -234 -57
$$ packed form
5400b19J85j52L36M9k26K38l2J92m38J93p1q1j15m3K19M2j55J15j20P3j38J80
5422C2j60J10n8J92k80J02J86mJ03l32J22M4j66R4J52K4m8j38l75J38M30j68l02
5445c02J22j1J06O4J33mp3j59K84L39l19N6j99j8m0m6J60m0j57l7r2pN6M4J26
5470a4n8k32K19J86l57L97j65o6L9r2o1N39Mk38n8O9J17q5j49q0j43Q2n7j84M33
5495D6j52j0j04K35L0O0Lj59k7K61J7N3k55Q7l0j11J70j59J58q5N0P5j41J78q9
5520A01l26J14k17qJ0N82p3j61N5l4r9J09J56p4r0k00%K02J28p9P9l65Q4l6J98
5545E6p7J16l04J98P1k04J60J22O3j37J55j49L0J83Nk75K23k41Q5L1j01qLp7r
5570h1K02j50Jj0KO4J37k73L8K90j97qRJ7n3n8J37lj75M2R7j83K1j58K27j69J77
$$ plain form
5597 -57 -114 141 168 169 205 -120 -133 -81 233 300 100 220 -149 95 -152 19 -213 -211 -153 138 -44 -165 73 -185
5621 -185 122 133 -125 305 -189 -228 17 281 176 106 -47 35 -41 57 45 -234 42 -213 -71 15 105 67 4 -180
5645 -180 -87 -170 -44 164 71 273 18 -78 -48 79 -81 88 219 61 -29 17 162 83 101 -81 -105 -242 240
5668 240 -153 34 129 -352 -302 -166 -86 32 117 168 162 -95 205 107 138 238 44 -102 22 189 -19 191 1
5691 1 -193 -308 -175 271 95 22 -166 -42 -363 159 122 261 -28 74 65 0 204 242 131 34 17 18 217 -10
5715 -10 7 -173 -121 -363 -184 -121 151 78 76 -317 -208 -115 41 239 169 295 104 5 12 48 -12 71 -80 203 87
5740 87 108 16 -168 -321 -106 -79 22 -95 5 13 81 -36 -71 -67 -151 214 163 136 140 -335 -254 -100 -1 -26 -35 -76 60
5767 60 -142 18 -208 -156 169 204 -138 -157 -232 18 -22 -270 -37 52 18 -19 191 -90 3 -70 124 -104 -85 -10
$$ packed form
5597e7n7K55K7JL6l25j3N2L14O7k00J20l69K44k47J71k32KN8K91j82j21K38k58
5621a85L07J1k58M30m94l9K45K64j05p0j53Q2p6R8j2k79K76k55J42Q6R0l8o3j84
5645a80R3q3J26K08r3K02k55r6L0J27j60J69J31j58r0M6J45p9J8j82k4j37M82
5668B40l93J87R5m81N0J36Q0J18Q5N1ok57L00r8L1J00j94j46J24J67k08K10j90
5691Aj94j15J33M46j76p3j88J24l21N22l7J39k89J02ro5K04L8j11r7j7JJ99k27
5715a0J7j80N2k42J79O3K72p3kl93J09R3J56J98p0J26j91r9PL6o0Q3j51K83j16
5740H7K1r2j84j53K15K7J01j17J00QO8j17l5Mq4L65n1k7Mm75Q1J54R9k5rm1J36
5767F0k02J60k26N2L25L5l42j9p5K50m0k48K33Q9l4l7K10k81R3p3J94k28J9P5
$$ plain form
5791 -10 102 -233 -249 -151 17 37 173 217 39 176 -126 222 22 313 99 -170 -144 277 105 -116 57 114
5813 114 65 -90 -209 114 -102 -382 -251 46 -271 140 -30 29 -21 136 23 274 36 34 190 -13 38 72
5835 72 -187 146 75 -102 102 5 10 -57 47 -71 78 -183 -134 -30 -149 311 202 66 41 50 290 114 -113
5858 -113 107 125 210 -156 -183 -123 -264 -422 -99 -41 -160 109 -199 -9 -70 13 62 136 221 23 83 -220 3 353
5882 353 76 -42 199 179 148 113 4 105 15 -141 -265 -118 -201 -230 167 -218 -146 109 188 359 40 77 30
5905 30 -92 414 243 26 14 -63 52 203 -1 -102 -263 -40 21 -122 -54 -101 41 -91 -364 -134 -80 -184
5927 -184 217 230 -22 -28 37 65 67 292 282 12 -78 -21 -271 -179 -210 -287 -117 -153 30 -269 285 -259 17 44 32
5952 32 60 54 231 56 46 44 -31 170 -92 -168 119 -71 -127 -174 -133 -23 -83 -6 -127 65 4 160 -57 49 23
$$ packed form
5791a0J12l35j6R8J68K0J36M4j78J37l02L48k00K91k14k69K6M21j72k21J73N7
5813A14m9j55j19L23k16k80J31K97l17M11j70N9n0J57j13K51k38kJ56k03N1L4
5835G2k59L33p1j77K04r7No7J04j18J49k61M9J04j19M60j09j36k5RK40j76k27
5858a13K20J8Q5l66k7O0j41j58L23N8j19K69l08J90o1Q3M9P4Q5j98O0l03K23L50
5882C53k77j18K41k0l1l5j09J01r0j56j24J47q3k9L97l85P2K55P9J71l19L7m7
5905C0j22N06j71k17j2p7J15J51k04j01j61K23O1j43O8m7J42j32k73K30N4j04
5927a84M01J3k52oO5K8KK25j0k70r0N7k50R2l1p7J70l6J83k99N54n44K76K7j2
5952C2K8oJ77j75j0kp5K01k62p6K87j90n6m7M1J10o0P7j21J92o1J56k17J06k6
$$ plain form
5977 23 -43 151 -28 208 165 10 -180 20 -6 26 -198 -73 55 -6 -44 -165 34 -101 38 -29 -76 140 303
6000 303 141 119 64 127 114 7 325 151 167 -144 138 84 26 -185 16 -211 -300 -63 85 -105 -171 39 -28
6023 -28 -30 -109 -54 22 -235 6 102 294 202 322 65 60 34 77 -142 -103 -441 -98 -339 -355 3 -62 89 -10 -94 -22
6049 -22 5 235 57 180 27 37 -17 189 268 177 48 -116 -60 -32 -52 -174 -8 -33 -119 -186 -158 -85 -158 68 -130
6074 -130 34 83 321 188 -71 21 -153 147 -63 35 -1 33 -9 41 -67 116 45 -99 157 -201 223 1 105
6097 105 -303 -127 227 -60 189 -113 54 10 -39 280 -30 61 16 139 31 56 -192 -64 -255 -113 4 -102
6119 -102 -67 -280 -200 82 112 65 -239 208 15 288 236 68 25 -84 121 -42 49 123 -220 -245 -188 95 -214
6142 -214 -91 -72 -202 -306 399 70 226 84 26 171 73 290 109 331 98 35 -329 -31 -234 -157 -16 21
$$ packed form
5977B3o6J94j79K36m3j55j90K00k6L2k24J25J28o1l8j21J99j35J39o7m7K16J63
6000C03j62k2n5O3j3j07L18j74J6l11K82n4n8k11K01k27q9K37J48j90o6K10o7
6023b8kp9N5P6k57K41R6J92r2J20k57nk6M3k19L9l38L43k41j6L58o5J51r9q4P2
6049b2K7K30j78J23j53J0n4K06P9r1j29j64N6K8k0j22J66k5q6o7K8P3p3K26j98
6074a30J64M9K38j33k59R2j74L00k10R8l6L4m2N0j08J83p1j44K56l58M24k22J04
6097A05m08J76L54k87K49l02J67m4m9L19l10R1m5J23j08K5k48J28j91J42J17j06
6119a02L5k13Q0K82L0m7l04M47j93K73n2j68m3j09K05j63R1P4l43k5N7K83l09
6142b14J23J9j30j04P05l29J56j42n8J45r8K17j81K22k33o3l64K98k03P7J41L7
$$ plain form
6164 21 -258 -228 94 30 -106 -118 -205 253 290 366 295 -78 177 12 3 81 130 -1 -130 -18 -117 0 -9 -305 -64
6189 -64 -73 79 247 79 -167 -14 195 -45 -58 30 130 81 15 207 255 -117 -126 119 107 36 33 -47 145 198 21
6214 21 12 -243 -348 -20 -94 33 -102 -221 -31 -166 -66 -107 6 -44 -32 273 385 -13 8 208 105 88 53
6237 53 -188 46 -176 -274 74 -26 -97 -142 -121 -19 122 -51 128 259 128 88 139 167 210 151 475 33 -150
6260 -150 99 -44 -165 -192 -169 -256 -302 -41 -8 47 -72 6 54 -163 144 152 185 191 331 344 130 299 324 147 -147
6285 -147 -75 -139 -197 -56 -69 -207 29 -125 -215 -114 -70 139 -20 48 -197 423 370 -45 17 145 -3 -90 131
6308 131 -62 54 -157 39 -276 -30 46 152 33 -30 56 152 40 192 7 6 99 308 122 98 -40 -66 5
6331 5 -121 200 -2 6 -79 296 91 -74 -16 32 -30 25 -189 -169 -187 22 88 -26 -227 -137 -47 -268 323 263 199
$$ packed form
6164B1k79L0L22o4j36j2q7M58L7P6p1l73K55j65rP8M9j31j29J12r9J17rk96K41
6189f4rJ52J68j68k46J53K09k40j3Q8J00m9o6J92M8l72rK45j2p1lq0J92N3j77
6214B1rk55j05L28p4J27j35j19J90j35J00m1J13n0J2L05J12l98K1K00j03j7l5
6237E3k41K34k22r8L48j00p1m5K1J02J41j73J79J31j31m0N1K8M3n9L24m42j83
6260a50K49j43j21k7K3q7m6K61L3N5j19P8M8k17L07QL3OJ40J3k14J69K5j77k94
6285a47P2o4n8J41j3j38K36j54r0J01M4K09j59O8k45O20n3m15O2J28j48q7K21
6308A31j93J16k11J96l15K46P6J06j19o3Q6R6j12J52j85jR3K09j86k4j38k6P1
6331Ej26L21k02Qq5L75k05j65N8M8o2N5k14K0j8K09O6j14k01R0R0k21N91o0o4
$$ plain form
6356 199 -46 80 103 176 -84 9 98 -70 -383 -39 -97 41 -271 -55 -8 -126 157 -113 3 3 49 51 -77 281
6380 281 380 615 250 -66 2 -17 -117 -32 -107 -217 -283 -241 -391 -253 -130 -27 55 -56 -12 -11 292 70 241 61
6404 61 -111 74 -17 -18 -4 -87 -317 -259 -97 98 -110 -349 -30 -84 -66 64 -160 130 71 82 172 254 176 29 40
6429 40 -45 12 25 130 32 186 -364 -227 -6 -131 -112 -274 -116 29 -41 -12 -126 63 -137 -29 52 95 57 323
6453 323 271 -5 296 -3 120 142 26 -185 -84 -42 -5 -232 -326 -374 -22 -88 -105 -197 -127 -362 -301 228 111 69
6477 69 265 273 137 235 223 63 -2 87 -140 -140 -277 -218 -30 -50 20 -20 -242 -429 -159 -191 306 -197 100 38 240
6502 240 356 235 254 -6 28 -27 -125 85 -211 -120 -316 -51 -100 -144 -269 3 -166 -215 -97 68 75 156 191 255
6526 255 59 -5 -38 9 65 280 -300 -339 67 -270 17 -135 -184 -169 -151 86 -174 118 136 -85 -129 52 123 82
$$ packed form
6356A99k45J26K3P3k60R3Q9j68l13L44n8J38l12K16M7j18K83k70J16%M6Kj28L58
6380B81R9K35l65l16O8j9j00Q5p5j10o6M2j50J38J23J03Q2j11M4JL03k22J71j80
6404F1j72J85r1jJ4q3k30N8J62J95k08k39L19n4J8J30k24K90n9J1R0Q2p8j47J1
6429D0q5N7J3J05r8J54n50J37K21j25J9j62J58J45p0K9j14J89k00J08Q1M3l8K66
6453C23n2k76L01k99J23K2j16k11J01M2L7k27r4m8L52o6j7r2P0k35O1N29j17m2
6477F9J96Qj36R8j2j60o5Q9k27%j37N9J88k0P0m0k22j87K70l2M97n03K97o2K02
6502B40J16j21J9k60L4n5r8K10k96R1j96K65m9m4j25K72j69m9J18J65PQ1L5O4
6526B55j96o4l3M7N6K15n80l9M06l37K87j52m9J5J8K37k60K92J8k21m4J81P1m1
$$ plain form
6550 82 -6 140 75 59 24 143 317 196 74 218 221 134 -224 -156 -124 -115 -170 -280 -141 -128 102 260 -169 -24 209
6575 209 110 227 209 -17 217 204 94 289 -28 67 -53 62 -243 -177 -266 -242 71 202 -84 -44 -74 -215 -79
6598 -79 265 113 -113 249 141 280 201 42 -125 102 39 -4 -362 -206 -23 -293 -197 -91 -83 -65 -429 39 197
6621 197 115 -135 285 341 68 100 214 -67 57 246 78 164 100 -104 -394 -90 -163 34 -78 -576 -102 -87
6643 -87 -104 -32 -105 53 75 -2 -188 -16 -88 20 92 162 -36 -193 273 39 -59 8 153 -95 56 -133 -122 -90
6667 -90 -135 -361 -23 8 -9 100 115 -5 -219 211 264 110 101 -72 148 282 -75 -146 -1 -205 -217 -104 -288
6690 -288 -207 -41 -157 -104 -46 -46 26 100 186 355 100 51 360 243 49 -37 6 85 -299 -31 -141 -158 -81 -367 -28
6715 -28 -337 -65 -275 -183 -58 -10 292 111 279 373 137 8 95 39 327 178 -256 -161 -7 38 -166 -268 -45
$$ packed form
6550H2q8J46o5j6l5J19J74j21j22J44Lq7l58O8L2Rn5j10J39J3K30J58m29J45K33
6575B09r9J17j8k26K34j3j10J95l17R5j20J15l05O6q9K4L13J31k86M0l0j41J36
6598g9L44j52k26L62j08J39p9j59j67K27o3m3l58J56J83k70R6J06QJ8l64M68J58
6621A97q2k50M20N6k73L2J14k81J24J89j68Q6o4k04k90L04p3J97j12m98M74J5
6643h7j7P2p3J58K2p7j86J72p2J08P2P0j98j57M66k34r8O7J45k48J51j89J1L2
6667i0m5k26L38L1j7J09J5j20k14M30N3j54rj73K20J34l57p1J45k04j2J13j84
6690b88Q1J66j16N3N8%P2P4Q6J69k55m9L09j17j94q6M3P9l84K68j10j7P7k86L39
6715b8l09K72k10R2J25M8L02j81J68R4k36j29Q7n6K88j49m34R5J54M5k04j02K23
$$ plain form
6738 -45 -206 -37 -81 -12 95 93 84 374 171 15 144 107 69 63 -264 299 -142 39 -70 -41 -183 -38 51 17 205
6763 205 77 69 -303 141 -206 -60 134 198 96 22 24 193 -2 32 -44 -85 -27 157 286 219 87 -76 -229 -93
6787 -93 -24 -19 -223 -246 -79 -30 -64 -77 -181 -77 180 -13 -88 196 125 140 427 162 1 -222 103 -17 144 47
6811 47 -263 83 -246 -104 -8 -219 -186 -68 123 -132 145 -61 71 122 143 284 311 301 -125 157 -188 -71
6833 -71 -59 99 -161 -306 -254 -163 135 135 -49 -37 46 -42 -43 216 109 38 -85 0 144 -91 154 20 206 -456
6857 -456 -415 -225 -95 -28 -207 -43 -293 -169 117 110 58 -62 10 255 256 235 340 243 227 -206 -160 74 53 223
6881 223 259 -49 -227 101 -53 9 -16 -241 16 -276 -248 16 190 390 -9 78 164 7 264 68 97 72 85
6904 85 -108 101 169 -209 -266 -247 -126 10 -170 51 -35 87 31 -98 62 160 -118 69 174 79 248 75 436
$$ packed form
6738d5j61J69m4O9J07krK90k03j56J29l7l8ol27N63m41J81j09K9j42J45Q9l4J88
6763B05j28ql72M44l47J46J94O4j02p4KJ69j95L4p6m1N8J84J29o7j32j63j53J36
6787i3O9Nk04k3J67M9l4j3j04J04K57j93p5K84p1J5K87k65j61k23L25j20J61r7
6811D7l10L46l29J42R6k11L3J18J91k55K77k06J32N1K1J41K7j0m26K82l45J17
6833g1J2J58k60j45N2R1K98%j84J2Q3q8jK59j07p1j23Q5J44k35K45j34J86o62
6857d56M1J90J30O7j79J64k50J24K86pn2j20P2K45Jk1J05r7j6m33M6K34k1J70
6881B23L6l08j78L28j54O2k5k25K57k92K8K64J74K00l99Q7Q6j57K57j96K9k5J3
6904H5j93K09O8l78n7J9J21J36j80K21q6J22n6j29J60R8k78J87J05r5J69j73L61
$$ plain form
6927 436 102 238 77 -134 -161 224 -46 -72 -170 -93 -175 -238 -79 141 -101 -29 114 106 225 -4 208 203 435 -158
6951 -158 -14 45 -21 -19 19 -47 -329 -217 -95 -95 -138 -51 -37 45 -191 -118 45 20 -24 149 242 42 -145 6 97 237
6977 237 -11 125 -175 -244 189 -7 -112 63 -312 -284 -9 51 205 -116 -92 -111 -145 215 53 132 125 210 316
7000 316 60 318 107 -57 -3 215 210 95 -22 -219 -267 -256 102 -324 -105 -107 -98 -4 -18 64 291 221 -32 134
7024 134 157 -40 185 106 34 170 -34 52 -111 -115 -115 -103 -236 -165 -225 -226 -215 22 6 246 166 321 62 238 223 38
7050 38 241 142 327 -114 26 -277 -209 -326 -178 132 -273 -106 -341 -332 -5 20 205 151 -75 130 134 171 102 154
7074 154 -97 12 -58 -45 -169 -69 123 -245 -25 -304 -79 178 -125 -23 358 -29 -1 145 111 72 156 214
7096 214 137 29 253 106 -37 -43 -57 -107 9 129 -104 -176 132 19 -152 42 54 -171 -152 -96 -122 -7 -271
$$ packed form
6927D36l34J36j61k11k7L85k70k6r8P7q2o3J59K20k42P2J43qJ19k29K12nK32n93
6951a58J44N9o6KL8o6k82J12J22%m3Q7J4Q2k36P3J63k5m4J73R3k00j87J51R1J40
6977B37k48J36l00o9M33j96j05J75l75K8K75O0J54l21K4j9l4L60j62P9pQ5J06
7000C16k56K58k11j64N4K18nj15j17j97m8J1L58m26K19kRR4j4Q2K27p0k53J66
7024A34K3j97K25p9p2J36k04Q6j63m%J2j33P1o0jJ1K37j6K40q0J55k59J76j5j85
7050C8K03r9J85m41J40l03O8j17J48L10m05J67k35RL27K5J85n4k26K05ML7o9N2
7074A54k51J09p0J3j24J00J92l68K20k79K25K57l03J02L81l87K8J46l4l9Q4N8
7096B14p7j08K24j47j43oj4n0J16J20k33p2L08j13j71J94J2k25J9N6k6J15k64
$$ plain form
7119 -271 -163 13 126 134 131 -72 433 254 -97 167 -62 -196 -39 40 -41 -390 -38 -115 3 -181 -97 -234 -99
7142 -99 -99 -32 65 52 37 440 220 255 177 210 -6 -125 114 2 -211 -254 -283 -237 -192 -44 16 40 118 -199 85 10
7168 10 50 199 378 179 118 209 -97 122 162 84 88 -131 -200 -82 2 -11 -68 -162 -277 -270 134 -78 46 193 -74
7193 -74 -112 -18 8 97 -25 -42 -191 4 105 9 -164 -185 -92 -297 -45 39 59 -177 85 -249 -66 -139 197 56
7217 56 410 21 -288 -14 -263 165 -102 31 -38 -21 24 100 45 -74 -21 -345 82 -152 75 23 -122 -108 -11
7240 -11 14 -121 119 241 53 103 37 229 76 306 411 121 -48 170 10 13 -207 -211 10 -328 -132 -186 142
7263 142 -57 -121 -1 -25 -11 150 121 236 24 146 238 -10 79 113 42 65 -133 -57 -386 -436 -182 -132 107 -147
7287 -147 -277 -1 77 77 -109 280 185 126 9 114 32 147 -177 -61 102 39 -237 -340 236 -42 -96 -137 -108
$$ packed form
7119b71J08J76J13Qlk03N05j79l51K64k29j34J57P9q1l49L52p7J18j84Q4j37J35
7142i9%O7R7j3j5M03k20L5p8L3k16j19K39j12k13m3k9M6M5J48O0K4P8l17K84p5
7168A0M0J49J79j99o1R1l06K19M0p8Mk19o9J18Q4j3n7r4j15PM04k12J24J47k67
7193g4l8R4K6Q9j22j7j49J95J01r6j73k1R3k05K52Q4K0k36K62l34J83p3L36j41
7217E6L54l89l09K74k49M28k67J33o9J7M5P6n5j19N3l24M27k34K27n2j45J4R7
7240a1K5j35K40J22j88N0o6J92j53K30J05k90j69K18j60Lk20mK21l38J96n4L28
7263A42j99o4J20k4J4J61k9J15k12J22R2k48Q9L4p1K3j98P6l29n0K54N0K39k54
7287a47j30K76P8%j86L89r5n9j17J05q2J15l24J16J63o3k76j03N76k78n4m1K9
$$ plain form
7310 -108 -256 -126 233 -63 -45 132 -6 -27 52 98 215 170 -119 17 8 -207 9 5 -272 -221 -9 17 -154 -34
7334 -34 -97 -221 -138 -68 -5 152 180 75 16 -23 -4 -84 -43 71 89 -146 44 122 60 -216 -74 -344 -179 -139 -35
7359 -35 -22 -256 -55 -360 -211 0 90 -211 104 32 -41 322 349 -112 85 255 96 -2 2 247 156 26 -219
7382 -219 -200 -103 -199 -239 -49 -177 -378 9 36 -69 169 -21 103 154 -131 193 248 16 -33 -31 -60 -71 -104 -296
7406 -296 -180 -215 -305 -114 -236 -19 134 177 82 -23 -118 110 53 37 -145 252 165 71 27 -223 -131 -185 -170 103
7430 103 -99 -271 -196 -165 -6 12 -50 -310 -40 264 43 277 54 8 49 -151 81 -16 47 -124 150 -38 -97
7453 -97 -165 1 145 -412 -183 -172 -10 69 0 77 39 -114 -126 99 203 230 239 -12 -241 24 126 193 -13 35
7477 35 -349 -11 -71 -6 -213 -192 -59 29 -35 -118 -67 -224 24 172 147 6 148 40 65 248 233 109 -58 57
$$ packed form
7310a08j48J30L59k96J8J77j38k1P9M6J17m5k89J36rk15K16mk77N1K12K6j71J20
7334c4o3j24Q3P0O3J57K8j05n9l9J9q0M1J14J8k35J90P8o2k76J42k70J65M0J04
7359c5J3k34K01l05J49K11R0l01L15p2p3L63K7m61J97J70j59r8MK45r1j30k45
7382b19J9R7r6m0J90j28k01L87K7j05K38j90J24N1k85L24N5k32m9Kk9j1l3j92
7406b96J16l5r0J91j22K17J53M3r5j05r5K28n7j6j82L97q7r4m4k50R2n4J5K73
7430A03k02j72P5L1J59J8o2k60K70L04k21K34k23m6M1k00K32r7O3j71K74j88n9
7453i7o8J66J44n57K29J1J62P9o9P7l8j53j2K25J04K7Rk51k29K65J02O7k06M8
7477C5l84L38o0O5k07K1J33Q8o4q3N1j57K48J48k5j41J42j08K5J83j5j24j67J15
$$ plain form
7501 57 130 -164 -60 -144 116 92 70 105 -185 -179 -342 -282 -194 25 -74 149 260 202 257 56 158 -37 191 -166
7525 -166 106 69 -48 -66 84 -89 -216 -148 -119 7 -32 -80 -175 71 -82 68 200 94 114 -5 202 66 41
7548 41 39 96 -42 -139 -37 -109 64 -369 -110 310 -126 54 26 36 172 160 -120 80 51 -63 109 148 107 167
7572 167 9 75 159 -12 42 -11 8 -34 -112 -28 -339 -208 -171 -41 -31 -15 42 49 20 144 -45 -5 195 -40 97
7597 97 197 183 18 19 -130 36 2 -205 -162 -113 -170 -122 50 -16 -39 -22 -33 36 -38 193 223 130 157 135 -155 -202 -52
7624 -52 83 -244 -266 -119 -160 -185 -13 -193 -110 -234 -2 -124 96 111 -205 -96 -111 -46 242 -65 51 -17 -19 -114
7648 -114 181 77 -52 45 -127 -252 -21 66 -103 8 -171 -123 -189 169 -10 13 -34 -222 67 -60 225 47
7670 47 -139 81 56 43 152 150 -63 41 66 -299 -331 -111 3 -56 -21 -66 -139 -185 48 182 -87 85 -61 303
$$ packed form
7501E7P3k94J04q4K60k4k2L5k90Oj63O0Q8K19r9K23J11n8N5k01J02j95K28l57
7525a66K72l7j17j8J50j73j27O8K9J26l9m8r5K46j53J50J32j06K0j19K07j36k5
7548D1kN7j38r7J02p2J73m33K59M20m36J80k8J0J36j2k80K00k9j14J72L9m1O0
7572A67j58O6Q4j71N4n3J9m2p8Q4l11J31L7J30J0J6N7Pk9J24j89M0K00k35J37
7597I7J00j4j65Jj49J66l4k07M3M9n7M8J72o6k3J7j1O9p4K31L0r3K7k2k90m7J50
7624e2J35l27k2J47m1k5J72j80Q3j24K32j22K20J5l16J09j5O5K88l07J16o8kr5
7648a14K95j04j29R7j72j25K31Q7j69J11j79M8o6L58j79K3m7j88K89j27K85j78
7670D7j86K20k5j3J09kk13J04K5l65l2K20J14n9L5m5p3m6K33J34k69J72j46L64
$$ plain form
7694 303 90 381 144 98 -22 39 -41 -211 -160 2 108 -46 -69 -283 -183 115 -201 23 -53 180 50 209
7716 209 190 37 276 66 72 363 70 20 2 -93 18 -70 35 75 -98 -64 -32 -79 -8 -112 -98 202 -118 41
7740 41 322 236 55 413 90 -193 -147 -87 -80 42 -232 -79 62 -242 -197 158 52 -402 -132 106 54 -182 206
7763 206 73 -46 60 134 339 115 -105 -41 -249 -195 122 93 43 -248 -213 -353 83 -222 288 -173 50 -142
7785 -142 -128 -89 -160 -45 -185 200 159 -171 151 -20 -8 250 133 -173 164 -121 41 -10 -186 -283 -337 -107 -210
7808 -210 -96 -16 -101 -60 -127 -208 90 140 95 -184 130 251 -34 -36 170 150 10 -210 -176 -7 -142 -24 -149 -165
7832 -165 -356 -111 -43 173 40 159 -169 320 68 253 182 186 269 162 58 6 33 57 -136 -291 -235 78 -93
7855 -93 49 -99 -57 6 -81 -28 -35 37 8 113 170 288 0 13 71 339 70 -70 -241 38 -206 -32 -30 -337 -287
$$ packed form
7694C03k13K91k37m6j20O1q0j70N1J62J06j54k3k14J00K98l16K24p6K33j30J59
7716B09j9j53K39k10OK91k93n0j8r5J11q8J05M0j73L4L2m7P1j04J4L00l20J59
7740D1K81q6j81L58l23k83M6O0PJ22k74J53J41l04M5L55j06m54K70K38n2k36L88
7763B06j33j19J06P4K05k24k20O4k08N4L17k9n0k91L5j40M36l05N10m61K23j92
7785a42J4L9p1J15j40L85m1l30L22j71J2K58j17l06L37k85J62n1j76r7n4K30j03
7808b10J14Q0q5M1o7q1K98N0m5k79L14J21k85kK06k0j40k20L4J69j35J18j25j6
7832a65j91K45O8K16j33J19l28M89k52J85p1MQ3j07j04n2K7K4j93j55N6L13j71
7855i3J42j48M2O3q7N3pP2k9J05N7J18k88J3N8K68k69j40j71K79k44J74Kl07N0
$$ plain form
7880 -287 -65 156 -63 55 111 -53 216 89 -31 130 -56 188 177 66 35 253 -180 127 154 -91 -14 4
7902 4 102 -47 -94 -4 -84 53 -84 142 -76 0 -9 124 248 321 314 78 66 79 57 53 -145 -17 217 230 -89 -134
7928 -134 15 -17 -327 -16 16 -315 -8 166 11 213 0 110 85 221 137 57 -3 -231 -14 -164 254 -241
7950 -241 -37 -71 -210 -370 -329 72 76 -416 50 -122 163 -41 58 11 -109 203 114 75 292 56 65 172 -154
7973 -154 -83 -326 -82 62 -113 -225 300 -318 -163 25 39 -70 26 -1 199 99 5 230 167 97 -122 -86 -211
7996 -211 -202 124 -40 -79 -59 -108 -2 -49 156 269 10 -6 -167 -38 71 90 50 169 -97 -52 -78 19 234 79
8020 79 -68 35 -66 -100 -194 152 122 16 -171 297 61 -96 -36 213 40 238 36 199 137 0 -255 126
8042 126 162 -92 13 46 118 26 77 -25 3 -148 -115 -84 -73 -140 -97 104 -38 -43 5 48 395 -6 12 314 205
$$ packed form
7880b87K22K21k19J18N6j64K69j27j20J61j86K44j1j11l1K18m33L07K7k45P7J8
7902DR8j49m7R0q0J37j37K26k18P6rJ33J24P3pk36j2J3k2mj98J28K34J3l19m5
7928a34J49l2l10L11L2l31L07J74j55K02k13J10k5J36q4q0o0k28K17j50M18m95
7950b41K04l4j39j60M1M01Mm92M66j72K85k04R9m7j20L12q9l9K17k36RJ07l26
7973a54P1k43K44J44j75j12N25o18J55J88J4j09R6k7K00j00r4K25o3p0k19L6j25
7996b11RL26j64l9K0m9J06m7K05J13k59j6j61J29J09J9m0J19k66M5k6R7K15j55
8020G9j47J03j01l4r4L46l0j06j87M68k36j57O0K49j73J98k02J63o2j37k55L81
8042A26L6k54J05L3P2r2N1j02K8j51L3L1J1o7M3K01j42nM8M3L47m01J8L02j09
$$ plain form
8067 205 -67 -244 124 26 -77 -30 -66 -49 -68 -195 -282 -1 25 -37 -112 -21 60 215 -178 -34 237 147 76 305
8091 305 315 -23 30 -25 -173 -31 66 -55 -151 -232 -147 25 -24 -77 -139 194 -171 55 215 -99 -52 4 174 217
8115 217 174 139 112 76 259 -135 -250 -83 -186 154 -58 98 5 -50 -76 110 -144 -131 -24 -67 125 2 72
8138 72 134 216 39 210 51 -44 175 163 40 -74 43 -7 -161 -197 55 -33 168 159 50 186 41 299 170
8161 170 146 107 305 151 225 -29 -75 195 -161 34 -98 10 -252 -249 -184 -263 72 -47 -174 -127 -59 85 -15
8184 -15 237 43 350 300 4 164 -87
$$ packed form
8067B05k72j77L68r8j03M7l6J7j9j27q7K81K6o2p5R1Q1J55l93J44K71r0p1K29
8091C05J0l38N3n5j48J42R7j21r6q1Q5J72m9n3o2L33l65K26J60l14M7N6J70M3
8115B17m3l5k7l6J83l94j15J67j03L40k12J56r3n5k6J86k54J3J07m3J92j23P0
8138G2O2Q2j77J71j59r5K19j2j23j14J17n0j54l6K52q8K01rj09J36j45K58j29
8161A70k4l9J98j54P4k54m6K70l56J95j32J08k62LO5p9L35j19j27M7O8J44j00
8184a5K52j94L07n0k96J60k51
8191h7
$$ Imaginary data points
##PAGE= N=2
##DATA TABLE= (X++(I..I)), XYDATA
$$ plain form
0 0 0 0 0 0 0 0 0 0 0 0 0 -8 8 -8 8 -15 16 -16 24 -24 32 -40 48 -56 64 -73 88 -99 115 -131 150 -172 196
33 196 -220 250 -281 314 -353 395 -438 489 -543 600 -667 739 -814 901 -991 1093 -1205 1327
51 1327 -1461 1610 -1779 1966 -2177 2417 -2696 3018 -3399 3857 -4424 5142 -6082 7381 -9295
66 -9295 12410 -18377 34032 -169569 -392258 -164926 59152 285782 368729 362930 260904
77 260904 179343 113628 72634 -10879 -105710 -173238 -164082 -128889 -77960 -41444 -42267 -94334 -125450
90 -125450 -97278 -12065 77290 125582 104636 40381 -31824 -44192 32087 139470 182046 148434
102 148434 73147 -2781 -44152 -45740 -51208 -93368 -162684 -205498 -170068 -77328 -1062 32016
114 32016 35896 26495 37495 102183 182078 215019 184849 112794 27717 -47599 -106472 -140507
$$ packed form
0@%%%%%%%%%%%qJ6j6J6k3L1l2M0m8N6p2Q8j04J20j37J61j87K14k46K81l22L68
33A96m16M70n31N95o67P48q33R27j032J143j267J406j553J715j892K084k298K532
51A327k788L071l389L745m143M594n113N714o417P256q281R566j1224J3463j6676
66i295K1705l0787N2409k03601k22689K27332K24078K26630Q2947n799j02026
77B60904q1561o5715m0994q3513r4831o7528R156L5193N0929L6516q23n2067l1116
90a25450K8172Q5213Q9355M8292k0946o4255p2205j2368P6279J07383M2576l3612
102A48434p5287p5928m1371j588n468m2160o9316m2814L5430R2740P6266L3078
114C2016L880r401J1000O4688P9895L2941l0170p2055q5077p5316n8873l4035
$$ plain form
126 -140507 -147804 -151405 -155876 -132856 -76036 -6763 65763 122893 134244 104893 66808 45680
138 45680 49530 51575 21662 -24980 -56708 -64757 -41742 808 19789 -2840 -37726 -57533 -53493
151 -53493 -34307 -22729 -22094 -17783 -7953 7405 36108 62772 71554 77387 86706 84555 67548 37670
165 37670 -3429 -44311 -81320 -114894 -131396 -125378 -106491 -72804 -26957 10405 38347 71497
177 71497 105497 130213 138412 118341 75420 29840 -15595 -57368 -82728 -93221 -91759 -69636
189 -69636 -37252 -17240 -10193 -11523 -13866 -4069 15561 27842 34201 36249 30608 27439 31877 29777
203 29777 19898 13468 9594 9600 12594 5161 -13285 -33108 -55572 -74180 -74051 -60289 -41920 -13976
217 -13976 15449 36217 54249 69430 75197 72739 57805 26225 -4048 -23903 -39489 -47114 -47190
$$ packed form
126a40507p297l601m471K3020N6820O9273P2526N7130J1351k9351l8085k1128
138D5680L850K045k9913m6642l1728q049K3015M2550J8981k2629l4886j9807M040
151e3493J9186J1578O35M311R830J5358K8703K6664Q782N833R319k151j7007k9878
165C7670m1099m0882l7009l3574j6502O018J8887L3687M5847L7362K7942L3150
177G1497L4000K4716Q199k0071m2921m5580m5435m1773k5360j0493J462K2123
189f9636L2384K0012P047j330k343R797J9630J2281O359K048n641l169M438k100
203B9777r879o430l874OK994p433j8446j9823k2464j8608J29J3762J8369K7944
217a3976K9425K0768J8032J5181N767k458j4934l1580l0273j9855j5586p625p6
$$ plain form
230 -47190 -50438 -51033 -38195 -17614 5448 26953 35716 35398 35279 27896 14668 7136 1289 -6049
244 -6049 -6661 -5981 -11447 -15629 -17349 -19727 -17105 -13453 -9692 4431 24849 34555 32338 19030 -5638
259 -5638 -25873 -28328 -19734 -4921 12992 25673 35265 41083 29402 1264 -27865 -52237 -64487
272 -64487 -55754 -37040 -18788 2002 22679 38295 48792 48011 35334 27525 25068 18230 8507
285 8507 -4657 -23645 -36991 -35779 -32063 -30872 -30723 -30501 -21158 -2145 10396 13675 17914 23601
299 23601 32916 46905 48706 30918 7695 -10252 -20879 -22097 -24417 -28754 -22758 -7218 5451
312 5451 11881 7400 -9972 -22140 -19891 -11844 -5052 685 4916 16372 34424 41187 33146 18516
326 18516 1048 -9469 -8569 -11972 -24665 -32422 -29734 -16582 2927 13668 10639 6745 6397 5213
$$ packed form
230d7190l248n95J2838K0581K3062K1505Q763l18j19p383j3228p532n847p338
244f049o12O80n466m182j720k378K622L652L761J4123K0418R706k217j3308k4668
259e638k0235k455Q594J4813J7913J2681R592N818j1681k8138k9129k4372j2250
272f4487Q733J8714J8252K0790K0677J5616J0497p81j2677p809k457o838r723
285H507j3164j8988j3346J212L716J191J49K22R343J9013J2541L279M239N687
299B3601R315J3989J801j7788k3223j7947j0627j218k320m337N996J5540J2669
312E451O430m481j7372j2168K249Q047O792N737M231J1456J8052O763q041j4630
326A8516j7468j0517R00l403j2693p757K688J3152J9509J0741l029l894l48j184
$$ plain form
340 5213 4680 -15 -9665 -8014 8673 23216 25736 14868 -4907 -18419 -19477 -21898 -27204 -27684
354 -27684 -19601 4212 36621 51495 39639 16757 -2564 -9682 -3837 -1930 -12345 -21385 -20981
367 -20981 -12423 581 4221 -6895 -16396 -14689 -6380 5756 14759 14375 14625 19532 19311 13964 8875
382 8875 5071 6875 10262 426 -20006 -33819 -33295 -19014 720 5385 -7951 -17597 -12141 4575
396 4575 20556 18769 -576 -12800 -4065 19496 44023 48320 27095 2172 -9095 -12329 -14071
409 -14071 -19297 -31220 -39611 -34686 -23074 -9027 4980 13016 16991 20867 17106 9285 12681 22646
423 22646 28922 24447 5549 -20011 -31254 -23574 -9440 -2040 -10464 -26634 -23788 2344 28594
436 28594 36516 21699 -6015 -22526 -13889 4769 15282 9083 -8742 -17272 -6661 8240 14554
$$ packed form
340E213n33m695r650J651J6687J4543K520j0868j9775j3512j058k421n306m80
354b7684Q083K3813L2409J4874j1856k2882j9321p118N845J907j0415r040M04
367b0981Q558J3004L640j1116r501J707Q309J2136R003l84K50M907k21n347n089
382H875l804J804L387r836k0432j3813N24J4281J9734M665j3336r646N456J6716
396D575J5981j787j9345j2224Q735K3561K4527M297k1225k4923j1267l234j742
409a4071n226j1923q391M925J1612J4047J4007Q036L975L876l761p821L396R965
423B2646O276m475j8898k5560j1243P680J4134P400q424j6170K846K6132K6250
436B8594P922j4817k7714j6511Q637J8658J0513o199j7825q530J0611J4901O314
$$ plain form
449 14554 13452 3305 -8987 -10250 -4375 -613 795 -1093 -4802 -5635 -5082 -2029 11407 25275
463 25275 24165 12275 -1662 -12699 -12816 -4428 -3488 -16198 -31439 -37208 -21509 5495 19609
476 19609 15704 9245 9107 21450 43567 52996 34526 1450 -25525 -34453 -26672 -20633 -23732 -25866
490 -25866 -22309 -14092 2540 15689 11366 -2051 -8329 -5363 6171 21224 31637 34461 27272
503 27272 9852 -3742 -6343 -6252 -5861 -3025 -6362 -16553 -20344 -14960 -9855 -12042 -23681 -32889 -25416
518 -25416 -3974 20116 39777 42460 26992 16130 21868 32610 34434 22545 -2512 -27770 -43145
531 -43145 -47478 -42230 -34205 -31718 -24742 -3611 20384 35236 39634 31098 11311 -5431 -9584 -688
545 -688 15992 25673 22629 12600 -4817 -23090 -28301 -22881 -19838 -17676 -12030 -4138 5389 13591
$$ packed form
449A4554j102j0147j2292j263N875L762J408j888l709q33N53L053J3436J3868
463B5275j110j1890j3937j1037j17Q388R40j2710j5241n769J5699K7004J4114
476A9609l905o459j38J2343K2117R429j8470l3076k6975q928P781O039l099k134
490b5866L557Q217J6632J3149m323j3417o278K966J1534J5053J0413K824p189
503B7272j7420j3594k601R1L91K836l337j0191l791N384N105k187j1639r208P473
518b5416K1442K4090J9661K683j5468j0862N738J0742J824j1889k5057k5258j5375
531d3145m333N248Q025K487O976K1131K3995J4852M398q536j9787j6742m153Q896
545f88J6680R681l044j0029j7417j8273n211N420L043K162N646P892R527Q202
$$ plain form
559 13591 13627 6493 -4125 -11341 -5113 14024 28321 30560 24641 10365 -5151 -11842 -12353 -14279
573 -14279 -19065 -26972 -32014 -27172 -16936 -6093 6777 17235 22675 31980 43981 47320 38540 19729
587 19729 -5651 -27176 -37255 -38776 -32648 -23512 -19181 -14608 -6402 -1278 545 3942 6201 9117
601 9117 18327 28584 34460 35664 28964 14818 312 -13093 -23316 -24539 -20245 -18183 -15017 -13546
615 -13546 -15738 -15417 -11156 -10405 -9904 -5079 3166 16531 30306 36222 34626 30036 23777 20934 19978
630 19978 9508 -11060 -29674 -42082 -47257 -43063 -35531 -29172 -18866 -3368 13967 29631 34185
643 34185 27473 21830 20424 17220 15754 15097 9574 1252 -4899 -10792 -17969 -24043 -27051 -21604 -11446
658 -11446 -7235 -6221 -834 3460 4800 8246 8636 3459 2699 10353 20682 25271 18206 5837 395
$$ packed form
559A3591L6p134j0618p216O228J9137J4297K239n919j4276j5516o691n11j926
573a4279m786p907n042M842J0236J0843J2870J0458N440R305J2001L339q780j8811
587A9729k5380k1525j0079j521O128R136M331M573Q206N124J823L397K259K916
601I117R210J0257N876J204o700j4146j4506j3405j0223j223M294K062L166J471
615a3546k192L21M261P51N01M825Q245J3365J3775N916j596m590o259k843r56
630A9978j0470k0568j8614j2408n175M194P532O359J0306J5498J7335J5664M554
643C4185o712n643j406l204j466o57n523q322o151n893p177o074l008N447J0158
658a1446M211J014N387M294J340L446L90n177p60P654J0329M589p065j2369n442
$$ plain form
673 395 -746 -4772 -8840 -15890 -28182 -32867 -21943 -7316 1203 3682 5890 12373 21100 24418 22884
688 22884 17974 6338 -2770 -2288 -2950 -11447 -18695 -19773 -18112 -15316 -12513 -7127 2289 10508 14212
703 14212 17761 15827 8066 7637 15180 15810 5763 -6291 -13199 -12202 -6389 -4031 -6792 -14141 -21529
718 -21529 -16500 -353 6925 940 -4634 -3828 3305 15639 26120 27997 21174 10142 2996 2787
732 2787 -214 -8522 -12694 -13632 -18857 -22542 -19283 -13710 -8492 -4017 -2316 -1129 1913 9646 24753
747 24753 37369 31648 13904 1627 -2240 -1108 2259 -406 -13148 -25016 -25855 -13770 1147
760 1147 3825 -4615 -10686 -9758 -4970 4981 13832 12231 5785 3680 6719 11604 13823 12000 9304
775 9304 3053 -8371 -16729 -14902 -10478 -6534 -2571 -2818 -7368 -7116 -629 7233 10117 3762 -5124
$$ packed form
673C95j141m026m068p050j2292m685J0924J4627Q519K479K208O483Q727L318j534
688B2884m910j1636r108M82o62q497p248j078J661K796K803N386R416Q219L704
703A4212L549j934p761m29P543O30j0047j2054o908R97N813K358k761p349p388
718b1529N029J6147P278n985n574Q06P133J2334J0481J877o823j1032p146k09
732B787l001q308m172r38n225l685L259N573N218M475J701J187L042P733J5107
747B4753J2616n721j7744j2277l867J132L367k665j2742j1868q39J2085J4917
760A147K678q440o071R28M788R951Q851j601o446k105L039M885K219j823k696
775I304o251j1424q358J827M424L944L963k47m550K52O487P862K884o355q886
$$ plain form
790 -5124 -5022 2623 9967 15613 13396 1568 -8136 -8617 -4910 -1833 -2414 -4794 -3823 -100 2016 4201
806 4201 6541 3905 470 682 -383 -4727 -5984 -4050 -1148 1332 343 -2731 -1949 185 1729 4804
822 4804 4261 -1845 -5134 -2236 2178 7024 9881 8643 6007 1181 -4945 -8334 -6610 -6022 -5198 -3566
838 -3566 -4714 -6324 -2261 3944 7293 6273 -563 -8209 -7390 350 9998 17461 15401 4032 -4892
853 -4892 -5029 -780 4177 3928 -4591 -14130 -16595 -10536 1955 11668 8657 -2382 -11379 -13351 -4667
868 -4667 9275 15692 9694 -1093 -8318 -4138 9867 20363 17015 3577 -12594 -20646 -12482 2494
882 2494 9781 5645 -6213 -16142 -13238 -341 10353 12389 3654 -11094 -16597 -6918 8749 20157
896 20157 19452 4950 -10924 -14398 -3746 11775 20370 12446 -5448 -16752 -14726 -2800 9190
$$ packed form
790e124J02P645P344N646k217j1828r704m81L707L077n81k380R71L723K116K185
806D201K340k636l435K12j065m344j257J934K902K480r89l074P82K134J544L075
822D804n43o106l289K898M414M846K857j238k636m826o126l389J724N88Q24J632
838c566j148j610M063O205L349j020o836p646Q19P740R648P463k060j1369q924
853d892j37M249M957k49q519r539k465O059J2491R713l011j1039q997j972Q684
868d667J3942O417n998j0787p225M180J4005J0496l348j3438j6171q052Q164J4976
882B494P287m136j1858r929K904J2897J0694K036q735j4748n503R679J5667J1408
896B0157p05j4502j5874l474J0652J5521Q595p924j7894j1304K026J1926J1990
$$ plain form
909 9190 8513 -5756 -18984 -19212 -7403 9685 17051 8911 -4400 -11269 -7446 5959 18532 18161
923 18161 8148 -2897 -9973 -8401 653 7133 7275 2136 -6466 -11512 -7298 -398 2753 156 -8992
938 -8992 -16775 -13366 254 14073 19150 11420 -2780 -8230 -1248 9889 16869 13508 895 -8804
952 -8804 -8515 -3790 -153 -1268 -7999 -12408 -8610 -2671 2596 5777 4127 -12 -1830 -2511 -2162 1669
968 1669 6461 8448 7836 2892 -3260 -2704 2473 5793 4773 -962 -8322 -8424 -1942 2547 1232 -5086
984 -5086 -11847 -10704 -2117 5259 7172 5474 2231 2177 6327 6858 1998 -2885 -5142 -3636 1465 2363
1000 2363 -1124 -2487 -1370 636 2092 32 -4740 -3859 2207 6553 6118 345 -7556 -9263 -4508
1015 -4508 160 1341 454 -1262 970 6785 7706 2722 -2761 -5367 -3039 3567 6299 3421 1059
$$ packed form
909I190o77j4269j3228k28J1809J7088P366q140j3311o869L823J3405J2573l71
923A8161j0013j1045p076J572R054O480J42n139q602n046M214O900L151k597r148
938h992p783L409J3620J3819N077p730j4200n450O982J1137O980l361j2613r699
952h804K89M725L637j115o731m409L798N939N267L181j650m139j818o81L49L831
968A669M792J987o12m944o152N56N177L320j020n735p360j02O482M489j315o318
984e086o761J143Q587P376J913j698l243n4M150N31m860m883k257J506N101Q98
1000B363l487j363J117K006J456k060m772Q81O066M346m35n773p901j707M755
1015d508M668J181q87j716K232N815R21m984n483k606K328O606K732k878k362
$$ plain form
1030 1059 557 1218 1835 -1340 -6944 -7363 -2500 1651 2950 -1220 -7789 -9124 -4512 95 1926 1685
1046 1685 1770 6207 13090 14005 7663 318 -4208 -2417 4277 5862 -485 -7704 -11700 -11587 -8387 -7933
1062 -7933 -9608 -6674 -258 6106 10232 8390 1259 -1192 3456 8324 11111 11046 7676 4849 3582
1077 3582 -1391 -8749 -14204 -16351 -10569 -385 3394 -1084 -6049 -7745 -5746 -462 2973 3144 5070
1092 5070 9683 14530 17655 12079 236 -6904 -6453 -4450 -2484 -940 -3010 -4637 -4657 -5004 -6736 -9377
1108 -9377 -9763 -3032 7011 10942 9236 8217 5945 3244 2379 258 -4127 -5177 -1705 4582 7272
1123 7272 1580 -8486 -12356 -9369 -4646 2378 7312 5757 3151 4242 5212 2726 -2787 -7514 -5909
1138 -5909 -619 1612 2657 2450 -1688 -5908 -4611 -1748 -1807 -185 4042 7741 8400 4722 975 876
$$ packed form
1030A059n02O61O17l175n604m19M863M151J299m170o569j335M612M607J831k41
1046A685Q5M437O883R15o342p345m526J791O694J585o347p219l996J13L200M54
1062g933j675K934O416O364M126j842p131k451M648M868K787o5l370k827j267
1077C582m973p358n455k147N782J0184L779m478m965j696J999N284L435J71J926
1092E070M613M847L125n576j1843p140M51K003J966J544k070j627k0l47j732k641
1108i377l86O731J0043L931j706j019k272k701q65k121m385j050L472O287K690
1123G272n692j0066l870K987M723P024M934j555k606J091R70k486n513m727J605
1138e909N290K231J045k07m138m220J297K863n9J622M227L699O59l678l747r9
$$ plain form
1154 876 1064 -649 101 -555 -4699 -5073 -584 1299 -2417 -7860 -10825 -8011 -3071 623 3779 5644
1170 5644 4230 5244 11276 12427 7282 2468 837 989 2134 1499 -1435 -6633 -13471 -16495 -12372
1185 -12372 -7402 -6035 -3041 1826 4029 4881 8008 10489 10703 8602 5442 4334 3766 1933 1478 1523
1201 1523 -3808 -10395 -10312 -6440 -4271 -3408 -4471 -6825 -7054 -4006 2417 9224 8791 2872 1195 3605
1217 3605 6143 9936 11950 7030 -1392 -7127 -8045 -4965 -2526 -4121 -6361 -7751 -8471 -5068 2858
1232 2858 6139 3148 794 833 4149 10131 12786 9042 767 -9311 -13525 -8333 -1593 1439 1757
1247 1757 -972 -4111 -2683 3422 7848 7503 3047 -3107 -5017 -1787 1846 4829 4331 -2722 -8709
1262 -8709 -7514 -2526 2881 4615 -12 -7174 -9006 -3949 4478 11893 10409 2527 -2645 -1391 3440
$$ packed form
1154H76J88j713P50o56m144l74M489J883l716n443k965K814M940L694L156J865
1170E644j414J014O032J151n145m814j631J52J145o35k934n198o838l024M123
1185a2372M970J367K994M867K203Q52L127K481K14k101l160j108n68j833m55M5
1201A523n331o587Q3L872K169Q63j063k354k29L048O423O807m33n919j677K410
1217C605K538L793K014m920q422n735r18L080K439j595k240j390p20L403P926
1232B858L281k991k354L9L316N982K655l744q275j0078m214N192O740L032L18
1247A757k729l139J428O105M426l45m456o154j910L230L633K983m98p053n987
1262h709J195M988N407J734m627p162j832N057Q427P415j484p882n172J254M831
$$ plain form
1277 3440 8543 7783 -69 -6738 -7705 -3748 1886 2447 -4012 -12128 -15270 -12573 -4733 4385 8651 8900
1293 8900 9019 7780 8269 9808 8326 3412 -1716 -5984 -7499 -3163 932 593 -3583 -9962 -13795 -9190
1309 -9190 -103 5068 5375 1128 -4600 -3268 3879 9741 9740 5641 910 836 5672 7827 4862 -1742
1325 -1742 -9952 -12673 -7455 -1029 1055 -451 -3861 -6596 -5542 -2624 334 3490 5100 4895 5876
1340 5876 6771 5596 5039 4108 -928 -6626 -8998 -7048 -953 4772 4807 1508 -2278 -4119 -1120 4171
1356 4171 3435 -2752 -7561 -7830 -3621 3664 6515 3745 -215 -2348 -503 4542 5578 1798 -1587
1371 -1587 -1378 -557 2052 4215 3094 -17 -2161 -4264 -5047 -4062 -3243 -556 2582 1679 -1723 -2620 -1575
1388 -1575 -155 2014 1689 -809 -705 2231 7135 9994 7603 335 -3362 -2947 -1604 -415 -1408 -5500
$$ packed form
1277C440N103p60p852o669r67L957N634N61o459q116l142K697P840R118M266K49
1293H900J19j239M89J539j482m914n128m268j515M336M095l39m176o379l833M605
1309i190R087N171L07m247n728J332P147N862jm099m731p4M836K155k965o604
1325a742q210k721N218O426K084j506l410k735J054K918K958L156J610k05R81
1340E876Q95j175n57r31n036n698k372J950O095N725L5l299l786j841K999N291
1356D171p36o187m809k69M209P285K851k770l960k133J845N045J036l780l385
1371a587K09Q21K609K163j121l111k144k103p83R85Q19K687L138r03l402q97J045
1388a575J420K169l25k498J04K936M904K859k391p268l697M15J343J189r93m092
$$ plain form
1404 -5500 -8342 -6539 -3421 -720 -567 -1256 -61 3391 5500 5224 5181 2927 667 1019 704 -907 -1482
1421 -1482 -1040 -7 1076 -556 -3937 -4484 -2675 -850 1685 2541 647 -807 474 928 139 -1340
1437 -1340 -3335 -1867 1836 4105 4428 3554 280 -2430 -1462 -1025 -2038 -1805 -424 1813 3718 3333
1453 3333 815 -783 -1607 -1852 -256 507 -1213 -1552 -505 -475 -1344 -3481 -5879 -5592 -2340 1416 4841
1470 4841 7253 6712 6342 7202 6418 3379 -422 -4002 -6065 -5843 -5102 -5463 -4481 -4701 -5042 -3476 -1538
1487 -1538 -930 1282 4193 5768 6947 7236 5052 3963 3354 1821 1026 480 -625 -1470 -1271 -2526 -5899
1504 -5899 -7874 -9077 -7626 -3270 979 2952 2943 716 -1185 -519 1912 4144 7368 9852 9988 9990 7991
1521 7991 2374 -4192 -9835 -14809 -14437 -9975 -5171 -71 3140 2500 952 232 495 2216 5417 7043
$$ packed form
1404e500k842J803L118K701J53o89J195L452K109k76m3k254k260L52l15j611n75
1421a482M42J033J083j632l381n47J809J825K535Q56j894j454J281M54p89j479
1437a340j995J468L703K269L23q74l274k710R68M37j013K33J381K237J905l85
1453C333k518j598q24k45J596P63j720l39J047L0q69k137k398K87L252L756L425
1470D841K412n41l70Q60p84l039l801l580k063K22P41l61R82k20l41J566J938
1487a538O08K212K911J575J179K89k184j089o09j533p95n46j105q45J99j255l373
1504e899j975j203J451M356M249J973rk227j901O66K431K232L224K484J36Kj999
1521G991n617o566n643m974L72M462M804N100L211o40j548p20K63J721L201J626
$$ plain form
1537 7043 5910 4615 2044 -119 -72 -348 -1633 -2890 -4084 -4508 -2306 60 -16 -1702 -3135 -3336 -111
1554 -111 5195 6655 4350 -1093 -6045 -6434 -1947 3292 6461 7308 4098 445 -543 -2092 -4343 -6332
1570 -6332 -8064 -7704 -3855 1895 7107 10893 10320 5559 1440 -1434 -2769 -1781 -375 -2984 -6533 -8558
1586 -8558 -7396 -2356 2540 3147 487 -1925 -2048 2956 10296 13201 8931 3111 -1845 -3583 -1589
1601 -1589 -493 -2715 -5537 -7994 -7389 -3483 11 -171 -561 -350 -738 817 3606 4506 3818 2114 -1102
1618 -1102 -1718 54 3970 9372 12269 8210 -280 -6819 -10930 -11448 -9109 -7573 -7398 -5279 -881 5366
1634 5366 8930 6432 993 -957 1124 5619 10323 11105 5842 -509 -4198 -5974 -6816 -7182 -7136 -4764
1650 -4764 -959 1391 1889 1839 -603 -1532 -391 1484 1881 2315 3141 2348 1188 -1120 -2453 -229 3168
$$ packed form
1537G043j133j295k571k163M7k76j285j257j194m24K202K366p6j686j433k01L225
1554a11N306J460k305n443m952l89M487N239L169Q47l210l653r88j549k251j989
1570f332j732L60L849N750N212L786n73m761m119k874j335R88J406k609l549k025
1586h558J162N040M896O07k660k412j23N004P340K905m270n820m956j738J994
1601a589J096k222k822k457O05L906L494j82l90K11l88J555K789R00o88j704l216
1618a102o16J772L916N402K897m059q490o539m111n18K339J536J75K119M398O247
1634E366L564k498n439j950K081M495M704P82n263o351l689j776q42l66M6K372
1650d764L805K350M98n0k442r29J141J875L97M34Q26p93j160k308j333K224L397
$$ plain form
1667 3168 4442 4099 883 -4217 -5750 -3872 -2665 -2610 -3090 -2190 1784 6054 6797 3209 -1599 -4564
1683 -4564 -2063 4076 6542 2284 -4019 -8666 -8331 -3102 1905 3394 2119 435 774 4475 6432
1698 6432 5000 2651 336 -1843 -1995 -1441 -2127 -3866 -5712 -7500 -6414 -2172 2843 7794 8309 2570
1714 2570 -4428 -6505 -3282 3294 9586 9755 4504 -491 -1719 392 2063 -620 -5778 -8759 -6798
1729 -6798 -2040 3119 2697 -3151 -8101 -8184 -3530 3238 8338 9258 7229 4564 3149 3347 4637 4011
1745 4011 1491 -1118 -5435 -9146 -8798 -6359 -4016 -2527 -2488 -2159 204 4384 7222 7026 2258 -3852
1761 -3852 -3959 716 5839 8372 6843 1664 -2712 -4096 -2757 -2185 -3324 -5930 -5667 -2622 94 2400
1777 2400 3426 2161 -583 -954 -60 822 1884 2874 2634 1743 -377 -1773 -551 975 -62 -1856
$$ packed form
1667C168J274l43l216n100j533J878J207N5m80R00L974M270P43l588m808k965
1683d564K501O139K466m258o303m647L35N229N007J489j275j684L39L701J957
1698F432j432k349k315k179j52N54o86j739j846j788J086M242N015M951N15n739
1714B570o998k077L223O576O292J69n251m995j228K111J671k683n158k981J961
1729f798M758N159m22n848m950q3M654O768N100R20k029k665j415J98J290o26
1745D011k520k609m317l711L48K439K343J489L9L29K363M180K838j96m768o110
1761c852j07M675N123K533j529n179m376j384J339N72j139k606K63L045K716K306
1777B400J026j265k744l71Q94Q82J062R90k40q91k120j396J222J526j037j794
$$ plain form
1793 -1856 -3558 -5049 -4397 -163 3485 4347 3473 2636 3252 3564 1475 -1495 -4010 -6756 -6953 -2934 779
1810 779 1748 1879 1987 1559 821 391 -88 807 1015 996 2980 4192 2924 1862 1187 -856 -3852 -5283
1828 -5283 -5499 -4359 -3132 -1704 -263 1270 1244 1410 3004 2656 465 -130 916 1702 2934 3929 4430
1845 4430 3410 1572 -860 -1878 -3783 -6228 -6587 -5195 -4707 -3121 -372 1904 3026 3183 2873 2931
1861 2931 2769 2020 2391 3170 1869 520 563 406 -714 -2130 -3231 -4152 -4576 -4131 -2463 153 1138 1452
1879 1452 2848 3387 1905 1020 1256 180 -1106 -1588 -1324 112 1432 1570 1848 1535 -625 -1528 -464
1896 -464 -276 -1135 -1356 -1158 -746 679 1291 1495 794 -907 -1543 -1009 -475 -1298 -1275 -146 69 201 768
1915 768 972 838 1169 1053 1596 1352 907 1604 2759 1696 -218 -2686 -4251 -5237 -4322 -3256 -2741 -2337
$$ packed form
1793a856j702j491O52M234L648Q62q74q37O16L12k089k970k515k746j97M019L713
1810G79R69J31J08m28p38m30m79Q95K08j9J984J212j268j062o75k043k996j431
1828e283k16J140J227J428J441J533k6J66J594l48k191n95J046P86J232R95N01
1845D430j020j838k432j018j905k445l59J392M88J586K749K276J122J57l10N8
1861B931j62p49L71P79j301j349M3j57j120j416j101r21m24M45J668K616R85L14
1879A452J396N39j482q85K36j076j286m82K64J436J320J38K78l13k160r03J064
1896d64J88q59k21J98M12J425O12K04p01j701o36N34N34q23K3J129K15J32N67
1915G68K04j34L31j16N43k44m45O97J155j063j914k468j565r86R15J066N15M04
$$ plain form
1933 -2337 -1297 397 3557 4984 4069 3295 2851 2193 2256 2429 1488 -16 -1076 -1543 -2129 -2631 -3918 -3648
1951 -3648 -2676 -2034 -2059 -1282 -480 542 2448 2607 1700 522 677 2056 4608 5094 2827 1303 336 -69
1969 -69 -117 -1024 -4062 -6134 -6435 -5150 -2347 -475 -500 314 1839 3775 4749 5177 3811 1931 851 -17
1987 -17 -1007 -1059 -681 -929 -417 -1640 -3348 -3750 -2837 -1743 207 1123 1007 1656 3329 4451 3968 777
2005 777 -3466 -4459 -2630 -71 2023 1851 -20 -1370 -348 829 796 -77 -2368 -3436 -1316 1192
2021 1192 2596 3408 2922 1714 1712 1733 725 -634 -2244 -4066 -4614 -4988 -4569 -2039 1005 2085 2127 1501
2039 1501 454 1390 3799 4903 4344 2262 454 643 2235 1609 -1867 -5833 -8904 -8998 -5382 -1764
2055 -1764 358 301 484 1461 4103 6116 4940 3244 702 -823 160 2184 2982 2836 1681 -900 -2737
$$ packed form
1933b337J040J694L160J427r15p74m44o58O3J73r41j504j060m67n86n02j287K70
1951c648R72O42k5P77Q02J022J906J59r07j178J55J379K552M86k267j524r67m05
1969f9m8r07l038k072l01J285K803J872k5Q14J525J936R74M28j366j880j080q68
1987a7r90n2L78k48N12j223j708m02R13J094J950R16j16O49J673J122m83l191
2005G77m243r93J829K559K094j72j871j350J022J177l3q73k291j068K120K508
2021A192J404Q12m86j208kK1j008j359j610j822n48l74M19K530L044J080M2o26
2039A501j047R36K409J104n59k082j808J89J592o26l476l966l071r4L616L618
2055a764K122n7J83R77K642K013j176j696k542j525R83K024P98j46j155k581j837
$$ plain form
2072 -2737 -3988 -4814 -4600 -4083 -4690 -4870 -3177 -811 2770 5603 5951 3434 2465 2684 4356 5392 3932
2089 3932 75 -3133 -4024 -2933 -905 -1308 -3995 -6652 -6301 -4015 -56 2662 3130 2839 3406 4050 5018
2106 5018 4842 2134 -1344 -3439 -3879 -3058 -907 921 779 78 -630 -1337 -694 -58 -88 -491 -1296 -1824
2124 -1824 -278 2548 3938 3778 2014 -396 -1466 -618 -229 -683 -2267 -3723 -3827 -1120 1554 2360
2140 2360 1624 -45 -1097 649 2910 4327 3872 2089 172 -714 -916 -2046 -3077 -4259 -5370 -5090
2156 -5090 -2580 -385 1792 2997 3249 2953 2926 3146 3627 3356 1633 -360 -1575 -1750 -1382 238 208 -1555
2174 -1555 -2707 -3947 -3630 -2210 -1167 -1071 -1165 -939 244 2777 4476 4010 2865 1965 1428 2217 3100 2745
2192 2745 725 -1838 -4107 -4653 -4180 -3894 -3724 -2912 -2538 -1408 1036 3401 4350 4315 3480 2480 1780 1178
$$ packed form
2072b737j251q26K14N17o07j80J693K366L581K833L48k517r69K19J672J036j460
2089C932l857l208q91J091K028m03k687k657L51K286L959K718M68k91N67O44R68
2106E018j76k708l478k095m40Q21K151J828j42p01p08p07O43O36l0m03q05n28
2124a824J546K826J390j60j764k410j070Q48L89m54j584j456j04K707K674Q06
2140B360p36j669j052J746K261J417m55j783j917q86k02j130j031j182j111K80
2156e090K510K195K177J205K52k96k7K20M81k71j723j993j215j75L68J620l0j763
2174a555j152j240L17J420J043R6r4K26J183K533J699m66j145r00n37P89Q83l55
2192B745k020k563k269n46M73K86J70Q12L74J130K444K365R49l5q35j000p00o02
$$ plain form
2210 1178 665 490 -683 -1833 -1871 -855 -685 -154 -1 -973 -2302 -2565 -2202 -307 941 970 924 1006 591
2229 591 766 1798 1403 14 -529 274 1262 1963 1120 -497 -2181 -3177 -3322 -1864 -503 -559 328 1958
2247 1958 2267 2386 2217 1866 476 -513 -1805 -2226 -2375 -2638 -1759 39 628 503 1311 2008 1943 1173 817
2266 817 305 149 356 1128 1728 846 -1649 -2164 -1778 -1795 -1974 -1632 -1690 -1416 -320 1265 1995 1545 398
2285 398 678 1852 1022 1121 1435 1356 398 989 1416 561 -437 -1895 -2614 -2846 -3812 -4136 -2616 -507 503
2304 503 1886 3037 2810 2565 2748 2727 1436 -363 -1503 -1196 -200 362 152 145 -1006 -1592 -1049 -577 -1978
2323 -1978 -2437 -2322 -829 1072 1871 2020 1443 687 -594 88 424 -343 134 864 1917 1975 1663 305
2341 305 -314 -1157 -2193 -2398 -1849 -2007 -1222 833 1266 747 707 532 483 293 -219 -1032 -1026 -1015 246 1842
$$ packed form
2210A178n13j75j173j150l8J016J70N31J53r72j329k63L63J895J248K9m6Q2m15
2229E91J75J032l95j389n43Q03R88P01q43j617j684r96j45J458J361n6Q87J630
2247A958L09J19j69l51j390r89j292m21j49k63Q79J798N89j25Q08O97o5p70l56
2266H17n12j56K07P72O00q82k495n15L86j7j79L42n8K74J096J585P30m50j147
2285C98K80J174q30R9L14p9r58N91M27q55r98j458p19k32r66l24J520K109J010
2304E03J383J151k27k45J83k1j291j799j140L07R96N62k10pj151n86N43M72j401
2323a978m59J15J493J901P99J49n77p56j281O82L36p67M77P30J053N8l12j358
2341C05o19q43j036k05N49j58P85K055M33n19m0j75m9j90n12q13OJ1J261J596
$$ plain form
2361 1842 2047 1221 782 1346 1007 203 -504 -1898 -2090 -1311 -425 443 169 -868 -1652 -901 -257 -131 33
2380 33 -151 93 1195 1980 2231 2221 1269 570 484 -113 -845 -885 -399 -1178 -1039 -876 -1101 -706 -358 -858 -1306
2401 -1306 -1664 -1429 130 1726 2717 2565 1636 1058 1143 1514 1081 -530 -1856 -2506 -2006 -114 1080 736
2419 736 -175 -1057 -1206 -856 -117 -578 -394 -255 -413 724 1492 1225 554 6 -534 -531 390 980 1229 1244 -382
2440 -382 -1641 -1196 -962 -439 533 335 -749 -726 -585 222 811 541 -709 -375 -317 -46 506 613 -770
2459 -770 -1253 -135 1668 2928 2706 1879 -27 -1108 -1756 -990 -239 -733 -1562 -1550 -1440 -1032 64 414
2477 414 -278 -689 -124 786 2131 1853 918 340 -488 -455 711 2038 1805 627 -1097 -1758 -1469 -520 143
2496 143 52 -375 -1885 -2055 -1089 -569 -763 -800 -636 316 2720 4374 4774 2853 -45 -2467 -2573 -1308
$$ packed form
2361A842K05q26m39N64l39q04p07j394j92P79Q86Q68k74j037p84P51O44J26J64
2380C3j84K44J102P85K51j0r52o99q6n97p32m0M86p79J39J63k25L95L48n00m48
2401a306l58K35J559J596R91j52r29n78Q5L71m33j611j326o50N00J892J194l44
2419G36r11q82j49L50P39m61J84J39j58J137P68k67o71n48n40LR21N90K49J5j626
2440c82j259M45K34N23R72j98j084K3J41Q07N89k70j250L34N8K71N52J07j383
2459g70m83J118J803J260k22q27j906j081o48P66P51m94q29J2J10M08J096L50
2477D14o92m11N65R10J345k78r35n78q28L3J166J327k33j178j724o61K89R49O63
2496A43r1m27j510j70R66N20j94l7J64R52K404J654M00j921k898k422j06J265
$$ plain form
2514 -1308 -178 991 855 -935 -1826 -866 -352 -135 -749 -1737 -1383 -280 972 2120 1730 -182 -1670
2531 -1670 -1115 391 1974 2503 2090 562 -519 -727 -82 638 802 -589 -1242 -2110 -2537 -1900 -889 -376
2549 -376 -522 306 1009 2155 2808 2224 709 -1178 -2135 -1384 655 1824 1432 815 -209 -711 187 491
2567 491 259 -318 -1187 -1709 -980 -449 -898 -1057 -710 -662 -12 901 1165 1157 906 455 240 872 1035 1529 1548
2588 1548 872 -643 -1880 -2426 -2250 -1032 -104 -265 153 306 299 692 107 -1308 -1928 -1272 -14 1440
2606 1440 2124 1677 1276 1147 1166 1378 712 -477 -1004 -988 -1188 -1658 -1738 -1799 -1266 -399 452 501 281 -92 236
2627 236 434 841 991 1019 1335 1037 895 375 -797 -1314 -856 -257 616 829 108 -188 -103 -497 -1140 -1387
2647 -1387 -1822 -1289 238 983 954 884 574 534 1370 1400 713 133 -412 -1015 -590 -342 -1124 -1106 -576 -1 1065
$$ packed form
2514a308J130J169j36j790q91R60N14K17o14r88L54J103J252J148l90j912j488
2531a670N55J506J583N29m13j528j081k08O45P20J64j391o53q68m27O37J011N13
2549c76j46Q28P03J146O53n84j515j887r57P51K039J169l92o17j024n02Q98L04
2567D91k32n77q69n22P29N31m49j59L47M8O50R13K64qk51m51k15O32J63M94J9
2588A548o76j515j237n46J76J218R28j61M18J53pL93n85j415o20O56J258J454
2606A440O84m47m01j29J9K12o66j189n27J6k00m70q0o1N33Q67Q51M9k20l73L28
2627B36J98M07J50K8L16k98j42n20j172n17M58N99Q73K13p21k96Q5l94o43k47
2647a387m35N33J527P45k9p0l10m0Q36L0o87n80n45o03M25K48p82J8N30N75J066
$$ plain form
2668 1065 1302 476 -166 -120 -575 -581 -649 -983 -725 120 64 -98 -164 -428 -200 785 1379 1300 1274 940 644 774
2690 774 193 -1044 -1482 -1606 -1125 -103 338 -492 -893 -598 -340 -270 131 -482 -364 354 755 1297 1425 1098
2710 1098 1104 1372 960 518 49 -619 -1073 -1030 -1397 -1717 -2059 -1897 -1340 -344 120 -196 282 1040 1665 1756 1668
2731 1668 1051 244 184 454 702 648 -292 -516 -475 -276 -915 -663 -1093 -1688 -1169 -845 -232 -179 -321 71 522
2752 522 1066 1228 1823 1715 1507 1462 1083 18 -670 -1036 -1397 -1382 -1097 -1072 -724 -160 -95 -96 -403 -321 -249 402
2774 402 904 629 608 401 218 622 694 11 61 -215 -56 787 833 145 -496 -1126 -1187 -704 -273 -462 -585 -535
2796 -535 -128 611 1117 625 286 -156 -464 -801 -234 548 110 392 340 385 739 1042 715 105 -542 -1426 -1369
2817 -1369 -874 -441 -216 -151 -1088 -863 -763 327 875 962 14 -106 220 982 1451 1337 218 -916 -1078
$$ packed form
2668A065K37q26o42M6m55oo8l34K58Q45n6j62o6k64K28R85N94p9k6l34k96J30
2690G74n81j237m38j24M81J022M41q30m01K95K58P0M01o13J18P18M01N42J28l27
2710A098OK68m12m42m69o68m54M3l67l20l42J62N57R96M64l16M78P58O25R1q8
2731A668o17q07o0K70K48n4r40k24M1J99o39K52m30n95N19L24O13N3j42L92M51
2752E22N44J62N95j08k08m5l79j065o88l66l61J5K85K5L48N64O5jl07Q2P2O51
2774D02N02k75k1k07j83M04P2o83N0k76J59Q43M6o88o41o30o1M83M31j89j23N0
2796e35M07P39N06m92l39m42l08l37N67P82m38K82n2M5L54L03l27o10o47q84N7
2817a369M95M33K25O5r37K25J00J090N48Q7r48j20L26P62M69j14j119j134j62
$$ plain form
2836 -1078 -474 199 884 611 -293 -932 -971 -323 687 175 -846 -1267 -940 -1139 55 1091 883 690 249
2855 249 511 1329 1789 1385 483 -652 -2003 -1524 -425 591 262 -119 -624 -1200 -495 580 857 191
2873 191 -866 -1733 -719 422 1194 1484 810 -592 -796 549 1764 1832 756 -388 -934 -675 -234 423
2891 423 342 -1446 -2455 -2041 -832 74 690 990 185 -324 19 855 1597 1511 -148 -706 -640 -502 684
2910 684 1825 1151 -251 -705 -737 -165 251 -394 -1166 -2266 -2696 -1560 343 1065 662 344 175 819 1631
2929 1631 2209 2038 593 -479 -909 -46 124 -496 -388 -947 -1411 -1465 -309 205 130 -125 -383 -263 154
2948 154 101 726 683 55 -535 360 799 1111 1733 1496 618 -326 -641 -358 -500 -1193 -2031 -1931 -1610 -984 -99
2969 -99 817 679 276 632 1228 1306 1221 390 -272 -385 -819 -399 251 -4 -319 81 257 302 400 541 251 -178
$$ packed form
2836a078O04O73O85k73r04o39l9O48J010n12j021m21L27j99J194J036k08j93m41
2855B49K62Q18M60m04r02j135j351M79J099J016l29l81n05n76P05J075K77o66
2873A91j057q67J014J141P72K90o74j402k04J345J215O8j076j144n46K59M41O57
2891D23q1j788j009M14J209R06O16L00q05n09L43Q36P42q6j659n58O6J38J186
2910F84J141o74j402m54l2N72M16o45p72j100m30J136J903P22m03l18j69O44Q12
2929A631N78j71j445j072m30Q63J70o20J08n59m64n4J156N14p5k55k58J20M17
2948A54n3O25m3o28n90Q95M39L12O22k37q78r44l15K83j42o93q38J00L21O26Q85
2969i9R16j38m03L56N96P8q5q31o62j13m34M20O50k55l15M00J76M5R8J41k90m29
$$ plain form
2991 -178 -656 -1027 -791 -702 -970 -583 2 -171 315 972 1246 861 451 166 -198 139 130 341 58 -427 -1010
3012 -1010 -276 -76 122 262 90 139 -133 222 -250 -577 -1088 -1260 -490 85 434 848 949 1285 1212 1314
3032 1314 1380 479 441 -290 -694 -823 -1290 -1346 -883 -569 -352 -121 236 416 462 806 442 -67 -58 -289 146 279
3054 279 290 110 364 214 556 612 326 -3 -89 -585 -720 -682 -1107 -1293 -963 -736 -494 -74 105 644 917
3075 917 932 876 1255 656 40 -139 -334 -726 -726 -603 -269 270 479 449 268 85 -350 -417 -311 -523 -885 -669
3097 -669 -549 -401 287 352 741 905 1190 1047 1039 573 42 -21 -205 -545 -572 -621 -1010 -853 -607 -686 -352 -561
3119 -561 -210 195 671 716 571 260 209 122 495 637 772 656 557 373 72 -48 -472 -365 -403 -677 -799 -1244
3141 -1244 -885 -532 -402 167 154 573 802 1072 1179 624 27 -409 -328 -147 366 471 91 -503 -881 -421
$$ packed form
2991a78m78l71K36Q9k68L87N85j73M86O57K74l85m10k85l64L37rK11k83m85n83
3012a010P34K00J98J40j72M9k72L55m72l27n11j72P70N75L49M14J01L36p3J02
3032A314O6r01l8p31m04j29m67n6M63L14K17K31L57J80M6L44l64n09Rk31M35J33
3054B79J1j80K54j50L42N6k86l29q6m96j35L8m25j86L30K27K42M20J79N39K73
3075I17J5n6L79n99o16j79j95l92%J23L34N39K09l0j81j83m35o7J06k12l62K16
3097f69J20J48O88O5L89J64K85j43qm66n31o3j84l40k7m9l89J57K46p9L34k09
3119e61L51M05M76M5j45l11n1q7L73J42J35j16r9j84l01j20m24J07l8k74j22m45
3141a244L59L53J30N69j3M19K29K70J07n55n97m36Q1J81N13J05l80n94l78M60
$$ plain form
3161 -421 26 101 -89 -60 -512 -633 -380 -86 -167 -449 -258 -55 719 1001 833 687 76 -223 -249 282 385
3182 385 671 391 178 -593 -968 -649 -49 214 -230 -261 -429 -49 247 520 209 -470 -612 -155 441 1251
3202 1251 939 109 -205 -298 130 995 1019 482 -241 -290 -862 -923 -505 -743 -452 -222 -230 -187 348 53 -68 -25
3224 -25 -225 -159 429 1009 924 649 341 -101 -189 163 272 411 -456 -971 -1175 -1162 -596 -312 -50 -242 -275 334
3246 334 193 344 529 -128 214 530 911 694 1089 317 -469 44 -357 -427 -333 -787 -444 -572 -473 -399 -319 118
3268 118 -590 -275 140 207 330 606 398 539 320 836 753 668 116 -438 -533 -923 -457 9 201 -371 -521
3289 -521 -171 -77 228 -79 -677 -442 -530 -92 889 976 682 321 -55 -122 571 934 131 -273 -737 -843 -466
3310 -466 110 -105 -268 -331 -462 -527 -172 378 96 156 -179 -81 329 726 1042 553 -185 -944 -644 -30 658
$$ packed form
3161d21M47P5j90K9m52j21K53K94q1k82J91K03P74K82j68j46o11k99k6N31J03
3182C85K86k80k13p71l75L19O00K63m44l1j68L80K96K73l11o79j42M57N96Q10
3202A251l12q30l14r3M28Q65K4n37p23m9n72o1M18k38K91K30qM3N35k95j21M3
3224b5k00O6N88N80q5k75l08m42q8L52J09J39q67n15k04J3N66K84K62j92l3O09
3246C34j41J51J85o57L42L16L81k17L95p72p86N13m01p0R4m54L43j28R9P4Q0M37
3268A18p08L15M15O7J23K76k08J41k19N16q3q5n52n54r5l90M66M66J92n72j50
3289e21L50R4L05l07n98K35q8M38R81Q7k94l61l76o7O93L63q03m04m64j06L77
3310d66N76k15j63o3j31o5L55N50k82O0l35R8M10L97L16m89p38p59L00O14O88
$$ plain form
3331 658 950 609 8 -343 -217 -26 600 35 -1044 -1312 -1175 -346 302 728 340 -215 74 218 714 859
3351 859 620 -5 -571 -369 290 528 855 6 -173 -194 -657 58 -99 41 -482 -797 -1023 -586 98 246
3371 246 197 -287 -467 179 837 1195 1078 746 66 -241 -59 482 15 -269 -855 -1404 -1033 -631 -261 -65
3391 -65 -96 -231 -254 73 469 583 456 115 79 277 228 657 782 493 -234 -135 -489 -447 -395 -382 -546 -861 -998
3414 -998 -599 -296 -32 13 143 234 575 877 1291 810 429 -20 -164 -232 -101 -127 -215 -415 -476 -561 -180 -125 -149
3437 -149 -54 -89 33 64 247 14 219 146 121 331 430 91 100 319 -96 -145 158 7 106 245 198 61 -273 -529
3461 -529 -262 76 118 69 291 273 173 15 -394 -766 -510 -80 75 217 318 309 564 477 364 592 429 296
3483 296 126 -51 -339 -511 -998 -809 -737 -26 -161 -200 -209 -457 -278 9 275 603 912 925 876 778 682 226 -294
$$ packed form
3331F58K92l41o01l51J26J91O26n65j079k68J37Q29O48M26l88n55K89J44M96J45
3351H59k39o25n66K02O59K38L27q49j79k1m63P15j57J40n23l15k26M37O84J48
3371B46m9m84j80O46O58L58j17l32o80l07J82N41m67k84n86n49L71M02L70J96
3391f5l1j35k3L27L96J14j27l41l6J98m9M29J25k89p27R9l54M2N2J3j64l15j37
3414i98L99L03K64M5J30R1L41L02M14m81l81m49j44o8J31k6q8k00o1q5L81N5k4
3437a49R5l5J22L1J83k33K05p3k5K10R9l39RK19m15m9L03j51R9J39m7j37l34k56
3461e29K67L38M2m9K22j8j00j58m09l72K56M30J55J42J01rK55q7j13K28j63j33
3483B96j70j77k88j72m87J89P2P11j35l9rk48J79K87K66L28L09J3m9r8r6m56n20
$$ plain form
3506 -294 -198 -603 -584 -471 -526 -236 -286 -382 -568 -582 -508 -138 179 538 300 261 263 1037 1280 974 646 259 -467
3529 -467 -548 -391 -396 -468 -401 -459 -571 -1 159 -54 -38 -205 -97 141 513 602 460 841 1 -337 -143 -38 85
3552 85 164 -230 -294 -246 -233 -63 410 153 -259 -428 -412 36 54 -113 -321 -199 -344 -55 468 530 168 27 -201
3575 -201 -321 -188 298 543 441 222 59 368 438 32 -250 -235 -765 -902 -145 -16 -10 -136 36 -356 -149
3596 -149 66 480 539 324 268 398 513 192 391 34 -128 -618 -406 -542 -306 -647 -420 -514 -106 -72 69
3617 69 632 181 -57 124 411 145 426 481 290 752 485 -140 75 -309 -736 -551 -529 -323 -519 65 -307
3638 -307 -380 21 -229 232 129 -128 350 579 353 427 596 173 138 -319 -45 -103 46 -258 -510 -556 -365 -236
3660 -236 88 329 -394 -329 -244 66 -214 138 427 32 243 -127 331 575 65 -377 -120 -218 176 324 430
$$ packed form
3506b94R6m05J9J13n5K90n0r6j86j4P4L70L17L59k38l9KP74K43l06l28l87p26
3529d67q1J57np2O7n8j12N70J60k13J6j67J08K38L72Q9j42L81q40l38J94J05J23
3552H5P9l94o4M8J3J70M73k57m12j69J6M48J8j67k08J22j45K89N23O2l62j41k28
3575b01j20J33M86K45j02k19j63L09P0m06k82J5n30j37P57J29Oj26J72l92K07
3596a49K15M14N9k15n6J30J15l21J99l57j62m90K12j36K36l41K27r4M08L4J41
3617F9N63m51k38J81K87k66K81N5j91M62k67o25K15l84m27J85K2K06j96N84l72
3638c07p3M01k50M61j03k57M78K29k26P4J69m23l5m57K74n8J49l04k52m6J91J29
3660b36L24K41p23O5Q5L10k80L52K89l95K11l70M58K44n10m42K57r8L94J48J06
$$ plain form
3681 430 313 -144 -495 -529 -218 -203 -135 -371 -646 -624 -42 -19 466 147 295 -98 71 464 417 448 418 81 33
3704 33 203 252 70 24 -510 -848 -717 -314 -97 293 8 -379 -285 -308 -96 398 562 331 33 460 651 973
3726 973 896 200 -441 -592 -608 -481 -48 -82 -418 -584 -407 -382 63 390 220 -102 -189 33 405 672 486 243
3748 243 40 48 80 554 239 -115 -591 -798 -250 -38 42 -17 -201 -510 -432 8 -43 201 -85 -293 65 436
3770 436 488 673 563 2 -228 -400 -102 -284 -53 -12 -296 -125 -154 172 499 115 -426 -268 -545 -599 -116
3791 -116 227 84 158 115 -122 103 585 85 87 -271 -108 145 527 327 192 33 -294 -336 -320 -264 -326 -154 -350
3814 -350 -33 -191 358 195 335 478 278 -46 183 93 651 435 569 242 236 128 50 46 -550 -896 -569 -412
3836 -412 -558 -333 -421 -131 26 25 274 462 674 279 425 602 451 344 40 -136 -33 7 -326 -391 -332 -441
$$ packed form
3681D30j17m57l51l4L11J5O8k36k75K2N82K3M85l19J48l93J69L93m7L1l0l37m8
3704C3J70M9j82m6n34l38J31M03K17L90k85l87R4k3K12M94J64k31k98M27J91L22
3726I73p7o96o41j51j6J27M33l4l36j66J77K5M45L27j70l22q7K22L72K67j86k43
3748B43k03QL2M74l15l54m76k07N48K12Q0n9j84l09P8M40n1K44k86k08L58L71
3770D36N2J85j10n61k30j72K98j82K31M1k84J71k9L26L27l84n41J58k77n4M83
3791a16L43j43P4m3k37K25M82n00Kl58J63K53L82k00j35j59l27m2J6N6o2J72j96
3814c50L17j58N49j63J40J43k00l24K29r0N58k16J34l27oj08p8mn96l46L27J57
3836d12j46K25q8K90J57jK49J88K12l95J46J77j51j07l04j76J03M0l33o5N9j09
$$ plain form
3858 -441 -435 -222 82 -165 75 191 390 190 -140 -107 334 314 514 250 298 218 -6 305 -107 -301 -654 -330
3880 -330 -461 -29 -240 -123 30 -79 35 384 378 220 -38 319 79 -34 121 -38 1 -208 -204 138 147 -38
3902 -38 78 264 -105 33 260 165 32 51 -244 -152 -308 -321 -248 16 8 -242 -228 72 56 108 309 208 149 157 319
3927 319 432 81 -186 78 -85 -271 -326 -427 -320 -620 -359 -568 -549 63 -93 136 430 221 282 493 403
3948 403 580 522 325 263 138 -214 -275 -510 -657 -691 -587 -372 -210 -202 -36 129 175 369 141 159 309 304 512
3971 512 513 526 270 136 -118 -151 -308 -519 -543 -475 -462 -407 -240 80 -106 19 -122 70 81 362 772 510 411
3994 411 315 394 467 221 -84 -21 -689 -875 -537 -370 175 426 -95 -194 11 -31 128 270 204 -352 188 87
4016 87 5 304 265 -22 -114 -129 -199 548 477 130 -158 -272 -260 163 226 207 -113 -340 -644 -727 -104 83 135 91
$$ packed form
3858d41OK13L04k47K40J16J99k00l30L3M41k0K00k64M8q0k24L11m12j94l53L24
3880c30j31M32k11J17J53j09J14L49oj58k58L57k40j13J55j59L9k09ML42Rj85
3902c8J16J86l69J38K27r5j33J9k95R2j56j3P3K64qk50J4L00j6N2K01j01n9QJ62
3927C19J13l51k67K64j63j86n5j01J07l00K61k09J9O12j56K29K94k09O1K11r0
3948D03J77n8j97o2j25l52o1k35j47l4J04K15J62QJ66J65M6J94k28J8J50nK08
3971E12JJ3k56j34k54l3j57k11k4O8J3N5J67L20j86J25j41J92J1K81M10k62r9
3994D11r6P9P3k46l05O3o68j86L38J67N45K51n21r9K05m2J59J42o6n56N40j01
4016H7q2K99l9k87r2j5p0P47p1l47k88j14J2M23O3j9l20k27l04q3O23J87N2m4
$$ plain form
4040 91 -50 -189 226 392 411 67 -109 -157 2 556 638 444 245 2 -353 -224 -205 -255 -502 -526 -697 -570
4062 -570 -388 247 535 353 -44 274 176 141 263 493 106 202 238 118 45 -178 -524 -725 -897 -559 -19 200
4084 200 -106 -68 80 -120 94 78 235 452 510 374 517 156 -48 149 72 101 -148 -119 -81 -333 -563 -435
4106 -435 -433 -215 -232 229 249 51 35 211 -11 164 -102 116 139 486 403 -56 -129 -360 -507 -48 560 413 184
4129 184 79 -220 -115 17 104 -135 -265 -310 -245 12 -5 -79 119 155 29 148 553 504 345 -110 -428 -340 44
4152 44 141 375 201 -253 -356 -606 -328 -115 4 -227 -317 -16 -16 373 378 -137 -63 -208 24 494 798 469 150
4175 150 -199 -74 -358 150 220 -455 -441 -634 -595 -222 -173 -147 195 29 26 97 403 333 404 193 55 67 267 122
4199 122 352 -228 -305 -792 -321 -139 -22 140 -108 -280 -89 -304 129 196 136 45 264 248 495 541 309 115
$$ packed form
4040I1j41j39M15J66J9l44j76m8J59N54Q2j94j99k43l55J29J9n0k47k4j71J27
4062e70J82O35K88j82l97L18r8l5J22K30l87R6L6j20p3k23l46k01j72L38N40K19
4084B00l06L8J48k00K14j6J57K17N8j36J43l61k04J97p7K9k49K9L8k52k30J28
4106d35KK18j7M61K0j98j6J76k22J75k66K18K3L47q3m59p3k31j47M59O08j47k29
4129A84j05k99J05J32Q7k39j30m5O5K57j7p4J98L6j26J19M05m9j59m55l18Q8L84
4152D4R7K34j74m54j03k50K78K13J19k31r0L01%L89Nn15P4j45K32M70L04l29l19
4175A50l49J25k84N08P0o75J4j93L9L73M9K6L42j66lP1L06p0P1k11j38J2K00j45
4199A22K30n80p7m87M71J82J17J62k48j72J91k15M33O7o0r1K19j6K47M6k32j94
$$ plain form
4221 115 -271 171 216 83 32 -160 -431 -443 -462 -358 -83 293 60 213 -170 -86 -216 -30 -134 -170 2 230
4243 230 274 275 152 19 -25 148 15 287 79 -46 -233 -169 -416 -146 -493 -435 9 -116 164 58 193 289
4265 289 333 314 80 193 -111 -22 -222 -29 -187 -47 -18 -160 18 -90 -23 -249 -127 -280 -182 -115 -28 206 49
4288 49 229 276 259 177 10 350 -19 59 66 262 5 88 -152 -292 -294 -172 -502 -111 -44 -137 46 -161 117 148
4312 148 298 14 -9 -77 -166 113 -71 -45 344 316 293 290 -168 17 -133 -81 -336 -368 -346 33 -256 81 -10 -132
4336 -132 -315 -64 199 109 85 383 119 527 481 175 194 7 40 -171 79 -60 -79 -168 -180 -140 -346 -250 -301 -5
4360 -5 127 -137 60 -237 262 456 551 728 93 18 -211 -14 106 154 -219 -261 -295 -106 0 -223 190 -194
4382 -194 -287 -173 64 -50 289 524 303 117 256 121 300 321 182 47 -21 -249 106 168 -42 -121 -313 -474
$$ packed form
4221A15l86M42M5j33n1j92k71j2j9J04K75L76k33J53l83Q4j30J86j04l6J72K28
4243B30M4Jj23j33m4J73j33K72k08j25j87O4k47K70l47N8M44j25K80j06J35R6
4265B89M4j9k34J13l04Q9k00J93j58J40K9j42J78j08O7k26J22j53R8O7Q7K34j57
4288D9J80M7j7q2j67L40l69P8PJ96k57Q3k40j40kJ22l30L91O7r3J83k07K78L1
4312A48J50k84k3o8q9K79j84K6L89k8k3lm58J85j50N2k55l2K2L79k89L37r1j22
4336a32j83K51K63r0k4K98k64M08m6l06J9j87L3k11K50j39j9q9j2M0k06R6n1K96
4360eJ32k64J97k97M99J94R5J77o35p5k29J97J20M8l73m2l4J89J06k23M13l84
4382a94r3J14K37j14L39K35k21j86J39j35J79K1j39j35o8k28L55O2k10p9j92j61
$$ plain form
4404 -474 -290 -161 -56 -44 -60 -213 -142 296 470 615 268 58 -61 117 6 155 284 226 16 -211 5
4425 5 -152 62 -59 -382 -161 -227 52 -7 285 -11 -224 -329 -126 50 209 73 -227 -87 -77 393 410 290
4447 290 -143 -180 -140 -338 -64 15 -219 -386 -152 59 156 213 -49 -46 -50 -71 -65 163 117 77 97 132 239 27 100 234
4473 234 -23 -166 -305 -290 -91 191 -284 -84 -340 -230 138 128 123 67 82 134 84 219 226 309 27 -99 313 -112
4497 -112 61 -133 -96 -148 62 -170 -76 14 -85 -310 -211 -28 -164 -63 4 37 26 100 26 404 160 184 -327 431
4521 431 105 190 132 -190 -416 -471 -221 -222 -174 -136 -213 -164 258 267 283 125 -76 73 -8 -185 82 231 5 32 181
4546 181 -55 320 75 64 26 -190 -157 -170 42 0 -293 13 -225 -12 -66 102 129 56 -56 -61 348 321 37 -22
4570 -22 -126 -96 -153 -64 -5 -19 -116 -82 36 92 -97 -216 -55 -226 -178 23 9 43 274 105 179 215 321 146 220
$$ packed form
4404d74J84J29J05J2j6j53P1M38J74J45l47k10j19J78j11J49J29n8k10k27K16
4425Ej57K14j21l23K21o6K79n9K92k96k13j05K03J76J59j36l00J40J0M70J7j20
4447B90m33l7M0j98K74P9k34j67K34K11R7N7k62Lmk1OK28m6m0K0L5J07k12P3J34
4473B34k57j43j39J5J99K82m75K00k56J10L68j0nn6J5N2n0J35PQ3k82j26M12m25
4497a12J73j94L7n2K10k32R4R0r9k25R9J83j36J01O7L3j1P4p4L78k44K4n11P58
4521D31l26Q5n8l22k26n5K50jM8L8p7M9M22RJ6j58k01J49q1j77K67J49k26K7J49
4546A81k36L75k45j1l8k16L3j3K12m2k93L06k38K13n4J68K7p3j12nM09k7k84n9
4570b2j04L0n7Q9N9j4r7L4J18N6j89j19J61j71M8K01j4L4K31j69P4L6J06j75P4
$$ plain form
4595 220 267 -399 -112 73 13 -16 55 -211 -366 -180 -293 153 87 74 -158 290 -8 -5 127 297 -13 42 10
4618 10 173 333 216 -47 174 225 -179 -119 -358 -1 -29 -263 -357 -336 -122 -147 1 4 89 291 222 239 184 274 -180
4643 -180 -79 -14 68 10 -73 45 -183 148 34 -140 -93 -203 -234 -253 204 19 276 9 -199 93 143 47 335
4666 335 15 109 120 261 90 -45 -70 -203 -196 -135 -183 -41 -73 -22 -94 -6 76 69 53 110 -24 -68 340 101 378 211
4692 211 -73 -86 183 -89 169 62 75 -143 -210 -162 -91 14 -163 -94 -71 -196 -297 -55 205 56 381 86
4714 86 83 61 -22 357 25 150 -37 -145 79 2 128 3 -388 -359 -197 -107 65 42 38 -12 234 -130 -139 236 -60
4739 -60 344 187 100 303 148 -40 -151 110 -102 -210 -378 162 13 -126 -322 -287 -185 -41 29 246 55
4760 55 6 166 34 196 -114 303 235 204 -84 129 -152 -221 -72 -251 227 -172 -187 85 -417 -125 118 189
$$ packed form
4595B20M7o66K87J85o0k9P1k66j55J86j13M46o6j3k32M48k98LJ32J70l10N5l2
4618A0J63J60j17k63K21N1m04O0k39L57k8k34r4K1K14k5J48LQ5K02o9J7n5R0m54
4643a80J01O5Q2n8q3J18k28L31j14j74M7j10l1j9M57j85K57k67k08K92N0r6K88
4666C35l20R4J1J41j71j35k5j33PO1m8J42l2N1p2Q8Q2pj6N7j34m4M08k39K77j67
4692B11k84j3K69k72K58j07J3k18o7M8P1J05j77O9K3j25j01K42K60j49L25k95
4714H6lk2q3L79l32J25j87j08K24p7J26j25l91K9J62R0J72k3mn0K46l64rL75k96
4739f0M04j57q7K03j55j88j11K61k12j08j68N40j49j39j96L5J02J44P0K17j91
4760E5m9J60j32J62l10M17o8l1k88K13k81o9J49j79M78l99j5K72n02K92K43P1
$$ plain form
4782 189 -334 -7 -110 112 191 192 51 356 76 -82 60 124 -176 90 -13 -61 54 -47 119 -240 -336 -203
4804 -203 -209 -275 86 -13 -212 19 78 176 321 170 426 -27 100 37 256 54 165 -35 -261 -140 42 38 59
4827 59 -115 -171 -181 -112 -52 199 277 -73 40 -27 213 171 396 255 53 -56 -44 102 227 217 -202 -72 29
4850 29 -231 1 -14 70 -174 -176 -287 -179 159 49 178 376 -222 -134 140 490 274 422 -14 -124 37 -23
4872 -23 79 272 -133 -100 26 -183 216 -98 -208 -228 -93 -135 -42 116 246 -42 -248 287 151 387 215 227
4894 227 41 35 -203 -169 214 80 -4 -400 -181 -289 -250 -141 22 -161 -154 23 -92 322 306 82 130 135 240 35
4918 35 116 184 250 -375 -18 -180 36 215 -9 -74 -155 -17 38 47 146 82 147 183 87 219 -1 50 16 146 129 45
4944 45 -111 112 -180 -159 23 -27 -287 -63 -116 -56 -23 -219 94 -92 29 -136 232 169 97 215 -170 -262 -80
$$ packed form
4782A89n23L27j03K22P9Jj41L05k80j58J42O4l00K66j03m8J15j01J66l59r6J33
4804b03oo6L61r9j99K31N9R8J45j51K56m53J27o3K19k02J11k00k26J21J82mK1
4827E9j74n6j0O9O0K51P8l50J13o7K40m2K25j41k02j09J2J46J25j0m19J30J01
4850B9k60K32j5Q4k44kj11J08L38j10J29J98n98Q8K74L50k16J48m36j10J61o0
4872b3J02J93m05L3J26k09L99l14j10k0J35m2R3J58J30k88k06N35j36K36j72J2
4894B27j86ok38L4L83j34q4l96K19j08L9J09J63j83PJ77j15M14j6k24M8NJ05k05
4918C5Q1O8O6o25L57j62K16J79k24o5q1J38N5RR9o4O5L6r6J32k20N1l4J30j7q4
4944D5j56K23k92K1J82n0k60K24n3O0L3j96L13j86J21j65L68o3p2J18l85r2J82
$$ plain form
4967 -80 65 244 94 -75 31 -48 -26 121 120 -84 -234 -374 -136 208 -82 3 -320 -16 79 35 378 -39 127
4990 127 6 -40 -68 -78 241 42 -59 32 -132 -325 -195 343 -142 -108 -164 -137 -316 -116 -113 -87 59 53 12 271
5014 271 321 66 35 -40 -29 120 262 73 -132 -76 -241 -245 -122 -150 -66 -27 -17 -1 41 33 15 68 156 75 320 -2
5040 -2 237 300 125 -78 9 -70 50 -128 -30 -153 -410 -45 -114 -227 104 -196 45 51 125 26 269 247 68 21
5064 21 129 102 -59 -79 -121 142 -27 10 -65 -102 164 153 19 150 -208 -100 -64 -14 -134 -1 -290 29 109 33
5088 33 -70 38 205 163 28 336 -172 353 93 -162 -84 113 2 242 -52 -61 -168 -62 -44 -309 -74 -89
5110 -89 -188 -102 81 -58 338 19 -36 -58 185 203 -38 -10 -86 41 -97 151 -118 -147 51 -89 8 118 93 65
5134 65 -114 138 69 354 138 108 0 -73 51 -25 110 37 -147 149 -265 -94 -155 -52 -60 -384 -67 -61 82 -27
$$ packed form
4967h0J45J79j50j69J06p9K2J47jk04j50j40K38L44k90Q5l23L04R5m4L43m17J66
4990A27j21m6k8j0L19j99j01R1j64j93J30N38m85L4n6K7j79K00LK6J46om1K59
5014B71N0k55l1p5J1J49J42j89k05N6j65mJ23k8Q4L9J0J6M2qj8N3Q8q1K45l22
5040bK39O3j75k03Q7p9J20j78R8j23k57L65o9j13L31l00K41OP4r9K43k2j79m7
5064B1J08k7j61k0m2K63j69L7p5l7K66j1j34J31l58J08L6N0j20J33k89L19Q0p6
5088C3j03J08J67m2j35L08n08N25k60k55P8J97j11K40k94rj07J06J8k65K35j5
5110h9r9Q6J83j39L96l19n5k2K43J8k41K8p6J27j38K48k69k9J98j40R7J10k5k8
5134F5j79K52o9K85k16l0j08p3J24p6J35p3j84K96m14J71o1J03ql24L17OJ43j09
$$ plain form
5158 -27 -142 -30 395 93 126 277 130 130 17 191 119 10 68 -230 -100 37 10 -62 -286 -109 96 -116 32
5181 32 -134 208 -186 -457 14 56 216 22 197 265 13 -78 -20 200 17 99 -123 -65 -234 -56 -323 5
5203 5 -164 -237 -180 -42 154 128 -33 -145 98 -9 224 196 213 174 -10 -69 219 -50 49 115 -58 -266 -179 161
5227 161 -146 -22 -88 -199 -165 101 168 163 421 171 120 155 -175 112 42 171 0 -114 0 -30 45 117 -240 -314
$$ packed form
5158b7j15J12M25l02L3J51j47%j13J74p2j09N8k98J30J37k7p2k24J77K05k12J48
5181C2j66L42l94k71M71M2J60j94J75O8k52r1N8K20j83Q2k22N8j69J78k67L28
5203Ej69p3N7J38J96k6j61j12K43j07K33k8J7l9j84n9K88k69R9O6j73k08Q7L40
5227A61l07J24o6j11L4K66O7nK58k50n1L5l30K87p0J29j71j14J14l0P5P2l57p4
$$ [...]
8191b68
##END NTUPLES=NMR FID
##END=
