##TITLE=1H_CA-8533-pc
 CDCl3, 8 sc, 
 17.1.2019
##JCAMPDX= 6.0         $$ Bruker NMR JCAMP-DX V2.0
##DATA TYPE= NMR FID
##DATA CLASS= NTUPLES
##ORIGIN= UXNMR, Bruker Analytische Messtechnik GmbH
##OWNER= root
$$ XWIN-NMR		Version 3.5
$$ Thu Jan 17 13:46:53 2019 Russian Standard Time (UT+4h)  she@DPX200
##.OBSERVE FREQUENCY= 200.1313
##.OBSERVE NUCLEUS= ^1H
##.DELAY= (6, 6)
##.ACQUISITION MODE= SIMULTANEOUS
##.ACQUISITION SCHEME= undefined
##.AVERAGES= 8
##.DIGITISER RES= 18
##SPECTROMETER/DATA SYSTEM= spect
##.PULSE SEQUENCE= zg30
##.SOLVENT NAME= CDCl3
##.SHIFT REFERENCE= (INTERNAL, CDCl3, 0, 15.7039)
##AUDIT TRAIL= $$ (NUMBER, WHEN, WHO, WHERE, WHAT)
$$ ##TITLE= Audit trail, XWIN-NMR		Version 3.5
$$ ##JCAMPDX= 5.01
$$ ##ORIGIN= Bruker BioSpin GmbH
$$ ##OWNER= she
$$ F:/spectra/data/she/nmr/H-F/1/audita.txt
$$ ##AUDIT TRAIL=  $$ (NUMBER, WHEN, WHO, WHERE, WHAT)
(   1,<2019-01-17 13:45:30.43 +0400>,<she>,<DPX200>,
      <created by zg, POWCHK disabled, PULCHK disabled
       configuration hash MD5:
       00 E9 B6 7A A2 85 ED C7 34 08 36 98 17 FE 4E 26
       data hash MD5: 16K
       62 CE AA D4 31 FB FF 85 E5 B7 E4 21 CF 12 2D 16>)
$$ ##END=
$$ 
$$ hash MD5
$$ AD B7 A7 15 4F E2 91 8B 25 B8 04 84 74 AD AF 7B
##$RELAX= 
##$RELAX= 
##$RELAX= 
##$RELAX= 
##$RELAX= 
##$RELAX= 
$$ Bruker specific parameters
$$ --------------------------
##$DU= <F:/spectra>
##$EXPNO= 1
##$NAME= <H-F>
##$PROCNO= 1
##$TYPE= <nmr>
##$USER= <she>
##$AMP= (0..31)
100 100 100 100 100 100 100 100 100 100 100 100 100 100 100 100 100 100 
100 100 100 100 100 100 100 100 100 100 100 100 100 100 
##$AQSEQ= 0
##$AQ_mod= 1
##$AUNM= <au_zg>
##$AUTOPOS= <>
##$BF1= 200.13
##$BF2= 200.13
##$BF3= 200.13
##$BF4= 200.13
##$BF5= 200.13
##$BF6= 200.13
##$BF7= 200.13
##$BF8= 200.13
##$BYTORDA= 1
##$CFDGTYP= 0
##$CFRGTYP= 5
##$CHEMSTR= <none>
##$CNST= (0..31)
1 1 145 1 1 1 1 1 1 1 1 1 1 1 1 1 1 1 1 1 1 1 1 1 1 1 1 1 1 1 1 1 
##$CPDPRG= <>
##$CPDPRG1= <>
##$CPDPRG2= <>
##$CPDPRG3= <>
##$CPDPRG4= <mlev>
##$CPDPRG5= <mlev>
##$CPDPRG6= <mlev>
##$CPDPRG7= <mlev>
##$CPDPRG8= <mlev>
##$CPDPRGB= <>
##$CPDPRGT= <>
##$D= (0..31)
0 1.2 0 0 0 0 0 0 0 0 0 0.03 0 0 0 0 0 0 0 0 0 0 0 0 0 0 0 0 0 0 0 0 
##$DATE= 1547718330
##$DBL= (0..7)
120 120 120 120 120 120 120 120 
##$DBP= (0..7)
150 150 150 150 150 150 150 150 
##$DBP07= 0
##$DBPNAM0= <>
##$DBPNAM1= <>
##$DBPNAM2= <>
##$DBPNAM3= <>
##$DBPNAM4= <>
##$DBPNAM5= <>
##$DBPNAM6= <>
##$DBPNAM7= <>
##$DBPOAL= (0..7)
0.5 0.5 0.5 0.5 0.5 0.5 0.5 0.5 
##$DBPOFFS= (0..7)
0 0 0 0 0 0 0 0 
##$DE= 6
##$DECBNUC= <off>
##$DECIM= 32
##$DECNUC= <off>
##$DECSTAT= 4
##$DIGMOD= 1
##$DIGTYP= 9
##$DL= (0..7)
0 120 120 120 120 120 120 120 
##$DP= (0..7)
150 150 150 150 150 150 150 150 
##$DP07= 0
##$DPNAME0= <>
##$DPNAME1= <>
##$DPNAME2= <>
##$DPNAME3= <>
##$DPNAME4= <>
##$DPNAME5= <>
##$DPNAME6= <>
##$DPNAME7= <>
##$DPOAL= (0..7)
0.5 0.5 0.5 0.5 0.5 0.5 0.5 0.5 
##$DPOFFS= (0..7)
0 0 0 0 0 0 0 0 
##$DQDMODE= 0
##$DR= 18
##$DS= 0
##$DSLIST= <SSSSSSSSSSSSSSS>
##$DSPFIRM= 0
$$ [...]
##$SUBNAM2= <"">
##$SUBNAM3= <"">
##$SUBNAM4= <"">
##$SUBNAM5= <"">
##$SUBNAM6= <"">
##$SUBNAM7= <"">
##$SUBNAM8= <"">
##$SUBNAM9= <"">
##$SW= 20.0189088683792
##$SWIBOX= (0..15)
0 0 2 0 0 0 0 0 0 0 0 0 0 0 0 0 
##$SW_h= 4006.41025641026
##$TD= 16384
##$TD0= 1
##$TE= 0
##$TE2= 300
##$TE3= 300
##$TEG= 300
##$TL= (0..7)
0 120 120 120 120 120 120 120 
##$TP= (0..7)
150 150 150 150 150 150 150 150 
##$TP07= 0
##$TPNAME0= <>
##$TPNAME1= <>
##$TPNAME2= <>
##$TPNAME3= <>
##$TPNAME4= <>
##$TPNAME5= <>
##$TPNAME6= <>
##$TPNAME7= <>
##$TPOAL= (0..7)
0.5 0.5 0.5 0.5 0.5 0.5 0.5 0.5 
##$TPOFFS= (0..7)
0 0 0 0 0 0 0 0 
##$TUNHIN= 0
##$TUNHOUT= 0
##$TUNXOUT= 0
##$USERA1= <user>
##$USERA2= <user>
##$USERA3= <user>
##$USERA4= <user>
##$USERA5= <user>
##$V9= 5
##$VALIST= <valist>
##$VCLIST= <CCCCCCCCCCCCCCC>
##$VD= 0
##$VDLIST= <DDDDDDDDDDDDDDD>
##$VPLIST= <PPPPPPPPPPPPPPP>
##$VTLIST= <TTTTTTTTTTTTTTT>
##$WBST= 1024
##$WBSW= 4
##$XGAIN= (0..3)
0 0 0 0 
##$XL= 0
##$YL= 0
##$YMAX_a= 379542
##$YMIN_a= -506998
##$ZGOPTNS= <>
##$ZL1= 120
##$ZL2= 120
##$ZL3= 120
##$ZL4= 120
##$ABSF1= 10
##$ABSF2= 0
##$ABSG= 5
##$ABSL= 3
##$ALPHA= 0
##$AQORDER= 0
##$ASSFAC= 0
##$ASSFACI= 0
##$ASSFACX= 0
##$ASSWID= 0
##$AUNMP= <proc_1d>
##$AZFE= 0.1
##$AZFW= 0.1
##$BCFW= 1
##$BC_mod= 2
##$BYTORDP= 1
##$COROFFS= 0
##$CY= 11.3945322036743
##$DATMOD= 1
##$DC= 2
##$DFILT= <>
##$DTYPP= 0
##$F1P= 18.9103706918063
##$F2P= -1.10871071338519
##$FCOR= 0.5
##$FTSIZE= 0
##$FT_mod= 4
##$GAMMA= 1
##$GB= 0.15
##$INTBC= 1
##$INTSCL= 1
##$ISEN= 128
##$LB= 0.24
##$LEV0= 0
##$LPBIN= 0
##$MAXI= 10000
##$MC2= 0
##$MEAN= 0
##$ME_mod= 0
##$MI= 1.114404
##$NCOEF= 0
##$NC_proc= 0
##$NLEV= 6
##$NOISF1= 3.799351
##$NOISF2= 2.8
##$NSP= 1
##$NTH_PI= 0
##$NZP= 0
##$OFFSET= 15.70392
##$PC= 1
##$PHC0= -9049.354
##$PHC1= 13.60004
##$PH_mod= 1
##$PKNL= yes
##$PPARMOD= 0
##$PSCAL= 0
##$PSIGN= 0
##$REVERSE= no
##$SF= 200.130013532006
##$SI= 16384
##$SIGF1= 3
##$SIGF2= 2
##$SINO= 400
##$SIOLD= 16384
##$SREGLST= <1H.CDCl3>
##$SSB= 0
##$STSI= 0
##$STSR= 0
##$SW_p= 3612.71676300578
##$SYMM= 0
##$S_DEV= 0
##$TDeff= 0
##$TDoff= 0
##$TI= <>
##$TILT= no
##$TM1= 0
##$TM2= 0
##$TOPLEV= 0
##$USERP1= <user>
##$USERP2= <user>
##$USERP3= <user>
##$USERP4= <user>
##$USERP5= <user>
##$WDW= 1
##$XDIM= 8192
##$YMAX_p= 0
##$YMIN_p= 0
$$ End of Bruker specific parameters
$$ ---------------------------------
##NTUPLES= NMR FID
##VAR_NAME=  TIME,          FID/REAL,        FID/IMAG
##SYMBOL=    X,             R,               I
##VAR_TYPE=  INDEPENDENT,   DEPENDENT,       DEPENDENT
##VAR_FORM=  AFFN,          ASDF,            ASDF
##VAR_DIM=   8192,          8192,            8192
##UNITS=     SECONDS,       ARBITRARY UNITS, ARBITRARY UNITS
##FACTOR=    0.0002496,     1,               1
##FIRST=     0,             0,               0
##LAST=      2.0444736,     0,               0
##MIN=       0,             -506998,         0
##MAX=       2.0444736,     379542,          0
$$ Real data points
##PAGE= N=1
##DATA TABLE= (X++(R..R)), XYDATA
0 0 0 0 0 0 0 0 0 0 0 0 -8 8 -8 9 -16 16 -24 25 -32 40 -48 57 -72 81 -97 113 -130 151 -175 200 -231 261
32 261 -296 336 -380 426 -480 538 -602 672 -748 833 -922 1021 -1132 1250 -1380 1521 -1677
49 -1677 1847 -2035 2242 -2469 2725 -3012 3334 -3699 4118 -4604 5177 -5864 6702 -7755 9121
64 9121 -10981 13664 -17895 25618 -44310 190624 68694 -257411 82737 336057 279235
75 279235 -32646 -162211 -121438 -112866 -164504 4103 102431 -106255 -291683 -83909 240817
86 240817 270674 -70517 -277247 -24338 259128 122062 -102566 -88934 29613 67269 49876
97 49876 73620 130973 7739 -194747 -92017 175631 114257 -192600 -298345 -86486 146118
108 146118 81517 -132061 -82290 116593 102852 4266 50834 110534 45265 -70741 -60594
119 -60594 99778 109933 -127222 -197299 30689 148080 -4027 -158805 -103728 76144 96331
130 96331 -60835 -64965 81707 61756 -52763 -10162 105037 100926 -37857 -130138 -7655
141 -7655 116372 -13360 -148037 -40823 84696 41387 -50943 -35958 91053 125256 -25714
152 -25714 -86688 35404 53347 -72686 -108622 -26357 37801 -7875 -90210 -14500 134678
163 134678 86853 -42441 1783 99207 62514 -56510 -108227 -14684 70752 -29387 -127479
174 -127479 -33655 60780 28457 -1912 23023 50194 14954 -73072 -49188 78103 48519 -105993
186 -105993 -107111 28832 101649 52349 -35602 -12647 91293 68620 -29646 -19018 6991 -49816
198 -49816 -79190 -37223 16540 7798 -82603 -84856 78124 152099 33197 -55734 -15910 59407
210 59407 80608 10610 -48044 -20364 -24421 -59134 2338 60780 -4419 -78944 -58573 34611
222 34611 95161 10856 -95652 -32929 72191 50551 -9196 -23783 -7137 24150 19720 2462
234 2462 26180 -1091 -78831 -44086 57469 55800 -28023 -86702 -48078 61212 76434 -18368
246 -18368 -42807 2392 5644 4227 21789 16916 1522 -26317 -31114 39411 67120 -20977 -63730
259 -63730 -2656 40772 22382 -33786 -65870 -9504 39270 2284 -12434 14725 725 -8805
271 -8805 21075 40626 38032 -5673 -59858 -20193 48463 15238 -39477 -30948 -7620 10584 9809
284 9809 -12184 6398 29378 -8361 -19673 20805 16367 -14164 -16804 -5847 18024 16783 -32447
297 -32447 -29366 29055 27874 -6301 -7020 -3968 2359 7789 -9514 212 22723 -12841 -37188 396
311 396 17666 2302 -5271 -11759 2282 20017 -7611 -15608 25912 24282 -10948 -12800 -5541 5131
325 5131 13915 -11021 -17368 13030 2243 -21755 1610 16803 6703 2919 -9145 -5448 17242
338 17242 -1502 -20851 9040 16519 -9518 -11969 -7546 2016 21197 4701 -14481 5665 3972
351 3972 -15421 3358 16569 3174 -2689 -15509 -13714 18286 13491 -17018 -7158 2760 -8364
364 -8364 -1879 -179 -3645 12210 8325 -7741 9958 12561 -8256 647 9984 -2811 -6262 -16784
378 -16784 -23452 6491 17693 -3849 46 7959 -369 9595 14363 866 1979 -8063 -28667
391 -28667 -11251 5119 -8752 -4098 7271 4293 15656 18742 4357 14769 17932 -8702 -13292
404 -13292 -10349 -24332 -17064 -4111 -9068 1621 7911 -4484 10936 30790 15862 6641 2596
417 2596 -14718 -11182 -4664 -17197 -9084 3267 -9222 -3067 15805 12029 15176 18689 -241 -4014
431 -4014 -1488 -19352 -17177 -2560 -11454 -11407 -815 -4579 6609 23583 13987 11848 17356 -391
445 -391 -6401 3428 -5302 -7553 -1795 -15758 -15629 -146 -5276 -2642 10670 481 -4731 5088 -986
460 -986 2083 17264 8208 1849 9147 -870 -3029 10099 544 -9376 -5062 -16258 -17703 -905
474 -905 -3587 -5188 8563 3028 -1821 9938 5463 1740 11986 1439 -8264 1183 -3184 -4351
488 -4351 13491 11866 2882 6779 -2784 -9190 1950 -6854 -21453 -17820 -22541 -23696 -2712 6066
502 6066 9226 26012 25176 20333 32541 26455 8075 5384 -7926 -25445 -25115 -32829 -37817 -16375
516 -16375 -5832 -7072 7411 11397 9822 24946 26425 13819 11764 -1077 -16168 -3398 3748
529 3748 -4599 -388 -1285 -5724 8339 9897 -2807 -217 -5128 -20129 -14645 -11822 -19178 -7956
543 -7956 1570 2737 18174 21163 9808 19901 28218 16727 10413 -2870 -21911 -16516 -9947 -17122
557 -17122 -12474 -12680 -23287 -9389 8959 8799 11093 7349 -2403 9391 17954 3785 2939 7376
571 7376 -230 2550 3811 -8578 -6632 -1557 -8608 -1611 2823 -13053 -12653 2803 7930 13686 8665
586 8665 -10923 -6899 7372 1275 -610 -372 -13322 -11113 2136 4525 12474 15425 963 4160
600 4160 17946 7461 -4071 -6312 -13058 -8808 -4861 -18981 -17592 -1393 649 6318 16617 7040
614 7040 723 4987 2011 7132 10044 -10831 -19190 -2621 4176 7371 12540 3843 3321 11276 2250
629 2250 -2579 987 -13021 -23070 -15202 -14914 -14384 -5285 -3995 6583 25016 19186 10573 18721 17778
644 17778 11741 9997 -5108 -15799 -12455 -18537 -17969 -3098 -5893 -14232 -5437 470 4602 12723
658 12723 5605 691 10043 4721 -3588 6862 9772 4284 6092 -405 -4206 4584 -657 -8796 -1172
673 -1172 -4009 -15474 -10403 -6191 -4140 4676 764 -3844 9215 10121 454 7358 10899 5838 6077
688 6077 -1580 -8483 1585 2566 -5927 -1148 -3041 -14374 -9458 -2174 -472 5499 -1325 -10659 2508
703 2508 13138 7603 8584 6999 -193 3930 3092 -5705 -2311 -3788 -12820 -4933 2019 -6187 -5105
718 -5105 347 3251 13375 10167 -6685 -4252 4571 1879 4077 1076 -11333 -8539 -418 1413
732 1413 9117 7808 -7796 -5323 6560 4535 3057 -1186 -10412 -3678 4737 -3146 -2947 1607 -2712
747 -2712 3135 10174 1684 -2427 -1627 -4022 5173 10093 -6532 -13048 -4554 -202 6535 8272 -5038
762 -5038 -7038 1370 745 5119 8655 -3334 -8116 -19 691 3205 3593 -6433 -4065 7392 2335
777 2335 -3050 -224 -2960 354 7463 -408 -5369 -1678 -4756 -515 9844 2363 -6435 -3476 -2917
792 -2917 3377 11442 1425 -6120 168 -272 36 5980 244 -4834 544 -2234 -3634 3028 -1793
807 -1793 -4671 3726 1991 -2940 966 -1700 -795 8643 4156 -3243 700 -1336 -2229 6038 2345 -4894
823 -4894 -2423 -5097 -5916 3651 2038 -3712 1203 875 -1373 5318 4588 777 5451 1003 -5837 -518
839 -518 -1039 -5006 196 -726 -5689 -679 -107 -1595 7133 6407 -1513 1297 1461 -3258 1302 1010 -3866
856 -3866 757 -164 -5672 966 4604 675 4202 2449 -4644 -1380 -466 -4673 1330 1499 -6476 -3386
872 -3386 1551 1332 7707 7409 -457 2069 3154 -2720 -224 949 -5831 -4671 -2945 -6970 -1703 2108
888 2108 -1931 3388 7125 -190 218 3121 502 4037 4857 -4512 -4142 -441 -3751 634 4610 -2488
904 -2488 -3762 -984 -3400 1581 4879 -2791 -2093 2821 -1625 -498 3673 117 1108 3118 -3227 -1886
920 -1886 2627 -2313 -270 5182 396 -2068 4 -2782 1359 5772 -2852 -6232 -1685 -4352 -2786
935 -2786 3151 502 413 3702 -689 2462 9268 2950 -1788 1209 -2802 -5041 -2777 -5979 -3297 3437
951 3437 -1849 -3567 4206 3818 2858 6072 2231 -702 -10 -6586 -6619 2306 -285 -5008 -792 174 2103
968 2103 7372 3704 2269 6003 -793 -6681 -1295 -1836 -4496 -2082 -3921 -3193 2968 782 -21 8511
984 8511 6967 -481 82 -1237 -1925 1380 -3015 -5960 102 -1877 -5614 2163 5736 2759 3313 -51
1000 -51 -1549 3996 343 -4963 1075 1307 -5359 -3210 -903 389 4832 1260 -3243 2850 2641 -3182
1016 -3182 911 4074 209 -324 -3475 -4110 3857 2661 -4884 -326 2637 -2299 -1756 349 1443 5280
1032 5280 1165 -4719 1339 3952 -2594 -1393 1674 -1204 -2251 -4356 -5117 3968 6037 -2780 -1037
1047 -1037 4461 2061 1451 1918 -219 2482 -710 -8252 -2529 3641 -1701 -2509 1431 1397 2817 1014
1063 1014 -3221 3443 6120 -4092 -6422 -1122 -1764 -923 770 -42 4028 4286 -2415 1675 9523 3533
1079 3533 -2691 -3063 -4258 -1941 -2413 -7965 -2816 3279 -2640 -3759 3559 4983 4189 3601 783 3278
1095 3278 4332 -4841 -4309 4736 2055 -3656 -3763 -2914 1335 3317 -2908 -1956 3744 -2316 -6260 37
1111 37 2938 1559 -547 -3643 1281 7683 992 -2182 5296 4879 -719 -2110 -2934 447 2313 -4817
1127 -4817 -5759 1481 -1255 -6085 -1282 3159 3175 1166 -3980 -853 8103 3904 -2399 2391 3403 -659
1143 -659 -1600 -2605 604 3766 -3646 -7441 728 1950 -3225 -1219 1404 2510 2412 -3363 -3252 6075
1159 6075 3971 -4003 -1291 1817 -19 -310 -1504 738 5864 -15 -6155 773 4601 -915 -2257
1174 -2257 -1315 -400 918 -4139 -4902 4609 5459 -2879 -2151 2053 2158 2318 -150 -755 3872 133 -6758
1191 -6758 -814 5009 705 -2566 -2098 74 3949 -115 -4891 2093 5228 -2549 -4506 -514 626
1206 626 1566 -562 -1984 3327 2557 -4843 -1214 6328 3471 -1118 -3732 -2882 3638 2538 -4424 -1300
1222 -1300 3199 -2042 -3509 818 1972 2305 -687 -4102 2221 4871 -2883 -3463 3282 3256 186 -2512
1238 -2512 -3906 2149 4146 -2135 -1466 2543 -1213 -3534 786 2631 3250 -580 -6294 -1166 5615
1253 5615 270 -3422 156 715 -100 -612 -2322 1580 3992 -2367 -2511 3440 1360 -2619 -640 1232
1269 1232 3410 1580 -5432 -3417 4737 1991 -2401 -436 -330 -1031 -295 -1876 1736 4097 -2566 -5235
1285 -5235 2061 3468 18 -622 -1283 1352 2960 -2619 -3051 3517 2542 -2496 -723 -130 -403 330 -2646
1302 -2646 -278 4204 -551 -5574 -63 3695 1986 688 -1488 -753 3149 -543 -2723 2860 2513
1317 2513 -2774 -2423 -593 825 2063 -1690 -2535 3012 1373 -3708 -578 2810 1671 462 -2090
1332 -2090 -1943 2612 620 -2908 1500 2588 -1658 -1810 -225 998 2854 -313 -3392 1286 1736 -2701
1348 -2701 -932 1781 448 -49 -2075 -2480 2599 2697 -2375 44 2063 -1124 -1120 76 777 2788 -336
1365 -336 -3999 -67 2742 -1093 -1087 1342 479 588 -1002 -2394 1965 3198 -1911 -1572 1443 -735 -991
1382 -991 68 97 2276 769 -3990 -821 3489 831 -545 191 -976 -17 354 -1956 1016 2940
1398 2940 -1888 -2426 1269 752 112 429 -1227 946 1915 -2906 -2118 2499 1010 -507 -151 -1186 -256
1415 -256 1192 -738 663 3454 -1325 -2640 867 1388 720 699 -2323 -1095 1212 -1625 -1855 1809
1431 1809 423 -1155 168 -612 105 2081 -659 -519 2421 -317 -2512 443 798 790 1096 -1823 -1541
1448 -1541 1322 -62 -997 1730 548 -1708 -775 -780 -148 1889 -1125 -1973 1214 491 -988 1122 1040
1465 1040 509 1424 -835 -1644 1322 301 -1508 698 -197 -1975 -720 -390 91 2606 247 -2319
1481 -2319 621 876 -574 789 408 -1033 411 -622 -1559 1584 1519 -884 451 257 -1200 95
1497 95 269 -754 1035 -81 -2479 -666 762 -465 1075 825 -1253 -60 401 -715 1187 1259 -1144
1514 -1144 -231 269 -941 862 1071 -620 537 63 -1914 -282 984 -635 342 281 -1792 -465 845
1531 845 -316 950 1532 -1297 -486 1006 -466 734 1322 -1061 -382 687 -900 381 1272 -598
1547 -598 -371 587 -1559 -989 717 -991 -95 952 -1436 -808 1258 301 1188 1967 -591 -833 622
1564 622 -770 467 1272 -1198 -1205 335 -1066 -267 1396 -315 -240 466 -1004 -473 939 -447 -143 1061
1582 1061 -567 -849 464 351 589 1706 -560 -1221 349 -295 -727 1043 -476 -1158 116 -681 18
1599 18 2012 370 -1050 453 -218 -764 414 -507 -335 1015 -502 -1501 719 543 207 1293 10
1616 10 -1051 301 -729 -207 1952 336 -1453 -221 -183 -108 955 -61 -831 429 -569 -1800 470
1633 470 539 -215 535 242 -737 1143 622 -160 1284 569 -1771 -236 -222 -905 556 -145 -1517 235
1651 235 -151 -1105 943 1067 -198 154 -212 -652 777 614 -617 353 649 -1215 45 521 -29 827
1669 827 124 -1454 -86 358 -812 410 775 -929 -472 55 -524 957 1289 -793 70 543 -922
1686 -922 -122 657 -241 342 240 -1153 -35 972 -115 217 944 -520 -327 159 -736 589 1096 -961
1704 -961 -1071 348 -561 32 851 -459 -7 433 -855 -8 1302 21 -324 495 -475 -204 341 -800
1722 -800 188 959 -797 -1170 -28 -338 19 865 -333 -342 308 -433 108 1650 194 -470 279 -358 -5
1741 -5 891 -507 -442 471 -512 -945 455 94 -270 605 -275 -470 307 -225 -660 1304 301 -899 -134
1760 -134 -220 136 1059 -62 -653 641 -212 -474 741 373 -418 -82 -944 -370 792 2 -999 788
1778 788 80 -569 4 -123 82 976 244 -857 648 15 -621 502 994 -244 -91 -601 -630 682 486
1797 486 -954 -296 -323 -897 70 167 -129 811 92 -919 814 919 -286 355 466 -309 43 -406 -748
1816 -748 804 794 -824 -326 120 -464 313 619 -272 583 -143 -1025 625 887 -65 22 363 -616 90 173
1836 173 -722 559 770 -1058 -677 191 7 623 651 -134 604 459 -752 149 952 -105 -713 -385 -1171
1855 -1171 -300 89 -690 503 796 -497 -171 745 8 457 518 -583 7 541 -509 270 980 129 -631
1874 -631 -532 -800 128 445 -769 -677 250 -802 -413 842 789 805 938 127 277 1117 122 -361 454 -473
1894 -473 -932 -553 -1148 -620 599 -719 -707 575 -84 -242 981 875 237 566 -626 -190 1334 445
1912 445 -491 187 -200 -683 55 -332 -620 140 -661 -757 75 111 -380 541 540 225 471 -236 -453 1014 484
1933 484 -418 14 -518 -549 39 6 -353 240 -247 -995 313 364 -247 162 -391 -288 500 9 -182 592 569
1954 569 -437 121 -128 -527 -78 -94 -437 333 -398 -781 459 982 284 607 255 -551 340 -25 -844 -23
1974 -23 -432 -877 -603 232 251 451 842 -186 389 369 -492 223 420 -270 -119 -550 -927 -65 355 -250 164
1995 164 384 -317 -134 178 -346 63 364 -659 -192 658 18 567 718 -42 -86 184 -394 44 292 -766
2015 -766 -413 -156 -819 -330 423 145 598 468 -366 65 577 102 115 275 -327 -385 -116 -431 201 436 -488
2036 -488 -355 229 -238 -320 550 -50 -122 250 -80 48 685 13 -29 258 -414 -382 14 -314 -40 392 -444
2057 -444 -379 285 105 64 942 164 -248 206 -360 -479 345 -156 -296 310 -251 -269 404 321 -268 466 -548
2078 -548 -341 167 -46 -148 441 -6 -485 55 378 464 704 -49 -232 83 -137 -467 239 -22 -578 -52
2098 -52 -330 -295 529 326 -61 368 111 -527 102 35 -114 478 -21 -670 -4 104 -176 379 190 -383 55
2119 55 -156 -445 114 66 -330 112 23 -141 447 518 119 613 78 -361 199 223 -244 235 99 -643 -226 -45
2141 -45 -249 124 403 -224 -209 74 -286 404 380 -141 123 238 -109 213 573 -145 -178 231 -383 54 303
2162 303 60 79 151 -346 -114 338 -177 273 402 -106 -109 192 -503 -167 551 -64 -224 223 -77 -47 389 -179
2184 -179 118 212 -483 -267 387 61 127 205 -66 -116 331 -100 134 580 -43 -575 -12 -53 2 252 -180 92
2206 92 489 -10 -89 382 252 137 142 -305 -465 352 -23 -234 267 -125 -235 -380 10 107 399 2 -303 241
2228 241 -79 -192 146 103 12 6 -167 -381 321 11 -254 278 -38 -643 -48 -96 -88 377 -107 -616 2 598
2250 598 -42 47 47 -217 -90 -176 -222 424 350 -657 -16 52 27 104 213 -98 121 -300 -491 178 201 -263 -106
2273 -106 163 27 141 -107 -122 637 483 -324 24 116 -398 93 -36 -316 170 -136 -517 -187 711 93 -169
2294 -169 -153 -34 24 112 -285 183 317 -221 -409 224 -24 47 -126 -520 19 -356 -441 10 341 -75 -439 -16
2316 -16 77 306 198 -154 178 450 -115 -97 165 -13 -141 -332 -429 -20 -191 -199 -279 492 287 -52 -85 158 301
2339 301 188 -112 64 111 -209 -176 19 41 -78 -139 -458 -229 309 -135 -283 339 167 39 213 148 453 534
2361 534 42 -265 404 -36 -478 -169 -292 -456 85 -422 -515 -92 108 -393 -75 308 -140 41 -77 112
2381 112 462 221 -171 280 337 1 27 -68 -146 122 -538 -386 362 -19 -486 -214 44 312 363 29 68 573
2403 573 164 -401 -177 19 -85 -165 -154 -10 111 74 -141 184 394 -125 -133 -105 -105 33 -12 -400 -166 42 -150
2426 -150 159 418 242 100 -91 -277 477 339 -156 -4 242 -189 19 66 -236 -196 -56 -87 -148 145 -223
2447 -223 -172 -183 -19 -67 -169 -144 705 285 105 -80 457 -270 -59 217 -489 -178 -238 -485 -155 -182 -124 -370
2469 -370 33 111 20 120 12 161 568 191 -20 178 -134 -54 113 -206 -6 -73 -584 -534 -150 121 -44 275
2491 275 89 -94 197 197 213 447 -11 -83 378 122 -43 297 -198 -303 -1 -194 -129 114 -1 -251 -50 107
2513 107 -56 313 104 -3 168 -122 1 214 163 42 102 -63 -308 -153 45 -259 -152 37 -329 54 299
2534 299 97 216 207 295 242 -101 -158 -168 326 -85 27 -8 -241 30 138 -207 348 255 -25 126 -226 117 452
2557 452 -13 -253 130 18 -151 143 289 5 86 14 -215 99 -190 -17 116 47 -415 96 87 34 222 212
2579 212 -28 -20 -87 100 -85 76 72 -226 83 -240 311 221 -54 30 144 241 -10 64 196 47 -38 -252 35
2602 35 323 -66 -209 64 -166 81 -77 -171 125 244 -66 -50 61 71 163 15 -107 -155 141 137 38 74 -60
2625 -60 -61 224 -63 108 109 -47 -71 229 -180 -136 20 208 -103 -67 -77 66 9 -45 108 132 181 -83 -85 136 -90
2650 -90 222 -102 -2 45 145 -45 91 -55 -61 110 119 33 130 188 8 -35 49 -17 71 -82 -130 140 110 59 150 23
2676 23 -64 -71 56 -118 360 -107 65 182 136 -5 199 93 -206 -71 -151 37 61 -130 -162 305 -246 -36 -166
2699 -166 331 44 -123 63 -193 97 201 -35 -24 108 -28 102 133 -126 -78 37 -55 -118 -107 -68 -33 117 32
2722 32 -71 -95 -127 72 129 61 112 24 -168 -108 24 14 -215 228 -226 -66 160 -372 98 147 -49 166 -29
2745 -29 -92 -4 174 -250 145 280 187 221 142 69 26 -34 -80 32 69 -139 -163 -56 73 152 -11 -113 308 129
2769 129 -13 -66 -120 -64 -119 206 -84 125 -77 140 16 -230 -142 49 -88 -22 30 379 335 81 93 -116 -16
2792 -16 202 -231 -103 116 -123 -67 37 -3 -76 230 -232 -230 -37 -83 44 178 213 28 17 21 -328 106 17 -65
2816 -65 221 -146 49 -111 -112 86 -137 84 -180 1 246 -22 176 114 -194 7 1 -284 -33 312 -251 -207
2838 -207 6 -294 58 -31 -184 92 -38 -191 -81 295 178 5 51 237 304 6 -21 255 -90 54 -404
2859 -404 41 -123 57 153 -222 51 23 -48 -184 31 -44 -123 -40 -25 101 81 88 -19 -34 -186 -50 139 -142 17
2883 17 126 -143 -113 -86 133 105 -81 121 -112 -58 -275 -213 111 -335 -110 119 -74 -18 -63 -163 96 232 -223
2906 -223 123 -95 -24 -71 -116 -20 -19 -132 -66 -41 50 -5 62 -148 40 -23 291 2 -44 45 62 250 -98 190 -162
2931 -162 -80 61 167 285 -294 -83 -9 -70 -79 129 -72 -61 225 -147 52 117 -48 -120 -97 82 29 -139 13
2954 13 106 -69 -294 88 -61 36 -3 -111 -117 120 214 -122 280 20 37 -20 86 195 -38 -263 -17 -14 -100 -234
2978 -234 -31 69 129 -97 85 120 -107 101 13 52 -39 191 -5 -38 235 12 54 -65 -113 15 -37 -125 18
3001 18 143 157 -163 -47 -72 -124 122 -41 44 155 29 -223 87 -101 -60 -83 -232 40 -66 -26 184 166 -205
3024 -205 -139 -27 66 -65 -60 -157 60 121 187 -24 41 -87 -13 204 -51 -3 128 -32 -412 151 -15 129 92 36
3048 36 -305 -35 -104 -285 -73 0 170 -188 -129 103 25 29 -106 1 103 -147 68 37 -168 -56 -213 -202 138
3071 138 100 -90 -17 153 17 72 201 24 101 187 4 14 12 42 21 50 -217 -199 143 -202 -89 -96 5 -158 -55
3096 -55 -6 80 -26 -85 121 -13 -41 44 -241 -32 -180 36 50 -222 9 -144 140 -114 114 -178 -179 -107 -160 303
3120 303 110 333 133 -237 -51 44 16 74 38 -233 142 37 -93 -31 70 -105 97 -44 -79 -171 8 -132
3142 -132 16 15 -28 -85 18 -179 -253 -80 -200 -70 -92 -143 -34 -140 -58 -121 -214 -71 279 -153 106 15 -2 -85
3166 -85 -173 -49 176 69 -84 -151 9 129 -211 144 200 -150 -162 -82 28 -111 22 79 119 72 -97 -1 57 123
3190 123 -59 -30 -149 -294 20 226 -169 -54 -123 -139 200 -200 10 190 -237 -140 -51 132 -118 23 -41 -293
3212 -293 124 -55 -36 219 -124 -97 -100 25 178 69 6 -189 14 -13 -199 37 -98 -5 84 113 -186 -119 89
3235 89 111 23 162 -227 -69 -64 -47 -79 116 40 -123 73 93 70 252 -150 4 -270 -65 -38 -220 13 -136 260
3259 260 251 -180 52 48 -85 173 40 -252 -62 -164 -24 246 -37 129 98 -213 91 -44 -78 -234 93 -62
3281 -62 -32 233 151 -259 60 -105 -195 -71 -135 165 160 -262 54 26 -37 242 206 -8 -8 39 -60 -7 175 98 -332
3306 -332 -38 -61 -43 216 -239 172 -23 48 -92 176 7 92 119 49 -228 175 -128 -24 0 157 -212 -18
3328 -18 103 -178 10 91 11 -46 108 -76 330 -137 -214 24 -170 -166 181 -76 -153 -58 -58 -412 76 142 -204 -44
3352 -44 18 -18 32 7 50 93 342 -133 244 157 -199 5 102 -52 109 -174 -78 67 245 161 -226 -41 -131 133
3376 133 -98 143 37 24 33 -63 121 -19 17 -29 -261 54 -35 -176 251 -78 -134 -154 26 -31 186 182 -25 54
3400 54 53 24 65 65 117 -169 -20 -285 -21 -81 -305 235 233 126 -180 107 -117 -33 20 -32 49 271 -215 -139 79
3425 79 55 -143 -26 -19 -6 15 61 82 162 89 -83 -22 -204 110 109 5 -52 -29 -22 78 -86 26 -43 -71 57 125 182
3452 182 151 -238 127 56 -220 129 -165 133 147 -227 43 203 -211 128 -53 88 4 73 171 -57 34 -74
3474 -74 -241 71 -117 -131 -367 127 -144 -47 68 -10 184 196 -39 158 32 -29 -58 89 -129 -17 129 7
3496 7 2 255 55 11 -28 -19 -148 235 -241 -49 222 -209 -107 -236 -28 194 70 36 223 53 -158 -57 139
3519 139 -135 226 -188 81 -3 34 -73 66 73 -202 136 87 100 66 62 -47 175 430 85 -133 -5 51 53 -65
3543 -65 -56 217 -12 -33 -148 111 2 33 224 1 91 -51 103 -3 -6 -108 154 -37 -117 59 -78 -317 -102
3566 -102 4 -50 205 127 55 -89 -8 21 -4 143 116 230 145 -63 -212 -26 -113 -41 -60 -23 -96 -191 15 4 -3 192
3592 192 11 -105 -198 4 75 -29 -117 249 -64 -13 254 65 -137 -109 47 -25 429 303 -161 112 309 -154
3614 -154 -13 -95 2 62 -172 7 37 -152 146 -128 -101 -120 -1 101 -142 322 99 -262 -19 -94 29 -14 42
3637 42 35 53 151 -45 44 56 -220 -29 102 7 85 24 61 -53 17 -97 221 -190 -26 61 -33 -114 54 132 9
3662 9 13 93 216 124 -169 59 -73 224 123 69 -30 -203 -61 -5 -8 -31 -88 -92 51 195 -5 -207 10 -288 296
3687 296 34 -341 94 -98 59 -40 -35 164 140 -143 93 297 100 -134 -57 126 118 258 28 -37 -142 -25 -147
3710 -147 -51 48 -283 53 54 -3 -91 -82 -404 -279 67 21 148 122 80 100 -73 -102 58 63 -141 141 -15 -246 -199
3735 -199 85 124 -92 -146 -329 -144 -37 -5 -148 -140 176 -35 280 -20 -90 36 120 -25 -198 -92 55 -41 176
3758 176 -220 -115 -114 -23 68 -259 187 254 -57 -202 -97 -221 87 71 -54 -114 -15 -170 29 101 88 -6 201 -121
3782 -121 -201 162 -206 -6 105 55 -108 9 -19 -44 98 -333 59 4 163 145 123 -90 124 -160 50 -235
3804 -235 -22 -85 63 1 -65 -188 59 -68 48 -4 8 -202 -25 124 -298 -213 -2 -451 -129 12 -177 151
3826 151 -57 -136 78 -363 -88 -94 38 -199 70 -85 -122 44 54 -13 253 106 -214 -202 122 -80 162 72 -87
3849 -87 38 -76 8 -103 -3 -26 -87 -71 -140 44 182 -89 -46 -182 -459 4 -92 116 16 -201 38 19 -184
3872 -184 -90 -3 102 158 73 -79 21 267 204 82 -119 -234 85 222 91 -79 18 -80 -371 -87 186 -54
3894 -54 -162 91 -44 -28 107 -165 183 24 242 115 100 -143 12 -70 -233 121 34 62 -199 43 325 140
3916 140 -18 175 -170 -14 -172 -359 97 -99 -7 113 64 -200 210 214 -75 -201 -210 131 -74 -130 -139 -148 -97 62
3940 62 -200 -34 -189 -11 -83 -196 112 9 -158 -109 -133 86 41 -146 34 251 22 -89 33 199 172 -15
3962 -15 125 -175 195 19 -12 198 69 25 60 -206 -73 7 -127 -138 198 -23 -133 -141 249 4 156 66 -16
3985 -16 231 -76 -100 100 43 158 178 0 76 81 -31 49 137 46 -115 -109 -69 155 292 -30 -454 185 107 -250 379
4010 379 -21 -109 57 44 -204 34 118 -67 -75 64 -291 57 -26 -22 114 256 -245 -218 117 -37 -80 -33 28 189
4034 189 7 85 -71 -66 -60 -149 49 4 -151 -89 66 -149 39 -48 163 216 -98 -156 -41 32 -119 40 -26 3 -1
4059 -1 131 190 19 7 6 -36 -177 84 -118 -175 106 50 207 154 -4 66 25 -102 -160 122 -39 111 -5 128
4083 128 69 136 -213 45 -28 89 116 -108 159 -83 47 -21 -5 151 78 -178 -203 355 -2 -270 4 -127 114
4106 114 -40 -118 -166 2 -30 -178 5 233 19 -94 231 -103 158 34 -205 226 -351 -22 164 -131 -2
4127 -2 190 -109 -98 125 120 -89 70 -109 -137 0 39 -63 81 -6 -139 114 13 230 -37 -18 -75 -117 2 18
4151 18 16 279 -297 -108 -175 -21 -206 -50 188 4 169 -184 151 -109 -35 23 183 -116 -56 30 106 159 256 -140
4175 -140 48 119 -77 190 2 -219 89 46 -88 103 105 -113 -151 288 -25 162 170 -60 -37 181 23 4 66
4198 66 42 98 128 169 -128 164 -64 89 220 -197 208 248 117 246 244 -236 -115 -70 113 124 19 -54 -114 -161
4222 -161 -27 -305 77 -1 -130 -22 -37 -40 325 -86 246 275 -351 -53 124 -11 -94 283 45 -78 196 136
4244 136 -50 32 16 -112 -51 86 8 93 -101 -79 -193 91 -227 -84 -112 155 193 56 78 -199 90 -34 -5
4267 -5 313 152 50 127 210 213 -3 -307 117 201 -96 282 -132 -112 11 90 -99 28 65 75 22 322 -170 -168 -47
4292 -47 199 -189 65 18 1 -9 -150 135 89 80 74 185 -13 -1 209 -172 72 -111 -170 112 124 26 33 -20 -90 -49
4318 -49 -77 -32 -295 -243 -40 -52 385 -262 -5 148 -264 247 56 113 -174 63 -61 79 79 -78 259 291 230
4341 230 66 148 -32 139 -7 -51 -271 -269 -73 10 -94 -10 79 195 88 -62 54 -257 -195 -34 55 134 -43
4364 -43 60 147 -14 18 -70 55 -12 -132 99 -122 -171 203 -135 209 -20 71 -214 44 -122 -128 333 17 -27
4387 -27 -79 30 5 -42 -95 -192 14 82 -79 232 171 -102 -169 -335 36 223 -206 -260 226 37 -345 145 -48
4410 -48 -50 -186 -51 -259 341 92 203 -6 36 -48 -134 -204 -25 153 148 54 9 -50 -274 258 97 58 -112 -45 -9
4435 -9 179 -93 -97 -69 98 -171 163 284 -30 280 10 -28 94 10 -152 33 64 -173 -6 144 -277 108 339
4458 339 100 56 -31 -117 -29 173 -135 103 209 45 -96 102 -138 -218 -108 -197 54 280 -74 23 13 93 -291
4481 -291 -118 56 -81 116 205 -118 20 10 66 147 -98 -61 -216 5 137 52 -159 -188 68 58 -182 175 218
4504 218 -216 215 -75 -177 98 -35 108 146 93 -25 253 -54 256 -59 -184 -37 231 -238 -147 123 -67
4525 -67 181 84 57 -69 -168 95 -103 381 109 -196 66 198 0 176 -105 15 78 -202 99 264 84 -144
4547 -144 29 -69 141 81 -114 -159 -82 -1 -173 -79 -50 -70 22 175 -195 -81 -325 -159 11 75 18 278 76 -213
4571 -213 183 -146 -127 53 125 -94 -10 53 -73 55 -96 -4 -206 3 -122 290 -5 -184 39 -151 145 71
4593 71 -38 -80 15 -18 162 -97 184 -123 11 -122 6 -165 -175 -87 96 -196 -219 -6 -94 -100 110 144 -9 -81
4617 -81 -160 7 185 101 121 132 35 41 48 -47 -75 156 -96 99 124 -111 -105 -190 198 -188 -162 235 -7 -20 -195 -20
4643 -20 -92 168 47 -101 -29 114 -99 117 -137 -133 125 -244 16 -148 62 -10 -184 133 -40 35 -177 19
4665 19 155 95 -69 7 48 -16 98 -1 -18 -14 -25 107 135 -65 40 -94 -153 -284 -8 -143 -6 2 121 57 -267
4690 -267 -150 171 43 121 -64 -175 133 -25 56 -28 112 -132 -103 -364 73 42 75 90 -71 143 150 -507 -135
4713 -135 30 -133 -79 154 5 54 -116 -22 -173 78 -27 -185 47 -124 55 50 215 18 95 -167 -70 -82 -139
4736 -139 205 -89 -166 -233 98 81 -57 -212 -173 19 -150 -2 142 -9 -15 36 -128 111 182 102 -81 -87 163 -346
4760 -346 -137 -112 189 -137 147 185 -129 113 172 110 -105 22 -83 -39 90 27 -15 45 -227 -37 -29 -94 12 84
4784 84 -176 -79 65 23 -75 20 255 -59 75 -35 141 75 101 -5 -104 39 -121 40 -309 54 33 -425 -121
4807 -121 1 -291 136 27 -94 -291 108 -178 36 -163 -39 -119 189 -239 -122 -105 -126 -38 138 -62 142
4828 142 -1 -108 -143 33 232 4 75 63 -72 -27 -56 -107 17 26 256 22 113 57 35 24 -46 284 94 71 157
4853 157 -162 -30 -87 -181 104 89 82 -71 41 -121 147 81 83 -54 23 30 -4 -42 -103 -222 -132 -30 145 122 33 -96
4879 -96 155 -68 -66 239 -188 -167 66 310 -262 104 27 40 98 335 -201 -145 129 -76 31 286 -54 158 -138
4902 -138 -56 144 282 123 -7 239 -363 42 10 106 220 126 139 98 171 -20 77 34 -197 145 -82 -62 106
4925 106 65 78 -186 143 47 -31 189 -54 31 203 68 -140 134 -352 -16 -11 -51 -139 35 -115 199 -59 312
4948 312 22 -86 54 -39 380 -102 -177 -115 -108 -110 -56 -255 -35 187 270 -42 -213 228 -250 115 -90 -246 321
4971 321 -191 -150 109 -88 20 96 -122 322 9 304 5 -79 -82 63 213 50 -132 -83 134 -73 -15 -109 -189
4994 -189 48 3 -72 57 -77 150 118 154 74 82 145 -333 256 -197 39 63 265 -83 -370 195 -114 151 127
5017 127 -63 -111 -70 -110 -48 -175 -21 155 52 112 -63 212 -5 192 -168 -181 32 40 169 -118 -258 -220 70
5040 70 -239 -89 -94 32 2 82 -224 11 -13 93 -4 94 -114 34 135 293 -14 -112 37 37 160 32 146 84
5064 84 110 86 98 154 36 -50 -95 94 292 13 -5 -52 -13 -61 -42 100 -56 61 68 2 -178 158 68 -224 164
5089 164 -169 90 130 -18 -68 -112 -24 -28 -63 214 132 -3 35 55 194 12 -49 37 85 -124 5 186 4 -155
5113 -155 -215 -2 -119 29 -216 105 -8 80 41 -26 131 38 76 137 -88 24 12 -148 -258 -66 104 -99 1
5136 1 19 157 -13 55 113 14 26 -260 162 148 64 65 -6 -156 -192 -42 -53 49 109 154 38 -141 33 -83 -13 -103
5162 -103 131 229 -7 -12 -23 -118 -152 87 -362 -4 -61 61 -135 -258 6 46 -128 -99 83 73 54 -12 182 84
5186 84 -67 -38 43 168 139 156 132 212 -61 -188 -34 -142 52 231 9 -142 -261 -66 50 91 115 -154 -307
5209 -307 61 -45 122 46 -76 -16 122 -135 -92 -108 -225 59 37 153 -36 -47 -112 -176 -62 -267 169 -172 -62
5232 -62 58 -161 -19 -102 34 -204 36 136 -171 -32 50 99 161 -111 -47 206 11 -22 131 51 -351 27 155
5255 155 -145 52 158 -74 62 -44 21 -18 -99 -41 -20 -54 -57 -21 206 -1 1 72 169 159 7 -207 -57 163 -74
5280 -74 -233 40 -43 63 13 101 -232 -8 -113 -50 -62 -84 -60 -12 -26 -217 -63 -23 90 -1 19 62 -43 13 134
5305 134 6 -224 -40 146 -77 135 10 0 123 -133 155 -94 116 146 187 39 -206 44 60 131 254 -41
5327 -41 -51 172 -60 95 -246 -238 -78 -3 305 -21 -178 111 236 50 213 207 -177 2 106 66 12 91 82 -105
5351 -105 229 276 -43 178 -108 -314 147 -40 -74 -226 -11 -63 94 143 -81 59 -258 -59 155 11 54 34
5373 34 -139 -90 200 -12 -44 90 202 233 78 261 -24 70 79 120 2 -46 93 265 -47 60 -121 129 -45
5396 -45 -42 -82 235 111 202 -80 -31 -145 -19 -46 -133 19 -25 -187 -6 -40 15 -72 70 155 -36 -36 -153 -12 -217
5421 -217 -40 230 178 47 -125 212 316 -36 -122 -34 71 143 73 44 -15 -114 -188 -68 118 131 30 -118 -79 -125
5445 -125 12 -203 -23 171 130 -48 -20 92 26 124 -224 125 -25 -91 57 153 239 -100 -45 7 85 -44 -100 270
5469 270 -20 -49 -259 -13 -106 117 246 -176 -81 -158 36 -116 304 -26 -56 119 -22 -57 97 18 -47 71 -204
5492 -204 161 14 47 17 110 -182 -91 275 -69 -88 -69 175 65 -169 297 117 53 -5 -41 -45 -62 -246 -143 75
5516 75 -87 -94 -33 -137 -95 43 233 -93 -126 -222 43 164 47 -24 23 -47 194 81 -21 -26 68 -129 166 22
5540 22 -132 -36 -20 39 -43 -116 -56 181 211 197 94 36 -140 -58 14 -96 38 102 -107 -202 88 -142 8 203 -59
5565 -59 254 85 -242 110 136 131 -56 87 -65 -50 -258 -92 71 68 -149 -311 -190 23 -164 -29 111 85 -102
5588 -102 -57 -12 5 255 -25 -77 -322 -84 -61 -6 -169 24 193 -39 96 72 -154 276 29 140 23 -28 -88
5611 -88 4 -41 213 144 -161 4 66 -104 -4 172 60 188 111 303 23 22 37 -47 206 -44 -9 135 40 156
5635 156 -121 -202 289 133 170 173 -336 9 -69 105 -57 -265 -215 -74 -37 120 65 105 -51 -253 252 -243 -89
5658 -89 -35 -105 114 -187 -289 -245 78 95 19 259 -163 -37 110 -49 154 -45 34 -4 121 -151 281 207 -6
5681 -6 181 -129 -39 -207 123 -161 2 -338 -72 113 181 100 -219 -184 -44 69 -82 -126 29 -84 33 39 -71
5704 -71 4 -203 -37 22 212 76 -56 -13 201 67 -55 -9 211 126 304 -10 103 80 184 -84 1 36 -14
5727 -14 -49 57 -40 136 -30 94 -103 69 -64 -79 120 -106 50 147 -70 -22 144 -125 -86 99 47 62 76
5750 76 38 3 -65 157 -76 66 329 -116 47 -123 -47 9 240 -166 -21 154 160 78 -3 6 -112 2 42 91 -25
5775 -25 28 -45 89 -25 -202 101 -12 -27 2 128 116 -113 -12 -258 233 -238 -35 -267 -43 188 129 44 -112
5798 -112 -270 51 93 190 45 47 12 -110 -31 -232 -225 3 -64 -66 -10 115 9 2 48 41 -364 -60 76 -42 165 -23
5824 -23 -133 28 15 49 -94 -13 110 10 10 189 178 -85 -189 148 41 93 -295 -225 -202 60 -104 -100 30 12
5848 12 18 127 40 -182 114 124 84 26 -43 -40 161 3 -55 219 -133 64 -53 -115 157 169 -15 -170 372 -122
5872 -122 -83 -15 40 86 -169 325 -96 40 -42 3 242 121 108 70 73 -169 -70 43 -156 -38 117 42 -12 38 89
5897 89 -36 -28 -148 16 91 108 -4 -127 218 197 -93 99 217 69 154 -214 114 -71 130 -87 -36 92 175
5920 175 158 73 157 -47 -87 117 36 16 148 -61 -114 -55 29 -51 -95 -54 -213 -16 -78 24 120 70 -41 -89 272
5945 272 -100 -141 160 19 211 -158 -262 -81 -17 56 -47 135 -40 64 -49 20 -264 -13 135 153 -14 -205
5967 -205 -23 191 -62 213 -311 159 103 -46 31 25 -139 24 124 -68 -78 229 188 -44 78 100 66 129 -62
5990 -62 -25 39 -31 60 41 103 77 -6 88 40 127 -299 -242 13 -15 -82 47 -287 12 86 -71 -103 102 146 157 1
6016 1 -95 28 -35 -185 50 -127 -66 -185 -77 -59 -297 -7 -105 -7 185 -113 -4 13 -59 -61 195 17 20 169 -10
6041 -10 80 -93 206 25 64 -130 167 192 -10 83 229 -71 -101 5 -20 371 -134 181 -9 3 -103 45 -145
6064 -145 -150 12 141 80 -153 217 -154 0 -14 193 -82 -110 276 192 -98 -59 -48 151 -97 -32 224 69 -8
6087 -8 192 -65 130 62 -10 58 62 -79 15 52 218 -56 -33 135 -217 -71 63 21 267 85 -123 -96 117 168
6111 168 131 47 47 14 225 -152 105 19 34 -221 -147 -20 62 -62 -246 -93 -2 91 -58 169 17 221 12 -6
6135 -6 -45 163 114 151 -60 -274 136 90 5 -128 148 -75 -215 178 -134 -85 83 -154 -63 264 -49 23 27 -161
6159 -161 111 13 76 27 23 -221 -139 -43 92 216 301 74 365 -96 48 150 -25 -66 87 197 -104 190 157
6182 157 140 122 379 -230 -282 -107 112 -35 76 -213 -169 -87 76 -6 -211 -196 -101 -136 -85 -72 148 -208 -77 109
6206 109 -22 214 -81 92 -147 0 -75 -265 -105 106 -145 131 -84 -250 -200 -63 -95 -79 130 -189 -66
6227 -66 -149 -131 152 -173 -182 67 56 -46 271 87 -114 -120 169 -87 84 -37 -124 -31 46 -213 156 195 -70 287
6251 287 -44 219 -56 306 37 165 24 -37 41 -225 -227 -40 -61 190 182 92 -6 -111 174 171 -42 232 -385 -79
6275 -79 -244 48 -97 -45 -77 -10 45 171 -23 -43 -24 -200 -76 -38 -213 231 -240 -40 245 -80 12 -68 -54 177
6299 177 -54 118 48 116 24 225 -177 51 -27 30 -91 51 58 106 -63 210 206 53 26 170 -63 130 67 -195
6323 -195 124 -150 -106 -105 -89 -234 169 -413 -220 260 -184 129 65 -123 -10 221 -150 -78 347 77 -155 257
6345 257 101 -316 88 -124 99 308 175 -220 48 7 -151 179 -60 0 136 3 179 -44 5 -137 -3
6366 -3 -134 -122 46 -127 -127 -49 163 -170 77 126 111 28 49 195 157 78 28 112 151 -223 -181 137 28 54 128 -195
6392 -195 50 -5 -345 -166 216 47 -205 120 4 149 61 -186 -68 -51 -15 -29 -142 -357 -63 186 -166 236
6414 236 8 -124 -173 22 13 -258 23 -36 145 145 -83 9 39 -124 184 209 46 -40 139 -123 -58 -26 28 -97
6438 -97 16 44 -44 -107 -92 -2 207 -137 -173 66 -287 -61 -71 -46 253 -172 93 27 89 22 -66 186 -275 -422
6462 -422 8 173 289 70 30 -191 -129 -118 -45 142 179 -136 -27 -250 42 2 -48 5 58 185 87 -5 129 50
6486 50 198 120 10 -49 203 -177 69 65 5 3 -123 -93 205 40 -56 -248 -274 69 -100 -28 -70 38 275 -243
6510 -243 -9 19 -46 -19 -203 -222 147 114 149 155 77 123 79 130 14 167 0 109 115 -38 44 56 -76 103 -141
6535 -141 0 33 0 -25 66 -47 53 -76 12 -142 110 143 85 164 -31 -156 12 68 78 130 -325 55 -84 -204
6559 -204 -209 -59 -57 -100 -441 47 -215 -186 -20 -4 -29 205 102 197 -90 199 -93 157 98 161 39 -34 117 112 189
6584 189 183 -26 219 -89 50 95 -217 -15 42 -110 -175 -128 138 14 107 20 17 103 -26 -121 -114 -147 -237 68 27 -19
6610 -19 -45 -299 -147 111 -123 -17 60 118 -92 -38 -108 -133 250 -191 145 -154 -182 -346 206 171 -110 251 76
6633 76 64 -52 86 44 -151 -239 -84 33 -24 170 192 -133 -183 272 71 -124 88 193 77 -56 -42 104 313
6656 313 -99 -203 -13 119 -289 -29 -154 -114 290 -25 -298 11 -33 59 13 -40 -260 111 156 102 -118 -16
6678 -16 -74 20 86 -256 193 12 -8 36 58 -118 18 227 -61 181 -96 -224 72 43 70 21 -21 -127 26 35
6702 35 84 54 91 124 38 77 -102 -139 158 -29 -97 -139 124 -78 -174 28 -59 79 74 100 -99 116 -9 48 -118
6727 -118 145 220 -2 -184 317 -109 -53 -97 31 177 -117 -217 72 153 -246 34 104 -59 -107 128 -100 40
6749 40 -75 -84 -146 47 88 -49 378 11 -35 -64 -210 -10 135 -34 9 -105 -123 112 203 -166 -219 -49 -22 116
6773 116 119 -85 109 47 -3 -284 -3 -52 37 219 1 -185 -132 6 -24 -380 -61 -115 70 -138 123 -152 8
6796 8 127 -116 -109 -112 2 -218 -41 204 103 -38 169 -169 -48 80 208 -67 -47 0 -100 48 -104 -11 -71
6819 -71 44 173 126 -258 -109 20 217 157 21 88 -224 -89 -73 118 -64 -168 -149 -176 -64 -66 111 66 68 -188
6843 -188 -42 -30 -32 74 0 31 156 30 135 79 165 -79 18 182 166 42 -251 236 -23 117 -181 19 68
6866 68 -8 -200 -114 108 258 -26 169 80 -64 323 -12 287 -7 -106 -61 79 223 -162 -38 -93 -68 -58 199
6889 199 37 18 59 86 141 -55 10 41 -234 109 3 54 3 121 123 34 -187 237 57 -1 45 52 -31 141 -227
6914 -227 -152 27 -242 493 51 290 -92 -108 -47 161 123 -87 38 -57 -142 36 322 16 -55 -99 -314 -149 347
6937 347 179 -50 236 -130 -25 43 212 -78 239 86 -218 21 -242 -42 -26 -31 -239 18 -175 -349 53
6958 53 111 111 -92 -63 -88 220 -4 160 173 19 -159 -11 81 -121 -108 273 -76 4 262 62 175 -238 114
6981 114 102 -94 -156 7 -157 -151 86 23 46 -91 -11 2 109 -4 -323 276 360 -71 261 -30 -16 116 -44
7004 -44 21 65 -101 191 128 62 -30 -187 -120 37 -6 -80 105 75 -150 -116 90 -155 46 -171 10 -63 238 136
7028 136 -140 -252 251 238 48 37 -63 201 88 -81 -1 6 -300 186 -127 44 -205 -105 -288 72 228 87
7050 87 -2 194 5 94 56 -26 216 133 -241 -76 -6 -10 70 104 -44 -137 101 -113 -63 69 199 -143 310 -74
7074 -74 83 256 40 201 -43 -77 -23 -42 -248 97 46 112 -148 12 -192 -58 215 5 184 58 -54 30
7096 30 52 47 42 172 195 183 220 239 -177 146 -23 -193 33 78 -13 -78 145 -119 -79 -65 -169 -8 39 -111 48
7121 48 -117 -45 23 58 -32 8 113 49 19 -1 5 -82 -42 118 53 -9 -26 15 -227 257 169 92 -33 109 79 -10 38
7148 38 156 121 47 115 -182 6 -106 -64 19 -147 -247 16 -57 27 123 -127 28 44 -57 -6 27 157 152 32 150
7173 150 5 -26 261 -258 205 -34 -95 277 151 51 50 82 122 -90 142 -30 -150 36 -6 93 -79 -37 163
7196 163 39 234 -55 -8 -231 -100 -107 -85 -204 147 9 -10 171 -214 -82 -43 -132 171 -50 241 32 181
7218 181 -167 -57 93 -24 -103 120 -4 -18 -46 -213 25 -217 -13 100 -42 -351 120 105 108 -256 186 70
7240 70 68 -136 198 214 316 141 -105 127 124 15 75 84 -35 256 149 301 231 -109 108 172 -126 40 10 60
7264 60 -216 125 -155 -335 268 -1 12 107 98 85 -247 -122 41 101 -64 -57 98 282 -103 50 269 -249 78
7287 78 -14 111 -47 228 16 177 108 129 -123 -4 21 196 70 -67 170 -34 107 71 145 70 157 -70 13
7310 13 299 -242 -14 32 -75 -197 174 60 -17 220 140 -234 112 -262 -41 -232 86 127 124 145 164 -10 -47
7333 -47 -59 10 153 -315 -64 485 134 -148 297 -41 26 83 29 -114 122 -5 -152 19 -149 -106 116 -36
7355 -36 -52 -16 24 74 -32 -222 -15 -12 113 75 -49 19 -23 121 27 -209 -20 -60 -44 28 45 62 266 50 -242
7380 -242 9 -419 -73 -12 -88 -103 -34 85 -4 -30 93 -154 21 -174 -207 -216 124 -70 50 -27 79 28 47 24
7404 24 61 132 7 -186 -21 120 148 -59 -118 129 -57 -104 -109 -130 -184 222 -9 10 -37 -69 -360 71 86 76 0
7429 0 -117 34 314 51 -60 -22 7 300 59 -118 204 82 16 -27 278 -177 -192 86 -146 148 -67 100
7451 100 -219 163 -51 75 113 -132 -194 27 51 11 186 -120 -38 49 -159 -276 -1 -19 37 79 -158 113 118 40
7475 40 -38 341 -157 86 92 94 -19 -7 -123 129 78 15 133 64 72 -104 -32 64 -306 40 262 114 -101 -30 -280
7500 -280 103 -59 -180 -141 43 -137 -188 -118 -124 -132 128 27 -63 -47 37 82 89 55 -84 16 81 71 88 -142 -142 96
7526 96 -159 165 31 169 -15 9 -25 -62 20 -198 272 2 98 51 155 -185 -126 59 -173 -41 -112 -117 -29 18
7550 18 -77 -151 32 -81 41 58 237 -153 -42 -77 80 136 -48 274 148 68 -129 27 -63 -137 -81 -222 -54
7573 -54 173 130 64 225 -163 -159 86 57 -37 262 62 -271 -161 -211 -256 -153 245 -86 -166 -119 191 152 88 -66
7597 -66 82 -204 -166 112 172 -135 225 -21 32 106 30 191 -6 -106 -204 -89 -63 279 -22 9 133 133 155 -49
7621 -49 -173 -167 35 67 -37 -130 170 20 -12 23 -29 -38 76 -26 -263 192 107 -37 36 206 -53 101 211 -110
7645 -110 -97 99 -79 40 130 -281 -111 -192 83 -22 -21 -124 -48 -41 74 121 -23 65 -45 -49 -22 -69 -150 262 -36
7670 -36 142 366 -32 57 -43 128 -34 -306 -83 140 156 146 51 14 -66 254 34 -85 282 171 -139 38
7692 38 -326 9 -91 -240 -70 167 -74 -135 10 -61 6 124 -47 115 42 -152 -52 132 121 130 -5 -83 28
7715 28 -157 5 72 -19 89 248 173 14 -70 -43 -107 80 6 124 -69 244 34 55 197 -111 133 -17 14
7738 14 82 351 124 113 137 80 -237 117 -168 -163 -24 170 191 262 23 -102 74 57 -243 -49 -152 -189 -18 -188
7762 -188 -64 102 -65 50 125 40 -109 -135 -38 -291 10 -173 97 -12 82 7 67 72 122 160 119 85 81 39 56 20
7788 20 32 -120 35 77 -242 41 113 -129 61 -221 123 -23 60 -47 120 214 -81 64 197 188 -84 159 -98
7811 -98 -77 93 -44 -55 -108 -157 -54 -110 -204 176 193 146 -10 -8 134 214 101 -104 -172 58 -147 -122 124 -156 -158
7836 -158 -72 -19 -103 -397 -46 -30 -213 -112 -40 176 -98 -184 87 175 -103 21 54 -12 216 -50 -116 42 91 -61
7860 -61 -115 156 82 -10 238 337 99 -281 -85 34 60 27 -14 155 108 225 -171 -46 153 100 262 2 -19 -60
7884 -60 179 59 -54 209 211 170 -36 115 0 -27 318 -86 221 32 15 216 46 -166 12 -226 -106 -50
7906 -50 -357 -87 -263 155 -200 141 15 -13 -76 -103 288 -187 99 -77 -178 188 -71 -10 3 -5 -85 2 112
7929 112 205 -120 -80 296 -96 -129 49 -173 -208 -78 135 37 38 -31 51 63 -180 -34 30 36 194 31 58 110 247
7954 247 2 186 -284 -63 21 7 -93 248 26 -203 -118 -25 124 11 78 10 -133 114 -30 -185 -67 -114
7976 -114 -5 -231 9 29 86 -3 39 52 161 -116 -40 15 -164 -15 -151 15 167 67 117 147 121 61 -205 4
8000 4 -43 36 66 -173 9 -6 -252 -65 -38 92 24 -53 159 12 160 224 -19 -67 -274 -174 21 -80 189 -13
8024 -13 -23 -118 200 -36 -107 53 73 -117 196 -147 -67 -110 117 52 122 146 19 145 -151 -43 -114 -41 -92 -35 10
8049 10 -39 -48 -187 -41 74 117 -249 141 -57 -162 -98 41 -9 16 -30 225 97 27 -129 155 201 -236 38 -65
8073 -65 -174 78 -2 -34 -58 -62 -18 27 -261 247 145 -124 -72 -186 124 50 -45 -10 -49 249 -41 -136 -64 83 66
8098 66 -26 93 45 24 185 -74 -92 63 176 30 -146 103 114 67 -132 74 -231 110 -47 -169 341 -72
8120 -72 -71 -44 -21 -76 40 -41 87 -235 85 -163 134 -72 -127 -295 113 -77 112 -97 226 74 99 126 100 22
8144 22 260 61 -58 -45 -109 -27 -124 -4 -2 -129 -104 -101 89 82 120 150 18 -188 40 -65 -313 14 -85 430 -134
8169 -134 106 -34 2 -22 222 -13 29 -123 147 39 -84 41 98 143 21 89 -188 129 -59 56 6 -19
8191a9
$$ Imaginary data points
##PAGE= N=2
##DATA TABLE= (X++(I..I)), XYDATA
0 0 0 0 0 0 0 0 0 0 0 -8 8 -8 8 -8 11 -16 16 -24 32 -32 40 -48 56 -66 80 -95 107 -123 144 -164 187 -214
32 -214 243 -274 309 -346 391 -437 488 -545 606 -673 745 -826 913 -1008 1112 -1225 1352
49 1352 -1489 1638 -1807 1991 -2199 2432 -2694 2994 -3338 3742 -4223 4800 -5514 6424 -7628
64 -7628 9297 -11778 15859 -23744 44611 -220307 -506998 42616 379542 287200 3533
75 3533 -29907 109790 172333 72758 101459 99791 -139978 -308493 -77579 190392 119734 -204223
87 -204223 -303626 16952 289823 85479 -190108 -134702 33479 55730 9772 9313 56878
98 56878 5155 -95338 44211 291428 184941 -139337 -192825 38989 182476 19068 -233887
109 -233887 -188916 32618 27685 -91900 -31372 66928 28787 -37648 8300 141692 133262 -82280
121 -82280 -134077 97618 182918 -21694 -165525 -67767 97664 82172 -94602 -118463 33267
132 33267 29245 -91121 -41168 86314 71533 -42317 -78273 54716 162770 22235 -130102
143 -130102 -28023 85667 -2152 -109925 -73651 48964 82172 -35882 -68215 84280 128453
154 128453 -5634 -47526 31833 51069 -35426 -124581 -72207 53346 8059 -110951 -34733
165 -34733 105754 81206 -14934 -22087 70355 121641 -1769 -123083 -40422 51956 -10356 -61204
177 -61204 -19216 21576 10525 -30181 3195 107308 63984 -101709 -103115 33112 61109 -31243
189 -31243 -104700 -55135 67402 71389 -13927 13066 77700 35541 -4163 25534 36291 -14698
201 -14698 -102480 -106755 26185 73971 -60718 -126071 -21453 81962 89972 22227 -27648 13607
213 13607 36849 -2392 22580 58698 -19111 -89001 -40362 46696 69115 -20140 -108395 -31767
225 -31767 80334 37231 -47317 -42790 -3364 28150 27760 3457 15965 11959 -39721 -7123 81713
238 81713 51283 -52883 -84927 -24486 64187 56992 -49113 -71130 4392 23308 4565 13749
250 13749 5488 -15258 -24084 -17493 34663 54572 -25975 -59383 22478 66500 24141 -29462 -43912
263 -43912 7205 46254 -7396 -46583 -15144 -13568 -24411 9766 30443 16455 -9619 -33059
275 -33059 10985 74996 31733 -40723 -25815 7535 9782 -96 -21189 -12140 15187 -9367 -23294
288 -23294 21169 24932 -12173 -10004 8028 16798 9872 -29928 -28902 28385 26767 -21195 -18791
301 -18791 1150 5709 11897 1267 975 20376 -4690 -30497 7779 27599 -3067 -15938 -13775
314 -13775 -5058 10425 -8586 -21120 17560 22022 -16752 -14289 8734 14623 16380 -3667 -16168
327 -16168 10629 6813 -22926 -3490 16987 -1186 -8079 -7452 -4054 16650 7184 -16144 8379
340 8379 20090 -12017 -16997 -556 4502 13847 1438 -19829 -272 10259 -9442 3205 19604
353 19604 23 -9919 -8910 -5195 20091 18024 -16185 -9109 10357 -2582 -4788 955 -7461 -499
367 -499 -160 -16457 -2301 11988 -4505 3209 20876 6771 -1559 -3021 -9557 7462 13551 -17331
381 -17331 -22140 -3681 -6440 2014 16436 6782 7178 9381 -5681 3562 17103 -7904 -20273 -10461
395 -10461 -16251 -12065 -296 -5620 7316 25380 9892 6747 20249 8152 1847 6451 -10802
408 -10802 -18894 -15095 -25911 -14239 12388 5292 -1062 11541 8859 12116 21029 3925 -5127 -301
422 -301 -18364 -23811 -4056 -4369 -4041 9164 4316 5343 19781 10800 4948 15392 -816 -17846
436 -17846 -12869 -17962 -17071 -559 -5389 -8746 7172 5178 3443 20396 17195 6484 9965 -2171
450 -2171 -10378 2754 -1774 -9265 879 -5864 -15703 -2928 -3019 -5841 6790 802 -10093 1761
464 1761 3506 1678 18111 15460 1870 7628 3100 -5415 5584 -5 -14058 -6840 -9086 -16436
478 -16436 -2173 2773 -1844 9084 5817 -7022 1805 2065 -6371 5083 5317 -7347 754 6506
492 6506 6006 21515 21116 2988 2654 -2396 -16843 -12727 -15024 -29748 -24275 -19479 -19687 3574 19378
507 19378 17145 29226 36190 24540 23546 15593 -3357 -3435 -8431 -30433 -31098 -25245 -25849 -7737 6457
522 6457 1449 7099 11011 3583 14426 20145 1281 -5511 -4269 -9478 2247 11669 1833 7251
536 7251 14458 3545 4626 7220 -8783 -13093 -11673 -22563 -19896 -14490 -21216 -6536 16773 14867
550 14867 14984 18945 11839 19528 27741 10908 -465 -5205 -20704 -16684 -1938 -8826 -14308 -12149
564 -12149 -15180 -2838 11307 -73 -3207 8133 4780 4645 10626 2212 2163 11054 3985 1986 4966
579 4966 -11014 -14846 1300 3643 -549 -3326 -13865 -5878 15302 11839 2012 2967 -7701 -11322
593 -11322 -372 -2751 -6422 -4131 -13026 -7247 15096 13759 5165 11955 13124 11790 11960 -5771
607 -5771 -14967 -3882 -7068 -13068 -5984 -10200 -13181 1980 9073 11415 14363 -2336 -13090 2401
621 2401 6234 -3545 -4584 -8891 -7663 8432 11141 9283 19653 13934 1545 7008 3239 -10571
635 -10571 -13880 -19575 -22168 -11051 -14293 -20451 -1822 12641 13922 20199 17243 10477 16585 13259
649 13259 3638 6864 -1724 -19705 -15240 -7257 -8164 -3303 -6285 -10778 448 1874 -6709 2862 8794
664 8794 221 929 1940 491 10637 11786 2712 8664 9216 -4829 -3358 1069 -4159 -3907 -8373
679 -8373 -16413 -5936 -415 -9164 -2165 7809 3208 3384 3393 -613 9278 13570 2364 3083 4733 -5905
695 -5905 -3145 5101 871 -1871 -8057 -18501 -7178 5099 -3045 -4741 661 -1026 5086 11519
709 11519 4894 6555 8775 -1450 -37 4768 -7206 -11574 -4261 -2839 1701 1170 -10983 -5121
723 -5121 11165 9375 5267 3244 -7520 -6096 4027 2305 1249 102 -11907 -7919 9333 8199
737 8199 2013 1347 -3926 561 8357 -1426 -6994 -600 -3778 -2248 5106 -1738 -6233 1381 3214
752 3214 7350 10800 -3875 -11581 1196 5805 4162 2471 -9281 -11040 2104 4295 2619 5530
766 5530 -3568 -8280 2856 5184 1810 2029 -5494 -4977 6672 2741 -5787 -706 564 820 6623
781 6623 62 -6764 -304 819 496 7756 578 -10330 -4561 815 2795 7271 -1015 -9957 -398
796 -398 4011 1241 5685 1710 -4535 1620 1945 -1777 3028 546 -5171 1695 1859 -5511 -2242 -523
812 -523 -2238 4672 2520 -6092 -1153 2626 592 6912 5530 -3573 -808 974 -1833 4395 2271
827 2271 -7335 -4638 -1640 -4965 295 2876 -1866 2677 3631 -2286 3463 6826 97 2383 1632 -6095
843 -6095 -3958 -1214 -4230 814 2421 -5352 -1694 3776 704 3678 5067 -1719 -198 1030 -5551
858 -5551 -1925 3682 -1267 -265 2375 -2780 1073 5826 906 2547 2680 -7191 -6845 -192 -2653 -832
874 -832 1139 -5094 -1327 6180 2869 4590 8619 1391 -415 2164 -3316 -3242 198 -5845 -4518 654
890 654 -5110 -4928 2813 1918 3325 5637 -1960 -2701 3779 1679 1254 5033 -2414 -5479 572 -433
906 -433 1100 4243 -3203 -5105 1541 -1049 -2051 2594 -85 -1280 2398 -1971 -2299 3584 63 -1805
922 -1805 4105 -395 -4486 491 952 2851 7194 158 -4698 1649 853 -1941 1521 -2260 -6586 -2939
938 -2939 -4276 -2600 6022 3021 -1531 4487 5011 1794 3767 679 -1496 1776 -4233 -9540 -2210
953 -2210 -265 -2188 2485 2698 443 4080 2031 444 6585 2357 -7408 -5538 -3380 -4112 411 -261
969 -261 -1921 4431 3755 -941 5696 7243 642 -177 -2346 -5550 -2129 -3486 -6167 1454 2966 -3645
985 -3645 -416 4522 3859 6072 3119 -2717 564 -670 -6961 -1765 2461 -2746 -2468 -1099 -878 5020
1001 5020 4886 -1071 2830 4557 -3689 -3660 925 -216 885 -1360 -6008 -246 3385 -2592 683 5378
1017 5378 422 -1686 -875 -1374 4180 3719 -4623 -1819 3559 -2271 -3260 773 458 1598 -534 -5505
1033 -5505 378 6159 -315 -472 4545 1450 -1658 -1787 -2744 2331 3261 -6796 -6580 1715 587 -580
1049 -580 2358 1666 3309 2875 -3399 276 6319 -912 -5604 -1200 -1046 -1460 -814 -2338 3379 7383
1065 7383 -1299 -4529 2886 2228 -1461 -1624 -3631 -3038 -1246 -5760 -1639 8126 4492 -1359 2212 4511
1081 4511 4868 4090 -2437 -2219 1817 -5094 -9415 -1915 -152 -2626 -1304 -1261 1791 5108 -463 -1018
1097 -1018 7990 5143 -3636 -2748 -70 2083 3365 -2264 -2900 3615 -285 -5443 1177 3960 -1200
1112 -1200 -3757 -5502 -2075 3808 -1124 -5238 3239 5378 -1176 -430 2842 4598 5821 -574 -3491
1127 -3491 3192 1306 -5855 -1967 2441 -667 -3839 -6401 -3567 5302 2253 -4964 372 4382 179
1142 179 58 2011 3353 5244 -515 -5777 1774 4197 -3260 -3269 554 -257 -1234 -3692 -3036 5164 4133
1159 4133 -4715 -2065 3136 460 -971 -340 133 3166 -373 -5887 1570 6543 311 -1492 1231
1174 1231 1018 859 -2029 -4085 3022 3847 -5963 -5721 1550 1706 645 -27 -881 3190 1784 -4381 462
1191 462 6774 158 -4395 -1706 307 2525 519 -3979 1703 5517 -2012 -4380 1376 2117 293
1206 293 -1151 -3341 884 1408 -5073 -1875 6549 2717 -3348 -2444 119 4472 4062 -3297 -1763 3843
1222 3843 -921 -3540 1058 1940 83 -1970 -3866 1087 4657 -2602 -4326 3435 3606 -1611 -2505 -2213
1238 -2213 2536 4863 -1993 -3143 2548 -183 -3280 1149 3300 1128 -1448 -5071 -99 6542 1167
1253 1167 -4663 -159 1908 -320 -257 -1344 641 2997 -2278 -3756 3123 1989 -3098 -624 2324
1268 2324 2022 707 -4079 -2384 5621 3449 -3322 -1064 728 -775 120 -246 468 2781 -2486 -5588
1284 -5588 2061 4440 -1307 -1954 -685 601 2590 -1535 -3024 3709 3196 -2855 -1240 1424 626 418
1300 418 -516 -485 3197 -590 -5972 -271 4123 473 -1789 -2242 -1314 2598 758 -2170 2829 3322 -2591
1317 -2591 -2060 1288 1693 1626 -1278 -2907 1752 1706 -3886 -1022 3653 758 -985 -1335 -1513 2589 1736
1334 1736 -2740 139 2769 -2096 -2398 957 1535 1897 -153 -3220 1103 3284 -1927 -1167 2771 361
1350 361 -1008 -1697 -1865 1953 2489 -2675 -1563 2106 -773 -1538 1422 1244 1492 -68 -3587 237 3628
1367 3628 -773 -2430 901 239 -759 -344 -1425 1594 2943 -1977 -2104 1719 -8 -1286 628 319
1383 319 857 -53 -3858 -1341 4090 1031 -1989 -107 -289 24 1229 -724 580 2356 -1782 -3085
1399 -3085 1518 1396 -563 307 -704 307 1822 -1851 -1975 3235 1577 -1962 -828 -1007 -572 1192
1415 1192 -543 -515 2201 -1232 -3127 1185 2676 843 535 -1295 -705 2269 217 -2022 1757 389
1431 389 -2357 -912 -100 -240 1171 -361 -1313 2019 233 -2480 842 2093 513 264 -1249 -1496
1447 -1496 1601 1035 -1129 1307 935 -2053 -476 975 337 1539 -696 -2783 373 655 -1921 -36
1463 -36 1110 -346 241 -244 -818 2200 2126 -677 422 953 -1511 -541 385 -255 1196 -555 -2832 10
1481 10 1531 -313 431 686 -993 -421 108 -1366 967 1649 -1589 -486 974 -704 481 1624 -465
1498 -465 790 518 -2154 -721 1686 75 -540 299 -1866 -432 1059 -376 341 1546 -1392 -983
1514 -983 868 -656 65 1347 -509 -205 817 -913 100 1899 -167 -267 498 -1612 -862 979
1530 979 -558 -199 879 -1493 -1213 1037 -32 244 1393 -793 -1106 828 -160 115 1843 -183 -551
1547 -551 867 -301 -303 1546 93 -756 96 -2058 -1896 790 -27 -430 1208 -638 -1001 1014 808 575
1565 575 1651 -526 -1513 719 -138 -441 1331 -275 -1043 216 -384 -720 1190 152 -889 525 -523
1582 -523 -1489 928 269 -83 1159 -571 -1211 979 1184 -271 984 109 -1809 -78 -357 -764 1216
1599 1216 -25 -1619 260 825 -595 933 425 -396 705 -286 -1820 515 1036 -536 455 169 -900
1616 -900 408 417 -191 1046 554 -1827 -562 792 -296 945 456 -864 -17 436 -1203 624 1095
1633 1095 -791 -406 -398 -1051 70 617 -426 648 982 -1073 129 1093 571 815 316 -1526 -391 247
1651 247 -756 279 947 -742 -529 35 -461 827 996 -713 -12 567 -868 -206 1048 469 566 401
1669 401 -1193 -62 1185 -219 -49 675 -947 -1108 2 -328 373 933 -1087 -602 941 -197 -131
1686 -131 888 -298 -143 -291 -1031 -338 1334 -181 -591 757 -402 -586 498 132 389 1055 -1341
1703 -1341 -1127 695 96 -262 386 -559 -568 378 -528 -259 1258 98 -799 719 -20 -164 912 171 125
1722 125 928 -489 -1079 514 393 -170 433 -594 -1089 337 -314 -33 1093 -119 -1299 348 252 64
1740 64 1045 -213 -664 588 142 -995 482 353 -492 224 -278 -795 490 -106 -450 810 186 -1276
1758 -1276 -620 366 253 855 171 -1132 124 289 -463 1166 789 -645 -227 -69 -343 773 237 -994
1776 -994 320 371 -1010 -129 303 -392 659 170 -1073 259 397 -371 534 862 -307 -480 -295 -612
1794 -612 1369 636 -786 -282 304 -444 -19 456 -647 -183 -243 -1187 165 583 -358 -2 831 62 -78
1813 -78 241 -424 822 918 -627 -515 344 -196 -25 623 -43 -128 25 -1050 436 1281 -184 -492 411
1832 411 -255 338 690 -249 172 737 -821 -995 365 -197 -383 -32 -237 -302 475 -367 463 1498 369
1851 369 -152 306 -198 -300 319 -454 -492 166 -895 -1118 494 241 -251 334 -470 -188 707 -135 36 1093
1871 1093 287 -800 320 134 406 993 -315 -715 345 -595 -1251 -70 -596 -549 -320 -803 57 1427
1889 1427 453 189 1386 1000 -29 407 137 -151 382 -862 -1779 -272 -606 -691 177 399 -528 -176 -348
1908 -348 0 1404 699 -598 218 359 -208 742 465 140 259 70 -794 -139 -196 -632 -43 -19 -668 -207
1928 -207 -224 -451 965 902 -234 -19 410 -71 426 586 -322 -156 -14 -625 435 718 -342 -256 -80 -733
1948 -733 -196 112 -437 465 535 -484 58 539 -34 460 613 -252 -349 -225 -1019 -249 388 -158 -152 80 -146
1969 -146 644 752 -35 93 641 -710 -662 -39 -475 -398 42 -734 9 540 -94 499 1116 -213 -284 14
1989 14 -461 -87 499 -273 -520 -69 -468 -71 559 100 -291 441 -715 -655 315 -406 -236 342 -257 -208 558
2010 558 156 199 1019 -79 -144 1 -533 -508 171 -367 -505 -189 -668 -301 568 320 -5 463 -185 -59 551
2031 551 17 -188 478 -178 -532 498 66 -337 504 -134 -487 -1 -258 -411 579 275 -297 410 -6 -216
2051 -216 557 446 -170 172 -477 -878 -26 414 -257 85 113 -263 201 259 -83 417 362 -327 -153 -349 -546
2072 -546 347 426 -212 247 -176 -86 233 266 -410 35 -101 -1050 -151 227 -306 366 454 -179 483 586 6
2093 6 365 363 -287 -33 -137 -600 65 166 -327 -70 -46 -319 206 572 -37 173 -82 -759 -83 477 -215 130
2115 130 235 -271 -179 331 -202 247 136 -610 -618 42 -359 -385 221 -51 -47 188 -50 358 571 -3 218 324
2137 324 -25 -107 150 -291 -24 18 -704 -601 162 -58 -12 335 -292 -70 94 -353 -15 645 76 -133 253
2158 253 -130 83 631 27 -20 -35 -468 -260 197 -16 -200 118 -99 -262 413 -65 -71 442 -175 -596 -3
2179 -3 7 67 225 -26 -48 227 -156 -527 381 185 -266 13 -220 -67 295 133 -2 136 -197 -364 170 169
2201 169 -35 172 -93 -360 193 -71 -357 461 235 -306 -45 -293 -141 469 208 -378 215 264 -393 74
2221 74 117 159 71 -269 -573 173 367 -345 -108 415 -184 -378 87 -159 374 370 -136 98 386 -303 -189 225
2243 225 176 151 -44 -652 -41 491 -252 -11 209 -378 -368 138 -112 204 479 -678 -2 590 21 -74 244
2264 244 -4 320 -147 -574 126 319 -165 -256 143 -304 -335 -213 -289 136 494 -355 -192 442 351 126 87 -120
2286 -120 165 81 -227 -70 429 -21 -386 -200 71 7 209 -166 -30 495 -103 -339 445 237 170 177 -11 138
2308 138 352 -92 73 370 46 -532 -521 -22 -69 -58 -471 -295 324 149 -108 568 440 40 165 -262 -223
2329 -223 226 -433 -516 42 -295 -269 -225 194 244 220 -157 -19 326 305 -43 261 423 59 -99 -243 -283 150
2351 150 -104 -384 112 -253 -294 -69 -77 29 337 8 -298 279 197 -38 331 310 -95 -73 -329 -248 325 49
2373 49 -503 -256 79 -298 38 8 -42 416 237 -466 167 428 16 170 -178 -19 70 146 -74 211 -67 -489
2395 -489 -583 32 69 64 135 -62 198 201 -56 312 256 -46 59 142 -233 -129 -11 -320 324 301 -186 -179 365 146
2419 146 158 103 -344 -150 143 -303 -156 14 -258 -121 -52 -153 298 331 -193 44 167 -308 -253 224 164 83
2441 83 -106 -155 -30 286 -216 -196 221 -12 -651 -207 -213 178 252 -282 -159 296 243 76 245 491 471 70 -161
2464 -161 -147 154 -218 -695 -34 -118 -244 -143 20 -86 88 120 96 231 252 -88 312 318 -13 6 -13 -105 282
2487 282 -84 -622 -202 -246 -266 -240 -171 -110 76 -234 -218 280 308 201 236 32 94 12 -264 -281 248 163 -473 -185
2511 -185 64 -26 119 0 -56 -154 80 -12 136 278 -113 437 261 230 291 168 46 208 174 -381 -126 86
2533 86 83 -55 -40 -181 318 340 -176 74 237 144 -11 -407 -218 -121 95 -397 -126 248 3 -185 59 206
2555 206 67 -53 -254 -72 -134 -103 -4 156 10 -185 5 17 50 -4 -200 -78 1 89 -291 260 -28 -121 133
2578 133 -174 -240 364 -42 -94 129 -181 -77 -180 -137 280 369 -197 -7 28 -331 -126 83 -133 85 -48 -50
2600 -50 82 504 -25 -132 127 177 -1 195 -215 35 133 76 -258 206 -12 -178 271 -58 135 152 -26 -50
2622 -50 181 -11 204 -93 76 -102 -7 -100 -51 68 82 -37 41 65 -33 -122 -95 -133 -53 14 -307 233 31 80 -17
2647 -17 20 -70 372 92 -164 235 -114 -123 299 11 304 47 73 -89 -177 -44 -133 -149 91 -259 -128 132 -36
2670 -36 -10 3 7 -72 140 126 187 131 2 -181 82 -173 -362 229 -11 -63 242 -136 -125 -191 48 -21 161 -141
2694 -141 -397 164 -94 146 35 -40 109 -187 -239 -139 254 142 -153 -157 -241 128 127 90 -255 -45 4 59 118 -55
2718 -55 172 43 -159 -27 118 -28 -149 239 -26 -94 -189 -130 -187 109 -146 -303 81 -71 27 -108 120 -26
2740 -26 57 -63 0 13 -92 -150 134 -93 -404 27 -37 -80 243 -41 48 285 -230 160 89 127 -110 276 177 -50
2764 -50 267 218 -241 149 252 120 205 117 141 -3 84 73 -93 -94 -72 100 132 -198 14 -131 -186 -19 8 125
2788 125 73 92 49 109 37 -11 68 -12 86 41 -113 32 171 -35 -165 26 104 57 -27 147 -111 -8 -169 15
2812 15 36 -63 -100 258 -33 24 290 269 -146 79 168 -242 82 277 -160 128 16 -46 -72 -183 40 79 279
2835 279 -140 119 153 59 -104 87 -46 -231 -239 -114 96 107 90 -234 5 168 46 -168 -142 -152 367 2 -144
2858 -144 130 -55 9 -46 17 -182 -36 -350 73 47 188 -36 188 13 -84 280 -31 107 -66 -78 -256 84
2880 84 82 -109 -8 -99 91 290 178 14 4 -87 -193 123 71 118 138 -67 -120 324 126 13 97 79 -205 71
2904 71 110 96 240 147 126 166 244 -148 132 -310 -96 62 -4 -193 -257 -84 16 68 183 8 -19 -43 -138 308
2928 308 254 -151 57 -17 55 -22 54 122 35 -61 -60 66 -153 -80 -210 -97 -289 62 -128 -167 -51 119 117 -8 -14
2953 -14 228 8 -76 -85 -31 -36 -159 -97 150 -7 66 -57 -66 -112 -49 -111 99 267 228 16 246 6 -156 95 -206
2978 -206 -98 37 -191 -363 -75 77 123 -106 -98 -109 -246 -154 -130 218 -72 143 -30 -165 -72 -160 -76 -125 -153 -24
3002 -24 -207 186 -125 -5 -126 -124 84 -77 -127 30 131 -158 -60 52 -34 -91 -34 99 35 351 -129 5 263
3025 263 78 5 -201 -74 65 187 -248 -18 48 18 13 -108 -61 230 113 0 -280 43 323 56 213 184
3047 184 188 57 152 -18 24 131 -254 224 71 39 -25 240 -38 -151 -183 0 61 200 129 119 -57 -103 -12 41
3071 41 20 98 188 -260 62 -132 -221 -25 -66 -144 -15 40 67 227 6 103 36 5 -74 182 80 -41 125 262
3095 262 -26 104 1 275 -121 219 49 -99 172 -117 90 91 -176 -76 -175 -152 174 -95 106 81 173 -30
3117 -30 -34 -35 28 157 263 -56 94 155 38 12 29 140 -62 24 -66 -66 -153 -20 -118 -170 286 -87 21 -344 50
3142 50 -85 -217 -59 -10 -36 177 163 -297 -31 79 270 55 -86 52 -169 -293 0 -118 -202 -238 160 318
3164 318 -164 -69 -22 188 1 132 -68 -201 95 -85 -115 -9 26 171 66 63 -140 -130 14 -286 -282 228 229 31
3188 31 138 -125 0 -96 197 -5 103 -162 -61 10 -102 0 55 -168 -22 46 142 44 137 207 45 -46 -26 13
3212 13 190 -126 -23 179 -171 203 51 -193 205 162 -58 -96 110 85 11 -104 -162 -118 111 57 8 -37 57 -224
3236 -224 -28 146 35 -37 30 196 218 -9 -337 -27 -6 -1 -92 7 93 -18 -167 146 -2 89 -87 167 -217
3259 -217 -106 167 115 -191 144 -112 -13 -57 -53 -227 65 -9 -152 -24 148 174 54 -108 -103 -12 188 -217 -33
3282 -33 21 -116 167 94 -295 186 84 121 152 -24 -11 316 144 48 131 14 -179 -120 -261 -206 29 51 -7 -81
3306 -81 -40 -104 148 -51 -307 -17 -114 -97 -78 -49 153 -16 52 -2 -111 -85 -84 -112 112 -127 18 147 74 211 171
3331 171 54 -22 -127 -1 100 -33 -93 227 -14 -69 206 136 37 -54 250 -60 -3 -61 -149 -174 239 -189 51
3354 51 -6 55 64 -48 81 42 54 -40 55 42 -54 -10 3 85 -61 -75 -304 -152 185 -126 -204 -34 -66 47 156 208
3380 208 -230 25 193 111 139 141 -17 102 -191 -27 108 -98 42 30 79 -13 93 9 -51 -150 65 45 153 93
3404 93 -114 -30 -31 -66 165 -212 -39 293 227 134 16 -50 97 162 -153 -288 -7 94 -51 -91 34 3 51 -98
3428 -98 -228 29 14 -215 237 89 -28 -11 -178 -211 208 -354 -201 150 -85 -255 -114 -119 143 17 -8 100
3450 100 108 -88 82 -5 120 -95 -101 58 47 138 -74 -140 -125 -55 -157 37 148 -220 4 70 -167 387 93 39
3474 39 -40 -201 -246 227 40 -117 174 -62 -81 185 86 -148 148 17 -97 -107 160 -53 122 408 -287 -27
3496 -27 43 190 -13 -57 -149 -115 -84 -195 199 28 -90 169 210 -72 249 209 47 -187 271 -80 42 292 -7
3519 -7 224 -51 -30 -143 -133 -34 -42 205 6 -130 -95 -146 -235 -43 -122 7 165 126 69 -88 198 -159 197 -171
3543 -171 -40 65 -94 -7 10 -70 -235 79 -61 -32 213 -139 -225 180 150 -21 -20 107 203 -13 149 -151 22
3566 22 -50 -162 96 197 -193 -66 4 -134 122 34 -33 86 123 20 92 121 -32 -99 -204 -84 66 169 -68
3589 -68 -125 -255 -64 -63 -92 84 111 -15 -173 -159 113 259 -76 -245 -140 -13 -120 -262 23 299 95 -144
3611 -144 241 -92 -94 48 -318 177 107 65 328 -20 -180 -13 145 62 221 -28 94 118 -99 49 -130 286
3633 286 -117 14 -23 -97 170 118 -177 54 80 -231 29 -50 -131 105 -49 -167 -84 183 -181 4 35 -15 -91
3656 -91 84 -245 -69 67 -192 35 49 -59 -117 -12 159 343 47 -152 90 231 -22 96 318 -12 -47
3677 -47 22 -107 -33 -171 -58 -37 339 -63 -58 -37 -151 110 -169 -348 -15 88 -116 -14 224 -280 -42 -37 -161
3700 -161 124 -2 246 -124 270 -149 -107 188 38 13 59 -160 -127 165 76 371 48 50 -56 252 23 -148
3722 -148 105 141 -126 61 185 -160 174 68 198 61 -53 -234 105 66 224 110 -171 -86 4 140 -131
3743 -131 -21 -55 -81 -32 61 79 20 -123 99 257 58 -32 -19 -127 -170 -223 -45 -94 23 -132 -98 172 198 16
3767 16 -17 95 -13 72 168 -188 -60 144 -7 27 -110 -27 264 68 30 -22 300 -94 255 -92 -71 93 53
3790 53 -3 -92 93 0 20 95 -90 -66 24 91 -43 -12 -71 -16 228 -119 -121 80 -169 -23 264 -70 27 4 -29 -115
3816 -115 250 143 166 -9 -250 -61 242 100 -200 12 -17 -264 124 6 -156 1 -15 -106 -4 121 -260
3837 -260 -50 143 36 -190 91 47 23 -149 -20 21 139 -134 -59 64 -354 357 169 100 48 -146 -20 170
3859 170 9 -189 278 -255 -69 305 -150 272 130 -21 70 118 88 62 314 -71 22 127 164 -131 98 -57
3881 -57 -87 55 -72 75 70 47 -116 221 13 25 3 -237 2 -104 54 -203 86 81 -131 -75 -149 -222 -122 19
3905 19 -200 -39 40 -95 103 -208 -252 110 -53 -214 7 44 -277 202 153 42 210 -55 107 104 259 -27
3927 -27 6 34 93 122 253 -102 -115 91 -180 35 -218 43 16 -93 -291 71 -16 193 78 -54 -53 -121 -68 35
3951 35 -63 64 57 71 122 48 74 30 -41 105 277 -205 -238 255 -248 185 90 -38 -28 145 -205 93 86 -124 -51
3976 -51 -135 -37 -16 60 -30 138 -245 -226 -26 -19 -75 -77 87 14 -128 122 -291 -152 50 -73 -72 -61 -159 174 -17 -126
4002 -126 235 -112 -123 -17 101 107 -9 -3 124 96 243 225 57 218 -75 -108 -259 -187 -51 206 -21 -57 291
4025 291 -12 33 36 -38 -226 104 81 -122 26 -202 130 196 -104 -143 109 -47 24 -26 -155 -197 -84 -177 -299 210
4049 210 -91 -114 155 33 -216 78 109 -9 119 -16 -70 76 69 -181 110 168 -68 7 -71 -171 8 -34 -389
4072 -389 -130 5 42 141 -3 -325 60 -18 -47 352 -106 122 179 46 31 15 147 -214 -110 -193 -358 -3 57
4095 57 -90 19 -49 -224 -55 -74 -37 219 -8 -146 29 -116 -94 62 39 37 219 238 143 155 54 97 147 235 -190
4120 -190 82 146 -409 -193 43 -131 -46 -386 -287 269 214 -63 -29 191 -124 -98 -157 253 -60 30 -61 16 -103
4143 -103 52 60 -58 -232 -56 130 -35 -38 62 -141 -198 100 94 -55 -19 -74 -198 -201 -102 85 66 -141 114 280
4167 280 87 69 74 207 -82 77 22 16 229 113 -14 -129 -95 -135 83 246 80 118 13 -64 -40 66 23 -9
4191 -9 -208 -99 48 -81 -87 -3 116 -35 34 15 0 170 10 -157 104 -202 -28 98 157 181 -52 -19 -78 -42
4215 -42 -130 -212 6 60 2 -57 -96 -53 167 99 0 105 67 -145 88 -84 88 246 41 -15 -79 -109 -67 39 32 -8
4241 -8 23 237 -61 126 -198 49 -235 -207 29 36 -129 -9 62 -151 -224 289 196 -127 30 37 -46 -31 126 -106
4265 -106 108 121 13 -352 -91 -187 346 -16 -95 -106 -168 94 83 -27 253 85 83 -218 40 207 124 37 126 49
4289 49 58 243 175 174 -7 228 -139 -34 190 7 201 40 -116 83 79 15 313 -232 81 68 -126 -220 8 -124
4313 -124 177 288 -326 110 157 253 -41 46 -234 49 -19 -33 327 126 130 136 -30 -246 215 126 169 84 133 -144
4337 -144 -112 137 -133 -107 182 -116 -49 -48 -44 11 144 -164 41 78 85 -116 97 167 -135 107 -197 0 199 21
4361 21 105 179 -151 -126 120 109 -40 123 78 -203 0 -81 254 -99 176 78 92 -76 -77 -52 -138 186 93 178 125
4386 125 -172 244 -34 -238 40 -165 2 101 -11 1 -188 -101 -10 20 209 -171 43 250 47 -41 -71 -76 38
4409 38 -41 -5 8 -365 -61 204 -75 -84 99 -77 153 40 120 -84 -24 -155 251 26 -65 -247 -188 -235 -44 -76
4433 -76 -89 197 99 33 -223 162 202 18 -68 11 172 28 -8 28 105 -50 37 483 -110 -30 229 -27 143 184
4457 184 -7 -150 -14 -112 126 199 -106 94 30 154 -202 246 -36 -278 -122 -178 -61 81 -60 14 29 -288
4479 -288 -187 -81 119 -64 161 -79 -173 48 -185 -272 167 2 -122 -175 37 68 225 236 16 134 -14 117
4501 117 -98 -48 41 -16 108 -244 -152 -141 86 30 83 72 -97 70 82 182 -175 -64 -39 129 -192 -52 16 71
4525 71 -38 116 123 50 150 -345 125 -116 33 27 137 -82 110 -30 12 221 -202 38 151 -155 -153 146 -53
4548 -53 117 -85 -98 -60 -54 110 -98 191 75 -46 257 -30 157 -71 -27 -34 136 -86 6 -192 -136 -12 -219
4571 -219 380 119 -206 170 -84 -269 -80 -78 158 70 -120 238 45 -187 -200 -110 -100 -194 27 52 60 143 -103 -105
4595 -105 114 84 106 196 111 164 -113 0 15 28 194 -35 213 131 -57 112 55 17 5 -134 257 169 -43 53
4619 53 -158 -65 85 -93 169 -22 86 243 -63 124 67 228 -135 46 -56 -8 -22 -146 22 -76 -309 -99
4641 -99 113 131 226 -9 -70 2 -172 5 143 166 86 -223 19 -57 48 10 -20 -21 -38 -156 129 -180 193 232 174
4666 174 127 -158 206 -63 142 16 269 -75 84 -330 39 -135 280 -121 -77 45 208 36 13 342 -198
4687 -198 220 54 1 -68 40 3 -24 -145 -33 243 8 223 23 -4 233 -40 -134 -104 -370 35 -17 -132 35
4710 35 -122 -25 36 -105 30 -37 -92 -65 188 48 -223 -182 -184 61 162 -8 -187 232 148 -69 -74 109 -28 -45
4734 -45 -189 96 126 102 108 38 128 -20 -22 -411 24 14 166 -25 117 94 113 4 282 -185 -86 2 -279 24 -168
4759 -168 38 -61 -120 146 -100 60 -17 -89 14 -71 -108 74 48 -96 80 -92 251 15 -56 -165 85 -65 -276
4782 -276 72 159 42 -205 120 210 -166 -102 -98 171 -115 104 292 178 -130 36 6 -146 -60 10 -33 137 -123
4805 -123 -120 227 71 -166 235 -96 -53 139 -133 -33 -76 92 60 176 176 -37 -18 -77 193 -48 -295 -106 10
4828 10 -106 -148 -48 -36 -101 291 131 206 -4 24 -82 16 37 -57 125 19 130 -241 24 -112 -184 393 -6
4851 -6 360 55 -121 29 142 -40 89 164 -26 -55 43 -122 -96 48 -30 -118 64 237 -3 33 -46 -77 10 52
4875 52 206 180 199 78 53 69 183 73 73 -45 -108 51 -35 -59 32 -132 -44 98 111 -48 47 217 -102 -121 -139
4900 -139 -173 -38 -33 -84 118 448 62 -105 38 74 -145 -104 -39 76 -216 224 63 -71 -155 -8 242 153 23
4923 23 54 90 -135 69 -84 52 112 243 113 -98 212 -122 -3 -159 26 41 118 52 21 49 15 119 249
4946 249 183 -151 152 23 54 -48 -119 -129 45 -155 132 150 109 -178 -108 -188 -114 183 285 -225 11 -156 -250
4969 -250 -81 -15 -8 -254 -228 89 -106 -47 -5 -123 -38 -60 -25 -129 -44 -126 37 90 181 169 -94 218 23 130 195
4994 195 -86 116 -97 62 -74 -118 -48 52 -165 189 -99 -7 -150 -202 -108 -25 -7 -47 280 159 -122 -70 -105
5017 -105 -57 134 86 -164 -170 89 -133 109 87 -43 -53 -211 -56 -113 134 -78 289 -10 -51 -31 -37 -133 192 -143
5041 -143 84 172 -29 107 207 93 47 -173 -169 128 138 -461 -162 84 -97 -85 -130 -220 39 -126 -154 -112 169
5064 169 164 -208 -69 -19 -49 -306 68 180 -19 70 -30 161 -99 -94 -127 -230 98 -60 -176 2 9 165 -110
5087 -110 12 -124 -92 10 19 -102 77 40 -134 -156 155 68 130 -162 120 -74 -269 262 -50 274 -74 -134 -10
5110 -10 -161 20 160 -21 71 -42 -186 69 17 -16 -66 40 -88 179 -28 19 140 -22 18 -94 5 -88 -29
5133 -29 195 -351 80 264 -43 -138 -26 -14 15 -84 -161 102 28 58 -97 -59 -321 46 -53 -42 -23 46 16 -8 61
5158 61 -75 -91 -149 -115 -105 -165 11 30 -6 154 295 26 107 64 23 32 -116 171 -77 -104 152 -28 -200 81 -91
5183 -91 -275 100 -79 -157 -2 109 35 -110 102 95 172 200 263 -41 -187 118 -137 -114 -78 89 64 19 107 -44
5207 -44 56 195 156 184 -229 -201 -56 63 54 30 117 -171 -161 103 77 43 386 49 65 -27 -32 58 120 -156 -116 55
5233 55 -31 100 131 142 -74 -129 -58 48 -120 186 -133 -117 -22 71 48 -293 92 170 212 -303 103 173 0 62 -320
5258 -320 -158 -2 50 29 -59 100 66 -10 103 172 -3 177 27 8 56 -167 25 -167 101 -5 -61 -65 -129 96
5282 96 -5 -111 143 -10 -101 33 15 155 87 230 20 124 -140 -162 -98 -209 45 -80 -215 -49 66 101
5304 101 2 144 -89 19 -16 -103 28 227 -110 38 -126 -33 47 168 254 -65 -111 121 215 115 -134 -77 -55
5327 -55 -51 -12 189 12 -10 150 -142 135 12 49 15 133 -167 197 -141 206 152 187 47 36 213 -167 47
5350 47 -50 -189 14 -62 -150 219 247 -105 -48 219 -194 -187 -85 -151 81 88 -26 228 172 -55 -290 91 -111 131
5374 131 153 55 0 -63 103 -173 83 -444 -96 42 -179 -51 139 -228 -178 129 -38 -134 -177 -49 60 -67
5396 -67 -4 -133 265 -132 -109 -275 -240 11 27 -4 17 -29 50 211 44 -3 184 53 -166 -29 -149 -44 -66 -160
5420 -160 -62 16 -59 -31 14 -242 -44 -40 140 -316 -281 -113 2 -75 39 22 52 262 66 -46 36 -31 -199 -133 -3
5445 -3 -95 234 304 -116 119 -104 119 113 -8 -72 -28 259 -123 -35 -117 -223 50 54 -88 208 185 122 115 -171 142
5470 142 -37 231 -77 0 92 -96 44 124 29 22 -63 8 -137 250 73 82 -207 108 228 -3 114 -79 46
5493 46 169 -13 108 -46 175 -40 -35 -148 -154 180 187 190 -62 -222 281 160 108 58 87 167 -224 -86 -21 206 -136
5518 -136 -203 55 96 -154 -107 38 -161 -5 -80 -85 123 -72 -77 130 -98 -20 -154 136 -75 -180 32 165 -182
5541 -182 175 45 37 -40 11 94 -148 -97 -77 77 -53 39 7 32 -61 122 17 170 -99 91 195 186 -111 -170 -133
5566 -133 55 -229 -243 6 24 234 -14 -13 109 -248 -212 154 -115 -108 -166 192 -2 88 20 -216 195 -20 -3 131
5590 131 -211 -51 185 -67 -22 248 -16 134 50 44 115 -103 -83 -14 -151 -69 6 -114 198 -173 32 128 -100
5613 -100 54 -208 -214 -9 148 193 -2 -169 22 -301 81 -23 203 -120 103 -46 27 82 155 -130 -289 -29
5635 -29 41 50 -46 51 -71 9 -6 120 -111 -45 -29 184 -292 -35 -113 -53 86 95 89 20 128 -121 -63 190 -124 -280
5661 -280 -66 -69 -249 56 77 -204 -14 53 -300 -24 -8 -31 49 -133 98 -84 257 90 -342 26 12 73 72 -165
5685 -165 85 328 263 42 39 -101 126 120 -52 184 182 -131 -80 195 -50 -13 142 83 -230 -9 28 84 -241 -68
5709 -68 -145 -136 -26 205 -13 -69 -66 -171 43 -19 -74 -180 11 -23 -109 -29 146 218 58 41 10 80 154 161 -231 18
5735 18 64 -108 -113 -180 135 109 0 -191 192 -14 -173 9 -139 8 -81 -94 80 -233 9 -26 131 287 -1
5758 -1 25 -63 -66 -208 -35 -71 329 156 82 -29 -32 2 162 109 58 26 -35 170 18 44 -175 200 114 7 154 -29
5784 -29 -95 -304 -73 9 15 -180 -105 184 -99 18 73 -62 11 -3 126 -85 200 -43 -293 -28 -197 165 65
5807 65 112 282 -7 -10 -57 -136 -240 -78 -119 -21 148 53 -78 -154 92 287 5 -118 -33 -124 -169 -169 -35 137 8
5832 8 174 100 -2 35 68 -176 -6 -152 110 -92 11 285 89 231 -240 -19 -34 -12 -155 53 -57 -164
5854 -164 -19 -152 -124 145 -23 363 80 117 -73 217 -144 24 209 -56 113 135 -171 -7 -84 -153 -150 100
5876 100 -33 218 -53 -177 248 -143 109 -130 -94 271 -172 227 145 -96 93 268 -17 -59 -16 4 45 174
5898 174 80 24 40 18 -63 -341 11 136 -88 -138 42 109 139 -93 186 -63 45 208 -121 173 31 -52 -17
5921 -17 141 5 -41 -152 -242 45 -61 -363 -27 290 -43 40 -159 183 -187 -214 288 -103 92 -242 117 -147
5943 -147 48 65 233 190 -206 84 -189 71 254 -61 -354 65 -60 -63 -133 -53 86 47 -43 14 44 -53 -148 -43
5967 -43 -54 -152 29 94 -114 192 223 -19 -62 -70 -181 -45 64 44 -65 20 -45 -279 -203 -7 211 -39 216 -43
5991 -43 -195 -172 22 -9 140 100 -41 8 -49 52 43 -38 -3 -111 -72 -56 41 48 33 60 -60 -46 20 -86 20 114 -85
6018 -85 -6 -80 7 42 61 -8 -55 -13 89 -41 3 71 74 -23 -49 175 235 -65 96 39 -56 -74 147 126 108 -109 138
6045 138 59 -172 25 -225 -16 -73 19 -125 -96 155 -200 -24 130 164 339 53 154 255 161 61 -338 -150
6067 -150 44 5 30 -133 -263 301 87 114 -48 -4 113 -23 -177 -216 154 -30 44 186 -69 -10 -28 -41 153
6090 153 33 172 -147 -42 -27 29 22 -33 13 119 -23 42 134 -119 -73 -144 112 -22 67 -74 -144 78 114 -113
6114 -113 191 -30 18 190 239 -170 104 79 -162 226 162 112 -90 90 164 -15 221 267 49 -147 -93 -95 134
6137 134 -85 249 -41 -114 54 -129 -239 18 3 -141 237 24 -172 -61 70 -45 -79 -184 27 -14 -225
6158 -225 90 210 -100 -105 152 -21 14 109 106 -42 -77 -5 -152 1 39 186 16 210 110 146 206 -51 216 -132
6182 -132 -92 -56 61 130 73 50 -88 -134 87 -166 232 144 -142 96 73 165 32 41 31 -176 -307 -163 192 -71
6206 -71 -64 232 -32 -128 -317 -248 304 66 24 -13 60 -19 100 -112 -129 -412 -148 -97 -88 162 68 28 5 136 -173
6231 -173 169 125 121 41 28 176 -27 59 -153 229 -74 101 -134 -6 -41 42 189 102 -114 82 -177 10 97
6254 97 22 -4 -56 199 -90 -114 23 -112 -132 -224 -175 59 -213 169 130 -52 42 186 -11 35 9 -50 -40 83 -75
6279 -75 -6 12 91 -100 -48 -4 -295 117 243 -105 32 -168 124 13 -71 -125 -116 -142 -191 -130 -177 -7 73 163 -102
6304 -102 20 -40 -100 204 -106 -155 -39 -60 105 179 165 -35 -276 65 -429 120 70 -160 16 -145 -102 -27 -8
6327 -8 5 10 -45 8 -96 100 333 145 -10 185 -177 -157 -136 45 -113 -259 -99 154 49 63 276 -212 57
6350 57 235 52 -267 -185 -41 -95 210 -26 -120 -32 58 36 151 -138 -19 -98 24 -10 111 89 -10 245 172 -117
6374 -117 14 13 179 118 27 1 195 130 -35 79 -201 27 -22 -112 -38 -49 -16 -299 -34 63 -76 -36 33 -38 -3
6399 -3 23 107 -69 -101 74 22 -101 -88 41 -46 -94 88 -333 130 201 -70 91 -82 -9 -239 -128 -169 -18 -53
6423 -53 -228 -23 46 158 -152 124 -220 55 -159 187 46 -102 -146 -13 -41 -154 -43 -193 34 51 46 183
6445 183 65 -71 -21 75 -12 -125 -23 227 -2 114 -38 -49 -101 6 73 -222 -19 -139 -70 -50 -115 -258 -150
6468 -150 123 -10 -38 -38 -79 190 76 -83 78 214 126 2 30 -91 -10 13 -45 13 42 -200 -11 -165 55 4
6492 4 -68 -250 -70 -58 -161 46 93 192 63 194 69 179 138 -150 -7 -68 -41 181 45 101 132 -146 -54 -18
6516 -18 6 -7 -220 -32 -254 -39 -18 -69 -222 161 -98 79 31 215 -149 -49 74 -148 116 16 94 -244
6538 -244 -27 222 73 -62 -181 -46 -178 -110 18 -55 -169 -44 -71 173 10 -88 -209 -8 126 -5 -47 -278
6560 -278 -5 127 115 -169 102 232 -333 -231 39 -117 118 41 121 5 -327 -106 30 6 149 -178 9
6581 9 223 60 -3 -14 -69 -108 71 -59 -43 -40 -25 73 -107 -83 7 -193 76 73 -299 -15 -2 -20 -28 106 -22 320
6607 320 69 -6 -191 -14 -250 89 -142 190 -87 -18 86 60 -39 -162 88 48 74 24 33 -104 85 -25 -27 165
6631 165 -219 -98 34 -13 -7 208 -3 -22 -6 -107 -225 296 -153 76 14 -270 -23 176 42 74 -81 131
6653 131 137 -40 72 -54 73 -22 -27 140 64 -29 151 -50 -228 -172 143 2 86 -49 21 180 77 42 -129 -77
6677 -77 -95 -100 214 55 -48 148 19 -209 26 29 65 61 -110 -150 -219 -17 -255 91 -163 -76 59 -79 -72 24 -116
6702 -116 40 -35 168 84 -103 -158 116 109 46 282 -160 5 -41 217 34 -77 113 -55 13 -147 -110 205 187
6725 187 -214 167 144 127 -35 101 -195 -337 92 -81 -179 -31 -40 159 95 80 -3 -77 -93 -322 119 -160 -123 170
6749 170 126 -4 -2 -19 -205 -98 -202 272 -58 104 -16 -152 174 -4 28 -90 0 73 302 179 -101 -176 -82
6772 -82 -56 80 0 155 51 -29 -254 -61 -85 85 276 -33 38 338 53 39 -150 125 -173 -70 178 -121
6794 -121 4 28 -12 -116 106 -84 -65 -6 28 184 117 236 -18 -143 339 -3 6 91 110 181 -64 -36 36 -63 4
6819 4 -90 288 -124 -124 48 235 -69 117 68 -204 321 204 53 16 -28 161 2 -30 -24 -234 136 -126 1 -17
6843 -17 39 47 62 -136 -86 -67 -42 -26 120 -58 205 240 -70 -40 99 102 -80 143 131 -46 76 -121 -146 148 -56
6868 -56 -62 127 -126 -156 -109 -293 71 120 57 -54 146 93 -83 36 63 35 -46 -18 149 48 -139 -80 352 142
6892 142 116 56 93 69 -1 108 59 -35 28 -110 -94 248 113 -37 -288 -117 96 -22 -142 -67 20 99 325 -138
6916 -138 48 -79 -88 -166 -99 -148 -142 251 35 87 96 -7 -34 -107 -114 -357 -121 20 -170 124 44 3 -115 -95 -175 233
6942 233 -59 -20 82 -7 -28 60 82 -86 196 206 -61 13 155 134 63 191 116 109 -58 -187 -139 -54 114 328 -2
6967 -2 14 -128 -107 -5 -169 -22 -75 22 59 -165 166 -105 -105 -198 -220 193 -151 -16 6 -69 202 -116 -76 -15 -64
6992 -64 -119 73 -119 189 -25 316 146 144 83 206 121 4 -10 43 123 69 117 18 178 117 185 -36 2 -28 -33 193
7018 193 -265 19 69 -174 -268 112 -93 68 99 -61 -25 -15 151 -137 -149 -75 -65 143 186 -3 272 38 -30
7041 -30 225 96 -117 101 -167 -12 28 -86 212 175 42 109 -28 114 -296 -32 35 -155 247 -188 -28 -65
7063 -65 -52 134 -300 83 -87 236 7 10 -18 -3 -61 -278 -143 -205 35 78 14 119 158 -49 131 151 -128 -146
7087 -146 16 -111 179 332 -90 -5 92 -76 92 -198 -99 241 87 25 114 -42 -5 65 -167 -117 1 180 -50
7110 -50 -190 -92 -68 17 -144 -14 -47 189 -201 -17 -110 -171 189 13 8 81 -29 -297 132 276 21 131 123 -303
7134 -303 59 72 -67 -18 170 185 235 -33 93 57 98 49 -12 -18 46 -216 -48 -182 162 -206 71 29 -186 -126
7158 -126 -239 -34 150 80 -164 -21 4 83 -200 -93 94 -193 54 200 -17 117 63 15 -5 -3 8 -84 16
7181 16 -258 113 109 -335 -114 215 82 108 36 13 46 -26 31 -153 -98 -61 -18 115 -81 -161 34 -110 -146 -112 130
7206 130 -132 6 103 -30 -143 -159 132 27 -169 -31 170 -229 107 -7 149 289 310 -75 337 62 -15
7227 -15 -146 163 26 197 175 -208 4 -15 82 108 75 53 -139 -208 -29 -83 -121 62 -222 -142 -16 247 31 64
7251 64 -46 191 63 -96 68 68 -195 -53 -10 -401 -101 51 63 -149 9 -26 74 21 70 -41 -86 18 -8
7274 -8 -46 183 44 -85 72 19 49 -42 81 56 61 -209 -157 -165 61 -44 -114 234 -102 6 62 155 12 225 -146
7299 -146 -80 -63 75 113 -17 90 -87 -55 -111 -133 4 -180 -39 -38 -19 120 63 -207 -117 -74 -101 87 12 -83 -73
7324 -73 17 105 152 -127 112 -137 50 63 69 -100 -40 216 218 136 -49 145 114 -76 147 119 -170 245 65 -84
7348 -84 35 -110 308 196 223 -132 -117 118 -195 -47 -166 -11 -95 112 -20 135 -125 15 102 23 -142 -97
7370 -97 243 126 113 -61 207 -51 198 -42 142 194 -188 358 -132 -78 -166 -279 -2 -188 -121 -73 10 156 262
7393 262 -106 168 -86 -31 -72 166 173 -44 21 -272 95 -57 130 35 -123 -228 307 152 55 -63 6 10 148
7416 148 -91 -139 207 9 -40 122 80 1 86 -72 -29 -5 -102 -176 211 353 21 89 216 92 56 3 -89 98
7440 98 110 11 131 171 -158 28 263 -156 51 -7 -200 30 -7 -134 65 44 -75 -251 -98 -31 126 10 -25
7463 -25 -11 -109 -99 91 -115 -23 -91 30 225 38 -73 8 224 -36 103 -18 203 -165 -161 110 157 42 168
7486 168 305 -69 4 -199 -21 -37 -219 -42 -40 -166 216 92 -227 47 -55 50 -64 159 2 -69 11 106
7508 106 18 -105 -259 78 113 -184 -53 7 -21 -14 -6 -130 -36 353 28 -41 185 3 62 -27 -195 51 276 -151
7532 -151 -38 284 -21 -307 -13 -162 -223 93 40 -226 -75 -19 13 65 261 200 131 46 -245 16 -146 54 49
7555 49 13 -217 61 91 -66 19 107 -27 -91 237 96 41 -154 50 -31 24 -29 -171 129 164 -120 -106 146 107
7579 107 -48 -20 -55 104 -92 129 -17 -180 -179 139 75 -48 -231 -193 -111 232 30 -17 151 48 115 -10 -452
7602 -452 60 -152 -33 37 -108 -106 36 -149 112 31 67 107 -215 76 159 202 43 -165 116 -49 -16 146 81
7625 81 -44 67 146 -126 121 83 -30 27 -20 -155 197 184 12 -2 15 65 -32 169 169 -145 305 85 33 278
7649 278 -142 -15 52 48 29 -1 209 290 -180 -204 91 -3 96 -189 -80 -5 214 78 123 -64 181 -219 173 -78
7673 -78 15 217 -203 3 -121 238 -19 -158 50 339 -147 -117 -123 136 79 -224 -90 72 -105 271 86 -52
7695 -52 38 -15 -15 18 0 88 -30 -51 -124 13 89 77 -55 108 -3 -68 -18 -249 -109 91 -8 -96 -200 -15 -39 -119
7721 -119 -161 135 -13 147 64 188 61 106 40 1 42 -60 -147 271 112 221 221 59 -79 245 -1 -10 -93 12
7745 12 -308 -119 -147 -158 -99 -198 65 -48 17 -57 -220 1 -96 94 31 96 -152 21 102 94 -26 -96 -76 66 106
7770 106 -51 143 -281 -20 215 -116 -26 -81 5 -117 131 85 -130 -46 9 -11 168 171 -327 1 -248 -65 78
7793 78 -177 -1 -28 -144 -45 169 -105 4 -39 -60 -160 -16 250 6 -106 -84 159 86 62 7 -73 306 -232
7816 -232 -110 -71 -228 -72 163 9 27 -21 -66 209 -104 -39 164 66 207 169 259 -64 -161 -162 -151 -70 109 96 -107
7841 -107 -98 -233 29 -23 116 50 -94 -140 -277 104 -205 229 176 -10 -118 21 -2 -153 -207 24 -72 262 37
7864 37 48 17 -84 -124 -110 165 -113 137 78 46 34 -135 -376 86 70 -21 190 -198 -27 111 -211 145 -23
7887 -23 -68 -101 9 67 -274 201 -45 -112 -19 -71 -253 -240 40 -38 270 336 -121 131 -4 47 227 155 331 -172
7911 -172 1 -149 110 20 195 -46 -154 -81 -136 33 -21 208 124 -40 -127 -22 -151 194 -81 102 -93 224
7933 224 -56 164 -195 -229 -174 -6 -229 -90 -77 -143 -96 -92 15 154 52 -62 -16 -173 -43 219 98 58 -61
7956 -61 -101 -188 143 87 -70 20 34 185 3 -269 48 138 -121 99 108 -21 36 24 -33 -138 -8 -1 4 -176 -28
7981 -28 107 -135 167 -127 -176 39 298 -155 -84 58 67 -36 -159 -12 -185 44 81 -57 -118 360 4 -33 -37
8004 -37 20 -40 9 -126 139 146 -337 69 -162 235 -9 -128 -8 44 192 135 -179 90 64 -324 -204 -127 -13
8027 -13 -158 -123 -100 231 -113 -111 -361 111 -244 -34 81 -113 -24 -94 71 -75 48 60 -48 169 -16 70 -90
8050 -90 150 -54 -150 81 86 131 183 -139 -38 147 -194 75 23 -109 -44 22 -109 85 46 68 65 108 -184 -41 -33
8075 -33 -45 -175 45 -74 55 -35 68 5 87 129 270 106 -77 -73 19 -103 42 -58 93 -2 90 -69 296 -92
8099 -92 -168 -147 -179 -145 -140 60 -129 -1 198 -93 -266 264 -13 35 -10 -61 -76 182 77 -74 127 -210 -123 -111
8123 -111 12 -79 -24 -8 -26 135 128 -66 61 -212 -72 43 -108 220 71 -236 81 298 13 19 50 9 65 268
8147 268 10 -78 72 -91 -310 90 -189 -112 -228 -44 -168 -20 107 -419 147 -36 145 -71 -253 -47 23
8168 23 -11 24 -20 -172 -41 4 -224 94 -155 -327 278 -58 106 -169 -107 -48 4 95 -124 -16 156 -79 79
8191G9
##END NTUPLES=NMR FID
##END=
