##TITLE=1H_CA-8532
 CDCl3, 8 sc, 
 16.1.2019
##JCAMPDX= 6.0         $$ Bruker NMR JCAMP-DX V2.0
##DATA TYPE= NMR FID
##DATA CLASS= NTUPLES
##ORIGIN= UXNMR, Bruker Analytische Messtechnik GmbH
##OWNER= root
$$ XWIN-NMR		Version 3.5
$$ Wed Jan 16 15:07:07 2019 Russian Standard Time (UT+4h)  she@DPX200
##.OBSERVE FREQUENCY= 200.1313
##.OBSERVE NUCLEUS= ^1H
##.DELAY= (6, 6)
##.ACQUISITION MODE= SIMULTANEOUS
##.ACQUISITION SCHEME= undefined
##.AVERAGES= 8
##.DIGITISER RES= 18
##SPECTROMETER/DATA SYSTEM= spect
##.PULSE SEQUENCE= zg30
##.SOLVENT NAME= CDCl3
##.SHIFT REFERENCE= (INTERNAL, CDCl3, 0, 15.7039)
##AUDIT TRAIL= $$ (NUMBER, WHEN, WHO, WHERE, WHAT)
$$ ##TITLE= Audit trail, XWIN-NMR		Version 3.5
$$ ##JCAMPDX= 5.01
$$ ##ORIGIN= Bruker BioSpin GmbH
$$ ##OWNER= she
$$ F:/spectra/data/she/nmr/H-F/1/audita.txt
$$ ##AUDIT TRAIL=  $$ (NUMBER, WHEN, WHO, WHERE, WHAT)
(   1,<2019-01-16 15:05:53.95 +0400>,<she>,<DPX200>,
      <created by zg, POWCHK disabled, PULCHK disabled
       configuration hash MD5:
       00 E9 B6 7A A2 85 ED C7 34 08 36 98 17 FE 4E 26
       data hash MD5: 16K
       D9 1E 45 A6 11 17 81 01 13 09 D5 EC 37 9F BE 22>)
$$ ##END=
$$ 
$$ hash MD5
$$ 9D 34 82 92 72 16 93 F2 C5 CE C5 B4 AC 7F 05 EB
##$RELAX= 
##$RELAX= 
##$RELAX= 
##$RELAX= 
##$RELAX= 
##$RELAX= 
$$ Bruker specific parameters
$$ --------------------------
##$DU= <F:/spectra>
##$EXPNO= 1
##$NAME= <H-F>
##$PROCNO= 1
##$TYPE= <nmr>
##$USER= <she>
##$AMP= (0..31)
100 100 100 100 100 100 100 100 100 100 100 100 100 100 100 100 100 100 
100 100 100 100 100 100 100 100 100 100 100 100 100 100 
##$AQSEQ= 0
##$AQ_mod= 1
##$AUNM= <au_zg>
##$AUTOPOS= <>
##$BF1= 200.13
##$BF2= 200.13
##$BF3= 200.13
##$BF4= 200.13
##$BF5= 200.13
##$BF6= 200.13
##$BF7= 200.13
##$BF8= 200.13
##$BYTORDA= 1
##$CFDGTYP= 0
##$CFRGTYP= 5
##$CHEMSTR= <none>
##$CNST= (0..31)
1 1 145 1 1 1 1 1 1 1 1 1 1 1 1 1 1 1 1 1 1 1 1 1 1 1 1 1 1 1 1 1 
##$CPDPRG= <>
##$CPDPRG1= <>
##$CPDPRG2= <>
##$CPDPRG3= <>
##$CPDPRG4= <mlev>
##$CPDPRG5= <mlev>
##$CPDPRG6= <mlev>
##$CPDPRG7= <mlev>
##$CPDPRG8= <mlev>
##$CPDPRGB= <>
##$CPDPRGT= <>
##$D= (0..31)
0 1.2 0 0 0 0 0 0 0 0 0 0.03 0 0 0 0 0 0 0 0 0 0 0 0 0 0 0 0 0 0 0 0 
##$DATE= 1547636753
##$DBL= (0..7)
120 120 120 120 120 120 120 120 
##$DBP= (0..7)
150 150 150 150 150 150 150 150 
##$DBP07= 0
##$DBPNAM0= <>
##$DBPNAM1= <>
##$DBPNAM2= <>
##$DBPNAM3= <>
##$DBPNAM4= <>
##$DBPNAM5= <>
##$DBPNAM6= <>
##$DBPNAM7= <>
##$DBPOAL= (0..7)
0.5 0.5 0.5 0.5 0.5 0.5 0.5 0.5 
##$DBPOFFS= (0..7)
0 0 0 0 0 0 0 0 
##$DE= 6
##$DECBNUC= <off>
##$DECIM= 32
##$DECNUC= <off>
##$DECSTAT= 4
##$DIGMOD= 1
##$DIGTYP= 9
##$DL= (0..7)
0 120 120 120 120 120 120 120 
##$DP= (0..7)
150 150 150 150 150 150 150 150 
##$DP07= 0
##$DPNAME0= <>
##$DPNAME1= <>
##$DPNAME2= <>
##$DPNAME3= <>
##$DPNAME4= <>
##$DPNAME5= <>
##$DPNAME6= <>
##$DPNAME7= <>
##$DPOAL= (0..7)
0.5 0.5 0.5 0.5 0.5 0.5 0.5 0.5 
##$DPOFFS= (0..7)
0 0 0 0 0 0 0 0 
##$DQDMODE= 0
##$DR= 18
##$DS= 0
##$DSLIST= <SSSSSSSSSSSSSSS>
##$DSPFIRM= 0
$$ [...]
##$SUBNAM2= <"">
##$SUBNAM3= <"">
##$SUBNAM4= <"">
##$SUBNAM5= <"">
##$SUBNAM6= <"">
##$SUBNAM7= <"">
##$SUBNAM8= <"">
##$SUBNAM9= <"">
##$SW= 20.0189088683792
##$SWIBOX= (0..15)
0 0 2 0 0 0 0 0 0 0 0 0 0 0 0 0 
##$SW_h= 4006.41025641026
##$TD= 16384
##$TD0= 1
##$TE= 0
##$TE2= 300
##$TE3= 300
##$TEG= 300
##$TL= (0..7)
0 120 120 120 120 120 120 120 
##$TP= (0..7)
150 150 150 150 150 150 150 150 
##$TP07= 0
##$TPNAME0= <>
##$TPNAME1= <>
##$TPNAME2= <>
##$TPNAME3= <>
##$TPNAME4= <>
##$TPNAME5= <>
##$TPNAME6= <>
##$TPNAME7= <>
##$TPOAL= (0..7)
0.5 0.5 0.5 0.5 0.5 0.5 0.5 0.5 
##$TPOFFS= (0..7)
0 0 0 0 0 0 0 0 
##$TUNHIN= 0
##$TUNHOUT= 0
##$TUNXOUT= 0
##$USERA1= <user>
##$USERA2= <user>
##$USERA3= <user>
##$USERA4= <user>
##$USERA5= <user>
##$V9= 5
##$VALIST= <valist>
##$VCLIST= <CCCCCCCCCCCCCCC>
##$VD= 0
##$VDLIST= <DDDDDDDDDDDDDDD>
##$VPLIST= <PPPPPPPPPPPPPPP>
##$VTLIST= <TTTTTTTTTTTTTTT>
##$WBST= 1024
##$WBSW= 4
##$XGAIN= (0..3)
0 0 0 0 
##$XL= 0
##$YL= 0
##$YMAX_a= 262851
##$YMIN_a= -457390
##$ZGOPTNS= <>
##$ZL1= 120
##$ZL2= 120
##$ZL3= 120
##$ZL4= 120
##$ABSF1= 10
##$ABSF2= 0
##$ABSG= 5
##$ABSL= 3
##$ALPHA= 0
##$AQORDER= 0
##$ASSFAC= 0
##$ASSFACI= 0
##$ASSFACX= 0
##$ASSWID= 0
##$AUNMP= <proc_1d>
##$AZFE= 0.1
##$AZFW= 0.1
##$BCFW= 1
##$BC_mod= 2
##$BYTORDP= 1
##$COROFFS= 0
##$CY= 11.3945322036743
##$DATMOD= 1
##$DC= 2
##$DFILT= <>
##$DTYPP= 0
##$F1P= 18.9103706918063
##$F2P= -1.10871071338519
##$FCOR= 0.5
##$FTSIZE= 0
##$FT_mod= 4
##$GAMMA= 1
##$GB= 0.15
##$INTBC= 1
##$INTSCL= 1
##$ISEN= 128
##$LB= 0.24
##$LEV0= 0
##$LPBIN= 0
##$MAXI= 10000
##$MC2= 0
##$MEAN= 0
##$ME_mod= 0
##$MI= 1.114404
##$NCOEF= 0
##$NC_proc= 0
##$NLEV= 6
##$NOISF1= 3.799351
##$NOISF2= 2.8
##$NSP= 1
##$NTH_PI= 0
##$NZP= 0
##$OFFSET= 15.70392
##$PC= 1
##$PHC0= -9051.187
##$PHC1= 12.40004
##$PH_mod= 1
##$PKNL= yes
##$PPARMOD= 0
##$PSCAL= 0
##$PSIGN= 0
##$REVERSE= no
##$SF= 200.130013532006
##$SI= 16384
##$SIGF1= 3
##$SIGF2= 2
##$SINO= 400
##$SIOLD= 16384
##$SREGLST= <1H.CDCl3>
##$SSB= 0
##$STSI= 0
##$STSR= 0
##$SW_p= 3612.71676300578
##$SYMM= 0
##$S_DEV= 0
##$TDeff= 0
##$TDoff= 0
##$TI= <>
##$TILT= no
##$TM1= 0
##$TM2= 0
##$TOPLEV= 0
##$USERP1= <user>
##$USERP2= <user>
##$USERP3= <user>
##$USERP4= <user>
##$USERP5= <user>
##$WDW= 1
##$XDIM= 8192
##$YMAX_p= 0
##$YMIN_p= 0
$$ End of Bruker specific parameters
$$ ---------------------------------
##NTUPLES= NMR FID
##VAR_NAME=  TIME,          FID/REAL,        FID/IMAG
##SYMBOL=    X,             R,               I
##VAR_TYPE=  INDEPENDENT,   DEPENDENT,       DEPENDENT
##VAR_FORM=  AFFN,          ASDF,            ASDF
##VAR_DIM=   8192,          8192,            8192
##UNITS=     SECONDS,       ARBITRARY UNITS, ARBITRARY UNITS
##FACTOR=    0.0002496,     1,               1
##FIRST=     0,             0,               0
##LAST=      2.0444736,     0,               0
##MIN=       0,             -457390,         0
##MAX=       2.0444736,     262851,          0
$$ Real data points
##PAGE= N=1
##DATA TABLE= (X++(R..R)), XYDATA
0 0 0 0 0 0 0 0 0 0 0 0 -8 8 -8 8 -13 16 -16 24 -25 32 -40 48 -56 67 -80 93 -108 124 -142 165 -188 215 -244
33 -244 277 -313 352 -395 443 -497 554 -615 686 -760 841 -931 1029 -1136 1252 -1381 1519
50 1519 -1673 1844 -2033 2244 -2477 2743 -3043 3388 -3786 4258 -4820 5509 -6369 7491 -9006
65 -9006 11187 -14618 20812 -35542 147972 -46241 -407344 -129205 109310 86650 -62242
76 -62242 11846 146847 99777 -107591 -128938 -73213 -101093 -59847 144339 206585 41006
87 41006 -190944 -232328 24487 260365 63691 -210976 -71590 190191 110429 -110629 -118949
98 -118949 62225 152244 34936 -82351 -43899 -32497 -80925 15128 174946 139290 -58656
109 -58656 -208890 -142871 75993 104981 -86935 -53493 205782 183507 -117019 -241198 -103794
120 -103794 55579 97188 72363 95488 94533 -62843 -189986 -85378 57666 50885 -3899
131 -3899 14533 104417 108239 -101763 -246209 -43177 171455 73268 -55431 3985 55702
142 55702 -2504 -66824 -49193 42317 59767 -40124 -50841 55274 55906 -43033 -58645 26515
154 26515 93509 16911 -139658 -102611 95386 101187 -37279 -12534 74120 11193 -92947
165 -92947 -103419 -20932 83047 83824 13772 28060 47095 -57049 -139757 -75029 46717 106647
177 106647 59774 707 36896 19189 -135832 -157542 29480 123604 55371 10152 15471 16353
189 16353 -19255 -104572 -103599 44945 125376 49968 -12621 -13947 -23552 -38403 -38919 5273 67002
202 67002 23555 -55891 4203 70754 -14586 -76336 -8074 56057 47112 -26630 -104330 -43282
214 -43282 93369 87386 -7455 -27530 -21300 -41472 -44490 -18454 39285 82264 45053 11109
226 11109 20711 -54677 -152979 -78762 80199 140633 99451 -5858 -88711 -58244 -25303 -66765
238 -66765 -34886 83141 119344 60807 -16387 -82930 -91970 -50416 2681 83649 115557 16737
250 16737 -68770 -34627 -2468 -13238 -8195 -755 27914 65691 3480 -87518 -45097 38007
262 38007 38651 19524 646 -39632 -51471 -28364 14623 77545 73829 -11041 -41905 -22687 -44120
275 -44120 -46790 7286 60753 105245 83611 -48776 -133401 -83166 -25522 13864 82472 98973
287 98973 37876 -26401 -77574 -87785 -35198 7959 40289 99230 90575 -11195 -81513 -83172
299 -83172 -39794 38154 63042 19475 16604 23061 -34753 -57922 -11725 8521 12497 25440 4656
312 4656 -18433 -16457 -21955 2040 53470 35635 -25068 -40894 -32498 -7461 36281 37908 24543
325 24543 41588 4574 -74714 -71451 -18799 10482 52195 74966 31548 -17978 -57901 -89818
337 -89818 -48064 30512 54861 57652 56642 8295 -42759 -61288 -63459 -10837 63645 60245 26597
350 26597 21853 -17064 -64119 -44437 -11115 7780 39761 34745 -2407 -4514 -7978 -33867 -17381
363 -17381 13979 11765 11124 5538 -11655 4737 18538 -5607 -736 17390 -14854 -32801 -4647
376 -4647 6097 17042 37979 14418 -15550 -15119 -36036 -49563 -4230 35607 42241 44881 15607
389 15607 -31210 -43214 -46938 -34999 28288 68573 46349 27010 -1083 -54675 -62265 -31645
401 -31645 -7585 39897 74646 34950 -12133 -28278 -52492 -48900 -984 28881 41580 44998
413 44998 5557 -28875 -23046 -26345 -21203 22311 33690 9758 4653 -10013 -26700 1763 19323
426 19323 332 2928 2870 -25206 -19876 9059 16241 27685 27817 -10930 -34720 -34212 -37747 -4033
440 -4033 52095 57229 32770 4189 -48457 -70529 -32453 1937 33570 75339 58724 -4599
452 -4599 -40849 -63356 -64938 -10009 45281 59710 56953 16864 -46882 -59777 -37655 -17929 25270
465 25270 55290 33256 9577 -10685 -46375 -38173 7370 20352 21958 27158 -4591 -29105 -10639
478 -10639 1689 9377 26976 9173 -22614 -21239 -20462 -16376 21573 41498 24702 7501 -27323
491 -27323 -63206 -37834 9295 32888 59527 57298 -566 -43620 -51775 -51708 -12440 46187 59987
504 59987 47496 20723 -38666 -73293 -49117 -15225 23962 61815 46356 5713 -15814 -42922
516 -42922 -51106 -7863 25295 28405 36068 19369 -19446 -24114 -13965 -11845 12447 25849 1319
529 1319 -8272 -4479 -13774 -2984 18008 8446 -882 -5786 -29742 -27001 8832 20210 23811 34156
543 34156 6827 -29437 -31340 -29172 -12914 33661 50853 30174 13745 -18631 -55978 -45361
555 -45361 -12784 12188 43753 46543 10273 -12620 -29762 -52104 -30773 16294 33513 40748
567 40748 36241 -3395 -29603 -24491 -25135 -9633 25994 27000 11757 10837 -6192 -25418 -16604 -9474
581 -9474 -2381 18751 12608 -10870 -3300 4451 -3672 5309 7453 -10773 -6685 911 -8781 4610
595 4610 24479 13051 6854 6377 -20655 -34755 -17907 -1173 24160 44197 18710 -13097 -20258
608 -20258 -35283 -38450 -4138 22707 35884 47171 19566 -27330 -39152 -36768 -24593 21431
620 21431 51621 35309 15151 -8371 -38717 -36936 -17819 -4976 25155 45827 18661 -11220
632 -11220 -21471 -31413 -16998 13491 16376 12927 15338 -5834 -19494 -1236 4727 715 11701
645 11701 6070 -13053 -11654 -9767 -3799 25367 32127 3096 -14634 -25706 -36225 -13707 19273
658 19273 30079 37906 24797 -21612 -44639 -34621 -23887 7869 49923 50236 23059 -6702 -45684
671 -45684 -54513 -19022 10435 30958 50542 30622 -12728 -32729 -40688 -31155 8950 32254 26007
684 26007 23027 3888 -30265 -28985 -7384 1933 17381 22333 -277 -10363 -7088 -12661 721
697 721 22361 12559 -4694 -9735 -20408 -14948 11751 20085 19687 21745 -6495 -38730 -33221 -15795
711 -15795 4623 37111 42552 14848 -8264 -32812 -48702 -21098 16841 30759 41119 33428
723 33428 -5204 -32084 -38291 -34991 -597 38201 35842 18758 3943 -25123 -36347 -16966 -3672
736 -3672 9676 28553 19097 -1498 -5349 -15265 -20488 2292 15350 7778 5914 -2742 -12706 2890
750 2890 12346 1377 2681 2741 -14328 -14191 -3906 -3328 11292 25583 9375 -7142 -15596 -30771
764 -30771 -22436 11740 26432 26295 23711 -444 -23027 -22244 -22389 -12322 21600 36277 23579 10000
778 10000 -15147 -39369 -28532 -7965 4939 25825 30355 7275 -5867 -13061 -27512 -18068 6205
791 6205 14818 22476 23016 -1864 -15551 -8513 -10450 -5907 10453 7676 713 5463 -3004 -10286 925
806 925 1589 -4946 2405 -1566 -13380 -2862 7890 7925 16079 11138 -11643 -16088 -11179 -11765 5938
821 5938 26300 21214 12641 800 -26341 -33674 -15716 -1634 18178 37293 21588 -5950 -19611
834 -19611 -32948 -29560 1311 21873 28235 32162 10835 -20842 -26668 -21688 -12389 15434 29983
847 29983 17440 6916 -7526 -26746 -19286 -657 4004 12279 16020 -1942 -10409 -4821 -6612
860 -6612 1480 15177 5625 -6448 -5257 -10958 -7514 13675 19195 11013 6225 -12953 -29591 -16748
874 -16748 747 12404 30225 26021 -2627 -19530 -29187 -32265 -5920 24466 31065 29137 13246
887 13246 -22269 -36432 -23960 -9949 15098 37683 27139 6091 -8567 -28857 -30927 -5970
899 -5970 10520 18480 24723 7961 -14537 -15666 -13115 -8377 10930 15818 3139 588 -3321 -11858
913 -11858 -1500 9899 5802 5371 568 -16058 -14441 1228 7042 16490 21453 1384 -16920 -18245
927 -18245 -20538 -7808 18982 25328 17811 9644 -13872 -33194 -23357 -6909 9269 31172 29286
940 29286 5630 -9116 -22115 -29936 -10566 12709 18899 24165 16973 -8395 -19147 -16593 -16036
953 -16036 -3 19031 14098 5879 2844 -10816 -14177 -2481 -461 1471 9928 2501 -6237 882
967 882 1105 -1483 7200 4723 -6561 -4647 -4950 -6992 7440 15791 6935 2955 -3188 -18576 -16893
982 -16893 -4349 2103 15339 22833 6958 -7365 -12617 -22156 -16089 6472 17196 20803 20726 898
996 898 -17566 -17205 -16350 -9440 13301 22146 13839 7191 -7257 -23015 -16597 -5830 -68 15061
1010 15061 19892 4606 -3044 -6173 -13999 -6884 5339 4672 7900 10414 -2877 -7583 814 -555
1024 -555 -918 5514 -1803 -7724 -2197 -3039 -1294 11815 9470 -3113 -5357 -10663 -15758 -2873 9821
1039 9821 14049 20223 11186 -12459 -18932 -14878 -11216 6718 24607 20367 10406 -3725 -25153 -27075
1053 -27075 -9974 1400 14633 27130 14723 -5717 -15424 -22185 -15807 6229 15772 15203 17051
1066 17051 3454 -15521 -14358 -6807 -1709 10504 12076 688 -1635 -5015 -11856 -2238 9785
1079 9785 4468 -212 -2355 -10664 -7002 4597 6448 11165 14095 -3107 -17734 -13411 -8137 2123
1093 2123 19641 20201 9283 -544 -18907 -28967 -11571 6746 14882 23355 16881 -4975 -17907
1106 -17907 -23538 -20877 2880 22311 19555 14408 5466 -14492 -21443 -11538 -1951 12039 20437 8128
1120 8128 -2714 -4370 -12581 -13029 1742 8127 5627 4850 -3712 -8940 334 2692 286 7790 5286
1135 5286 -8444 -9423 -4481 -222 11001 13640 3139 -1128 -6724 -18878 -12813 6426 13633 16229
1149 16229 12853 -3333 -14581 -14974 -16822 -4196 18420 20681 9915 3019 -9988 -19586 -13127
1162 -13127 -4496 6213 21321 16945 -414 -5696 -9452 -15398 -6784 5276 8813 12572 6533 -7389
1176 -7389 -7060 -2225 -6618 -2755 7443 4833 633 73 -4361 -1118 6018 -275 -3901 2077 -1972
1191 -1972 -7950 -22 6175 6962 8585 18 -9344 -5784 -5691 -7649 5884 16352 10115 2551 -5721
1206 -5721 -15812 -12096 -4639 -511 12427 20913 7444 -6234 -9837 -14341 -10340 2232 9296 15501
1220 15501 16922 473 -14096 -10963 -8895 -6454 6100 12158 9109 5199 -6047 -14399 -5591 478
1234 478 -1354 5536 9940 1119 -3136 -3460 -4222 3270 6731 -1833 -2225 1766 -3933 -4409 5292 7610
1250 7610 5059 1462 -9609 -12533 -3738 -1265 2485 14859 13241 -1645 -10223 -15054 -12924 1497
1264 1497 10862 12787 17171 8475 -12350 -18259 -11964 -4680 7661 16323 12057 6276 -3873 -19591
1278 -19591 -18087 -1590 5379 9172 12947 5346 -4129 -7503 -11242 -5451 9150 9385 2095 2818 -711
1293 -711 -7069 -2951 1702 3414 6672 -60 -10602 -5975 990 320 5882 10194 2367 -5645 -10585
1308 -10585 -13221 -2253 11544 11285 9721 7911 -5890 -17152 -12808 -4365 7794 18600 13138
1321 13138 2246 -3443 -13940 -19779 -6870 7222 12247 13735 5961 -6118 -9296 -10644 -9980 3552
1335 3552 14268 9225 3601 -217 -7242 -6425 -1842 -976 4803 8230 -1158 -6865 -1326 -531 -294 3996
1351 3996 1501 -1843 -1702 -6213 -5887 6017 9916 3948 2548 -2308 -9681 -7761 -3389 2277 12787
1366 12787 13037 710 -5030 -7268 -12595 -7876 4140 10077 12800 8676 -5160 -11023 -8181 -8287
1380 -8287 -2644 9988 12597 7012 1808 -6704 -10764 -4377 -1853 935 10063 9489 -752 -3593 -4390
1395 -4390 -5973 -991 1651 182 3846 3937 -3924 -3091 2237 389 35 1337 -2477 -2323 -39 -1837
1411 -1837 1828 8546 3212 -3782 -3777 -5549 -5519 1119 4859 6599 9291 1622 -8947 -8419 -6090 -4238
1427 -4238 4763 11183 8100 4357 -3798 -13107 -9349 -1591 1383 7749 12703 6108 -2561 -7214 -11159
1442 -11159 -6012 3701 5748 6758 8489 96 -7913 -6323 -4013 -989 4857 4169 900 1739 -2013
1457 -2013 -6368 -578 3955 1360 1096 -964 -4322 -1402 2056 1709 5228 5616 -2665 -7227 -4907 -3950
1473 -3950 1609 8432 7483 4223 -56 -10085 -13427 -4203 2815 6979 11698 7061 -2447 -7284 -11322
1488 -11322 -9609 2859 10509 9363 8320 1950 -8405 -10165 -6795 -1959 6451 9943 3458 -842
1502 -842 -3127 -8166 -6198 1240 3691 4343 3993 -1759 -4157 -401 -294 572 5072 2550 -2997 -3360
1518 -3360 -3157 -1459 5045 6066 1866 -15 -4539 -9714 -5433 1937 5315 8697 6607 -2341 -7050
1533 -7050 -8025 -8461 -235 9779 10361 6621 2040 -6953 -10416 -5821 -1596 4438 11242 6957 -612
1548 -612 -4042 -7874 -8711 -1626 3954 4965 6196 2093 -4686 -3940 -1801 -1983 2230 4342 1123 474
1564 474 -42 -2835 -387 3042 698 -394 -23 -3951 -4032 839 2571 3441 4252 -823 -5336 -3990 -3625
1581 -3625 -1573 5313 7415 4237 2044 -3537 -8717 -5457 -658 2625 8031 7985 734 -3375 -5743
1596 -5743 -7975 -3694 2631 4380 6191 5545 -1855 -6093 -4690 -4169 -515 5077 4835 2503 2210 -2814
1612 -2814 -4501 -1591 120 410 3213 2395 -1082 -672 -934 -2350 711 1604 -1390 -905 -382 -1650 658
1629 658 3577 1790 1168 716 -3969 -4333 -1108 418 3060 6590 3077 -1848 -3165 -6578 -5478 1353
1645 1353 4761 5768 6087 1004 -5703 -6141 -5177 -2761 4105 7475 4862 2329 -2041 -7266 -5604 -1313
1661 -1313 1544 5177 6736 1500 -2099 -2968 -4914 -2507 2459 3006 2057 2267 -1640 -3618 -675 52
1677 52 668 2534 455 -2891 -1410 -624 -138 3510 3631 -36 -1765 -3237 -4633 -889 3702 4530 5091
1694 5091 2687 -3934 -6441 -4650 -2557 2528 7602 5524 1355 -1924 -7056 -7531 -2113 2256 5086
1709 5086 7510 3389 -2848 -4650 -5200 -3289 2417 5401 3706 2847 -575 -4793 -3722 -907 -216 2336
1725 2336 3303 -425 -1541 -1419 -2199 88 2846 1035 -726 -629 -2638 -1696 2108 2899 2640 2424 -1235
1742 -1235 -5002 -3077 -1421 857 4995 5213 984 -1772 -5022 -6564 -2325 2471 3763 5383 4014
1757 4014 -1923 -5035 -4799 -3600 757 5352 4527 2850 1177 -3657 -5169 -2148 -2 1999 4088
1772 4088 2063 -840 -1291 -2808 -3011 399 1788 849 1213 301 -1450 -208 559 86 1301 1189 -1696
1789 -1696 -1552 -56 -176 1547 2869 609 -996 -1812 -3677 -2480 1719 2314 2758 2883 -462 -3525
1805 -3525 -3437 -3081 -784 3787 4658 2189 1341 -1826 -4650 -3318 -594 956 4021 3969 307 -1102 -2752
1822 -2752 -4491 -2430 1576 2166 2486 1951 -986 -1915 -1359 -1691 -268 2223 2211 690 536 -771 -1496
1839 -1496 220 348 -199 749 -446 -2064 -178 749 695 1481 546 -1167 -1527 -1458 -1834 833 3344 2616
1857 2616 1485 -471 -3633 -3415 -1177 425 2945 4576 1671 -1327 -2239 -4034 -3546 396 2932 3583
1873 3583 3364 -117 -3592 -3305 -2300 -713 2355 3694 1800 352 -1260 -2859 -1712 279 651 2033
1889 2033 2274 -653 -1538 -961 -456 334 1457 84 -803 -517 -1082 -1016 1436 2002 950 340 -1474 -2873
1907 -2873 -1450 297 1720 3621 2543 -888 -2606 -2646 -2802 431 2897 3374 2790 838 -2851 -3927
1923 -3927 -2283 -630 1822 4011 2493 369 -1289 -3280 -2817 -212 1356 1964 2618 1225 -1563 -1980
1939 -1980 -1344 -807 1447 1737 377 53 -467 -1653 -279 928 599 467 188 -1442 -1295 367 233
1956 233 1285 1828 -46 -1484 -1449 -1778 -423 2261 2382 1736 905 -1560 -2987 -2003 -286 956 2699
1973 2699 2575 429 -1023 -2208 -3282 -1117 1389 1746 2251 1528 -789 -1790 -1522 -1324 229 2040
1989 2040 1475 759 638 -1203 -1516 -575 -124 311 1298 195 -809 -89 -54 -391 708 459 -490 -145 -113
2008 -113 -438 785 1391 458 380 87 -1346 -1620 -443 201 1299 2102 323 -859 -1284 -1932 -1181 565
2026 565 1374 1524 1583 -28 -1489 -1491 -1460 -766 1511 2189 1214 460 -665 -1668 -1436 -401 -68 1081 1501
2045 1501 414 -650 -885 -1498 -743 507 606 712 716 -558 -487 422 -133 -148 451 137 -335 -189 -437 -365
2065 -365 890 627 -471 -387 -914 -1287 -322 859 1008 1271 353 -947 -1038 -811 -801 481 2055 1495 922
2084 922 -544 -1855 -1549 -372 293 1264 2017 930 -482 -907 -1572 -1166 214 856 1343 1099 98 -1407
2102 -1407 -871 -337 18 717 584 360 -51 -28 -714 -155 799 285 278 406 -550 -636 123 317 617 636 -363
2123 -363 -1165 -809 -602 225 988 1197 390 -150 -785 -1438 -583 460 734 1373 1167 -494 -1101 -1181 -1056 -51
2143 -51 742 1025 769 242 -549 -1403 -722 -33 493 1068 516 -183 -346 -736 -664 186 520 152 573 201 -446
2164 -446 -157 119 -22 383 344 -396 -446 -331 25 350 710 144 184 -243 -804 -687 329 604 626 439 259
2185 259 -430 -653 -731 -289 714 741 463 239 -443 -989 -511 -146 120 770 620 314 -413 -228 -424 -429 208
2206 208 319 449 605 6 -235 -179 -330 116 397 407 -68 135 -213 -154 125 -46 108 194 -175 -457 44
2227 44 135 -68 287 -6 -7 -46 -79 -284 290 726 311 189 305 -688 -606 -16 -100 242 334 322 -212 -171 -397 -613
2251 -613 81 2 63 362 -5 -130 -257 -258 -344 256 321 163 116 -94 -646 -305 -116 -42 57 218 81 -53 -26
2274 -26 -101 96 184 85 -25 -188 -54 -170 135 -31 218 208 46 24 -141 -41 -99 122 505 217 139 -179 -165
2297 -165 -6 -102 120 392 553 4 -84 -248 -333 -350 -5 220 159 292 -280 -427 -244 -124 -88 85 364 98
2319 98 133 43 -42 -32 164 283 110 142 55 -91 -132 28 -219 84 252 -218 5 -282 -118 -17 293 259 30
2342 30 114 -300 -227 -190 458 106 453 276 11 -291 -786 -155 39 361 268 460 -226 -349 -398 -186 -213 41
2364 41 208 125 77 -131 -499 -223 181 126 525 411 -135 -137 34 -261 -8 7 69 -76 45 -100 -2 238 -39
2387 -39 184 217 138 -288 -49 252 -127 259 156 -51 140 -392 -369 -150 179 252 211 68 -416 -250 -350 -297
2409 -297 213 530 403 206 52 -523 -627 -590 128 279 598 514 -102 13 -492 -487 -39 68 362 302 305 -220
2431 -220 -438 -190 -114 -23 158 193 276 -127 -361 34 300 453 22 179 -278 -424 156 277 361 243 -179 -528
2453 -528 -137 -166 -239 279 524 96 37 -189 -944 -416 -87 -155 576 717 277 -225 -531 -766 -497 144 598
2474 598 521 610 -223 -560 -333 -356 -92 530 570 74 104 -201 -748 -97 279 82 307 604 -162 -155 205 4
2496 4 508 446 -104 -307 47 -4 -50 395 303 0 43 -709 -566 -240 -3 478 826 454 -156 -625 -707 -719 29
2519 29 743 503 906 362 -853 -953 -443 -297 578 1263 596 -137 -398 -1110 -783 -186 372 431 815 77
2539 77 -310 -348 -357 -32 303 621 130 -160 -371 -329 -42 686 59 540 -125 -665 -361 29 13 636 590 -2
2561 -2 -576 -637 -728 -104 937 848 745 438 -946 -1346 -865 -493 670 1435 939 -75 -396 -735 -1328 -373
2581 -373 460 910 873 430 -757 -672 -540 -461 548 922 432 337 140 -404 -565 217 -108 315 719 -122 -507
2602 -507 89 -17 240 548 55 -400 -267 -491 -174 202 768 342 279 -336 -690 -571 10 176 847 1324
2622 1324 13 -399 -710 -1250 -675 736 504 1156 675 -459 -850 -807 -645 -61 756 905 265 288 -658
2641 -658 -926 -285 -262 237 681 1057 56 -195 -301 -613 -169 507 -5 261 438 -453 -278 98 -57 10
2661 10 299 -401 -357 -98 -59 108 783 352 -174 -329 -835 -710 424 705 758 1155 418 -832 -925 -1002 -634
2682 -634 618 1056 897 302 -192 -1469 -1248 -178 439 1140 1201 568 -174 -886 -1331 -740 497 684 585
2701 585 890 -204 -952 -451 -368 -253 466 481 -271 -104 -287 -650 238 582 147 469 -71 -871 -207 463
2721 463 553 777 708 -291 -1147 -541 -778 247 1211 962 382 -169 -1100 -1603 -490 454 1059 1498 760 -503
2741 -503 -862 -1300 -932 417 1384 1242 959 124 -1073 -1054 -497 -228 826 947 211 -470 -370 -738 -500
2760 -500 530 469 421 386 -525 -687 49 463 73 699 221 -605 -372 -314 32 597 1080 210 -99 -803 -1405
2781 -1405 -658 356 598 1171 1150 -186 -997 -921 -986 34 1419 1383 771 406 -798 -1511 -722 -225 516
2800 516 1657 1069 -254 -387 -955 -1343 -265 615 511 888 489 -786 -426 -137 -388 234 655 60 60
2819 60 -59 -288 15 548 68 45 150 -643 -644 222 615 682 753 39 -816 -633 -509 -258 795 1228 574 495
2841 495 -510 -1263 -1050 -82 -80 1147 1475 185 -565 -931 -1341 -857 279 978 895 1197 -171 -1004 -839
2860 -839 -622 -123 863 849 462 176 -613 -939 -348 75 299 842 325 -259 -308 -17 -265 165 530 -434 -174
2881 -174 -192 -701 6 916 554 323 98 -761 -925 -369 257 576 1187 772 -294 -516 -1374 -1175 413 717
2901 717 1190 1272 123 -1434 -1265 -1091 -506 843 1459 645 243 -436 -1573 -1201 -303 282 1133 1323 209
2920 209 -418 -502 -793 -436 979 556 226 132 -588 -802 -72 224 352 330 -167 -740 -565 -13 165 983 1052
2941 1052 102 -331 -1084 -898 98 831 1051 969 734 -1045 -1670 -938 -523 436 1601 1107 233 -319 -1408
2960 -1408 -1858 -206 461 862 1497 757 -828 -973 -1111 -843 793 1015 729 641 -287 -931 -751 28 -141
2979 -141 251 702 -492 -528 -186 -306 87 907 309 -344 -176 -761 -341 561 856 526 658 -257 -1061 -935
2999 -935 -373 242 1233 1258 135 -531 -1114 -1522 -530 598 966 1087 887 -372 -965 -1017 -862 182 1342
3018 1342 1360 750 283 -956 -1168 -722 -91 471 1123 384 -472 61 -372 -613 153 469 -14 793 -6 -562
3038 -562 -62 271 255 220 400 -417 -442 59 -60 497 846 29 -314 -465 -947 -840 93 525 762 1101 -52
3059 -52 -880 -1090 -692 -41 897 1039 704 300 -411 -1360 -1037 -331 246 969 1509 110 -446 -688 -1046 -381
3079 -381 700 944 853 842 -551 -788 -313 -622 -65 922 457 132 -51 -399 -659 656 378 -93 154 -106
3099 -106 -791 -160 178 227 949 584 -661 -1048 -656 -520 612 1252 1081 333 -223 -1477 -1098 -245 401
3118 401 1061 1765 538 -785 -1188 -1395 -995 479 1034 1210 1204 68 -1232 -1145 -416 -452 963 1493 363
3137 363 24 -561 -1270 -508 411 401 615 581 -389 -472 -179 -88 194 815 104 -497 -410 -543 -152 729 738 483
3159 483 -56 -615 -1429 -588 494 502 1331 1049 -350 -1061 -1088 -1088 254 1426 1158 868 118 -1261 -1530 -869
3179 -869 -286 784 1634 916 -35 -547 -1184 -1122 380 882 811 835 231 -550 -429 -305 -376 738 780 -146 -130
3200 -130 -87 -453 -41 334 130 74 79 -951 -587 73 418 696 868 -14 -752 -638 -911 -74 1125 1174 713
3221 713 184 -461 -1518 -736 -409 438 1382 1042 -119 -480 -1007 -1624 -662 446 883 1133 784 -526 -679
3240 -679 -759 -603 321 1195 826 348 118 -312 -928 -44 -78 -83 541 -96 -372 -97 -175 -327 365 290 -123 -20
3262 -20 -258 -290 324 731 60 147 77 -931 -590 -35 178 619 1022 -10 -463 -709 -1489 -819 311 684
3282 684 729 1079 -197 -898 -718 -721 -470 1105 1126 919 561 -449 -1540 -382 -37 262 711 912 -91
3301 -91 -534 -482 -669 -113 543 401 368 439 -574 -383 46 163 373 413 -153 -543 22 -273 -132 793 625
3322 625 -101 -517 -605 -813 267 694 613 727 423 -1064 -992 -462 -524 788 1364 937 426 -310 -1432 -1434 -189
3343 -189 539 909 1141 336 -768 -1006 -1161 -640 665 859 482 263 -453 -1116 -443 -38 93 653 435
3362 435 -318 -1 -242 -327 243 953 97 -102 16 -637 -441 377 272 496 744 -496 -1260 -545 -553 507
3382 507 1163 703 218 -289 -1249 -1252 -90 694 893 1395 745 -608 -1137 -959 -815 590 1247 732 370 103
3402 103 -996 -1024 -360 -22 596 737 58 -426 -273 -728 -545 370 207 358 146 -391 -267 90 115 92 559
3423 559 -69 -424 -409 -137 -331 765 797 -138 -178 -368 -831 -544 860 576 716 885 -530 -855 -692 -691 -224
3444 -224 1017 955 768 302 -785 -1292 -600 -123 152 1215 708 48 -422 -584 -894 76 503 319 701
3463 701 353 -651 -246 -126 -123 213 330 206 -69 49 -375 -320 218 -8 -156 -13 -380 -401 -33 220 181
3484 181 695 339 -464 -235 -231 -277 589 870 431 245 -194 -974 -714 -171 257 891 921 149 -517 -726 -782 -461
3506 -461 361 799 891 667 -231 -1015 -531 -368 -136 689 783 89 -24 -690 -777 -114 487 223 321 355 -339 -415
3528 -415 -515 -164 193 481 -8 -280 11 -552 -79 618 651 173 286 -735 -681 -27 217 631 1043 447
3548 447 -510 -553 -758 -619 457 772 1013 793 -79 -873 -819 -510 -125 735 1097 365 -104 -550 -828 -423
3568 -423 285 291 475 639 -257 -701 -526 -367 34 660 759 -24 -75 -267 -498 230 545 47 409 -61 -607
3589 -607 -194 275 312 837 491 -121 -635 -575 -556 29 720 665 561 35 -629 -1027 -368 -226 360 1100 724
3610 724 107 -455 -1017 -979 51 698 712 809 95 -675 -508 -459 -494 461 884 181 152 -67 -628 -286 89 16
3632 16 436 553 -237 -346 -119 -138 57 528 163 -184 37 -326 -322 435 314 125 370 -390 -940 -311 -267 163
3654 163 728 800 -141 -239 -588 -1071 2 493 654 675 489 -343 -721 -435 -568 142 707 621 276 36 -610
3675 -610 -907 -330 64 367 619 431 -300 -181 -349 -408 91 466 230 240 61 -261 -239 462 0 426 178
3696 178 -425 -332 91 -261 87 677 37 -288 -299 -702 -584 349 724 551 556 -256 -564 -643 -339 -297 859 964
3718 964 306 251 -413 -1125 -715 87 346 762 923 -205 -666 -705 -642 34 614 603 606 407 -367 -392 -156 -191
3740 -191 79 653 532 -396 -240 -338 -365 534 371 -333 61 -191 -491 -257 200 93 273 300 -346 -699 -296
3761 -296 -294 422 1054 465 -94 -4 -717 -550 183 231 793 984 228 -668 -638 -696 -318 614 844 528 323 -322
3783 -322 -672 -689 -107 85 601 734 -165 -114 -455 -618 -263 382 176 266 426 -27 -491 -8 -126 168 425
3804 425 -169 -491 33 -253 -206 667 506 -103 -119 -296 -627 -110 214 380 746 530 -288 -939 -559 -383 208
3825 208 1027 748 214 -101 -641 -800 -146 175 532 723 422 -207 -130 -829 -577 164 492 579 297 201 -266
3846 -266 -285 -18 -310 531 487 -259 -113 -126 -403 138 357 -12 193 426 57 -558 157 47 268 376 -229
3867 -229 -540 -560 -278 120 500 654 205 171 -249 -1048 -535 -121 213 692 481 131 -200 -419 -795 -234 281
3888 281 477 411 272 -253 -658 -310 -348 -18 608 514 195 -235 -276 -723 -40 143 132 353 -20 -708 -28 -39
3910 -39 12 349 167 -137 35 98 -244 -14 539 155 153 135 -620 -289 -29 142 410 543 -57 -304 -284 -666
3932 -666 -375 228 649 452 307 -114 -700 -490 -364 39 582 867 -144 26 -170 -906 -341 44 395 214
3952 214 401 -149 -331 -101 -86 46 510 208 125 34 -68 -413 127 -138 -139 501 29 -280 -174 -33 180 592
3974 592 138 -93 -221 -453 -388 48 652 698 378 307 -519 -483 -320 23 300 852 291 -94 -290 -852 -565
3995 -565 221 307 347 622 133 -485 -467 -434 -118 476 527 165 323 -87 -318 -324 177 -29 489 118 -282 -79
4017 -79 32 -272 113 247 -98 111 21 -333 -141 240 68 446 74 -132 -572 -359 -51 143 763 490 -157
4038 -157 147 -383 -391 201 371 460 673 94 -305 -601 -164 -229 272 650 263 277 69 -532 -586 -75 242 287
4060 287 693 219 11 143 -227 -435 325 216 98 160 -47 -270 43 -20 -267 -4 23 -190 -142 22 -245
4081 -245 176 34 -270 189 30 -208 -187 269 467 115 418 -113 -414 -301 -278 -197 619 365 299 -55 -406
4102 -406 -468 -66 -2 94 402 317 -210 -142 -225 -494 -218 434 321 129 -57 -543 -388 -494 -168 160 708 224
4124 224 209 -40 -173 -246 148 33 -272 102 -119 -296 205 210 208 27 238 -223 -387 -32 -41 255 599 232 240
4147 240 -477 -789 -343 -25 42 321 675 36 -114 -226 -531 -7 269 520 390 225 -177 -231 -337 -124 -48
4168 -48 325 519 99 -334 -110 -371 -24 205 82 73 62 -125 -96 177 -41 178 109 172 -306 -70 -115 -35 260
4191 260 291 119 162 -333 -245 -295 151 112 613 280 -360 -239 -339 -216 233 716 458 147 3 -310 -388 29
4213 29 63 247 519 25 -203 -232 -382 -156 -21 -75 8 43 7 -317 -183 -145 35 52 114 146 -188 -45 -483 160
4237 160 168 68 -1 -221 -276 -70 16 179 250 191 -82 -246 32 -88 -15 480 373 -194 166 -342 -489 32 105
4260 105 187 501 163 -187 -197 -459 -355 204 276 408 287 7 -314 -312 -56 -172 -67 572 94 -58 -159 -103
4282 -103 -190 10 -6 31 44 20 -32 141 -155 -200 300 -199 -116 124 -357 -189 143 254 4 -59 -127 -305 -18
4305 -18 12 -135 333 274 -14 98 -122 -124 -148 248 216 429 159 -371 -534 -332 -199 -2 292 286 -45 -134 -308
4328 -308 -345 164 147 -6 362 150 -133 -139 -128 -102 105 138 -78 -53 36 -39 -55 133 79 225 166 -94 -176 -36 60
4353 60 57 149 39 -172 -120 -204 -71 95 305 204 28 -93 -245 -286 -76 -249 63 172 122 -49 -228 -435 -307
4376 -307 267 302 285 341 -307 -154 -151 -365 44 268 186 210 -29 -7 18 109 -253 -10 130 -172 -145 -106 -237 -176
4400 -176 380 108 54 -252 -29 -187 -245 144 176 39 -173 -258 -34 -7 -104 314 253 79 -214 -282 -231 -66 -6
4423 -6 334 104 175 108 -201 -312 -192 -67 350 168 132 32 -172 -406 -284 -181 -24 146 545 -169 -413 27
4445 27 -274 35 329 -75 40 143 -451 -149 32 85 -65 232 90 -101 -2 -13 34 282 332 -124 21 -96
4467 -96 -134 -117 159 114 30 54 -480 -192 -370 -175 -2 87 257 19 -55 -373 -165 -53 227 205 496 172 -51
4490 -51 -170 -233 -41 -41 440 246 144 138 -258 -158 202 -49 -68 -60 -228 -78 -8 -50 -18 134 56 197 81 -176
4514 -176 -91 -61 -219 87 218 -179 -128 -317 -211 152 248 211 43 89 -278 -165 -13 125 -16 180 249 -90
4536 -90 -230 -95 -172 83 344 97 329 -254 -213 -28 -56 -160 119 356 192 -324 -55 -344 -253 107 -34 34
4558 34 227 50 0 -110 123 -213 -324 26 -17 70 -98 -120 157 316 59 -6 59 -192 -90 -38 59 26 256
4581 256 210 -141 -82 -329 -22 91 313 56 174 -31 -374 -53 -83 -177 36 321 44 -145 -8 -120 367
4602 367 144 80 164 113 -128 -138 -7 60 168 13 58 -174 -27 -94 78 -35 211 -39 -47 17 -207 90 -238
4625 -238 -183 57 -73 -47 -242 98 -109 -105 39 16 136 -147 -130 -82 -40 -166 449 187 -69 -199 -198 85 248
4648 248 173 108 -57 91 57 -195 -44 -102 50 195 221 -256 -52 -169 -193 48 84 169 140 152 -247 -18 95
4671 95 -22 19 -17 125 22 -22 -116 2 152 -124 68 110 12 84 119 62 163 212 59 -83 -123 -58 -328 33
4695 33 116 245 246 -158 -239 -198 -6 -86 267 237 112 74 68 -152 -100 39 103 -132 27 -64 -166 -76 -31 -86 114 -118
4721 -118 -27 -54 119 -80 -47 -5 14 -170 127 -114 -190 30 53 32 98 183 -93 -234 -19 13 259 33 -100 20
4745 20 -61 -209 8 -143 -186 127 36 135 -52 -122 -218 -171 -62 71 353 -92 -129 -260 -74 -43 180 148 93 28
4769 28 -26 -14 -4 -44 80 28 8 106 -80 27 -213 -100 189 -272 -34 -48 38 -123 -35 10 -400 -27 175 -225
4793 -225 -118 54 152 32 36 -37 -343 -91 -100 -41 196 165 123 -45 -34 -197 1 18 284 149 176 185 110 255 -70
4818 -70 249 209 181 172 19 -2 -153 -87 -178 -54 -99 -5 13 -132 -98 -185 36 -205 -85 -74 78 -90 -143 78 -267
4843 -267 159 -31 -130 69 53 3 -103 -150 -37 -40 -223 -16 126 132 130 361 -42 -47 60 25 165 -128 8 151
4867 151 -2 72 -54 -120 -250 -71 101 9 141 -28 38 -70 53 -130 145 128 79 98 -151 -136 -131 17 286
4890 286 -18 331 -32 -94 127 106 165 -101 43 47 -258 74 52 -161 51 36 24 -15 93 -270 -165 8 -43
4913 -43 -11 263 8 -106 114 -189 23 53 -3 112 -137 -196 -211 -104 -80 74 275 -11 76 -37 -261 -58 184
4936 184 -82 90 182 -29 -40 37 -39 57 -134 234 -76 50 -178 13 57 -20 119 -257 81 -139 71 125 17
4959 17 -12 -146 96 -168 112 -44 -72 30 57 112 -147 -108 -211 198 -14 -120 51 -134 96 -112 -61 -283
4981 -283 134 -274 88 -83 69 -199 -259 177 51 65 57 -12 77 6 11 -81 92 71 -116 223 80 -305 36 278
5005 278 184 105 -5 150 -88 -121 31 139 48 147 -170 -154 -348 -118 76 10 -43 82 -189 153 -306 -202 127
5028 127 7 171 185 68 -175 -51 76 258 98 208 107 -204 -51 -123 -160 278 187 -59 151 -40 -232
5049 -232 -13 -113 -58 -54 -10 -282 -176 -34 -104 -134 260 19 82 54 -8 -180 -142 217 -109 216 -1 30 -15 17
5073 17 268 361 -70 23 -17 -18 -92 -97 -69 2 -169 176 61 -257 98 -141 -111 149 177 332 83 7 14 4 -22 53
5099 53 -63 -108 -132 199 -27 -12 -248 -4 181 -13 328 -206 -17 -163 24 102 -30 -149 -105 78 -40 55
5121 55 92 42 -124 -160 -35 29 99 293 195 20 -104 -163 284 79 75 -19 244 106 -31 58 16 -153 -45 346
5145 346 189 97 -251 -96 -124 -114 286 -127 28 270 -19 22 -71 -36 -46 -10 156 70 30 102 -137 58 -125 -153
5169 -153 41 126 217 46 -157 98 267 -38 -2 -179 134 -76 -318 12 -110 -245 -159 -10 -20 -276 143 149
5191 149 -3 41 51 -271 -345 -211 -236 240 148 242 -20 -314 -175 -86 167 -267 53 229 -188 -20 -209 14
5213 14 80 151 -35 -52 -23 -162 -45 -63 -29 150 34 -218 171 -127 81 -271 201 79 -179 -93 -192 -229 -111
5236 -111 6 20 90 -80 -122 -165 -328 48 138 164 123 -137 63 133 -80 15 137 156 314 -52 -186 -208 -237 -46
5260 -46 303 158 -111 -223 -102 -306 -115 245 -123 144 -170 48 -103 -178 -32 20 96 33 27 95 -19 124 119
5283 119 -31 50 86 -10 73 -227 -188 -10 278 116 167 47 -506 -133 -131 -166 -91 245 -137 223 210 -14 -16 196
5307 196 109 40 105 -9 -44 -394 -111 147 90 140 -4 199 201 -168 -34 204 25 100 201 -76 -6 -98 -99 56
5331 56 36 231 -58 -102 -180 -129 -55 61 -3 -103 -216 1 29 -1 -41 -62 48 -210 -19 49 -211 -41 174 -57
5355 -57 -95 130 -364 -36 -97 169 6 43 168 -8 -187 -125 -164 -58 135 127 155 68 101 -206 62 -346 53 -94
5379 -94 -1 56 38 130 -145 -35 247 -39 131 -59 -46 166 87 -103 -26 -246 189 18 -120 -29 -33 220 38 102
5403 102 -28 -59 -283 -517 91 111 202 48 -131 -39 -169 105 -4 226 -79 114 -188 -84 -110 -200 10 411
5425 411 -37 94 15 -177 -119 -204 -35 135 406 -37 126 32 -58 -124 19 65 82 85 18 55 120 149 68 4 368
5450 368 -441 -267 -65 57 -84 61 -139 -39 62 -18 17 77 -35 53 190 127 -91 6 -59 113 178 63 -142
5473 -142 -16 8 -5 -94 16 84 214 -71 -38 -42 -72 -79 104 287 112 -122 124 -37 -18 -32 118 252 137 38
5497 38 -213 -104 82 -133 181 -93 191 -207 -34 -190 -109 141 267 83 78 -190 -103 33 -296 72 46 6
5519 6 14 33 33 -113 176 148 -155 204 -51 54 -49 -181 90 287 40 76 80 -100 -239 117 45 28 223 62
5543 62 93 299 -159 -163 -62 92 268 -186 29 94 -77 143 13 306 285 -173 -301 -204 -171 -134 241 -268 -6
5566 -6 -23 34 -199 -43 154 337 9 95 -11 21 -63 -42 -18 289 252 219 -49 -35 -191 -149 -22 -16 133 122 -45
5591 -45 -27 72 -6 172 -58 -29 226 -234 -113 -17 232 -162 76 141 -64 -59 -24 -65 230 148 284 -6 -46 -223
5615 -223 6 -25 -109 90 290 -38 -191 -150 -161 54 126 190 -144 -66 51 -53 -206 31 49 75 -16 -57 52 -50
5639 -50 -39 -59 220 69 183 150 -158 -102 -40 -220 30 216 -61 -358 247 -132 145 99 10 -16 -15 -95 34 -65
5663 -65 -65 81 -1 119 -224 6 119 -7 88 102 46 -239 -169 -351 -108 49 234 264 46 154 38 68 254
5686 254 -200 36 -23 122 232 2 -64 162 -138 48 218 95 79 14 -93 -177 147 85 246 -23 -1 -109
5708 -109 -47 191 94 105 154 -99 -36 71 -18 -62 388 65 41 162 153 31 183 55 -182 310 22 152 -22
5731 -22 -96 -174 -33 130 -192 133 233 7 -102 -70 -45 73 88 140 264 -152 -311 -87 -9 24 71 -112 -186 -240
5755 -240 141 -314 205 338 108 60 70 139 -48 164 -90 87 158 17 -222 -117 151 87 -80 129 7 8
5777 8 -96 -157 124 297 12 -22 -58 -14 -82 -35 -59 212 6 90 -86 55 -342 -231 -145 83 196 -126 151 -51
5801 -51 -121 -245 -302 290 177 68 -37 59 8 -246 -44 -155 173 -112 -90 37 -77 77 172 37 79 -147 -238
5824 -238 -196 -151 139 63 48 57 -10 -185 -168 58 -60 201 207 313 -292 113 -40 73 298 -28 102 94 110 -290
5848 -290 -189 -138 157 -156 96 15 -11 -127 -52 280 19 143 136 -22 -181 122 46 -383 238 177 19 128 -249
5871 -249 -306 -87 -69 99 44 -42 -187 -52 151 -23 87 197 166 -182 -66 -56 -131 133 -108 -56 140 0 -214
5894 -214 108 -37 -8 7 117 -220 42 148 -66 -137 -154 -17 150 66 97 87 301 101 -107 182 -34 144
5916 144 -7 115 -200 214 -107 39 -43 -2 87 -77 -86 -75 25 85 181 -95 206 -7 -61 184 185 228 28 -80
5940 -80 -88 128 -120 18 395 86 271 -22 -165 22 40 224 -203 105 52 -69 -8 -279 8 204 103 222
5962 222 143 -52 -146 -287 -197 14 88 77 -98 -387 -86 -47 -4 -80 203 91 180 59 -61 149 253 9 143
5985 143 119 12 -34 -38 97 190 331 83 -74 -234 -74 92 99 159 56 158 -235 -41 -165 -130 -139 389 -101 -59
6009 -59 -165 83 -278 -66 39 -76 162 115 87 81 16 -78 239 31 40 -123 -27 -303 -97 -62 -15 43 19 -36 -284
6034 -284 -77 -183 -172 -191 10 -189 -18 -257 81 244 -160 -105 132 -203 -137 146 -321 -68 257 94 -57
6055 -57 181 -181 -310 -57 165 -40 257 88 -123 -35 -227 8 -43 387 431 -237 13 74 131 -19 79 239
6077 239 -40 -137 -27 -113 -132 -73 -60 145 133 65 107 125 -8 95 12 -54 -30 -181 -227 19 -95 35 12 -35 190
6102 190 48 -243 -83 127 29 80 -35 117 164 -10 -319 -60 124 15 113 75 147 24 -302 -296 -65 105 140
6125 140 102 -119 -14 -129 -83 326 68 137 -168 -65 -22 90 -280 96 96 119 -50 -54 -173 -207 14 320 132
6148 132 146 -96 -59 28 91 -140 -285 29 164 -127 112 44 -28 135 145 314 -137 -41 -142 -263 72 -6 32
6171 32 -74 -133 28 -172 -175 93 31 -124 -6 -71 -56 20 -164 -190 -84 245 159 119 -292 -248 120 65 4 -181 194
6196 194 1 -21 100 20 187 198 -30 -133 -75 -59 -155 72 -176 -189 123 84 -102 24 -141 97 195 -113 -110 116
6220 116 -192 -169 -250 44 16 -124 94 -277 -66 -38 -119 161 281 101 -116 138 -92 -36 -32 -60 -15 -2 116 65
6244 65 181 47 17 -152 71 60 -67 3 -141 22 94 21 -17 -29 85 25 -156 5 458 216 -56 164 -117
6267 -117 16 28 -21 230 -15 79 -89 -188 96 -88 -47 39 113 98 -109 -233 -223 5 29 136 203 182 -96 -138
6291 -138 -33 -202 134 -110 195 -46 -33 -101 -260 -42 -90 25 106 -5 62 282 -130 -214 32 -165 139 -78
6313 -78 -236 -39 -127 176 58 111 -40 -190 85 -213 -17 159 128 -24 11 -300 -253 23 -78 231 211 332
6335 332 -38 -207 -2 -174 -180 49 35 -36 9 -66 -254 106 163 -118 101 44 -213 75 -128 -165 16 34 -38 -264
6359 -264 -166 -116 -48 98 -68 -2 -79 -172 19 -18 -329 -242 236 208 -58 -89 -90 -174 76 174 17 56 -158 -136 93
6384 93 -122 -213 123 153 154 169 -84 -226 -163 -67 26 297 -11 -50 -175 -2 -238 -145 108 68 120 64 148 -50 91
6409 91 -27 12 57 -67 -11 -109 -55 -114 21 -133 -78 54 -28 -171 142 121 -210 -11 58 -83 -18 95 -193 29
6433 29 -46 92 104 -90 -18 -238 9 92 -146 222 4 -301 -227 -222 78 22 27 194 34 0 -128 5 19 62 207
6458 207 -61 -23 -23 -26 -287 -96 17 90 -87 49 104 -273 132 -232 115 -53 61 106 -88 -104 42 136 57 228
6482 228 -85 -401 -219 -23 -211 73 -68 127 80 -214 -165 -77 180 209 -91 65 1 92 96 -1 -61 -161 63
6505 63 197 8 -266 -316 -56 204 142 27 6 -124 34 -68 -45 -43 -107 211 -101 -126 -88 217 -94 73 -86
6528 -86 -63 167 121 -155 -181 17 -62 59 -17 105 -82 -28 -12 5 -1 -16 -55 -229 -244 -71 197 7 119 16 -178
6553 -178 -85 -339 -98 -63 167 -53 244 76 -215 -146 82 -104 -63 211 -10 33 -86 -35 -118 42 -101 171
6575 171 82 70 -147 -58 -9 -55 141 236 -7 -45 -169 -212 159 -72 -14 173 -43 -163 -120 -63 16 3 49 -101 -119
6600 -119 -31 -249 46 198 25 -4 365 -258 -150 -165 -119 -174 80 18 -193 158 -142 -161 -33 -18 -47 -71 -43 -40
6624 -40 -49 -125 2 -81 148 -38 47 12 118 -116 59 -128 196 -41 -22 -55 -104 11 54 170 73 -138 -231 -107
6648 -107 -134 166 -9 -51 150 -74 -63 -28 71 -10 91 176 127 22 209 -256 48 -165 234 103 -54 24 -328
6671 -328 -216 120 -115 99 159 300 68 63 -50 15 5 21 -149 -44 -93 -118 -54 -169 86 -106 -139 42 -50 -125
6695 -125 -294 264 167 -33 82 178 -162 -65 318 130 53 97 64 174 -145 -5 144 15 157 217 -164 -188 175
6718 175 -24 -165 72 150 36 25 -80 -187 -252 -224 56 162 392 96 143 -137 -20 24 412 -86 -2 -148
6740 -148 -178 -305 -18 53 24 -111 -55 -235 44 192 46 98 -25 -132 46 -168 -369 -170 -124 46 91 310
6762 310 103 -278 33 -148 38 -99 78 -114 82 -157 -115 -172 75 -72 14 181 -281 -85 134 78 -70
6783 -70 -25 261 -46 -59 -28 -230 105 -11 154 282 83 -45 368 -2 17 109 -38 228 22 -45 -299 166
6805 166 114 100 79 -117 -45 -46 -167 156 69 92 -150 -1 -54 -232 168 -28 55 53 146 79 -59 -40 -61 -309 368
6830 368 237 366 4 -5 75 20 37 9 314 201 -117 -103 -110 -283 111 149 48 249 -1 -179 -150 1 73 -72
6854 -72 14 -211 -295 -36 80 -98 73 47 90 -16 -106 163 -62 -4 -287 99 -77 -154 118 -74 17 64 -63
6877 -63 -271 29 42 -14 229 191 -37 193 198 37 -99 32 -138 -83 314 -91 -69 -28 -384 -202 -352 36 -114
6900 -114 -72 180 58 -297 -35 -401 5 -142 -30 -133 -358 -131 -43 -151 168 38 -14 60 37 72 -182 57
6922 57 156 96 115 175 25 -261 -75 -100 -84 122 -77 -101 80 -311 -345 37 66 247 145 66 -124 -133 61 74 202
6947 202 28 -28 -12 6 -23 51 109 93 32 -115 39 -142 -66 -95 -47 201 179 -282 119 -324 59 55 -113 26 -181
6972 -181 -174 -134 -83 -125 71 111 -117 -125 166 -70 -282 144 6 59 168 -229 -59 -59 -211 -24 87 131 29 -193
6996 -193 -23 -55 -20 44 44 286 -18 -233 -232 -73 -58 213 151 -138 -128 -25 74 -235 51 57 -59 138 -32 -143
7020 -143 -39 -30 -242 18 48 -93 -198 218 -126 -27 5 -51 89 131 -186 -198 78 -241 -166 146 14 -53 -185
7043 -185 -31 -2 7 147 39 68 73 -72 -3 61 137 -139 225 -170 148 65 -215 -206 65 27 66 269 22 -197 -78
7068 -78 -114 -157 161 86 -42 -34 45 -60 129 -174 227 262 -54 89 59 -27 -26 1 153 -107 124 -162 171 -255
7092 -255 72 -412 172 -23 -13 -5 -138 -38 -106 -40 127 81 50 -38 84 -79 -231 -3 312 191 49 -92 -278
7115 -278 21 -126 53 -12 -49 24 344 -64 -20 -176 149 -31 -33 -56 289 -57 231 121 -116 79 -99 -144 48
7138 48 260 44 56 111 31 -109 -200 -293 -325 172 246 76 -168 -243 -340 77 265 102 15 327 93 -187 -224 -222 -139
7163 -139 -107 203 52 23 -87 136 65 -317 82 -167 71 -80 -298 109 -215 176 60 -186 72 106 -201
7184 -201 -1 308 -216 -44 -223 48 -37 84 -55 -65 149 111 5 80 -239 -70 222 215 45 206 68 -12
7206 -12 -50 -69 -5 -161 243 140 130 -191 -184 -352 127 94 -91 328 -143 -42 -3 -12 -138 -1 -70 233 79 -12
7230 -12 -335 233 33 -133 40 -154 17 149 -6 -106 244 123 91 111 87 -76 -100 162 63 156 -21 139
7252 139 11 -165 -62 -71 66 260 -160 -87 -104 -63 1 -74 125 -43 216 -1 -37 -346 -301 126 -16 -195 212
7275 212 -152 -111 -137 -115 283 200 38 -5 -86 -57 -70 -77 -137 -38 62 63 265 224 116 90 132 276 117 64 -38 -186
7301 -186 49 36 -122 10 -116 29 -419 -189 193 92 243 34 -139 -205 -140 -329 -37 -36 -102 190 143 44 -121
7324 -121 -159 -50 -70 128 205 144 -165 -169 188 -305 -35 13 2 -92 -117 -9 -132 19 137 -123 74 132 70 116
7348 116 39 121 84 -55 120 254 -59 -46 -139 255 116 194 51 -144 -96 -181 17 69 -44 116 -264 -295 -299 -287
7372 -287 109 -44 146 49 110 252 70 -14 191 120 199 103 -72 -55 65 -25 20 85 128 -412 53 -4 -202 25
7396 25 -153 -295 -308 -80 -66 32 132 118 -42 117 -26 23 -35 -146 33 199 34 171 45 -426 -71 110
7418 110 94 -14 -116 74 -88 167 41 75 227 156 293 162 -213 -180 166 -109 190 -49 56 -69 3 -166
7440 -166 10 -42 2 150 187 -210 -187 -129 -99 56 14 172 32 97 171 -188 -148 44 -181 -7 227 114 -109
7463 -109 173 85 210 57 -53 -44 74 76 -135 140 39 51 148 -189 -73 -144 -124 -22 91 233 186 52 160
7486 160 -88 -124 -88 -177 60 95 49 61 -154 -48 -25 -81 -49 126 146 -119 -202 -153 -50 -99 180 238 -44 -109 -128
7511 -128 -33 15 106 13 -121 -36 -128 178 47 -88 95 320 13 -144 103 -130 122 38 -62 -376 162 -12
7533 -12 -152 -161 -153 -13 107 104 -93 28 -59 -87 -189 78 318 139 33 -401 18 113 120 67 43 209 -79 177 -124
7558 -124 230 -35 -3 26 119 -54 -165 133 -89 -94 71 80 56 135 -97 -115 176 6 -43 -102 -275 -263 61 110 102
7583 102 159 -48 -58 -86 -192 -21 152 190 23 30 48 35 -178 116 -232 97 58 -155 -90 125 -30 -223 29
7606 29 -46 105 -240 -4 -155 -9 206 4 48 194 29 129 18 -51 -52 120 184 239 82 -182 -110 192 -20
7629 -20 -41 -59 63 -86 -94 21 -171 164 84 -7 -4 -145 -269 -112 67 -27 47 66 -31 -48 -190 -53 -264 153 117
7654 117 265 -149 -207 -117 10 -63 26 106 -7 -73 -279 -150 -62 236 -45 -12 -17 237 -47 -93 -7 128 126 116 -39
7679 -39 -16 -238 -155 124 152 107 80 2 -47 -357 105 -5 172 212 51 56 -13 -50 -104 451 -81 114 -34 -172 -41
7704 -41 -97 -1 64 281 289 303 -53 82 -303 -28 -44 50 144 55 134 44 -164 -109 104 181 106 -216 123 -71 81
7729 81 115 1 -154 -41 -58 -117 -70 -62 131 -118 147 -269 -119 29 -57 313 208 2 -40 -10 -207 -368 1
7752 1 -310 143 -82 293 -89 -9 -163 -99 99 150 -215 -21 -80 -107 -187 -32 83 129 17 176 38 106 -154
7775 -154 -49 -44 -91 147 -10 115 -154 -162 166 61 288 -25 -53 -144 -257 -133 10 60 85 275 -157 -116 -77 19
7799 19 -191 102 230 92 -201 -182 -83 178 188 41 -148 82 42 -72 69 -4 209 124 181 6 218 -314 -1
7822 -1 85 34 9 136 -72 -77 -82 81 -28 -105 114 -32 -58 -17 -207 -144 -135 54 102 64 11 -138 54 -107 -106 158 -84
7849 -84 59 -65 -188 135 58 116 122 256 38 4 229 19 -89 -69 1 42 -99 -18 218 -88 -103 118 2 35
7873 35 -279 -37 2 -60 223 211 -183 135 -83 -163 31 76 -138 214 127 109 20 56 -158 -89 103 149 94 -156
7897 -156 -66 -308 146 18 104 -42 128 -168 -115 -198 -14 117 31 123 111 -141 -193 144 44 160 14 27 26 -126
7921 -126 -143 -142 94 89 238 81 44 -66 59 -161 178 -212 33 -24 -139 35 89 -101 7 90 361 -161 -76
7944 -76 -93 -147 158 115 343 152 -107 -160 41 -12 -75 -18 -134 -68 -340 -37 109 -123 201 3 179 51 -103
7967 -103 -144 -59 -173 -50 49 90 169 -14 56 -34 -6 -179 20 204 -72 72 65 61 -271 -37 -11 -166 85 116 -151
7992 -151 39 -11 17 230 -45 54 -277 -22 -54 -12 61 43 -27 -35 90 -109 177 -115 223 127 -5 -280 -54 -187
8016 -187 -76 197 173 54 -184 -277 -382 92 77 51 486 181 -161 -120 48 164 -114 -9 250 114 237 203
8038 203 24 -109 38 -74 226 187 -157 -73 -108 58 119 126 27 58 274 -48 -4 47 218 222 30 6 55 -209 168
8063 168 -54 120 137 150 83 -173 237 83 -45 -29 169 -203 -70 -127 -104 -76 96 -156 74 81 -12 -32 -42 -89
8087 -89 -136 -31 -7 63 126 -77 -15 323 154 41 -129 -97 -202 -131 104 32 136 -63 -32 -3 -167 4 -17 179
8111 179 107 -20 13 -179 274 -14 17 -27 75 -147 -100 46 -259 -6 123 213 104 182 50 -168 -251 -125 -182
8134 -182 43 130 -90 -122 -230 -127 136 -42 -8 27 357 51 -216 62 154 -31 223 205 52 -47 -20 -216 51
8157 51 94 -136 -10 -27 137 55 108 -67 -150 323 -67 79 -17 48 -95 35 86 -129 -17 -34 -131 45 30 285
8181 285 -136 53 -185 -33 -75 -51 177 138 -35 34
8191C4
$$ Imaginary data points
##PAGE= N=2
##DATA TABLE= (X++(I..I)), XYDATA
0 0 0 0 0 0 0 0 0 0 0 0 0 -8 8 -8 8 -16 16 -24 24 -32 39 -44 55 -63 72 -86 96 -112 128 -148 168 -192 217
33 217 -247 279 -313 352 -393 440 -491 547 -605 672 -742 822 -909 1004 -1105 1217 -1341
50 -1341 1475 -1626 1795 -1981 2190 -2428 2694 -3007 3370 -3798 4319 -4960 5778 -6856 8350
65 8350 -10571 14209 -21231 39750 -194867 -457390 -41552 176995 140878 -11939 -27432
76 -27432 57851 69112 -134814 -187253 -9060 78137 31633 126268 176483 -32897 -266693
87 -266693 -169415 151285 262851 -12838 -218397 -35436 171619 65427 -111508 -106073 48756
98 48756 150467 27541 -151725 -80725 57754 11761 11671 150794 93300 -163069 -237857 -34540
110 -34540 163675 111176 -62875 -27068 140583 65768 -179600 -221604 -32307 157308 179451
121 179451 46856 -24272 8078 -82283 -194560 -34754 172910 102399 -32898 8038 78611
132 78611 5332 -153609 -174661 37247 196349 77585 -76445 -51900 15478 2262 -53456
143 -53456 -54022 50912 91877 -39273 -76842 69775 76773 -70760 -62679 64637 71348 -37045
155 -37045 -110776 -39650 108067 103841 -34976 -56693 16072 -4337 -78133 -75322 28587 135195
167 135195 84048 -50508 -37377 18356 -77898 -127165 16120 129317 97462 24139 -30266
178 -30266 -38117 -38055 -94349 -78406 83063 162181 55299 -50045 -50766 -13250 -24318 -87906 -50809
191 -50809 111999 140662 -7363 -68958 -29174 -36119 -35061 12637 37020 44023 18775 -41325
203 -41325 -19017 47181 33 -67141 -10041 65999 42394 -48555 -93161 6051 122968 59765
215 59765 -60528 -54610 -25162 -37066 -3771 38415 46740 56990 21963 -46708 -51540 -51521 -83253
228 -83253 -6238 140701 153777 26917 -98681 -121401 -38552 16588 -7590 28278 110989
239 110989 79228 -20550 -78225 -107637 -73914 24679 75597 77765 66488 -23122 -109336 -52946
251 -52946 32771 23662 183 15077 39674 39331 -26866 -81612 -15739 61074 38241 248 -22370
264 -22370 -54945 -34528 20445 37908 52926 40080 -50227 -88223 -22824 4823 -4678 40361
276 40361 85500 69021 -2342 -102448 -124937 -27177 57915 81017 91871 49348 -38282 -80285
288 -80285 -86091 -61157 23238 74971 54712 53693 30218 -73682 -121335 -50192 31445 74842
300 74842 69332 13626 -15224 -10453 -35695 -38564 11693 32313 23908 18945 -13494 -33643 -8933
313 -8933 -4782 138 40792 18170 -56844 -51739 1333 23277 40611 39573 6383 -6748 -25734
326 -25734 -65050 -39338 32203 61350 63723 41355 -22809 -63448 -64437 -57687 4110 83802 69432
339 69432 17804 2008 -38459 -80666 -54157 -5981 37263 80348 58002 -7146 -29007 -37714
351 -37714 -51016 -15845 29241 40937 44607 17773 -28393 -24119 -11322 -30352 -8928 31429
363 31429 13792 -5931 1436 -10524 -7511 14778 -526 -12185 6815 -4409 -20877 8153
375 8153 27734 24193 21422 -7725 -34602 -22125 -21650 -21094 29174 56787 26566 5250 -19849
388 -19849 -60142 -48656 -8156 12567 50485 71004 21461 -27793 -41398 -55736 -39237 12655
400 12655 42654 59267 55627 -5376 -53805 -45818 -37486 -15852 39118 53272 27975 13350 -21900
413 -21900 -54462 -27828 807 3774 28703 37070 93 -17856 -15286 -16143 7576 22960 687
426 687 -5534 -1223 -18565 -7556 25127 20420 10938 6495 -29965 -46747 -15213 4223 23645
439 23645 59268 42899 -14409 -43747 -57914 -48599 7797 50081 54990 51671 11025 -53942 -67533
452 -67533 -45897 -16769 42619 79435 49432 10439 -27490 -72037 -57081 2195 29248 43049
464 43049 49978 9972 -31585 -37281 -39283 -18230 28818 37015 16633 6411 -18017 -31725 -1442
477 -1442 17435 13150 18649 8 -31979 -17868 4485 6288 28089 37447 -652 -30353 -39776
490 -39776 -44664 -7176 45250 51733 36572 9944 -44035 -67635 -38677 -6415 34200 72625
502 72625 52311 4448 -25652 -60442 -64722 -7073 41113 52140 52995 17972 -37153 -50211 -40286
515 -40286 -26104 18005 47254 28895 10167 -8225 -36477 -28166 417 8046 21769 28087 -2726
528 -2726 -16661 -56 -2197 1017 19461 6132 -15572 -13452 -18430 -12822 21632 29764 10697
541 10697 3331 -18258 -43174 -26646 -357 18410 47960 44760 1141 -23436 -35188 -47269
553 -47269 -15503 32567 43360 41313 24971 -22296 -46176 -35798 -29049 -1533 42586 44398 19255
566 19255 -992 -32686 -45424 -18992 367 14562 38761 28732 -2486 -6537 -12717 -25001
578 -25001 -6569 11624 10129 17600 11228 -16570 -12769 4088 -3553 -3717 1394 -11023 -9145 5661
592 5661 1391 7666 22248 5769 -9355 -6108 -19438 -22881 7939 26717 30441 30036 -3239 -39938
606 -39938 -32462 -19609 -11925 21513 42586 29655 12825 -16616 -51623 -42613 -9739 12843 43885
619 43885 53033 13186 -21006 -30997 -39163 -20573 15272 25835 32729 34456 -3217 -37551 -30221
632 -30221 -16861 -21 26187 22592 2256 -1924 -13547 -22016 459 12514 1880 5426 2772
645 2772 -13959 -7861 5476 8738 23434 21315 -15879 -32259 -20800 -13240 9717 38293 31275
658 31275 11208 -8757 -42551 -47811 -12132 15268 34584 51987 27492 -18048 -40742 -49454
670 -49454 -32692 17879 45777 38563 29468 -595 -43136 -45377 -21056 1404 33421 44280 16439
683 16439 -4834 -17799 -36041 -22983 10397 18929 17978 13906 -10718 -20250 -5670 -2384 5070
696 5070 21164 6577 -16914 -13498 -8487 -710 22632 24885 6419 -2534 -20733 -38888 -17216
709 -17216 15558 28541 37263 24020 -16548 -37393 -36527 -28326 8262 44294 37928 19589 525
722 525 -33845 -46335 -23945 -13 28562 51018 29009 -8442 -22113 -31900 -28395 2925 21387
735 21387 20534 22221 5601 -20163 -19223 -13853 -11871 9758 21016 4241 -3582 -4576 -9975 3840
749 3840 16304 1122 -4793 315 -9501 -8615 8043 10537 11840 16141 -4370 -24199 -20927 -17649
763 -17649 -3256 27823 31771 10974 -2293 -20436 -34058 -16836 1567 12103 33506 35119
775 35119 4309 -16967 -27287 -33039 -9711 20294 25929 25534 16794 -12930 -27226 -19916 -18410
788 -18410 -4381 21104 22525 12395 5077 -15796 -25286 -6510 2704 4127 16616 12895 -1641
801 -1641 404 -1579 -9036 1624 5781 -4718 -1260 -60 -10002 -892 11865 5475 2620 -1780
815 -1780 -20129 -18531 -179 5918 15890 27605 12053 -8573 -15458 -25922 -21082 8252 24486
828 24486 26584 25876 -50 -30342 -31893 -22480 -7697 22939 34629 19979 6117 -13953 -37191
841 -37191 -27000 -1893 11587 27864 30860 5303 -12991 -17180 -22247 -7954 15947 16373 10630
854 10630 7989 -9032 -17304 -4960 -181 2214 11318 1149 -13795 -7033 -2670 806 16839 17424
868 17424 -1146 -9535 -16281 -21492 -172 22232 22615 20724 7276 -23095 -32921 -20669 -8263
881 -8263 17058 38351 25572 2983 -14840 -36718 -34499 -2919 18528 29133 33524 9839 -19906
894 -19906 -26066 -25190 -14595 15058 28978 19795 11092 -6588 -25879 -17652 -1811 4143 15580
907 15580 15488 -3493 -9306 -5324 -8323 775 12666 4005 -3756 -3935 -12783 -7906 12236 15634 11052
922 11052 7760 -11253 -25107 -14237 -2374 10086 27936 22642 -323 -12653 -24289 -29690 -6499
935 -6499 17656 24249 26855 13242 -17325 -27868 -21649 -14764 7932 29115 22624 9844 -1657
948 -1657 -22086 -25083 -7503 2545 13420 24428 11510 -6218 -7678 -12469 -12190 3127 7578
961 7578 2709 6422 464 -9737 -2348 2933 -1947 2428 2685 -8028 -5269 2035 1396 9759 15353
976 15353 717 -8412 -8413 -14688 -7995 10668 13971 13847 12338 -7448 -22566 -16552 -11514 -1829 19707
991 19707 23223 10955 1845 -14310 -26468 -13735 911 8399 22966 23097 2658 -9097 -15750
1004 -15750 -21397 -7087 10173 11955 15087 12590 -7098 -16591 -10622 -9751 -2157 11213 8408 3289
1018 3289 4204 -5849 -10024 2133 4618 497 4652 972 -5963 965 4269 1834 8606 4502 -11391
1033 -11391 -11921 -7382 -7399 5520 17359 11320 5228 -4530 -22150 -20608 -1745 7841 18283 26012
1047 26012 11019 -8598 -17166 -24330 -15139 9932 20652 19254 16995 -1416 -23583 -23041 -13993
1060 -13993 -1601 17983 21316 7720 763 -9153 -21629 -12204 5063 9455 13566 11393 -3598
1073 -3598 -7485 -3575 -5732 2004 12452 3159 -6572 -5740 -7646 -3244 8947 8055 2921 2093 -11126
1088 -11126 -20495 -6659 7149 13263 20580 13062 -6246 -14897 -19530 -17396 5694 24453 20180
1101 20180 12338 89 -20843 -25657 -14501 -2107 17307 28438 12535 -4171 -11131 -21163
1113 -21163 -18827 1193 13293 17486 16353 -5 -13586 -9552 -7379 -5272 9140 13484 3757
1126 3757 -988 -5809 -9129 1123 5886 -270 2008 1418 -10538 -8802 3154 6343 10569 9047
1140 9047 -5043 -10838 -7989 -10500 -1527 17638 18409 7562 -692 -14480 -19575 -9544 -1082 9272
1154 9272 23577 16779 -4464 -12658 -15665 -16555 -2510 10713 14931 17759 7496 -13163 -16135 -8724
1168 -8724 -7189 2435 14326 11707 5892 -928 -12286 -9845 1276 150 921 9385 5148 -3506
1182 -3506 -2636 -3150 -1637 4840 81 -6264 262 511 -4608 2761 8930 4089 1293 -5182 -11556 -4526
1198 -4526 2555 1430 9698 15890 2918 -9114 -11986 -13370 -5157 7435 9686 12348 12964 -4022
1212 -4022 -18496 -13666 -7616 -463 12256 14965 9794 4722 -10010 -20275 -8656 2730 4939
1225 4939 12277 13750 3025 -4324 -10395 -13232 -1522 8131 3504 3984 6279 -3450 -8794 -4234 -1921
1240 -1921 3179 6199 -2400 -4694 2310 175 -1498 7284 7777 167 -3992 -9270 -8642 3719 8344
1255 8344 5908 9927 4602 -12463 -17095 -10583 -2642 10925 16710 9040 3738 -4705 -19631 -17456
1269 -17456 178 10166 15660 16458 4470 -6719 -12039 -17055 -9163 10589 15369 8765 5233 -3788
1283 -3788 -12596 -10266 -6140 890 12114 9266 -3059 -3509 -2347 -5799 -372 6083 4566 3555 -1544
1298 -1544 -9263 -2892 7128 4951 3637 4949 -4238 -11492 -9578 -5261 5567 15710 9226 -1263
1312 -1263 -3836 -12262 -16417 -3806 9388 15702 16836 5168 -9684 -12084 -11969 -10028 5485 18123
1326 18123 13551 4880 -4782 -14803 -12416 -4790 -517 9349 15737 4487 -6070 -6679 -7923 -4566
1340 -4566 3558 4705 5180 6291 -2554 -7926 -241 3693 735 2813 533 -4095 -2756 -2869 -1796
1355 -1796 7661 8845 -1697 -5205 -5893 -8770 -3555 5256 8414 11193 7356 -7174 -12246 -6730 -4732
1370 -4732 1083 11946 12507 6093 -1389 -12240 -14321 -4075 1310 4831 12725 10128 -1540 -7355
1384 -7355 -10325 -9107 660 5831 5294 8462 5430 -5936 -8006 -3530 -2065 2054 5176 1939 1893
1399 1893 1938 -4545 -4051 2959 1416 -1534 384 -1728 -2132 1607 986 1436 5661 365 -7542 -5110
1415 -5110 -1936 -458 5598 7918 4142 2511 -4093 -12168 -6866 1539 3903 8378 10492 2468 -5064
1430 -5064 -9418 -11942 -4480 6945 8436 7490 7830 -1818 -10796 -9839 -6400 758 9982 8889 3388
1445 3388 1773 -4775 -10278 -4552 2005 3747 6471 4264 -2007 -1743 -2404 -5083 468 5429 698
1460 698 -1872 -1705 -3555 -450 4286 2120 1889 1925 -5279 -7977 -1172 3332 5812 9192 4316 -2993
1476 -2993 -6051 -10026 -8303 3669 10631 8546 6078 -731 -10534 -11031 -7085 -1184 9532 13527 5678
1491 5678 -704 -5394 -11457 -8462 1248 6280 9740 8895 -861 -6520 -5309 -5524 -2592 5587 6083 2120
1507 2120 130 -4392 -5623 -47 1906 681 2979 820 -4726 -3118 615 2289 6178 5345 -1790
1522 -1790 -4064 -4092 -5895 354 8005 7342 4300 -322 -8456 -10362 -4962 -843 5715 12051 7479 -1608
1538 -1608 -6010 -9624 -8188 1047 7055 8323 9162 2536 -7030 -7911 -5586 -3129 3944 8206 4576
1553 4576 1780 -2298 -7563 -5004 612 926 2749 4008 -198 -2400 -1021 -1521 131 3723 1040
1568 1040 -1613 -220 -1712 -1660 3446 4229 1889 689 -3805 -6846 -2760 712 1831 5975 5613 -921
1584 -921 -4212 -6100 -7062 -739 5665 6246 6784 3806 -3902 -7827 -5305 -3300 1910 7597 6398 2695
1600 2695 162 -6011 -8303 -3073 604 3165 6441 4088 -1152 -2054 -3743 -4404 282 2961 1891
1615 1891 2954 1908 -2452 -1937 -9 -813 830 1955 -1297 -1551 412 -479 881 3344 419 -1796
1631 -1796 -1255 -3766 -2685 2227 3685 3349 3879 -399 -5512 -4711 -3171 -648 5726 7112 3545 800
1647 800 -3433 -8144 -5358 -253 2889 6705 7102 746 -3550 -5450 -6713 -2629 3803 5305 4840 3543
1663 3543 -2622 -5652 -3782 -2271 580 4819 3603 265 -193 -2327 -3571 584 2025 982 1588
1678 1588 -5 -3302 -1333 1313 1067 2268 1799 -2961 -3879 -2380 -1847 1927 5846 3850 856 -1638
1694 -1638 -6192 -5986 -156 3319 5704 7021 2367 -4129 -6017 -6168 -3570 3572 6658 5042 3393
1709 3393 -1350 -6812 -6137 -2209 725 5354 6288 1613 -1306 -3068 -4973 -2063 2383 2692 2827 2364
1725 2364 -1452 -3051 -1071 -759 693 2783 394 -2542 -1646 -1193 -367 2853 2768 402 -513 -2820 -4702
1742 -4702 -854 2988 3662 4733 2805 -2297 -4727 -4404 -3324 1847 6354 4399 1896 -921 -5535
1757 -5535 -6348 -2491 778 3941 6211 2736 -1338 -2738 -4543 -3786 948 3667 3763 3283 305 -2926
1773 -2926 -2486 -1689 -1278 1871 2647 253 -344 -540 -2016 -682 1091 -288 201 455 -1645 -1156 1476
1790 1476 1642 1678 1845 -670 -2485 -1626 -1634 20 3452 3429 796 -299 -3008 -4650 -2312 62 1734
1807 1734 4438 3788 -773 -2698 -3176 -3871 -990 2736 3572 3926 2251 -1829 -3753 -2819 -1997 292 3753
1824 3753 3177 895 -291 -2716 -3215 -942 -126 603 2665 1687 -835 -857 -1182 -1324 879 1486 -86
1841 -86 270 209 -1554 612 1859 632 204 -259 -2017 -1788 -312 226 1555 3427 1088 -1852 -2582
1858 -2582 -3478 -1880 1695 3263 3179 2720 -605 -3931 -3127 -2070 -479 3049 4402 2518 268 -2969
1874 -2969 -4782 -2549 474 1791 3162 3290 -106 -2060 -2342 -2521 -482 2069 1919 1533 966 -1723
1890 -1723 -2443 -613 602 873 1404 -175 -1326 -500 -47 16 1632 1991 -564 -1230 -2124 -2259 224 2345
1908 2345 2105 2137 310 -3395 -3497 -1535 -20 2333 3927 2345 134 -1628 -4041 -3171 149 2412
1924 2412 3226 3182 551 -2555 -3032 -2618 -1216 2268 3044 1810 833 -1185 -2925 -1806 -269 596 1829
1941 1829 1824 -425 -819 -581 -1258 -76 1522 605 -36 -250 -1339 -888 921 981 574 568 -917 -2346 -1270
1960 -1270 -179 1035 2572 2152 -288 -933 -2152 -2585 39 2075 2324 2463 1057 -1783 -2698 -2042 -1591
1977 -1591 1028 2821 2200 665 -355 -2554 -2333 -616 82 1453 2209 826 -864 -770 -1488 -838 374
1994 374 751 667 996 16 -1401 -446 117 -231 149 404 -730 -440 -158 -211 648 718 -147 -480 -324 -1403
2014 -1403 -612 599 1413 1548 1365 -597 -1895 -1244 -857 43 1656 1917 680 -86 -1407 -2604 -1160
2031 -1160 47 725 2221 1918 -14 -1041 -1488 -1595 -308 1165 1119 1306 1150 -483 -1543 -746 -851
2048 -851 -10 1257 848 261 6 -919 -847 386 342 -327 324 215 -536 101 -184 13 888 657 -658 -699
2068 -699 -594 -417 446 1638 939 190 -688 -1663 -1371 -149 537 1015 1590 857 -874 -1199 -1626 -976 874
2087 874 1471 1445 1126 -287 -1558 -1332 -719 -212 1025 1337 707 43 -597 -1608 -739 434 688 970 550
2106 550 -357 -658 -168 -538 -31 774 145 -81 -158 -467 -429 478 326 480 333 -803 -889 -171 473 686 934
2127 934 503 -445 -911 -1096 -987 440 1293 906 859 -4 -923 -1473 -817 -88 932 1380 595 18 -415 -1074
2147 -1074 -1050 -132 699 785 1069 12 -634 -489 -681 -299 245 960 221 -83 -173 -46 -164 64 -65 293
2167 293 180 -369 -327 135 -2 513 721 -87 -289 -246 -399 -190 764 488 257 53 -648 -804 -496 -9 407
2188 407 931 912 -3 -266 -536 -787 -352 398 528 721 592 -444 -548 -486 -539 -141 491 711 320 -42 -269
2209 -269 -435 -159 105 -80 473 160 -230 123 -222 -275 150 153 -112 178 -39 -189 5 143 84 24 -169 -479
2231 -479 -311 -126 10 409 268 234 3 -157 -463 -499 -28 100 600 626 155 -501 -187 -249 -119 95 467
2252 467 210 248 231 -549 -272 -100 -234 367 629 337 -33 -127 -352 -71 158 181 128 262 -44 -119 39 -268
2274 -268 -40 118 268 21 57 57 19 86 123 52 -10 18 -139 -227 6 115 227 189 37 -314 -180 -195 -208 81
2298 81 198 283 -81 -155 -417 -396 -41 -92 157 184 198 36 -188 -370 -242 189 65 351 -90 55 -273 -387
2320 -387 -164 33 -1 223 239 -163 193 -243 -33 92 -11 169 -55 -191 -126 -99 127 180 364 96 -251 -324
2342 -324 -374 -191 106 184 89 339 -202 -228 -398 -295 233 175 414 389 127 -193 -508 -172 -45 143 92 314
2364 314 -35 -271 -228 -249 54 335 351 272 236 -139 -408 -322 173 -113 174 7 147 44 -26 -225 169 271
2386 271 215 -168 -251 -381 21 301 430 179 0 -489 -425 -162 -145 332 472 382 145 -41 -300 -706 -270 220
2408 220 243 624 113 -173 -353 -286 -453 18 262 303 407 96 -517 -476 -341 -235 93 551 68 0 -120 -227
2430 -227 -254 297 -64 92 520 23 -194 -61 -39 -237 361 46 -129 -28 -108 81 243 254 39 196 -319
2451 -319 -508 -296 141 163 375 687 63 -111 -220 -751 -201 667 405 336 425 -80 -548 -398 -713 171 732
2472 732 665 204 107 -425 -752 -539 117 428 545 442 -116 -283 -429 -380 -52 373 244 339 -2 -505 -402
2493 -402 147 194 55 318 -130 -449 -317 -62 230 599 384 -43 -67 -264 -625 89 633 539 526 -100 -867
2514 -867 -859 -515 -83 522 983 277 -11 -397 -1112 -694 266 665 1095 981 48 -802 -682 -753 -135 627 852
2535 852 489 384 -426 -1050 -364 138 148 653 490 -450 -546 -145 -253 63 521 37 -118 -163 -452 -294 499
2556 499 557 268 189 -585 -755 -410 -483 165 1180 454 -87 -529 -862 -922 -42 641 949 1124 125 -840 -703
2577 -703 -469 -502 386 979 611 313 -357 -1214 -917 -200 251 451 879 395 -287 -409 -614 -363 292 289 207
2598 207 181 35 -635 -117 302 112 215 -122 -751 -129 41 70 453 786 -39 -535 -667 -929 -353 564 938
2619 938 747 689 -621 -1159 -438 -441 183 1053 1054 442 -7 -573 -1552 -493 173 420 1119 932 -294 -499 -703
2640 -703 -1247 22 786 585 819 428 -347 -693 -460 -289 137 987 254 16 176 -325 13 248 41 72
2660 72 254 -285 -525 -18 201 -84 553 46 -804 -686 -325 -329 410 956 438 374 -373 -1136 -906 85 321
2681 321 1149 1334 209 -590 -979 -1490 -682 889 952 899 849 -408 -1086 -987 -520 -35 1101 869 254 -13
2701 -13 -581 -948 -327 490 455 675 363 -274 -463 -22 -142 425 246 -17 -431 -452 -443 61 883 455 224 37
2723 37 -916 -1270 86 460 793 1481 779 -610 -638 -1151 -965 468 1242 958 633 -357 -1501 -1116 -678
2742 -678 -117 1057 1589 529 -101 -864 -1357 -885 531 887 1186 1182 -152 -853 -482 -673 10 952 796
2761 796 277 -91 -649 -877 302 410 150 189 -320 -807 -277 238 220 981 661 -86 -808 -491 -865 136
2781 136 1232 1145 670 -13 -1372 -1492 -455 55 734 1445 801 -254 -855 -1290 -1325 95 972 814 1356
2800 1356 374 -1083 -906 -761 -373 267 988 542 44 -232 -1090 -778 145 -14 356 576 -112 -323 -285 -172
2820 -172 28 541 141 -611 -324 -450 -440 402 760 397 199 -640 -942 -263 166 423 927 758 -115 -397
2840 -397 -930 -1216 -422 643 953 1080 885 -601 -1185 -984 -700 76 1225 1070 416 296 -863 -1257 -405
2859 -405 -7 386 1041 576 -109 -437 -738 -695 84 621 373 503 248 -364 -211 35 -66 198 453 -298
2879 -298 -413 -34 -72 304 659 220 -338 -423 -813 -662 497 585 770 756 87 -926 -1197 -700 -275 969
2899 969 1664 790 354 -556 -1868 -894 229 576 1289 1509 84 -836 -1120 -1104 -504 977 1031 894 859 -674
2919 -674 -1279 -519 -295 34 889 552 -321 -162 -416 -525 399 486 22 240 -159 -830 -253 678 173 801
2939 801 333 -610 -1328 -643 -266 863 1401 722 166 -309 -1492 -1250 159 1159 1232 1451 359 -994
2957 -994 -1293 -1260 -841 947 1547 871 543 -394 -1550 -1493 -340 99 1129 1285 233 -524 -533 -1006 -599 538
2977 538 527 496 458 -561 -710 94 -163 157 519 138 -659 -655 -298 2 671 709 98 -311 -830 -1334 -100
2998 -100 833 665 1162 794 -775 -1288 -999 -714 184 1454 960 242 -21 -1313 -1428 -467 192 638 1364
3017 1364 772 -351 -368 -1107 -926 502 951 697 1122 349 -739 -622 -508 -241 320 788 211 -197 -478
3036 -478 -635 -213 131 112 106 -11 -355 -355 423 299 359 696 -189 -766 -171 -578 -46 1178 1273 302 -72 -692
3058 -692 -1427 -926 -98 534 1154 1148 -244 -529 -895 -1415 -307 865 1262 1207 677 -737 -1318 -1091 -622 121
3078 121 1075 1013 312 76 -796 -1085 -488 211 349 876 245 -533 -288 -135 -258 430 471 -221 -433 -35 -383
3099 -383 -156 790 389 183 69 -907 -1022 78 64 815 1312 508 -590 -809 -1012 -626 901 1160 1103 1044
3119 1044 -323 -1471 -1337 -478 111 1474 1468 499 -22 -968 -1568 -838 20 486 1236 832 -303 -746 -830
3138 -830 -701 -2 1159 691 104 301 -292 -699 231 272 173 410 -329 -881 -175 136 182 720 770 -225 -555
3159 -555 -885 -1160 312 1371 942 581 12 -1190 -1549 -611 -202 1173 1721 595 -149 -388 -1414 -1356
3177 -1356 485 990 1116 1021 55 -1264 -969 -701 -301 845 1097 357 388 -458 -990 -423 -44 122 655
3196 655 956 -248 -347 -119 -397 148 679 201 -83 -287 -915 -218 1047 663 70 344 -660 -1114 -638
3215 -638 89 307 1098 908 -333 -790 -1040 -998 98 860 1061 1163 384 -851 -901 -637 -677 299 1313 621
3235 621 21 -104 -1147 -1238 -68 10 956 1387 434 -317 -574 -585 -491 325 468 552 545 10 -454 -96 101 -131
3257 -131 209 -19 -406 -94 26 -350 279 713 110 -378 -262 -811 -384 545 436 946 1105 -430 -1218 -563
3277 -563 -537 139 1204 1178 315 -36 -822 -1476 -905 -11 541 1190 927 -137 -654 -678 -944 -141 847 847 825
3298 825 258 -576 -865 -411 -421 4 958 100 -356 165 -553 -381 259 350 54 140 -133 -595 52 479 89
3319 89 657 180 -916 -584 -764 -264 376 1225 406 125 -648 -1407 -1010 116 490 1031 1138 57 -747
3338 -747 -882 -1177 -455 1049 1246 990 505 -453 -1456 -976 -299 253 878 1106 -12 -268 -444 -1018 -408
3357 -408 572 455 735 489 -449 -470 116 -112 304 631 -63 -612 -401 -511 -277 766 611 -41 167 -828
3377 -828 -1082 222 439 804 1050 165 -683 -881 -1088 -580 435 1291 1055 454 -169 -1269 -1354 -93 -45
3396 -45 1144 1286 485 -469 -511 -1141 -954 554 528 550 756 -390 -977 -609 -565 -255 422 683 112 -176 -192
3417 -192 -451 99 453 20 190 -81 -442 -241 310 124 595 548 -297 -667 -259 -676 9 1067 781 109
3437 109 -34 -764 -1126 -177 -11 643 1305 678 -413 -517 -775 -942 0 869 940 866 184 -858 -1009 -613
3457 -613 -626 275 853 206 160 87 -693 -766 61 66 85 605 62 -73 17 -46 -240 254 66 -360 -67 -195 -380
3480 -380 286 336 -7 277 -372 -893 -615 84 278 706 569 -172 -670 -614 -897 -416 783 1023 800 600
3500 600 -412 -957 -683 -358 158 1109 1002 144 -65 -1132 -1096 -357 282 498 1193 611 -320 -614 -389 -444
3520 -444 370 654 238 375 29 -566 -416 288 44 139 131 -204 -590 126 -68 321 830 462 -141 -417 -467
3541 -467 -779 284 692 494 624 -54 -872 -943 -415 162 795 1128 486 -90 -619 -1433 -671 205 644 889
3561 889 839 -230 -821 -497 -677 -223 920 806 227 147 -538 -600 -419 29 253 637 58 -714 -436 -247
3581 -247 -71 361 506 -72 11 -17 -515 -1 591 361 202 209 -626 -878 -122 197 415 981 424 -129 -267
3602 -267 -909 -698 173 675 654 817 -37 -725 -960 -393 -87 680 983 380 713 -529 -1020 -544 -2 353
3622 353 686 1003 275 -486 -267 -420 -267 503 263 105 -23 -337 -666 50 -2 -100 412 60 -306 -11 39
3643 39 -103 474 513 -193 -153 -175 -664 70 412 336 427 192 -532 -680 -602 -396 162 821 613 187 -112 -732
3665 -732 -915 -225 348 503 1002 643 -325 -672 -448 -305 309 579 386 414 4 -735 -470 -388 -132 255 520
3686 520 -99 -94 -240 -347 -191 249 -149 79 319 -317 -354 141 145 151 654 87 -286 -294 -134 84 584 740 112
3709 112 57 -583 -947 -562 48 506 650 520 -108 -487 -689 -813 -59 662 811 726 430 -563 -673 -643 -487
3730 -487 128 764 487 21 -420 -649 -833 -64 428 298 617 98 -276 -31 26 -231 550 501 -162 -356 -207
3751 -207 -517 -96 530 398 -24 -127 -577 -603 207 117 355 949 114 -730 -528 -501 -383 748 1036 286 345
3772 345 -465 -1083 -597 -102 283 717 831 106 -282 -737 -842 -571 481 630 719 407 -287 -434 -525 -275
3792 -275 184 752 566 56 -148 -428 -472 192 251 55 145 -65 -238 -69 78 227 484 231 -261 -470 -220
3813 -220 -235 275 758 415 76 -13 -401 -863 -129 178 478 810 307 -141 -340 -572 -874 248 776 450
3833 450 454 112 -527 -336 -363 -156 593 821 14 124 -152 -562 -411 506 62 282 262 -288 -327 -83 -295 193
3855 193 361 -28 -71 -140 -353 -129 402 204 198 55 -317 -284 -187 -2 465 675 409 -42 -432 -533 -588 38
3877 38 570 524 545 107 -577 -702 -84 -267 103 967 545 122 101 -541 -770 -82 400 517 765 61 -202
3898 -202 -295 -349 -372 405 387 36 188 105 -385 4 337 -89 56 110 -161 14 -52 -195 101 227 186 -49 -342
3921 -342 -363 -234 471 516 273 451 -488 -661 -455 -125 262 715 577 211 -183 -322 -612 -411 199 421 654
3942 654 510 -228 -339 -446 -365 27 596 352 387 210 -502 -597 -184 44 10 468 90 -325 -100 -392 -302 144
3964 144 337 39 -42 -7 -51 219 344 211 285 -98 -553 -354 -136 -70 270 536 47 -160 -277 -469 -212 303
3986 303 366 453 451 -44 -429 -455 -469 73 752 653 456 311 -387 -604 -359 -189 126 398 568 -173 -243 -234 -445
4009 -445 -71 465 28 277 89 -234 -394 86 245 -94 314 64 -77 -139 -185 -224 305 163 -93 -311 -363
4030 -363 -571 186 443 495 285 -32 -514 -483 -424 -55 369 614 237 195 -197 -661 -393 54 139 502 548 58
4052 58 -178 -429 -456 -257 172 188 138 430 -300 -345 -207 -13 -13 499 493 -145 -61 18 21 16 456 -44 -5 74 -119 -81
4078 -81 472 18 60 268 -231 -228 -97 -79 -16 358 213 11 -19 -500 -607 -162 93 216 467 391 -362 -79 -371
4101 -371 -281 -289 477 244 488 132 -536 -433 -297 -176 352 423 421 111 289 -407 -646 153 371 365 330 -13 -336
4124 -336 -248 -155 -228 285 275 -112 -16 25 -35 77 143 173 -312 155 -199 -143 17 -171 334 538 94 -340 -390 -189
4148 -189 -212 147 486 123 130 -373 -527 -242 -262 215 729 519 145 -64 -683 -509 -66 8 429 525 436 -330
4170 -330 -446 -165 -330 122 577 148 -183 101 -323 -212 112 83 -52 -45 -111 -334 -36 173 122 220 -35 -68
4192 -68 -17 35 -331 247 509 110 58 -269 -710 -187 -24 181 626 646 137 -368 -390 -391 -222 58 163 607 483
4215 483 -166 -355 -277 -233 85 348 509 169 62 -530 -407 32 165 159 273 160 -68 -106 -154 -150 10 271 189
4238 189 86 68 -287 31 481 191 -39 58 -381 -360 -28 16 142 325 -224 -390 -125 -419 -265 86 506
4259 506 130 343 20 -439 -634 -168 -143 188 453 141 225 -211 -276 -152 199 235 292 205 -62 -279 -443 -1
4281 -1 11 59 166 221 266 -104 -365 92 -19 -36 129 -192 -225 237 79 51 328 109 -30 -93 -129 -458 -191 7
4305 7 -33 213 159 -95 -250 107 -210 276 280 393 15 -75 -227 -343 -70 160 207 347 301 -275 -272 7 -111 283
4329 283 258 236 445 -106 34 -304 7 86 98 239 42 -9 6 -144 131 134 50 106 128 -198 -188 -63 17 128
4353 128 114 283 -389 29 -167 278 316 272 39 -291 -101 -282 -69 -89 407 402 133 20 -256 -86 -139 -235 201
4376 201 455 43 197 -225 -236 76 -127 401 417 132 -159 -137 -65 -114 17 277 -50 -11 17 -537 -180 196
4398 196 -45 224 30 -5 -139 -77 -176 5 193 147 -35 -164 -327 -61 170 -15 279 295 -43 -309 -175 -66
4420 -66 135 256 237 36 104 -210 -346 -300 -43 14 292 164 -76 124 -118 -238 46 49 237 73 163 -182 -341
4443 -341 -294 62 105 200 -72 59 188 44 -162 31 -37 297 48 -84 -392 87 220 84 51 94 -234 49
4465 49 -63 170 175 11 285 216 -200 -207 -214 -191 86 106 179 -75 -347 -132 10 61 216 302 258 -149 124 -137 -276
4490 -276 -93 -71 233 194 -71 82 -236 -210 -384 72 141 144 -70 31 -138 -37 247 58 222 -97 -225 -34
4512 -34 -37 72 356 255 -161 253 -24 121 29 -15 211 -69 136 -276 -214 -258 -223 -69 265 245 -48 -80 8 4
4536 4 -93 104 312 340 292 -150 12 -358 -237 167 146 147 -51 -115 -316 -123 -153 -34 51 260 36 -23 94 -166
4560 -166 70 88 -96 -65 188 -308 68 104 -83 -28 330 91 -152 -98 -160 -113 227 158 272 -107 -158 -426 -113
4583 -113 108 -191 344 54 -81 11 52 6 -30 240 76 189 96 92 -190 -16 -96 91 280 -86 -124 -25 -131
4606 -131 -269 64 -61 239 262 74 -38 -25 -293 -64 222 -85 74 23 -188 -209 309 233 143 -78 -39 -206
4628 -206 -269 78 -142 10 258 5 -86 -144 18 -58 130 328 171 28 -92 -412 -176 104 105 245 90 29
4650 29 94 109 -164 8 -10 311 139 161 -2 -297 -134 -26 136 154 -105 71 88 -170 -170 151 162 293 107
4673 107 -211 90 -283 -135 -73 133 248 -138 -169 -140 -4 -11 43 231 92 49 -265 -6 194 212 176 400 86
4696 86 27 28 -162 -65 208 225 126 127 -193 -70 -160 48 -263 -186 168 -83 22 -203 -48 140 35 21 213 152
4720 152 -47 -39 -6 -245 -7 -114 14 282 -34 -72 -312 25 -87 169 282 48 -233 173 12 140 193 -6
4742 -6 164 152 -103 -384 31 -77 86 30 61 -105 -418 -357 -222 -118 104 239 -27 -310 -303 -75 -282 212 7
4765 7 89 -277 -234 -232 -71 157 6 -115 201 4 -106 61 166 192 -40 93 34 43 97 63 -3 133 40 -24 -224
4790 -224 -103 -107 -156 163 -78 -140 -163 -78 -128 -269 141 179 255 -72 -67 -4 -268 -102 90 182 13 166 -126 -94 -26
4815 -26 -172 147 274 103 -4 -173 -65 -159 -168 -180 -76 -93 -152 9 -101 48 -199 149 5 -335 31 78 16
4838 16 -125 308 212 -41 54 42 60 -5 -33 218 209 129 -89 -102 -152 -394 142 -185 -180 84 115 71 -185 -178 36 0
4864 0 247 160 26 -55 90 103 -27 38 113 190 -101 156 -43 -232 -101 4 285 -140 36 -162 -112 69 52
4887 52 101 29 -78 264 201 -2 -230 165 90 97 -143 -152 -111 -81 107 112 100 67 -64 -27 52 -93 181 -61 -184 33
4913 33 -59 -109 -170 220 114 -16 202 -65 -40 136 -135 -10 110 -77 40 -70 64 23 -80 195 24 102
4935 102 132 69 126 156 -123 166 364 -93 135 -18 -140 -54 47 -40 137 5 -147 140 198 -125 -62 160 183
4958 183 -204 -156 -72 14 -114 30 104 171 -88 -251 197 -120 12 127 60 -87 -76 -254 33 -192 34 -169
4980 -169 -67 195 254 -69 145 -138 -127 102 191 31 54 -2 -172 41 41 -26 30 -216 -98 -141 180 15 60 221
5004 221 70 200 -37 18 -339 88 103 160 166 64 43 -315 -270 169 85 215 -37 -110 -431 -261 75 -185 -116
5027 -116 197 124 -221 -136 59 -118 19 72 37 -211 -182 -130 -100 -55 -56 143 91 -100 -202 -153 92 -58 86 135
5051 135 70 1 38 -67 -22 168 9 136 185 -247 -167 -218 -46 42 -29 -23 -65 -404 -250 3 237 -117 -32 -73 60
5076 60 18 -238 -118 -44 -112 206 218 -80 -108 -258 -47 321 -123 46 144 -190 90 -54 -36 24 -68 -329 259
5099 259 68 -56 -7 156 -216 -19 -76 -188 -210 15 122 -55 432 11 -186 1 -278 41 -44 220 122 238
5121 238 177 -30 -21 14 14 202 62 -60 -12 52 -232 -17 -142 -52 -26 58 161 -231 -11 -405 -102 93 -83 63
5145 63 -70 -104 -58 -112 -10 -135 34 29 -208 -2 -33 -32 -139 387 -31 -8 -153 -202 -244 -198 -22 57 156 53 -164
5170 -164 30 -12 232 189 112 5 -23 -255 -17 -18 -40 71 25 -83 53 -125 -126 82 4 154 81 -14 -154 -204 204
5195 204 -177 42 289 182 91 121 -4 62 -91 -26 160 -19 66 46 -137 -73 112 164 58 64 224 -105 -24 -46
5219 -46 -102 140 -57 -175 68 -100 47 -99 158 52 -163 -193 150 -174 156 25 -149 170 -103 -154 -53
5240 -53 -91 -47 -77 103 402 -24 -87 -79 -326 38 102 39 76 34 -120 -81 -119 -57 -346 333 224 -1 -87 -153 -64 44
5266 44 42 -55 123 -15 -81 -277 -106 20 197 -40 37 -49 -84 -25 94 27 222 -109 90 -112 -205 -101 -55 -96
5290 -96 123 -3 42 -178 -279 -153 327 105 88 75 184 -48 -135 -83 -2 -1 141 4 179 169 -147 -80 -40 46
5314 46 5 -72 106 -11 -82 25 56 96 133 -91 232 143 180 56 167 131 134 125 -128 76 -124 17 128 93 197
5339 197 -182 -21 2 -124 190 46 154 126 51 -119 -215 -70 37 -31 -74 -156 -214 -140 -261 141 101 38 183 113
5363 113 -255 38 -10 -186 35 -130 -100 84 -211 -143 -172 -30 12 114 -61 33 -186 -103 -111 12 85 -43 -150
5386 -150 -208 -150 -181 68 -20 335 169 -205 -169 -129 19 -93 78 112 79 166 -90 -272 -33 -5 -3 364 44 140
5410 140 44 -16 -72 -22 234 206 -76 187 -172 -83 74 -202 69 38 -166 124 -116 -99 -170 373 339 -64 4 -44
5434 -44 -32 -60 -63 -16 91 -53 -100 -15 149 -64 179 26 -155 -102 18 -109 70 58 56 149 215 -131 -341 -226 31
5459 31 1 156 44 -48 -20 -23 -219 -76 112 59 -143 184 236 -123 -109 -304 215 24 186 81 -164 41 18
5482 18 -276 127 114 155 -144 -47 -17 -246 180 235 75 -183 -352 66 -67 -43 -140 -28 55 -121 -78 -1 31 -301
5506 -301 -65 173 -283 82 11 -171 -210 -105 -103 126 315 112 -224 -219 -335 94 123 -35 -100 82 -132 -355 -176
5529 -176 -105 -144 136 178 -129 84 -352 -47 25 73 -37 -34 218 -270 -110 65 120 98 162 -68 14 12 -111 -41 108
5554 108 31 176 149 -320 86 99 40 -77 425 211 -214 -288 -125 65 119 -45 -11 1 -44 -279 -115 -16 -63 -138
5578 -138 437 26 -189 -52 -62 -189 226 -111 -138 5 -147 162 95 85 30 79 42 -76 -138 68 -242 174 209
5601 209 111 40 -238 1 121 303 290 184 32 -104 247 -56 -19 -53 174 50 19 193 -211 -371 -188 70
5623 70 127 -59 80 -31 6 -136 -288 43 -28 86 280 186 -149 1 -257 2 85 193 82 -63 97 -16
5645 -16 -41 -56 102 81 35 238 -384 73 60 166 122 71 -256 -132 -49 120 307 -6 27 80 55 -232 -116 177
5669 177 115 -7 -137 115 -139 -131 -268 -8 231 104 50 164 -173 -335 -280 -399 107 188 117 -33 132 -141
5691 -141 -194 -226 35 217 28 78 -222 -112 -41 -214 -28 43 176 -115 70 -24 -91 -44 52 22 121 -239 -110 57
5715 57 -79 8 74 227 -45 -6 -178 -63 -280 185 242 118 225 -361 38 -169 -136 225 116 9 -255 -122
5737 -122 -282 108 223 167 211 164 50 -120 5 247 12 89 296 43 35 21 -86 -43 74 -129 155 274 76
5760 76 -98 -58 -27 -49 91 -163 -151 73 -39 -143 40 16 -179 135 -28 -184 107 25 134 167 175 -175 81
5783 81 -223 -209 -214 5 72 146 -162 -27 -94 -31 67 -19 229 286 -18 74 -86 -44 -81 -8 266 258 -29 101 100 -254
5809 -254 -24 91 58 36 136 -4 -14 -215 -55 -150 -184 96 -151 104 100 -12 360 -43 246 -131 -189 57 -170
5832 -170 100 -25 96 239 -17 -242 -80 -109 -25 177 179 -14 170 -117 -401 -87 60 -51 308 111 -148
5853 -148 -276 50 -83 21 95 27 -182 -129 -84 -224 15 294 -139 243 77 148 -51 141 96 171 -303 -87
5875 -87 104 115 189 -48 130 78 -38 -35 -320 -291 -83 -32 89 78 -25 79 -32 -35 0 100 26 121 77 -38 90
5900 90 -142 133 54 267 -15 244 12 -59 -131 -237 -111 64 -17 107 31 -63 -38 -131 151 235 146 5 -68 -201
5924 -201 -25 -97 -159 132 153 -36 -121 -20 -335 77 111 118 -166 -37 -361 -364 19 87 -14 -57 122 -101 -115 -53
5948 -53 -290 -14 152 125 57 -129 -100 -14 206 -69 35 384 -29 2 -29 -20 47 -189 259 92 34 140 -50 -48
5972 -48 -277 -231 275 34 91 -95 -170 -110 128 154 -9 96 21 153 132 117 -276 105 53 -184 10 -16 -37 4
5996 4 73 277 143 141 -239 206 64 -54 -190 -29 241 -93 -83 -33 -6 253 152 -8 214 -96 -69 133 18
6019 18 58 33 69 206 -78 -66 -335 -97 26 201 -120 -50 -23 -26 79 82 210 320 -6 -81 -92 -267 229 120
6043 120 48 -170 -195 11 -100 -62 -82 179 45 77 -3 -14 17 -311 -38 125 94 161 117 -226 5 -44 -2 63 127
6068 127 -1 70 -17 -69 -111 244 52 215 112 112 -159 -182 -260 -133 195 289 -85 91 -303 4 -52 196 -55
6091 -55 -289 140 1 98 -151 78 54 167 103 125 94 -41 169 160 79 2 7 37 -307 -20 -106 2 78 166 -173
6116 -173 -68 -30 -52 -67 135 126 254 44 -195 32 -404 -129 -127 317 -54 -14 -64 -458 -344 -129 78 92 -16
6139 -16 -64 6 -107 5 30 -33 44 79 81 -219 -104 -42 47 -90 199 -129 -237 109 -140 -38 104 186 -94 242
6163 242 -221 -243 -32 278 284 126 54 -264 -121 -302 -363 -181 124 -8 130 262 -78 -373 32 93 -64 241
6185 241 165 -147 -214 -14 -148 48 261 -93 189 -7 -171 27 188 -197 -204 223 -206 -43 -122 65 118 106
6207 106 218 -115 164 -209 -158 16 318 160 -40 68 -221 -467 83 40 19 127 60 -214 -54 -39 -438 39
6229 39 -222 139 126 -230 -115 -175 -151 181 46 -72 64 -13 21 -284 -188 221 -117 178 71 -24 97 -211 64
6252 64 92 298 48 64 37 -341 -63 241 59 164 178 13 27 22 -115 16 361 -27 -88 -14 46 -146 104 17
6276 17 186 354 63 -17 -106 -50 -3 -138 176 81 2 50 -145 25 -211 180 82 104 131 -71 164 15 -322 42
6300 42 -6 47 123 62 -36 115 224 283 13 -187 -38 22 -39 57 122 188 226 -42 -54 -243 356 206 53 99 163
6325 163 76 -23 -9 21 26 78 80 -30 -74 -192 -82 145 73 51 290 181 275 44 -95 -175 139 -106 72 27 -11
6350 -11 -265 -184 -146 -330 127 177 -98 162 -137 -55 -9 77 148 -27 -10 29 -194 124 102 15 -50 12 -124 -82 226
6375 226 -41 -34 -43 -42 -203 32 -55 -373 214 15 58 347 -246 -160 -82 -254 -113 102 278 77 273 -145 -244 -157
6399 -157 -52 25 101 51 13 21 -293 -63 -78 -2 -18 -4 84 -23 -131 -135 -203 -55 54 -229 153 -57 -84 129 99
6424 99 -32 88 -36 -372 138 6 13 -15 0 -104 -68 -414 -13 111 16 -77 58 -99 -47 -166 -222 84 36 212
6448 212 137 149 -81 -160 -108 -70 198 150 12 43 -90 -134 -78 201 -20 276 325 18 23 -93 -62 127 236 331 -5
6473 -5 -26 -202 -32 142 -135 -156 -91 -189 33 50 -129 -191 151 8 194 -30 -207 -116 -129 -313 96 175 77 62
6497 62 -165 -186 14 102 106 -162 205 -71 -248 -121 -97 -143 -93 261 -111 12 18 -196 -127 100 -29 127 192 4
6521 4 -245 140 -4 122 245 71 287 20 -270 -56 192 -146 102 157 7 12 -193 -75 139 -107 144 173
6543 173 -26 -28 -257 -49 266 -10 280 101 -37 -49 -171 28 -65 68 -49 142 168 -238 -268 25 40 28 141
6566 141 64 -197 6 59 36 -72 213 69 216 -113 -35 -16 150 -172 -110 208 -240 -6 -203 -70 -80 -48 96
6589 96 36 -113 -168 -87 137 136 203 105 -176 -44 20 -201 -62 108 231 -47 -98 -99 -207 -118 -80 78 58 -35 -2 -76
6615 -76 -49 -131 -78 92 155 40 22 -191 -111 96 -353 35 315 20 -70 -18 -188 -133 56 -30 117 130 -47 -171
6639 -171 285 95 71 270 7 -349 -118 39 83 17 226 137 75 7 -295 -258 -209 208 257 149 -33 -302 -161
6662 -161 -104 155 42 29 -44 -93 -221 -134 -245 109 217 -145 154 -100 -205 -35 -31 139 31 90 214 -57 4
6685 4 -208 -78 -107 84 10 -180 23 -237 -113 -96 -18 227 79 11 -114 -114 -13 70 -132 301 209 -123 -121 -39 -162
6710 -162 143 105 -70 56 -182 -32 -41 -39 -69 149 50 91 -99 14 -176 -102 27 -100 -28 -185 91 -99 277
6733 277 79 -93 97 286 -19 148 22 -142 -119 -45 136 -6 -61 44 31 46 4 13 46 -335 -60 -301 -52
6756 -52 102 -23 57 259 -99 -78 -297 -47 138 -34 177 26 232 -25 -141 -260 -235 257 14 251 289 210
6778 210 39 0 135 121 48 -183 -80 -103 -190 -247 -81 -96 193 310 118 -161 -73 -145 90 73 83 -32 -112 -96
6802 -96 -54 17 12 81 -232 155 -37 -60 -13 -168 -36 102 37 -96 242 -51 -41 -29 -116 -62 -57 64 -221 72 -158
6827 -158 180 -29 11 88 -14 -158 -345 83 36 277 128 202 -197 -128 -67 -14 55 162 123 -189 18 -172 -9
6850 -9 16 1 118 -52 54 -189 -18 -46 145 10 34 -67 9 -147 -65 51 82 237 9 -76 -317 -109 -65 52
6874 52 272 20 158 -42 -123 -125 -102 -45 -40 95 -53 -213 270 80 102 194 256 220 -158 -154 -94 104 -19 204 156
6899 156 49 -134 -4 -101 -17 265 -11 267 -223 41 84 -121 3 96 294 -93 39 -42 -120 -19 168 -53
6921 -53 -76 157 -188 -177 -104 71 -135 240 146 245 -17 -219 -147 -75 -234 29 241 13 -67 -91 34 -47 -10 2
6945 2 37 -55 25 -103 -101 -64 127 112 -86 70 67 -20 59 217 102 53 27 -146 3 -93 -11 -67 414 45 267 0
6971 0 -67 -169 143 228 91 -34 -87 -243 -32 -27 -38 171 98 92 44 -197 -223 -123 -31 -43 75 -46 -5 -362 79
6996 79 6 -137 78 0 234 150 -158 -79 -174 -356 -6 227 34 -157 -359 -71 68 207 92 -158 120 -39
7018 -39 -91 -64 134 -73 119 175 35 -202 202 51 -121 57 169 -2 349 -3 -48 131 205 45 259 -91
7040 -91 -94 -44 -60 75 27 84 288 -30 26 -115 -157 -25 -41 -95 374 150 -181 152 -155 131 -78 23 -207 57
7064 57 -37 53 -158 40 -7 17 4 162 94 -52 112 153 -39 88 -106 6 -135 -57 -195 -55 138 99 263
7087 263 -54 -36 -129 87 -169 -45 -114 -217 -221 -116 -29 -135 101 282 -109 -39 193 -263 -75 -2 287 113 33
7110 33 -19 -81 175 -90 54 -85 227 68 62 75 -61 -25 194 153 54 107 19 -185 -29 -127 88 -51 115 226
7134 226 -6 -18 97 235 21 -39 -2 110 -95 229 2 195 65 202 -134 -179 -139 -164 -112 297 178 161 71
7157 71 -76 48 36 -31 5 300 79 -89 -226 80 -78 -37 -50 -162 19 -232 -21 -253 102 174 -5 -110
7179 -110 12 -5 -133 -151 150 172 145 -22 121 -101 -50 -7 -181 83 157 46 -78 -174 -114 145 -135 189 141
7202 141 10 -114 16 -131 -98 73 -28 336 -39 -193 40 -28 -42 -5 -17 80 -24 -13 -105 -50 121 313 5
7225 5 124 9 -123 235 149 219 -26 -87 215 -98 -473 -208 20 68 -15 183 52 133 27 -202 -42 279 -25
7248 -25 -17 -98 -305 75 -155 -104 156 271 10 26 19 -25 142 -116 87 3 -39 -39 -167 -284 -130 -229 37 57 -32
7273 -32 -292 -20 -214 -66 33 245 93 -144 30 -65 -158 -43 26 -42 -86 -46 188 121 27 -146 12 -154 42
7296 42 80 -215 -15 99 269 124 184 -155 276 -146 -199 -105 257 51 19 43 -30 8 -56 -226 42 121 176 219
7320 219 -80 -94 -415 -57 195 41 -52 -39 -237 33 -156 96 211 95 249 11 266 -267 0 109 -96
7341 -96 -126 -95 69 -38 9 -196 237 170 26 -113 -219 -97 -11 -35 210 185 -91 -124 -248 -259 -91 70 -69
7364 -69 -53 -158 -222 -78 -251 -92 -137 95 -96 161 -152 -287 101 44 111 304 104 -9 -46 -6 -266 -229 55
7387 55 -70 145 85 95 -180 -4 -99 191 -185 -273 -119 -131 -118 -63 59 129 91 107 -20 -67 32 -148 -71 249 -338
7412 -338 -104 -19 -129 -134 -76 -32 39 175 -217 -156 -282 -158 15 81 107 156 -257 -17 -109 31 134 17 37 -15
7436 -15 -148 -124 98 -281 -294 189 13 44 110 -268 -81 0 70 -49 -7 -22 -122 -102 58 -111 97 -3 -348
7459 -348 -5 -9 -71 -43 23 -164 65 -82 150 -86 -102 -362 -167 86 153 241 -68 -252 -161 -6 99 -171 115
7482 115 94 -24 -16 132 -147 20 13 -97 228 -362 -211 -23 128 -43 172 56 97 41 -44 -171 -80 197 -86
7505 -86 -32 -267 -50 3 -45 -186 -41 61 177 -229 -181 74 147 85 32 -157 -40 -385 -22 -56 -47 16 122 -26
7529 -26 -47 -128 -90 -118 188 246 -86 341 41 -299 -130 123 -196 99 122 80 -17 256 -139 -102 166 143 111 -76
7553 -76 -290 -187 -30 -70 -214 -50 295 -1 -130 134 -24 -113 57 -205 -103 -167 -80 -74 -75 -111 218 244 -38 -271
7577 -271 134 -147 42 127 6 114 -92 -138 -4 -160 113 81 228 179 -107 -169 -166 98 167 14 49 205 -33
7600 -33 28 -16 126 -116 -141 277 -36 97 -88 54 49 50 60 -208 212 -138 21 349 -6 65 48 -71 209 -57
7624 -57 -152 -230 -45 -144 -39 -229 -118 117 80 -35 17 56 195 -5 73 152 -64 -79 235 226 122 -33 -209 -41
7648 -41 -432 -66 -9 -169 -184 33 -53 -23 -14 44 210 94 18 -141 -105 -59 299 -58 27 207 -124 49 78 -79
7672 -79 12 162 -321 -29 37 -221 -37 35 -130 7 -39 372 -20 -82 12 -142 136 29 -50 -95 -4 -263 -149
7695 -149 -69 -210 42 150 -331 -198 51 -274 58 -36 -21 84 160 -113 -76 115 65 86 266 -39 -68 61 -65
7718 -65 -225 229 -22 98 50 5 -181 32 191 -41 179 25 -19 63 -57 -66 -1 75 90 -45 164 1 125
7741 125 -14 -117 151 117 -53 -104 -257 -296 -9 4 -40 93 326 74 -9 -164 -52 101 34 -3 189 233 119
7764 119 -127 -86 -242 75 87 191 50 -136 -41 -45 -169 1 1 79 -96 -74 -46 175 -150 367 50 -190 -238 -15
7788 -15 -192 74 336 -18 -206 45 -151 36 48 -10 85 82 -92 56 -78 50 -314 142 163 17 -13 123 5
7811 5 -99 138 49 168 81 39 11 323 106 14 119 -33 127 -60 -258 -27 -141 -133 114 -127 128 -85 -83 46
7835 46 -308 128 173 -34 -48 -29 -116 179 210 -11 142 246 -14 -165 -117 -95 217 116 -43 -250 -151 -99 -294
7858 -294 156 228 60 -174 67 -175 77 -144 8 -100 63 -20 45 67 -292 25 53 144 109 124 -103 -41 -85
7881 -85 -44 157 -35 75 111 56 -146 -118 64 42 -208 -66 -216 -170 1 -284 -113 175 166 67 258 175 -125 -105
7905 -105 1 324 30 91 125 -22 133 -352 -20 -10 34 -197 65 -75 -153 9 -208 -53 202 71 182 183
7927 183 -40 19 -357 28 126 43 50 108 -4 -53 -22 -114 165 -134 -144 164 -9 -137 63 -52 -63 -108 -15 76 85
7952 85 27 -37 20 14 -175 40 16 7 100 251 -68 -65 -115 -212 -17 16 -33 520 149 161 122 -230 -180 89 -224 20
7978 20 244 -223 -176 -224 211 29 -8 -49 124 25 -80 28 -125 0 107 -73 27 45 44 166 -34 51 238
8001 238 204 -34 -162 -231 -59 5 196 97 -160 -94 -43 -156 246 -88 -71 258 -19 -204 -79 40 -277 95
8023 95 175 147 -185 57 -40 -72 -72 -138 66 103 -43 15 -82 -4 102 -122 109 259 -69 -31 -108 113 -112 128 75
8048 75 -137 -19 3 -154 -214 -99 -168 69 -51 -23 -88 -143 23 -55 246 226 196 -200 -21 -180 -173 196 154 162 -156
8073 -156 12 -336 -47 122 157 170 47 -224 4 -68 -133 123 35 178 -50 -2 -307 -226 48 -208 55 32 116
8096 116 62 -208 -19 -142 156 -9 97 -4 68 -202 -31 -35 -61 -51 -48 163 -58 83 -69 176 95 2 -25 7
8120 7 -36 -250 -95 -151 39 145 6 -269 -122 -26 -63 9 186 16 235 13 -79 151 -169 132 49 111 75 -125
8144 -125 -108 -86 69 55 12 -29 46 185 -26 -34 154 70 33 -195 65 -98 -6 109 113 42 6 -91 -105 10 54 -30
8170 -30 -103 9 -71 -254 -29 -121 65 203 113 -13 106 -5 -269 96 -109 37 54 179 -6 70 9
8191I
##END NTUPLES=NMR FID
##END=
