##TITLE=1H_CA-8532-3
 CDCl3, 8 sc, 
 18.1.2019
##JCAMPDX= 6.0         $$ Bruker NMR JCAMP-DX V2.0
##DATA TYPE= NMR FID
##DATA CLASS= NTUPLES
##ORIGIN= UXNMR, Bruker Analytische Messtechnik GmbH
##OWNER= root
$$ XWIN-NMR		Version 3.5
$$ Fri Jan 18 13:53:41 2019 Russian Standard Time (UT+4h)  she@DPX200
##.OBSERVE FREQUENCY= 200.1313
##.OBSERVE NUCLEUS= ^1H
##.DELAY= (6, 6)
##.ACQUISITION MODE= SIMULTANEOUS
##.ACQUISITION SCHEME= undefined
##.AVERAGES= 8
##.DIGITISER RES= 18
##SPECTROMETER/DATA SYSTEM= spect
##.PULSE SEQUENCE= zg30
##.SOLVENT NAME= CDCl3
##.SHIFT REFERENCE= (INTERNAL, CDCl3, 0, 15.7039)
##AUDIT TRAIL= $$ (NUMBER, WHEN, WHO, WHERE, WHAT)
$$ ##TITLE= Audit trail, XWIN-NMR		Version 3.5
$$ ##JCAMPDX= 5.01
$$ ##ORIGIN= Bruker BioSpin GmbH
$$ ##OWNER= she
$$ F:/spectra/data/she/nmr/H-F/1/audita.txt
$$ ##AUDIT TRAIL=  $$ (NUMBER, WHEN, WHO, WHERE, WHAT)
(   1,<2019-01-18 13:52:24.25 +0400>,<she>,<DPX200>,
      <created by zg, POWCHK disabled, PULCHK disabled
       configuration hash MD5:
       00 E9 B6 7A A2 85 ED C7 34 08 36 98 17 FE 4E 26
       data hash MD5: 16K
       76 CC EC 04 DD D5 1F D0 AB AA FF FF 05 4A EE B6>)
$$ ##END=
$$ 
$$ hash MD5
$$ 01 69 AC 06 E3 3A AE A8 46 4E 84 15 3E 09 2C E8
##$RELAX= 
##$RELAX= 
##$RELAX= 
##$RELAX= 
##$RELAX= 
##$RELAX= 
$$ Bruker specific parameters
$$ --------------------------
##$DU= <F:/spectra>
##$EXPNO= 1
##$NAME= <H-F>
##$PROCNO= 1
##$TYPE= <nmr>
##$USER= <she>
##$AMP= (0..31)
100 100 100 100 100 100 100 100 100 100 100 100 100 100 100 100 100 100 
100 100 100 100 100 100 100 100 100 100 100 100 100 100 
##$AQSEQ= 0
##$AQ_mod= 1
##$AUNM= <au_zg>
##$AUTOPOS= <>
##$BF1= 200.13
##$BF2= 200.13
##$BF3= 200.13
##$BF4= 200.13
##$BF5= 200.13
##$BF6= 200.13
##$BF7= 200.13
##$BF8= 200.13
##$BYTORDA= 1
##$CFDGTYP= 0
##$CFRGTYP= 5
##$CHEMSTR= <none>
##$CNST= (0..31)
1 1 145 1 1 1 1 1 1 1 1 1 1 1 1 1 1 1 1 1 1 1 1 1 1 1 1 1 1 1 1 1 
##$CPDPRG= <>
##$CPDPRG1= <>
##$CPDPRG2= <>
##$CPDPRG3= <>
##$CPDPRG4= <mlev>
##$CPDPRG5= <mlev>
##$CPDPRG6= <mlev>
##$CPDPRG7= <mlev>
##$CPDPRG8= <mlev>
##$CPDPRGB= <>
##$CPDPRGT= <>
##$D= (0..31)
0 1.2 0 0 0 0 0 0 0 0 0 0.03 0 0 0 0 0 0 0 0 0 0 0 0 0 0 0 0 0 0 0 0 
##$DATE= 1547805143
##$DBL= (0..7)
120 120 120 120 120 120 120 120 
##$DBP= (0..7)
150 150 150 150 150 150 150 150 
##$DBP07= 0
##$DBPNAM0= <>
##$DBPNAM1= <>
##$DBPNAM2= <>
##$DBPNAM3= <>
##$DBPNAM4= <>
##$DBPNAM5= <>
##$DBPNAM6= <>
##$DBPNAM7= <>
##$DBPOAL= (0..7)
0.5 0.5 0.5 0.5 0.5 0.5 0.5 0.5 
##$DBPOFFS= (0..7)
0 0 0 0 0 0 0 0 
##$DE= 6
##$DECBNUC= <off>
##$DECIM= 32
##$DECNUC= <off>
##$DECSTAT= 4
##$DIGMOD= 1
##$DIGTYP= 9
##$DL= (0..7)
0 120 120 120 120 120 120 120 
##$DP= (0..7)
150 150 150 150 150 150 150 150 
##$DP07= 0
##$DPNAME0= <>
##$DPNAME1= <>
##$DPNAME2= <>
##$DPNAME3= <>
##$DPNAME4= <>
##$DPNAME5= <>
##$DPNAME6= <>
##$DPNAME7= <>
##$DPOAL= (0..7)
0.5 0.5 0.5 0.5 0.5 0.5 0.5 0.5 
##$DPOFFS= (0..7)
0 0 0 0 0 0 0 0 
##$DQDMODE= 0
##$DR= 18
##$DS= 0
##$DSLIST= <SSSSSSSSSSSSSSS>
##$DSPFIRM= 0
$$ [...]
##$SUBNAM2= <"">
##$SUBNAM3= <"">
##$SUBNAM4= <"">
##$SUBNAM5= <"">
##$SUBNAM6= <"">
##$SUBNAM7= <"">
##$SUBNAM8= <"">
##$SUBNAM9= <"">
##$SW= 20.0189088683792
##$SWIBOX= (0..15)
0 0 2 0 0 0 0 0 0 0 0 0 0 0 0 0 
##$SW_h= 4006.41025641026
##$TD= 16384
##$TD0= 1
##$TE= 0
##$TE2= 300
##$TE3= 300
##$TEG= 300
##$TL= (0..7)
0 120 120 120 120 120 120 120 
##$TP= (0..7)
150 150 150 150 150 150 150 150 
##$TP07= 0
##$TPNAME0= <>
##$TPNAME1= <>
##$TPNAME2= <>
##$TPNAME3= <>
##$TPNAME4= <>
##$TPNAME5= <>
##$TPNAME6= <>
##$TPNAME7= <>
##$TPOAL= (0..7)
0.5 0.5 0.5 0.5 0.5 0.5 0.5 0.5 
##$TPOFFS= (0..7)
0 0 0 0 0 0 0 0 
##$TUNHIN= 0
##$TUNHOUT= 0
##$TUNXOUT= 0
##$USERA1= <user>
##$USERA2= <user>
##$USERA3= <user>
##$USERA4= <user>
##$USERA5= <user>
##$V9= 5
##$VALIST= <valist>
##$VCLIST= <CCCCCCCCCCCCCCC>
##$VD= 0
##$VDLIST= <DDDDDDDDDDDDDDD>
##$VPLIST= <PPPPPPPPPPPPPPP>
##$VTLIST= <TTTTTTTTTTTTTTT>
##$WBST= 1024
##$WBSW= 4
##$XGAIN= (0..3)
0 0 0 0 
##$XL= 0
##$YL= 0
##$YMAX_a= 167267
##$YMIN_a= -292125
##$ZGOPTNS= <>
##$ZL1= 120
##$ZL2= 120
##$ZL3= 120
##$ZL4= 120
##$ABSF1= 10
##$ABSF2= 0
##$ABSG= 5
##$ABSL= 3
##$ALPHA= 0
##$AQORDER= 0
##$ASSFAC= 0
##$ASSFACI= 0
##$ASSFACX= 0
##$ASSWID= 0
##$AUNMP= <proc_1d>
##$AZFE= 0.1
##$AZFW= 0.1
##$BCFW= 1
##$BC_mod= 2
##$BYTORDP= 1
##$COROFFS= 0
##$CY= 11.3945322036743
##$DATMOD= 1
##$DC= 2
##$DFILT= <>
##$DTYPP= 0
##$F1P= 18.9103706918063
##$F2P= -1.10871071338519
##$FCOR= 0.5
##$FTSIZE= 0
##$FT_mod= 4
##$GAMMA= 1
##$GB= 0.15
##$INTBC= 1
##$INTSCL= 1
##$ISEN= 128
##$LB= 0.24
##$LEV0= 0
##$LPBIN= 0
##$MAXI= 10000
##$MC2= 0
##$MEAN= 0
##$ME_mod= 0
##$MI= 1.114404
##$NCOEF= 0
##$NC_proc= 0
##$NLEV= 6
##$NOISF1= 3.799351
##$NOISF2= 2.8
##$NSP= 1
##$NTH_PI= 0
##$NZP= 0
##$OFFSET= 15.70392
##$PC= 1
##$PHC0= -9054.259
##$PHC1= 15.00004
##$PH_mod= 1
##$PKNL= yes
##$PPARMOD= 0
##$PSCAL= 0
##$PSIGN= 0
##$REVERSE= no
##$SF= 200.130013532006
##$SI= 16384
##$SIGF1= 3
##$SIGF2= 2
##$SINO= 400
##$SIOLD= 16384
##$SREGLST= <1H.CDCl3>
##$SSB= 0
##$STSI= 0
##$STSR= 0
##$SW_p= 3612.71676300578
##$SYMM= 0
##$S_DEV= 0
##$TDeff= 0
##$TDoff= 0
##$TI= <>
##$TILT= no
##$TM1= 0
##$TM2= 0
##$TOPLEV= 0
##$USERP1= <user>
##$USERP2= <user>
##$USERP3= <user>
##$USERP4= <user>
##$USERP5= <user>
##$WDW= 1
##$XDIM= 8192
##$YMAX_p= 0
##$YMIN_p= 0
$$ End of Bruker specific parameters
$$ ---------------------------------
##NTUPLES= NMR FID
##VAR_NAME=  TIME,          FID/REAL,        FID/IMAG
##SYMBOL=    X,             R,               I
##VAR_TYPE=  INDEPENDENT,   DEPENDENT,       DEPENDENT
##VAR_FORM=  AFFN,          ASDF,            ASDF
##VAR_DIM=   8192,          8192,            8192
##UNITS=     SECONDS,       ARBITRARY UNITS, ARBITRARY UNITS
##FACTOR=    0.0002496,     1,               1
##FIRST=     0,             0,               0
##LAST=      2.0444736,     0,               0
##MIN=       0,             -292125,         0
##MAX=       2.0444736,     167267,          0
$$ Real data points
##PAGE= N=1
##DATA TABLE= (X++(R..R)), XYDATA
$$ [...]
$$ plain form
1921 937 3773 2448 850 -442 -3898 -3979 -1062 472 3204 5367 2292 -1467 -2666 -3749 -3270 1146
1937 1146 3200 3456 3846 274 -3846 -3239 -2138 -1077 2141 3675 1885 492 -1142 -3784 -1893 650
1953 650 811 1347 2082 -30 -1336 -350 -769 271 1985 307 -911 91 -801 -1169 1313 1626 729
1970 729 472 -1855 -3296 -1132 421 1140 3135 2815 -579 -2277 -2517 -3038 -102 2849 2763 3110 1898
1987 1898 -2618 -4208 -2408 -1152 1470 3873 2596 659 -505 -3288 -4043 -987 1006 1915 3137
2002 3137 1445 -1018 -1739 -1755 -1494 1150 2231 861 582 455 -1607 -695 233 -224 758 1018 -1305 -1632
2020 -1632 -45 -32 746 2129 188 -1064 -1204 -2047 -985 1747 1944 1322 1732 -437 -2877 -2445 -1404
2037 -1404 345 3542 3596 712 -445 -2279 -4044 -2064 801 1689 2792 2556 -400 -2153 -2185 -2732 -683
$$ packed form
1921I37K836j325j598j292l456q1K917J534K732K163l075l759j199j083M79M416
1937A146K054K56L90l572m120O07J101J061L218J534j790j393j634k642J891K543
1953F50J61N36P35k112j306R86m19J040J714j678j218J002q92l68K482L13q97
1970G29k57k327j441K164J553P19J995l20l394j698k40n21K936K951q6L47j212
1987A898m516j590J800J256K622K403j277j937j164k783p55L056J993R09J222
2002C137j692k463p21j6K61K644J081j370k79j27k062R12R28m57R82K60k323l27
2020a632J587J3P78J383j941j252j40q43J062K732J97o22M10k169k440M32J041
2037a404J749L197N4k884j157j834j765J980K865Q88J103k36k956j753l2n47K049
$$ plain form
2054 -683 2808 2459 1464 875 -1562 -2381 -704 -487 276 2053 1384 -499 -752 -846 -1450 551 1132 24
2072 24 366 -473 -1640 20 1576 692 359 324 -1319 -1242 -536 -406 1501 3238 1173 -366 -1100 -2782
2090 -2782 -2591 340 1826 2103 2499 186 -2284 -2044 -2296 -1605 1429 2977 2212 1316 -730 -3192 -1925
2107 -1925 -294 239 1951 2609 611 -651 -820 -2198 -968 738 661 1236 1240 -613 -1587 -356 -222 16
2125 16 890 91 -866 -219 -368 -436 1197 1157 21 -115 -674 -1864 -302 914 1198 1828 1085 -1361 -2260
2144 -2260 -1321 -1306 446 2317 1726 1235 197 -2297 -2490 -915 170 1471 2977 1789 -423 -1357 -2209
2161 -2209 -1892 389 1575 1375 1770 601 -1623 -1669 -1258 -531 783 1373 395 42 -88 -1156 -435 773
2179 773 508 148 557 -608 -424 457 201 481 1334 39 -1088 -951 -1023 -433 1207 1489 469 147 -1145
$$ packed form
2054f83L491l49r95n89k437q19J677K17P63J777o69j883k53r4o04K001N81j108
2072B4L42q39j167J660J556q84l33l5j643P7P06J30J907J737k065j539p34j682
2090b782J91K931J486K77L96k313k470K40k52O91L034J548p65q96k046k462J267
2107a925J631N33J712O58j998j262j69j378J230J706p7N75Mj853r74J231J34K38
2125A6Q74p99r57O47j49o8J633m0j136j36n59j190J562J216K84O30p43k446q99
2144b260R39J5J752J871n91m91j038k494j93J575J085J301J506j188k212r34q52
2161b209L17K281J186k00L95j169k224m6M11P27J314N90r78l53j30j068P21J208
2179G73k65l60M09j165J84Q81k56K80Q53j295j127J37p2N90J640K82j020l22j292
$$ plain form
2198 -1145 -2432 -1078 111 743 2003 1905 27 -861 -1457 -1938 -625 1368 1665 1650 1241 -984 -1963 -1418
2216 -1418 -1052 455 1970 1352 70 -77 -1024 -1814 -410 371 704 1339 520 -746 -601 -383 -563 603
2234 603 868 -3 -263 -122 -643 -186 903 324 87 347 -1037 -980 32 260 997 1587 370 -759 -911
2253 -911 -1457 -546 1175 1435 888 972 -113 -1611 -1370 -858 -272 1382 2034 528 -78 -1016 -2047 -997
2271 -997 285 586 1397 1634 -157 -931 -790 -1213 -472 902 733 572 569 -676 -984 -132 119 -131 569
2290 569 164 -634 -301 83 -252 628 511 -197 -382 -630 -795 125 1045 727 539 300 -847 -1056 -521 -110
2310 -110 771 1715 838 125 -493 -1699 -1488 13 673 904 1540 247 -769 -908 -1109 -708 786 1292
2328 1292 830 890 128 -1182 -974 -78 -382 498 1025 154 -422 -307 -546 -357 521 53 134 156 -403 -644
$$ packed form
2198a145j287J354J189O32J260r8j878q88n96m81J313J993K97j5m09k225r79N45
2216a418L66J507J515o18j282j47r47p90J404P81L33O35q19j266J45K18j80J166
2234F03K65q71k60J41n21M57J089n79k37K60j384N7J012K28P37N90j217j129j52
2253i11n46R11J721K60n47Q4j085j498K41N12N86J654O52j506o06r38j031J050
2271i97J282L01Q11K37j791p74J41m23P41J374j69j61lj245l08Q52K51k50P00
2290E69m05p98L33L84l35Q80j17p08j85k48j65R20R20l18j88k39j147k09N35M11
2310a10Q81R44q77p13o18j206K11J501O60K31O36j293j016j39k01M01J494N06
2328A292m62O0p62j310K08Q96l04Q80N27q71n76J15k39J89Q78m68Q1K2n59k41
$$ plain form
2348 -644 203 239 -98 628 -333 -734 -497 -328 214 995 1101 -132 -301 -676 -1244 -166 615 587 1107 757
2368 757 -722 -1023 -817 -889 -97 1221 971 296 10 -808 -1183 -505 60 480 1390 803 -125 -173 -729 -966
2388 -966 45 480 301 574 57 -628 -432 -142 -340 83 431 -344 -224 195 -49 127 696 75 -99 -82
2408 -82 -690 -555 366 455 387 810 -161 -787 -336 -339 -296 603 672 427 290 -519 -1246 -827 62 587 825 916 22
2431 22 -603 -972 -1039 -357 526 490 638 552 28 -837 -285 -280 142 687 320 204 143 -246 -870 309 61 -72
2453 -72 208 42 -381 -117 -98 -173 536 281 -162 -280 -544 -223 253 679 88 281 42 -538 -693 -53 84
2474 84 547 827 405 -264 -573 -646 -511 349 546 445 713 312 -705 -688 -360 -85 619 620 132 75 -221 -771
2496 -771 -493 -30 62 455 267 161 -227 -336 -356 -338 362 57 35 284 -144 -116 105 -43 -86 79 65 -441
$$ packed form
2348f44Q47L6l37P26r61m01K37J69N42P81J06j233j69l75n68J078P81k8N20l50
2368G57j479l01K06p2P92J318k50o75k86q18l75O78N65M20R10n87r28m8n56k37
2388i66J011M35j79K73n17o85J96K90j98M23L48p75J20M19k44J76N69o21j74J7
2408h2o08J35R21Q9o8M23r71o26M51lM3Q99O9k45j37q09p27M19Q89N25K38R1q94
2431B2o25l69o7O82Q83l6J48q6n24q65N52NM22N45l67j16o1l89o24J179k48j33
2453g2K80j66m23K64J9p5P09k55m43j18k64L21M76M26n91J93k39n80j55O40J37
2474H4M63K80m22o69l09p3J35Q60J97j01K68m01j017J7L28K75P04Jm88n7k96n50
2496g71K78M63R2L93j88j06l88j09k0J8P00l05k2K49m28K8K21j48m3J65j4n06
$$ plain form
2518 -441 -267 178 -142 247 285 -183 -247 -453 -730 7 456 665 298 176 -266 -687 -292 -352 50 722 766
2539 766 142 -14 -449 -641 13 185 512 446 447 -327 -432 -489 -508 25 321 154 187 -327 -258 -238 -8 36 9
2562 9 407 191 -107 -123 40 86 293 -161 -232 -75 -297 -175 174 237 192 273 93 -625 46 40 86 165 488 312
2586 312 -173 -196 -658 -138 -1 102 557 481 -96 -424 -281 -668 -302 272 415 288 -17 -64 -290 -181 -74
2607 -74 99 271 105 33 82 -182 -213 -129 8 79 278 299 -343 -162 169 183 180 -118 -197 -151 -104 22 357 355 148
2632 148 155 -27 -391 -164 -95 393 224 295 99 -539 -216 -129 -220 99 436 577 289 17 -516 -437 257 210 404
2655 404 393 145 -136 -97 -136 -186 121 -13 291 138 -119 -81 -21 -69 101 242 35 -96 -28 -76 -161 -47 -125 -134
2679 -134 81 -276 -269 -151 228 -40 215 213 8 -280 -191 -254 27 332 237 16 58 -142 -300 -227 21 384 555
$$ packed form
2518d41J74M45l20L89L8m68o4k06k77P37M49K09l67j22m42m21L95o0M02O72M4
2539G66o24j56m35j92O54J72L27o6Jp74j05n7j9N33K96j67L3n14O9K0K30M4k7
2562IL98k16k98j6J63M6K07m54p1J57k22J22L49O3m5Q1j80p18O71oM6P9L23j76
2586C12m85k3m62N20J37J03M55p6n77l28J43l87L66N74J43j27l05m7k26J09J07
2607g4J73J72j66p2M9k64l1Q4J37P1J99K1o42J81L31J4lk98p9M6M7J26L35kk07
2632A48Pj82l64K27O9M88j69P1j96o38L23Q7r1L19L37J41k88k72n33P9O94m7J94
2655D04j1k48k81L9l9n0L07j34L04j53k57L8O0m8J70J41k07j31O8m8q5J14p8r
2679a34K15l57PJ18L79k68K55kk05k88Q9o3K81L05r5k21M2k00j58P3K48L63J71
$$ plain form
2702 555 261 86 1 -129 -348 51 223 135 428 22 -115 -199 111 -176 46 252 162 133 -12 -156 -50 181
2724 181 -36 48 223 -96 -288 -181 -182 -113 406 195 -155 44 10 -215 107 320 43 127 -211 -264 -207 275 62
2747 62 251 311 -37 -116 -369 -358 -129 348 360 196 163 14 -251 -194 -290 -152 294 380 21 -44 -146 65 -298
2770 -298 -174 112 199 -95 -39 69 123 32 118 133 -31 -1 -261 -112 -66 -33 -138 -129 -120 75 -37 -141 2 -153
2794 -153 22 1 -101 -22 8 49 209 129 271 90 67 -283 3 -135 -104 134 319 147 28 -118 -301 -171
2816 -171 121 109 142 125 -76 -193 58 -221 -88 -42 41 175 -100 47 -256 49 146 -56 -94 225 22 210
2838 210 -54 -120 -126 -205 -109 -112 118 133 -47 162 294 -125 -11 -37 -114 -275 -92 85 124 116 216 -74 -81 -144 -17
2863 -17 -16 162 207 -53 49 -247 46 -140 159 113 9 110 -123 -140 54 264 51 -28 117 128 -81 147 51
$$ packed form
2702E55k94j75q5j30k19L99J72q8K93m06j37q4L10k87K22K06r0k9j45j44J06K31
2724A81k17Q4J75l19j92J07jO9N19k11l50J99l4k25L22K13k77Q4l38n3N7M82k13
2747F2J89O0l48p9k53J1K29M77J2j64l3j49k65N7r6J38M46Q6l59o5j02K11l63
2770b98J24K86Q7k94N6J08N4r1Q6J5j64L0k60J49M6L3j05RRJ95j12j04J43j55
2794a53J75k1j02P9L0M1J60q0J42j81k3l50K86j38L1K38J85j72j19j46j83J30
2816a71K92j2L3j7k01j17K51k79J33M6Q3J34k75J47l03L05R7k02l8L19k03J88
2838B10k64o6op9R6lK30J5j80K09J32m19J14k6p7j61J83J77L9qJ00k90po3J27
2863a7JJ78M5k60J02k96K93j86K99m6j04J01k33j7J94K10k13p9J45J1k09K28r6
$$ plain form
2886 51 -191 148 435 110 -9 4 -22 302 -25 379 215 360 -268 104 -89 135 -29 24 56 4 198 -14
2908 -14 190 68 30 66 45 49 47 -248 41 21 273 140 -59 -173 -38 -108 44 79 -55 258 167 144 1 -254
2932 -254 65 80 -110 119 -4 -20 114 163 -82 -113 84 -128 -138 -263 96 101 47 -180 5 120 -11 -108 -201
2955 -201 194 -76 53 -14 -173 -64 187 -151 114 10 160 32 -72 180 13 127 77 -173 91 -161 -199
2976 -199 -61 -69 137 101 -11 -98 -57 -49 -188 42 -107 -68 -80 -236 142 -65 55 -45 -128 13 87 -152 -123 -81
3000 -81 31 -67 8 249 -51 -21 28 108 281 -92 53 39 -2 15 -66 -142 39 11 -14 -9 -415 94 -106 -236 102
3025 102 102 262 -216 -55 -180 -60 -55 -87 50 74 -354 -159 -50 -80 -55 15 206 -30 -157 -49 -217 -130 -170 -144
3049 -144 127 125 38 -22 -190 -78 -95 261 174 239 321 -230 -43 185 165 23 139 -231 39 -46 -74 216 72 193
$$ packed form
2886E1k42L39K87l25j19J3k6L24l27M04j64J45o28L72j93K24j64N3L2n2J94k12
2908a4K04j22l8L6k1Mkk95K89k0K52j33j99j14J35p0J52L5j34L13r1k3j43k55
2932b54L19J5j90K29j23j6J34M9k45l1J97k12j0j25L59Nn4k27J85J15j31r7r3
2955b01L95k70J29o7j59J09K51l38K65j04J50j28j04K52j67J14n0k50K64k52l8
2976a99J38qK06l6j12q7M1Qj39K30j49L9j2j56L78k07J20j00q3J41P4k39K9M2
3000h1J12r8P5K41l00L0M9Q0J73l73J45j4m1J7q1p6J81k8k5Nm06N09k00j30L38
3025A02%J60m78J61j25J20Nl2J37K4m28J95J09l0K5P0J91k36j27J08j68Q7m0K6
3049a44K71kq7o0j68J12j7L56q7O5Q2n51J87K28k0j42J16l70K70q5k8K90j44J21
$$ plain form
3073 193 -59 -215 -65 -145 -36 273 168 11 -49 -220 -56 -288 -61 259 -53 -40 124 -128 -271 3 -9
3094 -9 130 156 258 148 -171 -79 -186 -89 404 -82 50 -16 127 -38 -22 -94 60 4 -158 222 152 36 94 76
3118 76 -101 -272 -182 -157 -6 0 202 -23 -122 267 -27 -264 -208 -41 130 168 90 43 -109 -219 -210 78 205 257
3142 257 9 35 -29 -24 106 -1 -65 179 122 220 6 -175 -118 224 42 167 32 -4 -12 -51 -149 19 -50 73 100
3167 100 -212 -56 31 -7 52 156 224 -201 83 -60 -9 188 80 197 42 -23 -210 -88 -41 6 17 186 266
3190 266 -78 -68 76 -9 -7 181 260 59 -7 -168 -147 -195 193 -25 85 227 -60 -229 -100 -126 -198 19 196
3213 196 60 31 -133 -108 63 -53 -35 214 25 -72 -103 -130 71 152 -51 -110 197 -122 145 318 -33 79 85
3236 85 -259 -304 50 73 -38 247 453 -68 46 -219 -342 138 34 -9 220 188 -72 -214 -305 -259 -30 167
$$ packed form
3073A93k52j56J50q0J09L09j05j57o0j71J64k32K27L20l12J3J64k52j43K74j2
3094iJ39K6J02j10l19R2j07R7M93m86J32o6J43j65J6p2J54n6j62L80p0j16N8j8
3118G6j77j71R0K5J51OK02k25r9L89k94k37N6J67J71L8p8m7j52j10RK88J27N2
3142B57k48K6o4NJ30j07o4K44n7R8k14j81N7L42j82J25j35l6ql9r8J68o9J23K7
3167A00l12J56Q7l8N9J04O8m25K84j43N1J97j08J17j55o5j87J22M7M7J1J69Q0
3190B66l44J0J44q5KJ88P9k01o6j61K1m8L88k18J10J42k87j69J29k6p2K17J77
3213A96j36k9j64K5J71j16J8K49j89r7l1k7K01Q1k03n9L07l19K67J73l51J12O
3236H5l44m5L54K3j11K85K06n21J14k65j23M80j04m3K29l2k60j42r1M6K29J97
$$ plain form
3258 167 104 67 107 -65 -160 -343 -231 1 137 309 -193 22 185 14 97 27 206 116 -14 67 -13 -30 -6 218
3282 218 -163 -171 -309 -46 -81 0 97 125 32 -26 -154 -165 -14 327 116 117 31 -157 -166 -82 -4 253 448 94 -34
3307 -34 49 -356 -379 -230 -163 167 241 275 -95 -313 -175 -130 -20 178 208 377 -81 -256 243 -13 -61 -14 261
3330 261 202 -258 -122 -103 143 -94 106 137 56 -143 -55 72 122 309 264 -72 -331 -282 -92 -63 152 376 -62
3353 -62 206 -29 -341 -133 -254 164 74 362 22 77 35 -187 90 30 342 184 213 -83 -281 -144 7 3 108
3376 108 96 -181 -15 -175 -251 175 -162 51 264 -93 28 46 3 -13 1 92 73 33 -106 -185 -72 156 94 21
3400 21 45 -386 -140 -1 127 183 303 -104 -240 -85 -98 -118 187 328 186 18 -6 -69 -247 -44 -130 143 314
3423 314 67 139 -81 -336 -215 -42 271 251 209 -59 -302 155 -116 64 39 40 -17 -88 47 15 321 -17 -162
$$ packed form
3258A67o3l7M0j72r5j83J12K32J36J72n02K15J63j71Q3p0J79r0j30Q1q0j7K4K24
3282B18l81qj38K63l5Q1R7K8r3n8j28j1J51L41k11Jq6j88rQ4P8K57J95l54j28
3307c4Q3m05k3J49O7L30P4L4l70k18J38M5J10J98L0J69m58j75M99k56m8M7K75
3330B61n9m60J36J9K46k37K00L1q1j99Q8J27N0J87m5l36k59M9J90K9K15K24m38
3353f2K68k35l12K08j21M18r0K88l40N5m2k22K77o0L12j58K9k96j98J37J51mJ05
3376A08j2k77J66j60p6M26l37K13K13l57J21J8m3j6J4R1j9m0j39p9J13K28o2p3
3400B1K4m31K46J39J28N6J20m07j36J55j3k0L05J41j42j68k4o3j78K03q6K73J71
3423C14k47P2k20k55J21J73L13k0m2k68k43M57k71J80k5Jn7p1J35l2L06l38j45
$$ plain form
3446 -162 83 44 -128 -161 131 -48 71 -26 41 -17 -245 -247 213 314 180 164 -206 -450 -52 -155 -33 271 170
3469 170 158 -135 -239 -409 -222 28 267 83 288 -166 -179 -151 -187 -50 -18 134 189 85 -229 -206 24 31 -101
3492 -101 295 170 -110 -79 -157 -350 -16 55 6 78 216 -354 -145 -47 79 186 47 -20 -337 -84 -6 47 134
3515 134 160 -3 -199 -201 -103 -58 322 328 274 205 -26 -162 -391 -303 -102 201 189 -39 -145 -134 -325 -287 162 39
3539 39 260 -53 -82 -101 -8 -159 -153 249 73 25 63 -252 298 130 93 120 -119 -78 -177 233 -164 -68 4 19 -228
3564 -228 -123 -132 -178 60 58 328 307 -251 -296 106 -150 129 178 156 68 99 26 -458 -108 7 -45 -85 242 88 -64
3589 -64 -101 -186 -121 75 182 227 279 -70 -450 -21 -64 38 153 165 -47 -151 -381 -30 235 85 231 16 -132
3612 -132 -157 -34 122 -147 97 79 -350 49 108 39 251 111 177 83 -179 -534 17 107 115 668 325 -170 -124
$$ packed form
3446a62K45l9j72l3K92j79J19r7O7n8k28kM60J01j34j6l70k44L98j03J22L04j01
3469A70j2k93j04j70J87K50K39j84K05m54j3K8l6J37L2J52N5j04l14K3K30Pj32
3492a01L96j25k80L1p8j93L34P1m9P2J38n70K09R8J26J07j39o7l17K53P8N3Q7
3515A34K6j63j96kR8M5L80On4o9k31j36k29Q8K01L03j2k28j06J1j91L8M49j23
3539C9K21l13k9j9R3j51OM02j76m8L8l15N50j68l7K7k39M1r9M10l97R6P2J5k47
3564b28J05rm6K38kK70k1n58m5M02k56K79M9k2q8L1p3m84L50J15n2m0L27j54j52
3589f4l7q5O5J96J07M5N2l49l80M29m3J02J15J2k12j04k30L51K65j50J46k15j48
3612a32k5J23J56k69K44j8m29L99N9o9K12j40O6r4k62l55N51R0QN53l43m95M6
$$ plain form
3635 -124 -331 -151 -252 125 200 115 132 -117 -494 -293 -286 138 294 128 -86 -100 -152 -514 55 135 38 186 234
3658 234 148 -17 -145 81 -203 55 -41 -50 -18 19 -3 238 -173 0 1 -208 -133 72 138 8 279 -113 -277 -279
3682 -279 -163 -189 46 200 265 202 -38 -123 -121 -146 -41 209 332 209 -192 -105 -292 -93 -35 65 198 226 150 -180
3706 -180 -227 -247 69 191 85 -111 -4 0 -142 -1 114 17 -181 -15 -134 -96 -21 -29 117 195 -183 -144 -303 -269
3730 -269 7 175 146 26 -14 -359 -219 -56 -11 -92 208 161 -180 -68 -316 -170 -110 112 147 218 319 -167 -194
3753 -194 -143 -239 92 233 158 88 -48 -265 63 75 139 -28 135 31 -68 -203 -202 -223 214 168 -66 185 -195 -27
3777 -27 44 -105 149 184 -95 -124 -152 1 201 376 104 -65 179 -149 -237 127 144 201 303 20 -268 -434 -164
3800 -164 -144 33 316 298 245 126 -52 -347 -135 10 90 520 -111 -144 59 -117 -221 124 172 8 -16 83 -95
$$ packed form
3635a24k07J80j01L77P5q5J7k49l77K01PM24J56j66k14j4n2l62N69Q0r7J48M8
3658B34q6j65j28K26k84K58r6rL2L7k2K41m11J73Jk09P5K05O6j30K71l92j64k
3682b79J16k6K35J54O5o3k40q5Kk5J05K50J23j23m01Q7j87J99N8J00J33K8p6l30
3706a80m7k0L16J22j06j96J07Mj42J41J15r7j98J66j19L8P5qJ46P8l78L9j59L4
3730b69K76J68k9j20m0l45J40J63M5q1L00m7l41J12k48J46O0K22L5P1J01m86k7
3753a94N1r6L31J41p5p0j36k17L28J2O4j67J63j04r9j35Jk1M37m6k34K51l80J68
3777b7P1j49K54L5k79k9k8J53K00J75k72j69K44l28q8L64J7N7J02k83k88j66K70
3800a64K0J77K83j8n3j19j78k95K12J45Q0M30o31l3K03j76j04L45M8j64k4R9j78
$$ plain form
3823 -95 6 -117 118 -169 167 -115 -23 189 103 16 156 -19 -93 53 -324 -70 -131 -54 184 216 21 -200 -49
3846 -49 -201 -26 135 207 -149 158 -25 -337 -240 25 13 476 293 -46 -56 -246 -85 -88 176 235 477 160 -190
3869 -190 -205 112 48 218 254 -158 -203 -22 76 -190 -149 11 -5 149 -102 -38 43 -166 -272 220 196 -157 -119 -159
3893 -159 -204 135 292 61 -35 -139 -263 -309 -249 35 59 301 6 -271 29 -371 57 74 386 392 272 44 -131
3916 -131 -55 158 65 154 301 -111 25 5 -95 -105 247 129 29 342 144 -171 220 -11 83 -2 211 -430
3938 -430 -164 157 -90 357 450 93 -119 -265 -457 3 347 -100 286 116 -165 -274 -76 -148 113 392 92
3959 92 120 -160 192 -222 -170 -94 -33 320 217 -8 38 82 -306 -7 -50 82 225 49 19 51 30 -245 201 164
3983 164 278 67 -139 -213 -60 24 110 -14 166 -47 -190 -52 -68 198 -151 -51 -19 16 -83 -241 151 15
$$ packed form
3823i5J01j23K35k87L36k82R2K12q6q7J40j75p4J46l77K54o1P7K38L2j95k21J51
3846d9j52J75J61P2l56L07j83l12R7K65j2M63j83l39j0j90J61lK64N9K42l17l50
3869a90j5L17o4J70L6m12m5J81R8k66M1J60j6J54k51O4Q1k09j06M92k4l53L8m0
3893a59m5L39J57k31r6j04j24m6O0K84K4K42k95k77L00m00M28J7L12Oj20k28j75
3916a31P6K13r3Q9J47m12J36k0j00j0L52j18j00L13j98l15L91k31R4q5K13o41
3938d30K66L21k47M47R3l57k12j46j92M60L44m47L86j70k81j09J98p2K61K79l00
3959I2K8k80L52m14N2P6O1L53j03k25M6M4l88K99m3J32J43j76l0L2k1k75M46l7
3983A64J14k11k06p4J53Q4Q6j24J80k13j43J38j6K66l49J00L2L5r9j58L92j36
$$ plain form
4005 15 112 109 -13 -103 -106 23 -56 284 413 25 -256 -243 -442 -171 155 -18 65 310 -243 -221 -241 -122 -25 261
4029 261 154 -19 -89 -261 -83 89 10 105 -17 245 -47 42 36 -101 -36 100 -135 145 -126 -73 -95 308 -11
4052 -11 20 -171 -85 -67 36 -77 42 214 134 -161 -248 49 -150 87 185 225 215 -103 -322 -64 -239 -51 -30
4075 -30 153 -58 97 -68 -262 -238 -95 120 274 338 57 1 -259 -146 18 257 128 168 186 -49 -289 -217
4097 -217 -15 -270 11 -175 -59 -20 10 -35 366 62 76 217 10 -42 22 152 9 42 169 -129 -315 -73
4119 -73 2 56 340 240 297 -143 -366 -381 135 -53 302 483 -16 84 -94 -63 47 39 268 292 234 -79 -142 -252
4143 -252 173 -187 84 331 5 47 -172 8 -339 -7 137 23 99 130 -256 -49 138 87 263 -41 -208
4164 -208 29 -147 -91 147 399 -37 10 -94 -396 -424 171 -4 53 371 135 -213 -96 -400 155 318 220 332
$$ packed form
4005A5R7lj22r0lJ29p9L40J29l88k81J3j99K71L26j73Q3K45n53K2k0J19R7K86
4029B61j07j73p0j72J78J72p9R5j22K62k92Q9oj37O5J36k35K80k71N3k2M03l19
4052a1L1j91Q6J8J03j13J19J72q0k95q7K97j99K37R8M0j0l18k19K58j75J88K1
4075c0J83k11J55j65j94K4J43K15J54O4k81n6k60J13J64K39j29M0J8k35k40P2
4097b17K02k55K81j86J16L9L0m5M01l04J4J41k07n2O4J30j43L3J27k98j86K42
4119g3P5N4K84j00N7m40k23j5N16j88L55J81m99J00j78L1J10qK29K4n8l13o3j10
4143b52M25l60K71K47l26M2k19J80l47L32J44j14P6L1l86K07J87n1J76l04j67
4164b08K37j76N6K38K52m36M7j04l02k8N95j75N7L18k36l48J17l04N55J63r8J12
$$ plain form
4186 332 130 -245 -75 -169 -128 276 256 31 -56 90 -149 -266 -48 -114 167 266 269 -30 -144 -131 -215 274 114
4209 114 -21 -72 107 -153 -75 17 -39 122 -48 -184 -235 -114 375 109 58 10 -241 168 -42 -156 419 65
4231 65 -87 100 -171 -438 -101 -91 58 106 259 2 191 -155 -301 -213 90 -60 250 364 146 -250 -228 -164
4253 -164 -122 96 -96 -28 -19 -49 -423 -371 74 -20 88 174 -139 -129 -57 -63 -71 165 29 -6 -58 -305 92 72 43 225
4279 225 79 -164 -325 -186 301 -19 170 138 -159 -185 -370 -275 -44 161 125 233 91 -89 -326 -197 -144 -133
4301 -133 671 184 15 -48 -185 -293 -99 -133 10 228 126 -156 -128 -209 -169 120 162 -69 -36 -91 60 -28 197
4324 197 -55 -151 -158 -268 -172 117 111 284 354 -200 -124 -40 -63 -79 35 336 102 168 -31 -297 -273 -240 -198 246 394
4349 394 31 -110 -52 -152 -145 296 35 501 -21 -84 -40 -71 -311 36 366 -127 67 90 -257 -139 127 -164
$$ packed form
4186C32k02l75J70r4M1M04k0k25q7J46k39j17K18o6K81R9Lk99j14J3q4M89j60
4209A14j35n1J79k60P8R2n6J61j70j36n1J21M89k66n1m8k51M09k10j14N75l54
4231F5j52J87k71k67L37J0J49M8J53k57J89l46j46Q8L03j50L10J14k18l96K2O4
4253a64M2K18j92O8Rl0l74N2M45r4J08Q6l13J0P2oqK36j36l5n2k47L97k0k9J82
4279B25j46k43j61J39M87l20J89l2k97k6j85R5K31K05l6J08j42j80k37J29N3J1
4301a33Q04m87j69o3j37j08J94l4J43K18j02k82K8q1M0K89M2k31L3n5J51q8K25
4324A97k52r6pj10R6K89oJ73P0n54P6Q4k3j6J14L01k34O6j99k66K4L3M2M44J48
4349C94l63j41N8j00PM41k61M66n22o3M4l1k40L47L30m93J94K3l47J18K66k91
$$ plain form
4371 -164 70 -28 -246 22 14 -84 -132 -23 59 31 -62 -168 -108 71 18 -50 211 127 -302 -268 -56 129 404 203
4395 203 153 -7 -69 -404 -160 87 170 248 261 51 -52 -185 2 -250 397 98 -15 -44 206 -375 -86 -343
4417 -343 29 284 52 260 -46 -30 -350 236 29 97 -215 98 -91 203 -6 82 81 296 -115 -69 71 -61
4439 -61 167 159 141 -49 7 76 -233 56 -13 221 119 77 -283 -16 -231 -238 -39 132 143 222 -150 -229 -413 2
4463 2 191 158 185 -70 118 -199 -155 6 159 75 20 348 17 -12 -83 -43 -99 208 149 -29 146 -122 -128 200 -217
4488 -217 -57 39 46 -7 -65 36 33 86 237 -161 -204 -300 -440 -18 408 110 38 162 -207 -120 -57 333 94 227
4512 227 277 211 -302 -51 -22 -82 26 332 297 213 -208 -24 -85 -355 228 258 179 145 167 -155 -16 90 59 207
4536 207 207 -81 -253 108 -294 56 288 38 -203 -238 36 -116 49 -86 -39 95 -34 -197 -10 -2 -180 213
$$ packed form
4371a64K34r8k18K68qr8m8J09Q2k8r3j06O0J79n3o8K61q4m29L4K12J85K75k01
4395B03n0j60o2l35K44K47Q3P8J3k10j03j33J87k52O47k99j13k9K50n81K89k57
4417c43L72K55k32K08l06J6l20N86k07O8l12L13j89K94k09Q8jK15m11M6J40j32
4439f1K28qj8j90N6O9l09K89o9K34j02m2l60K67k15pJ99J71J1P9l72p9j84M15
4463BJ89l3K7k55J88l17M4J61J53q4n5L28l31k9p1M0n6L07n9j78J75k68oL28m17
4488b17J60R6Pn3n8J01lN3J51l98m3r6j40M22M26k98p2J24l69Q7O3L90k39J33
4512B27N0o6n13K51K9o0J08L06l5q4m21J84o1k70N83L0p9l4K2l22J39J06l1J48
4536B07%k88j72L61m02L50K32k50k41l5K74j52J65j35M7J34j29j63J87Qj78L93
$$ plain form
4558 213 74 308 -123 -117 -61 68 12 -101 104 38 -150 -240 -75 -71 -99 -36 -76 193 38 -140 -496 -36 -191 -25
4582 -25 227 102 -142 -146 -98 -105 -215 40 55 187 69 -388 23 57 -79 256 121 86 -188 -79 -61 152 -75
4605 -75 180 -165 165 -142 -369 140 80 -13 201 14 -329 -110 -189 146 108 284 47 123 -177 -475 39 63
4627 63 133 133 197 -17 -328 -163 -246 14 81 -1 -166 106 6 -153 90 -247 84 169 5 -317 -27 -138 64
4650 64 129 186 215 -121 199 -233 -29 354 38 252 157 -292 -222 -331 -30 203 86 62 94 -10 -360 -208 11
4673 11 86 141 313 113 -137 -32 46 -75 15 244 157 333 127 -52 43 -216 -317 177 359 -50 -160 26
4695 26 -206 -34 121 67 241 236 -164 -142 -33 30 80 43 51 -360 140 99 -46 140 116 167 57 -91 -124 -15 149
4720 149 29 -10 280 -160 -288 -176 -172 -27 201 126 -208 -7 46 -330 -184 -26 239 407 380 -133 -141 -204 7
$$ packed form
4558B13j39K34m31ON6J29n6j13K05o6j88r0J65Mk8O3m0K69j55j78l56M60j55J66
4582b5K52j25k44mM8pj10K55J5J32j18m57M11L4j36L35j35l5k74J09J8K13k27
4605g5K55l45L30l07k27N09o0r3K14j87l43K19p9L35l8J76k37P6l00k98N14K4
4627F3P0%O4k14l11J65q3K60O7q2j65K72j00j59K43l37L31Q5j64l22K90j11K02
4650F4O5N7K9l36L20m32K04L83l16K14r5m49P0j09L01K33j17k4L2j04l50J52K19
4673A1P5N5J72k00k50J05P8j21R0K29q7J76k06j79R5k59j01M94J82m09j10J86
4695B6k32J72J55n4J74nm00K2J09O3N0l7Qm11N00m1j45J86k4N1j10j48l3J09J64
4720A49j20l9K90m40j28J12MJ45K28p5l34K01N3l76J46J58K65J68k7n13qo3K11
$$ plain form
4743 7 20 10 75 217 11 -242 81 354 71 107 -4 -12 -13 136 250 174 -56 -48 -52 -7 -35 5 14 211 126 136 221 -223
4771 -223 -242 -128 -99 190 33 -13 124 -115 -325 -90 -218 142 41 313 75 3 183 -229 68 83 -1 -35
4793 -35 360 -281 60 -132 -170 -173 329 80 -107 -144 -86 117 -57 197 -93 -26 205 -197 -46 -164 -241 -65 -120
4816 -120 -91 -404 -43 -266 25 14 48 -33 281 -48 -72 -66 -140 -85 110 232 214 -43 -158 109 92 63 247 175
4840 175 261 -139 -125 -116 -42 184 251 -16 61 118 -92 -171 140 238 71 -25 182 -115 -11 152 -89 -229 -66 94
4864 94 30 18 -76 48 152 -156 -161 -195 -96 40 -16 -58 -145 138 21 -81 47 59 187 -187 113 -25 219 -91
4888 -91 -143 -291 -311 -18 58 238 77 -80 23 6 -6 80 -7 325 -2 36 -72 -262 -341 -46 -31 263 145 -12
4912 -12 -52 52 -88 82 56 73 0 -47 83 -42 -2 29 -79 121 91 -196 51 196 187 142 -208 199 202 -132 39
$$ packed form
4743GJ3j0O5J42k06k53L23K73k83L6j11qjJ49J14p6k30QmM5k8M0RJ97q5J0Q5m44
4771b23j9J14K9K89j57m6J37k39k10K35j28L60j01K72k38p2J80m12K97J5q4l4
4793c5L95o41L41j92l8lN02k49j87l7N8K03j74K54k90O7K31m02J51j18p7J76n5
4816a20K9l13L61k23K91j1L4q1L14l29k4Op4N5J95J22j8k57j15K67j7k9J84p2
4840A75Q6m00J4RP4K26O7k67P7N7k10p9L11R8j67r6K07k97J04J63k41j40J63J60
4864I4o4j2r4J24J04l08nl4R9J36n6m2q7K83j17j02J28J2J28l74L00j38K44l10
4888i1n2j48k0K93P6J80j61j57J03j7j2Q6q7L32l27L8j08j90p9K95J5K94j18j57
4912a2m0J04j40J70k6J7p3m7J30j25M0L1j08K00l0k87K47J45rm5l50M07Ll34J71
$$ plain form
4937 39 -118 45 64 63 -126 24 -51 62 -151 1 323 105 -131 -71 -165 -91 -102 122 115 56 68 176 28 97 -139
4962 -139 -42 142 40 84 -45 48 -348 -88 227 150 -83 -181 53 -26 35 152 33 230 -148 3 147 -45
4984 -45 106 63 75 63 41 -127 -80 62 167 -95 126 37 -140 -108 -205 -133 -157 -10 142 -74 -59 -223 -142 -138 308
5009 308 28 83 -21 -100 -94 -256 85 77 83 40 117 -183 -61 -42 175 -151 134 41 -33 64 -187 -138 315 124 196
5034 196 -115 -148 -34 -94 -100 26 9 167 -51 -27 242 -79 -49 181 73 53 275 95 -201 87 -93 24 39
5057 39 152 94 -131 21 -277 -39 13 160 150 147 -181 -187 -109 -20 266 311 227 170 28 -146 32 181 94 126 59
5082 59 -180 -48 11 -200 -119 279 -34 10 22 49 -139 -47 75 -33 309 56 128 203 354 -68 -96 191 -123
5105 -123 -90 -39 -51 -3 36 29 -149 8 -101 -344 74 -60 39 -37 163 -111 142 -287 -51 -47 -17 -73 9 60 212
$$ packed form
4937C9j57J63J9jj89J50p5J13k13J52L22k18k36O0r4P4j1K24pn9J2J08j48O9k36
4962a39R7J84j02M4j29R3l96K60L15p7k33r8K34p9O1J17j19J97l78J51J44j92
4984d5J51m3J2j2k2j68M7J42J05k62K21q9j77L2r7P2k4J47J52k16J5j64Q1MM46
5009C08k80N5j04p9Oj62L41qOm3P7l00J22J9K17l26K85r3p4R7k51M9M53j91P2
5034A96l11l3J14o0oJ26j7J58k18K4K69l21L0K30j08k0K22j80k96K88j80J17J5
5057C9J13n8k25J52k98K38N2J47j0ll28oP8Q9K86M5q4n7j42j74J78J49q7L2o7
5082E9k39J32N9k11Q1L98l13M4J2K7j88R2J22j08L42k53P2P5J51m22k8K87l14
5105a23L3N1j2M8L9pj78J57j09k43M18j34R9p6K00k74K53m29K36ML0n6Q2N1J52
$$ plain form
5130 212 64 96 -198 -58 37 107 160 -123 92 -88 237 -111 -158 -186 30 -13 80 -99 -146 74 111 -4 106
5153 106 -123 470 -159 27 36 -10 0 -139 -182 -23 176 92 43 -24 -117 -122 -144 14 -26 121 135 -2 -74 -292 -53
5178 -53 -205 65 -51 132 60 -78 44 -50 -98 -21 86 52 7 -5 111 -52 58 140 -1 8 25 137 37 261
5202 261 162 -2 99 -51 -125 -212 48 -96 -39 56 -24 -199 121 -44 -92 -179 -186 88 250 -16 41 -20 -69 -1 211
5227 211 213 35 37 -10 -121 61 -102 -35 126 343 -97 -42 256 -20 -194 -34 -69 -217 17 68 0 2 -114 383
5251 383 89 -145 -27 -127 -29 -69 -146 14 139 84 -47 -74 -67 -94 81 -248 183 -130 -131 -122 -126 -9 314 48 -110
5276 -110 -20 -34 -117 -3 134 63 197 9 -104 -16 -90 26 -81 183 -150 300 110 65 -49 52 -170 10
5298 10 -54 -183 190 -65 -20 64 76 -139 -33 275 227 83 -33 -141 160 95 -52 -8 -84 -142 274 -129 -31 124
$$ packed form
5130B12j48L2k94J40R5P0N3k83K15j80L25l48m7k8K16m3R3j79m7K20L7j15J10
5153A06k29N93o29J86Rm6J0j39m3J59J99q4m9o7r3nk2J58m0J47J4j37p2k18K39
5178e3j52K70j16J83p2j38J22r4m8P7J07l4m5j2J16j63J10Q2j41RJ7J12j00K24
5202B61r9j64J01j50p4q7K60j44N7R5q0j75L20j65m8q7pK74J62k66N7o1m9O8K12
5227B11Kj78Km7j11J82j63O7J61K17m40N5K98k76j74J60l5j48K34N1o8Kj16M97
5251C83k94k34J18j00R8m0p7J60J25n5j31k7Pk7J75l29M31l13jRmJ17L23k66j58
5276a10R0j4q3J14J37p1J34j88j13Q8p4J16j07K64l33M50j90m5j14J01k22J80
5298A0o4j29L73k55M5Q4J2k15J06L08m8j44j16j08L01o5j47M4p6n8M16m03R8J55
$$ plain form
5322 124 -14 125 -246 146 -109 127 34 222 43 -194 30 -212 -88 -62 250 -196 23 -185 -177 -110 -39 -17
5344 -17 68 -1 -115 170 120 14 -143 102 -65 198 9 -187 -2 131 -273 -82 46 68 -10 -59 -66 -105 411
5367 411 -168 205 23 -105 -64 26 -26 90 75 41 -116 -153 -36 -329 -200 157 40 83 56 -102 -136 -181 -158 11
5391 11 40 257 -122 -54 -100 -111 -151 -83 194 -42 -94 -114 -78 252 -35 107 144 130 -43 -265 -50 -8 68 110 36
5416 36 -209 -213 159 262 -22 -97 -65 64 128 76 -127 8 -72 125 157 -50 -33 -216 -126 -122 -87 90 -8 -51 42 -228
5442 -228 -175 -55 -58 47 96 -67 39 -118 -74 -71 40 -8 207 -56 38 -319 54 18 1 -46 17 106 -205 107 45
5467 45 181 119 99 -37 66 40 -142 61 -207 -97 62 9 -28 43 -130 176 -42 109 34 199 -63 -90 20
5490 20 10 -79 -90 -11 -190 64 47 -236 -100 64 328 141 -22 -145 -85 -222 -201 78 110 102 -30 -65 164 44
$$ packed form
5322A24j38J39l71L92k55K36r3J88j79k37K24k42J24K6L12m46K19k08QO7P1K2
5344a7Q5o9j14K85n0j06j57K45j67K63j89j96J85J33m04J91J28K2p8m9pl9N16
5367D11n79L73j82j28M1R0n2J16j5l4j57l7J17k93J29L57j17M3k7j58l4m5K3J69
5391A1K9K17l79O8m6j1m0O8K77k36n2k0L6L30k87J42L7j4j73k22K15M2P6M2p4
5416C6k45mL72J03k84p5L2J29O4n2k03J35q0J97L2k07J7j83R0ML5J77r8m3R3k70
5442b28N3J20lJ05M9j63J06j57M4LJ11m8K15k63R4l57L73l6j7m7O3Q9l11L12o2
5467D5J36o2k0j36J03k6j82K03k68J10J59n3l7P1j73L06k18J51p5J65k62k7J10
5490B0j0q9j1P9j79K54j7k83J36J64K64j87j63j23O0j37K1K79L2qj32l5K29j20
$$ plain form
5514 44 54 133 -59 -13 -132 -229 153 39 -339 25 115 29 223 -2 -6 -65 103 -27 -127 -81 -66 -18 -89 -119 134
5539 134 264 -24 -85 32 -23 50 -6 -43 -12 182 -96 -24 -63 174 33 87 156 171 95 -214 -250 5 27 -224 141
5564 141 39 -147 -22 -187 -12 9 15 -181 -134 -147 12 79 156 183 -148 292 -44 -144 164 -168 -84 277 111
5587 111 -19 59 -180 129 -12 188 -29 135 95 -29 110 -119 -134 22 68 -124 -1 -16 -234 -139 196 90
5609 90 41 -244 159 14 91 177 36 -34 202 -43 -129 23 -86 -20 164 63 -139 44 -32 233 -105 211 11
5632 11 -19 20 21 72 152 -86 -29 148 47 -208 71 36 -148 220 219 -73 -139 -117 6 -165 -25 -68 55 33 -8
5657 -8 -66 -80 257 -177 -82 45 -18 -209 -11 -25 -223 89 119 126 9 -44 0 22 47 -191 -3 -51 -126 252 185 -46
5683 -46 -265 -27 -236 50 295 -46 -146 76 84 -38 -70 46 -163 25 -187 -128 -97 83 46 301 58 102 -173
$$ packed form
5514D4J0P9j92M6j19r7L82j14l78L64R0q6J94k25mn9J68j30j00M6J5M8p1l0K53
5539A34J30k88o1J17n5P3n6l7L1J94k78P2l9K37j41N4O9J5p6l09l6K55K2k51L65
5564A41j02j86J25j65J75K1Oj96M7j3J59O7P7K7l31M40l36j00L08l32Q4L61j66
5587A11j30P8k39L09j41K00k17J64m0j24J39k29j5J56M6j92J23j5k18R5L35j06
5609I0m9k85M03j45P7Q6j41p0K36k45q6J52j09O6J84j01k02J83p6K65l38L16k00
5632A1l0L9JN1Q0k38N7J77j01k55K79l5j84L68jk92o6K2J23j71J40m3J23k2m1
5657hn8j4L37m34R5J27o3j91J98j4j98L12L0Pj17n3M4K2K5k38J88m8p5L78o7k31
5683d6k19K38k09K86K45l41j00K22Qj22l2J16k09J88k12N9L1J80l7K55k43M4k75
$$ plain form
5706 -173 127 94 51 175 47 -34 130 4 -160 111 -135 -30 51 -77 -29 19 148 188 -87 99 78 98 -92
5729 -92 90 97 -219 -29 121 24 -47 110 193 241 -89 -35 -85 -150 -33 35 33 -59 80 -5 290 195 224 -50 185 -50
5755 -50 27 168 -28 254 20 63 -86 -2 42 243 -60 -79 -91 -116 -12 2 12 152 14 240 121 -189 163
5778 163 12 -270 -81 -8 -107 -40 -260 -180 -44 -148 -91 189 97 -166 -141 -2 -41 -112 -200 38 12 -205 20 -62
5802 -62 11 64 -109 35 100 -149 -28 -24 -50 155 -257 111 63 149 -242 -118 32 -249 286 -107 -57 -143 15 36
5826 36 97 42 38 -121 -107 -32 22 -238 17 26 137 16 133 -122 43 -16 60 63 195 11 40 -239 137 263 -189
5851 -189 -55 -69 -263 -364 -14 -250 106 275 150 74 147 -181 -13 5 253 -45 -197 -39 208 173 -33 -23
5873 -23 19 160 69 -272 41 7 166 -29 -104 148 27 -66 239 -39 39 -88 177 38 70 34 94 -138 93
$$ packed form
5706a73L00l3m3J24j28q1J64j26j64K71k46J05Q1j28M8M8J29M0k75J86k1K0j90
5729i2J82Pl16J90J50r7p1J57Q3M8l30N4n0o5J17O8kr2J39q5K95r5K9k74K35k35
5755e0P7J41j96K82k34M3j49Q4M4K01l03j9j2k5J04J4J0J40j38K26j19l10L52
5778A63j51k82J89P3r9O7k20Q0J36j04N7K80r2k63K5J39l9p1q8K38k6k17K25q2
5802f2P3N3j73J44O5k49J21Mk6K05m12L68m8Q6l91J24J50k81N35l93N0q6J58K1
5826C6O1n5mj59J4P5N4k60K55RJ11j21J17k55J65n9P6LJ32j84K9k79L76J26m52
5851a89J34j4j94j01L50k36L56J69j25p6P3l28J68J8K48k98j52J58K47l5k06J0
5873b3M2J41r1l41L13l4J59j95p5K52j21r3L05k78P8j27K65j39L2l6O0k32K31
$$ plain form
5896 93 36 79 -30 -57 -141 -95 -230 -26 315 187 -97 -85 -301 -16 197 215 127 3 -63 -159 0 113 -104 -198
5920 -198 -104 -44 -85 99 -36 -1 55 93 30 -179 -5 -52 -19 316 -19 158 -35 -62 -26 -46 -35 211 60 -25 135
5945 135 106 -328 -87 -28 87 -158 1 106 -24 -82 -132 -27 127 175 -130 150 114 30 -85 -16 -36 11 133
5968 133 -65 -35 -112 168 50 -56 -119 7 -21 127 71 -155 -101 -174 74 94 -5 71 -120 11 -72 278 -21 111
5992 111 143 -21 41 -154 -77 -62 237 214 47 -116 -263 2 -70 -126 43 -200 -56 162 -169 80 195 -118
6014 -118 -95 76 -9 -147 -397 -134 -87 52 95 -262 155 -189 22 172 56 -71 125 57 33 -185 42 -118
6036 -118 34 -62 -214 -260 2 83 111 104 40 163 -134 66 -232 88 53 -43 132 -77 163 -73 46 -169 -61
6059 -61 -200 -135 137 94 -100 -118 36 -151 164 88 171 37 -47 -57 0 250 70 206 4 45 -142 64 143 -262
$$ packed form
5896I3n7M3j09k7q4M6j35K04L41j28k84J2k16K85K13J8q8j24o6r6J59J13k17r4
5920a98R4O0m1J84j35L5N6L8o3k09J74m7L3L35l35J77j93k7L6k0J1K46j51q5J60
5945A35k9m34K41N9J15k45J59J05j30n8n0J05J54M8l05K80l6q4j15O9k0M7J22
5968A33j98L0p7K80j18j06o3J26k8J48n6k26N4p3K48K0r9P6j91J31q3L50k99J32
5992A11L2j64O2j95P7J5K99k3j67j63j47K65p2n6J69k43J44K18l31K49J15l13
6014a18K3J71q5j38k50K63M7J39M3l57M17l44K11J50j16j27J96o8k4k18K27j60
6036a18J52r6j52m6K62Q1K8po4J23k97K00k98L20l5r6J75k09K40k36J19k15J08
6059f1j39O5K72m3j94j8J54j87L15p6Q3j34q4j0N7K50j80J36k02M1j87K06P9m05
$$ plain form
6083 -262 -72 115 -191 -217 79 -218 -180 107 250 66 -104 15 105 81 45 -34 128 -60 -145 50 -15 -41 -58
6106 -58 60 167 -82 90 49 -194 -171 108 41 14 45 148 -23 17 123 -237 135 212 -66 33 -145 -25 -65
6129 -65 194 102 122 -174 -12 -5 -33 291 271 -136 -127 -36 -112 -99 -160 18 -75 -108 121 58 -107 27 -170 54 69 183
6155 183 -9 149 -122 -1 -26 -39 55 -71 14 -175 -112 -303 51 169 97 68 -84 58 41 -45 108 121 -149
6178 -149 64 -80 -179 -136 -295 32 -39 188 119 44 57 -33 176 -36 136 49 -16 322 56 -25 -100 -74 152 -47
6202 -47 156 -36 36 90 -72 -16 339 -58 -71 -70 -189 29 191 -13 87 160 -4 -224 -176 -37 -243 115 34
6225 34 -66 112 -161 -121 49 -44 176 152 -198 2 -82 182 -134 254 87 -48 141 -112 -33 -246 33 -42
6247 -42 29 -166 0 14 98 -185 -58 -16 -71 -68 -338 -65 -198 42 13 168 32 -224 -166 -75 132 87 36 93 54
$$ packed form
6083b62J90J87l06k6K96k97L8K87J43j84j70J19R0k4l6p9J62j88q5J95o5k6j7
6106e8J18J07k49J72m1k43K3K79o7k7L1J03j71M0J06l60L72P7k78R9j78J20m0
6129f5K59r2K0k96J62Pk8L24k0m07RR1p6J3o1J78r3l3K29o3j65J34j97K24J5J14
6155A83j92J58k71J21k5j3R4j26Q5j89O3j91L54J18p2k9j52J42j7q6J53J3k70
6178a49K13j44r9M3j59L27p1K27o9p5J3r0K09k12J72q7o5L38k66q1p5K6K26j99
6202d7K03j92P2N4j62N6L55l97j3Jj19K18J62k04J00P3j64k20M8J39k06L58q1
6225C4j00J78k73M0J70r3K20k4l50K00q4K64l16L88j67j35J89k53P9k13K79p5
6247d2P1j95J66J4Q4k83J27M2n5Lk70K73j33K40k9J55j36k56N8R1K07m5n1N7l9
$$ plain form
6272 54 -98 -9 176 -108 204 -70 90 187 0 -333 141 -53 162 82 150 -51 -71 60 -15 8 226 59 0
6295 0 -13 33 -15 -149 9 -45 2 -129 -57 -12 -112 72 117 6 54 100 -19 -65 -145 -41 -202 155 167 100 102 -80
6321 -80 41 70 -103 200 -37 -132 99 -42 -157 -235 231 87 -99 -77 67 -81 7 -43 -177 -123 196 -161 41
6344 41 190 57 -14 137 -54 -123 132 -94 -103 89 190 13 -44 -41 10 -22 17 -95 133 -11 -97 -116 -44 -193 113
6369 113 -16 86 233 56 -93 -279 159 -182 78 -8 132 404 107 -197 -37 174 -281 45 -34 109 -181
6390 -181 -214 -195 -104 197 -90 -218 8 -83 -89 -178 227 101 53 90 -143 -52 -24 31 193 236 -43 -100 137 34 5
6415 5 -79 -225 -56 120 -268 -41 -1 -68 -111 40 0 43 223 75 -150 -241 124 2 113 152 -25 161 -13
6438 -13 -127 84 159 7 -75 -135 -163 -192 -29 -61 38 -59 45 3 -3 11 112 210 139 -188 208 150 74 -144 -185 -62
$$ packed form
6272E4j52Q9J85k84L12k74J60R7j87l33M74j94K15q0O8k01k0J31p5K3K18j67n9
6295@j3M6m8j34J58n4M7j31P2M5j00J84M5j11M8M6j19m6q0J04j61L57J2o7Kj82
6321h0J21K9j73L03k37r5K31j41j15p8M66j44j86K2J44j48Q8n0j34N4L19l57K02
6344D1J49j33p1J51j91o9K55k26rJ92J01j77n7LN1l2L9j12K28j44q6j9P2j49L06
6369A13j29J02J47j77j49j86M38l41K60q6J40K72k97l04J60K11m55L26p9J43k90
6390a81l3J9R1L01k87j28K26r1oq9M05j26m8L7k33R1K8N5J62M3k79n7K37j03k9
6415Eq4j46J69J76l88K27M0o7m3J51m0M3J80j48k25r1L65j22J11L9j77J86j74
6438a3j14K11P5j52q2o0k8k9J63l2R9r7J04m2oJ4J01R8p1l27L96n8p6k18m1J23
$$ plain form
6464 -62 -93 -68 22 -71 -281 178 86 197 174 -19 -51 -31 -171 95 -176 113 -131 -92 -301 -79 -183 -159 -232 176
6488 176 48 -112 -218 -238 -174 50 -40 56 172 53 32 4 -202 -246 138 132 166 5 -55 -88 21 -42 -321 196
6512 196 302 205 -14 -100 -107 -56 231 -96 134 -74 -42 174 1 -79 155 213 44 -113 -59 -205 -323 -23 122
6535 122 -52 41 -164 -133 -95 16 266 29 -74 144 -126 -145 -173 38 55 -123 66 87 -436 -274 -242 163 149
6558 149 -13 -239 -4 -110 -210 10 115 245 0 -46 -1 -200 -43 145 81 296 -117 29 -164 144 73
6579 73 -235 -169 -16 -120 95 -90 -151 -134 -91 106 -27 175 32 -8 -167 17 -167 36 183 87 -169 -149 -98
6602 -98 -53 -209 78 169 -31 102 -63 65 -69 151 -32 -16 191 20 107 45 -68 225 156 -13 -33 198 63
6625 63 -36 82 -4 -66 53 -8 -45 -56 -97 28 -8 288 -2 111 -12 -80 253 -170 -97 109 -60 -39 -33 112 -4
$$ packed form
6464f2l1K5R0r3k10M59r2J11k3j93l2K0j40K66k71K89k44L9k09K22j04K4p3M08
6488A76j28j60j06k0O4K24r0R6J16j19k1k8k06m4L84oL4j61o0l3J09o3k79N17
6512A96J06r7k19q6pN1K87l27K30k08L2K16j73q0K34N8j69j57N4j46j18L00J45
6535A22j74R3k05L1L8J11K50k37j03K18k70j9k8K11J7j78J89K1n23J62L2M05j4
6558A49j62k26K35j06j00K20J05J30k45m6M5j99J57J88o4K15m13J46j93L08p1
6579G3l08O6J53j04K15j85o1J7M3J97j33K02j43m0j59J84j84K03J47r6k56K0N1
6602i8M5j56K87R1k00J33j65J28j34K20j83J6K07j71Q7o2j13K93o9j69k0K31j35
6625F3r9J18q6o2J19o1l7j1m1J25l6K96k90J13j23o8L33m23P3K06j69K1OJ45j16
$$ plain form
6650 -4 280 -97 -264 37 -339 -67 -39 25 37 -13 140 44 -123 9 115 21 -22 92 188 287 52 118 -102 40
6674 40 -110 66 159 41 167 19 111 -69 55 -4 22 54 -113 18 -225 -106 22 -65 -69 -73 41 97 24 219
6698 219 2 -61 100 -120 -142 25 31 57 192 18 209 75 -68 -49 20 182 240 27 135 -185 -201 78 -134
6721 -134 -135 102 20 -146 -35 -134 4 154 46 44 102 -87 103 112 77 -142 138 137 -96 23 -108 -52 149 92 36
6746 36 6 160 -242 232 143 88 185 -149 -79 50 -93 -5 -30 189 242 121 83 45 -58 -56 -61 8 74 71 -259 -77
6772 -77 -52 -196 -49 -47 -58 206 -55 -79 6 -42 -58 60 77 -2 153 72 -235 5 -66 -42 -10 313 -122 32 265
6797 265 -124 247 231 190 88 -158 -30 47 110 109 240 143 -261 -109 -333 -163 47 116 -23 -62 2 -34 -76 -66
6821 -66 52 79 229 -2 -335 -388 -150 199 -152 -83 83 30 43 47 -217 -274 140 10 -15 154 -138 51 267
$$ packed form
6650dK84l77j67L01l76K72K8O4J2n0J53r6j67J32J06r4m3J14R6R9k35O6k20J42
6674D0j50J76R3j18J26j48R2j80J24n9K6L2j67J31k43J19J28q7mmJ14N6p3J95
6698B19k17o3J61k20k2J67OK6J35j74J91j34j43J9O9J62N8k13J08l20j6K79k12
6721a34jK37q2j66J11r9J38J50j08kN8j89J90Rl5k19K80jk33J19j31N6K01n7n6
6746C6l0J54m02M74q9n5R7l34P0J29j43Q8k5K19N3j21l8l8j03KnO9O6ll30J82
6772g7K5j44J47Kj1K64k61k4Q5m8j6J18J7p9J55q1l07K40p1K4L2L23m35J54K33
6797B65l89L71j6m1j02k46J28P7O3jJ31r7m04J52k24J70K10O9j39l9O4l6m2J0
6821f6J18K7J50k31l33n3K38L49l51O9J66n3J3Mk64n7M14j30k5J69k92J89K16
$$ plain form
6844 267 -68 44 27 -124 65 -4 63 -125 81 72 47 -51 6 27 -102 95 76 152 52 41 -75 -132 -43 119 275
6869 275 59 289 -155 -162 -205 13 -77 43 295 -120 -95 -197 -17 -120 6 -27 82 99 211 0 -20 -39 20
6892 20 49 192 134 -56 277 39 9 128 -50 -6 146 111 115 103 83 319 78 -203 4 -163 55 -70 48
6915 48 52 -102 98 -55 -115 -185 58 -105 100 -78 2 137 -198 -184 125 -5 62 11 -18 -143 -204 -108 84 49
6939 49 85 124 -76 4 -2 48 154 -150 32 345 -205 125 57 10 204 -41 -53 41 -227 -13 -180 74 -52 -18
6963 -18 -53 232 -150 -79 -130 -184 -80 268 -57 -2 -65 200 -144 -56 98 89 114 154 -187 -220 -90 -77 75 -113 133
6988 133 -6 74 -91 258 72 153 245 -6 62 -98 15 26 -161 -38 -135 156 68 76 -7 -46 -131 105 188 -146
7012 -146 -333 43 -111 -168 122 -8 58 254 -178 -282 -71 46 23 -32 56 -32 -42 -41 89 68 138 -24 56 55 -56
$$ packed form
6844B67l35J12j7j51J89o9O7j88K06rk5r8N7K1j29J97j9P6j00j1j16n7Q9J62J56
6869B75k16K30m44pm3K18r0J20K52m15K5j02J80j03J26l3J09J7J12k11k0j9N9
6892B0K9J43n8j90L33k38l0J19j78M4J52l5Mj2k0K36k41k81K07j67K18j25J18
6915D8Mj54K00j53o0p0K43j63K05j78Q0J35l35J4L09j30O7n1k9j25o1R6J92l5
6939D9L6L9k00Q0oN0J06l04J82L13n50L30o8m7J94k45j2R4k68K14j67K54j26L4
6963a8l5K85l82P1n1n4J04L48l25N5o3K65l44Q8J54rK5M0l41l3J30J3J52j88K46
6988A33j39Q0j65L49j86Q1R2k51O8j60J13J1j87J23r7K91q8Qq3l9q5K36Q3l34
7012a46j87L76j54n7K90j30O6J96m32j04K11J17k3n5Q8q8j0JJ30k1P0j62Q0jj11
$$ plain form
7037 -56 -287 39 77 -21 150 53 -280 -239 -97 -68 150 -77 184 158 -16 -147 -172 46 -157 59 -179 203 8
7060 8 -118 4 -69 20 -113 18 40 -27 125 36 -185 182 -100 -73 -377 67 -238 58 -281 -250 -67 -42 132
7083 132 -136 -117 60 -93 76 -56 106 -5 61 -69 -7 58 216 160 -44 -73 -137 112 -135 46 214 -11
7105 -11 59 -40 -130 -51 83 61 142 84 -96 -56 -191 -92 47 409 -186 187 -33 -103 -96 115 -21 -53 93 -50 -36
7130 -36 -36 -175 -150 -98 194 -207 101 -179 -130 123 -141 185 202 76 -9 -56 32 46 85 89 -83 -261 16 -237 -216
7155 -216 -13 -65 46 -80 -344 -105 -131 -16 103 191 93 -8 111 -195 -14 -122 140 -81 131 150 151 -220
7177 -220 -125 -192 120 20 -45 -65 37 -140 -100 62 -88 49 -26 -170 -216 -118 -47 48 -81 27 45 77 29 -134
7201 -134 -63 -1 -30 -136 53 -231 167 -123 -277 19 93 -173 -66 172 -71 17 -46 -170 57 -12 46 8 45
$$ packed form
7037e6k31L26L8r8J71r7l33M1J42K9K18k27K61k6j74j31k5K18k03K16k38L82j95
7060Hj26J22p3Q9j33J31K2o7J52q9k21L67k82K7l04M44l05K96l39L1J83K5J74
7083A32k68J9J77j53J69j32J62j11O6j30O2O5J58n6k04k9o4K49k47J81J68k25
7105a1P0r9r0P9J34k2Q1n8j80M0j35R9J39L62n95L73k20p0PK11j36l2J46j43J4
7130c6%j39K5N2K92m01L08k80M9K53k64L26J7j26q5m7Q8J4L9Mj72j78K77k53K1
7155b16K03n2J11j26k64K39k6J15J19Q8r8j01J19l06J81j08K62k21K12J9Jl71
7177b20R5o7L12j00o5k0J02j77M0J62j50J37p5j44m6R8P1R5j29J08J8L2m8j63
7201a34P1O2k9j06J89k84L98k90j54K96P4k66J07K38k43Q8o3j24K27o9N8l8L7
$$ plain form
7224 45 -137 -157 136 82 -111 204 -54 -200 66 24 25 79 63 76 -152 -106 -128 28 105 -128 128 -115 -106 -54 -26
7249 -26 130 9 258 115 -79 -44 -336 -29 86 67 119 51 104 -78 -240 67 51 213 -56 -155 -104 62 170
7272 170 5 107 -97 136 -40 126 -120 -26 -260 -4 358 147 -69 -210 -55 -188 223 -89 -58 169 -112
7293 -112 158 -123 81 -88 -15 79 -159 -94 0 -201 102 -27 305 -260 -40 -257 92 -22 -109 -91 131 156
7315 156 95 -134 -34 -61 -183 -22 120 175 161 -173 -38 -227 -53 88 84 -13 54 -10 71 11 -27 160 24 69
7339 69 121 -116 203 -314 120 168 -108 220 -8 -65 -225 23 54 108 -103 2 -84 -219 -150 80 164 101 112 -161
7363 -161 -65 24 17 226 58 65 -84 -26 -185 10 -77 209 135 131 16 -30 -47 -117 286 29 -39 59 -51 -176 -16
7388 -16 -83 211 -1 50 -283 -98 158 -131 146 -246 140 244 148 -170 -223 106 -309 -44 114 46 11 -118
$$ packed form
7224D5j82k0K93n4j93L15k58j46K66m2JN4j6J3k28M6k2J56P7k33K56k43RN2K8
7249b6J56j21K49j43j94L5k92L07J15j9N2o8N3j82j62L07j6J62k69r9N1J66J08
7272A70j65J02k04K33j76J66k46R4k34K56L62k11k16j41J55j33M11l12L1K27k81
7293a12K70k81K04j69P3R4k38O5R4k01L03j29L32n65K20k17L49j14q7J8K22K5
7315A56o1k29J00k7j22J61J42N5j4l34J35j89J74J41mr7O7o4Q1o0l8J87j36M5
7339F9N2k37L19n17M34M8k76L28k28n7j60K48L1N4k11J05q6j35O9K30Q4o3J1k73
7363a61R6Q9pK09j68Pj49N8j59J95q7K86p4mj15m6j7p0M03k57o8R8j10j25J60
7388a6o7K94k12N1l33J85K56k89K77l92L86J04r6l18n3L29m15K65J58o8l5j29
$$ plain form
7410 -118 -174 -120 23 -13 81 137 -48 -30 -116 -390 -30 -126 137 142 146 10 -302 -369 180 75 -39 250 -74 -10 -191
7435 -191 185 15 89 -268 16 11 -27 -33 -47 -65 3 61 47 75 103 -119 67 135 -197 -220 -66 -46 -149 -11 94
7460 94 44 151 63 -54 9 -66 16 46 -29 223 4 103 -77 -63 -77 -97 125 -46 -36 -91 -221 -7 -88 174 117
7485 117 -135 -86 28 -84 -235 -34 -213 44 85 -95 146 -74 -93 46 61 -33 -36 1 7 120 -180 140 15
7508 15 -34 93 -205 -56 36 15 237 470 13 22 -170 183 -126 77 -110 51 61 67 223 -239 -173 91 199
7531 199 172 -24 -33 -10 -347 -117 128 67 97 194 -28 -67 1 -401 53 84 -223 98 -59 -154 -273 -51 193 272
7555 272 91 -34 -62 -77 -25 -10 128 -219 -143 -16 -105 -225 -28 300 -73 101 107 60 86 -110 14 150 -136
7578 -136 -61 40 49 -205 41 198 -97 -6 202 -91 57 61 -211 -130 308 209 197 267 -126 -165 130 19 -56 223
$$ packed form
7410a18n6N4J43l6R4N6j85J8q6k74L60r6K63NMj36l12o7N49j05j14K89l24O4j81
7435a91L76j70P4l57K84nl8oj4j8O8N8j4K8K8k22J86O8l32k3J54K0j03J38J05
7460I4n0J07q8j17O3p5Q2L0p5K52k19R9j80J4j4k0K22j71J0n5j30K14q1K62n7
7485A17k52M9J14j12j51K01j79K57M1j80K41k20j9J39J5r4lL7OJ13l00L20j25
7508A5m9J27k98J49R2k1K22K33m57Rj92L53l09K03j87J61J0OJ56m62O6K64J08
7531A99k7j96rK3l37K30K45o1L0R7k22l9O8m02M54L1l07L21j57r5j19K22K44P9
7555B72j81j25k8j5N2J5J38l47P6J27q9j20J97L28l73J74Om7K6j96J24J36k86
7578a36P5J01Rk54K46J57k95R1K08k93J48Mk72Q1M38r9j2P0l93l9K95j11p5K79
$$ plain form
7602 223 -220 -192 199 17 -72 -71 -112 13 -2 130 38 3 -34 -120 169 117 50 84 78 -184 -319 154 -81 99 87
7627 87 -10 -36 -70 -72 -83 -54 7 -56 145 -191 11 182 239 181 -1 -52 12 -291 70 37 -149 169 58 -135 -191
7652 -191 -201 -89 46 154 207 197 -61 -66 13 -121 -248 178 22 -35 113 0 -184 -67 78 -61 113 -42
7674 -42 -234 -29 -2 10 71 61 85 153 -33 -162 68 -242 -74 47 3 -216 -377 -52 -167 -24 21 10 -113
7697 -113 167 -98 -205 135 18 127 39 -105 -257 224 -45 20 -47 -207 91 52 8 -148 88 -64 77 131
7719 131 -38 50 -182 22 -78 -80 147 -63 14 79 -72 84 9 185 -117 -227 80 -214 113 77 19 163 -25
7742 -25 -36 -116 -65 23 18 90 166 152 -75 -44 -220 -238 -262 37 -52 -78 155 114 -89 -143 -70 35 78 417 1 -140
7768 -140 -173 -58 -3 180 171 90 -97 -4 -102 0 113 -112 60 6 -66 113 162 -66 -17 241 69 -2 140 -74
$$ packed form
7602B23m43K8L91j82q9Jm1J25j5J32r2l5l7q6K89n2o7L4ok62j35M73k35J80j2
7627H7r7k6l4kj1K9O1o3K01l36K02J71N7n8j82n1O4l03L61l3j86L18j11j93n6
7652a91j0J12J35J08N3j0k58nP9j34j27M26j56n7J48j13j84J17J45j39J74j55
7674d2j92K05K7J2O1j0K4O8j86j29K30l10J68J21m4k19j61L25j15J43M5j1j23
7697a13K80k65j07L40j17J09q8j44j52M81k69O5o7j60K98l9m4j56K36j52J41N4
7719A31j69Q8k32K04j00kK27k10P7O5j51J56p5J76l02j10L07k94L27l6n8J44j88
7742b5j1q0N1Q8nP2P6j4k27L1j76j8k4K99q9k6K33m1k03n4P3J05M3L39m16j41
7768a40l3J15N5J83rq1j87R3r8J02J13k25J72n4p2J79M9k28M9K58j72p1J42k14
$$ plain form
7792 -74 -10 153 -110 56 200 3 -137 81 123 -101 252 -15 119 212 -288 -302 -139 -62 -14 86 177 54 55
7815 55 52 -271 38 54 59 89 126 -449 27 -189 8 -18 81 76 -36 263 -157 -131 14 62 30 79 -150 -216 102 236
7841 236 145 75 -173 -166 -61 -8 40 -126 155 154 -34 88 -52 -12 -79 129 -99 242 -115 -109 -90 -72 -231 25 222
7866 222 -13 144 110 -504 -60 52 -26 144 -2 15 -40 -51 -79 147 86 -261 207 23 -220 -161 78 -169 91
7889 91 14 -79 -190 -172 121 -52 163 -48 5 117 152 60 -197 -212 112 178 134 -162 -38 137 -143 118 81 53
7913 53 -260 171 12 11 60 -174 212 69 -176 16 116 33 -310 -24 151 -28 194 88 -22 -173 27 35
7935 35 165 -139 -101 -56 308 -66 176 74 -3 79 -49 57 -163 112 -62 117 154 130 -103 132 31 -182
7957 -182 175 -95 185 375 -162 -156 -10 -154 48 -6 267 -182 -41 42 -1 145 -45 14 -176 7 -309 -334
$$ packed form
7792g4O4J63k63J66J44j97j40K18M2k24L53k67J34R3n00j4J63P7M8J00R1j23J
7815E5ll23L09J6NL0L7n75M76k16J97k6R9nj12K99m20K6J45M8l2M9k29o6L18J34
7841B36r1p0k48PJ05N3M8j66K81jj88J22j40M0o7K08k28L41l57OJ9J8j59K56J97
7866B22k35J57l4o14M44J12p8J70j46J7n5j1k8K26o1l47M68j84k43N9K39k47K60
7889I1p7r3j11J8K93j73K15k11N3J12L5r2k57j5L24O6m4k96J24J75k80K61l7k8
7913E3l13M31j59jM9k34L86j43k45J92J00q3l43K86J75j79K22j06j10j51K00Q
7935C5J30l04L8M5L64l74K42j02p7Q2j28J06k20K75j74J79L7k4k33K35j01k13
7957a82L57k70K80J90n37OJ46j44K02n4K73m49J41Q3m3J46j90N9j90J83l16k5
$$ plain form
7979 -334 -141 4 5 182 -20 95 -2 -199 -7 236 -234 -111 241 -34 -181 -144 131 109 126 59 47 47 -96
8002 -96 -120 -71 50 -91 360 -121 11 43 -123 -46 71 165 5 77 -107 -88 -208 -217 139 254 104 104 -98 -85
8026 -85 -145 -19 100 -58 -202 -124 -212 -178 -249 -218 -163 157 -202 119 132 -186 77 226 217 -116 -73 363 131 29
8050 29 85 38 -49 205 40 -183 -290 146 60 93 51 -157 -31 91 -142 -78 306 -103 8 -27 -447 -22 122
8073 122 -114 239 13 115 301 -293 -216 -113 64 -31 154 178 7 -2 -66 -206 -360 156 135 -96 -48 -133 -72
8096 -72 66 105 -207 -56 208 53 95 -123 -24 -36 -109 -113 68 -198 -50 29 -27 146 133 22 -54 -137 -132 -226 -101
8121 -101 194 79 114 239 -175 -169 -122 140 -53 70 206 203 14 29 -153 62 20 -76 113 207 -51 -272 174
8144 174 31 -215 81 -25 166 111 85 -81 0 207 219 336 -432 -109 48 190 -254 174 -82 57 15 -57
$$ packed form
7979c34J93J45JJ77k02J15r7j97J92K43m70J23L52k75j47L7K75k2J7o7j2%j43
8002i6k4M9J21j41M51m81J32L2j66P7J17R4j60P2j84J9j20rL56J15j50%k02J3
8026h5o0J26J19j58j44P8q8L4p1L1N5L20l59L21J3l18K63J49rl33M3M36k32j02
8050B9N6m7q7K54j65k23j07M36q6L3m2k08J26J22k33O4L84m09J11l5m20M25J44
8073A22k36L53k26J02J86n94P7J03J77r5J85K4j71ro4j40j54N16k1k31M8q5O1
8096g2J38L9l12J51K64j55M2k18R9j2p3mJ81k66J48P9n6J73j3j11p6q3Nr4J25
8121a01K95j15L5J25m14OM7K62j93J23J36lj89J5j82K15m2r6J89R4k58k21M46
8144A74j43k46K96j06J91n5k6j66Q1K07J2J17p68L23J57J42m44M28k56J39m2p2
$$ plain form
8166 -57 -109 -123 90 318 -118 -121 -219 -12 74 107 175 77 -96 -54 4 -191 -267 34 148 -3 189 41 -256 106
8190 106 107
$$ packed form
8166e7n2j4K13K28m36lr8K07Q6L3O8r8j73M2N8j95p6L01J14j51J92j48k97L62
8190A06J
8191A07
$$ Imaginary data points
##PAGE= N=2
##DATA TABLE= (X++(I..I)), XYDATA
$$ plain form
0 0 0 0 0 0 0 0 0 0 0 0 0 0 8 -8 8 -8 8 -16 16 -24 24 -32 36 -40 48 -56 64 -78 88 -104 116 -132 152 -170
34 -170 192 -216 242 -270 301 -338 375 -417 461 -511 566 -623 689 -760 835 -922 1016 -1118
52 -1118 1233 -1359 1505 -1666 1852 -2068 2314 -2610 2967 -3405 3965 -4704 5724 -7239 9719
67 9719 -14482 26994 -132467 -292125 -12838 111175 99280 23684 -2162 40666 61867 -84323
79 -84323 -137021 -10528 45953 8334 90528 136428 -11288 -178701 -137634 63693 167267
90 167267 6508 -141331 -28060 112704 48821 -62815 -83429 -6062 95102 52035 -83313
101 -83313 -54918 38222 -3011 -320 115500 79248 -102044 -158429 -36706 100539 90550 -34639
113 -34639 -33589 93810 67163 -106863 -168488 -68724 81403 149822 64129 -16843 6733 -51448
$$ packed form
0@%%%%%%%%%%%%Qj6J6j6J6k4L2m0M8n6O8p6Q8j04J20j42J66j92K20k48K84l22
34a70L62m08M58n12N71o39P13p92Q78r72J077j189J312j449J595j757J938k134
52a118K351k592K864l171L518l920M382m924N577o372P370q669J0428j2963J6958
67I719k4201M1476j59461j59658K79287J24013j1895p5596k5846M2828K1201j46190
79h4323n2698J26493N6481l7619Q2194M5900j47716j67413M1067K01327J03574
90A67267j60759j47839J13271J40764o3883j11636k0614P7367J01164m3067j35348
101h3313K8395R3140m1233K691J15820l6252j81292n6385J21723J37245r989j25189
113c4639J050J27399k6647j74026o1625R9764J50127O8419q5693q0972K3576n8181
$$ plain form
125 -51448 -155364 -54775 108317 81397 8009 32942 54130 -453 -107518 -148908 -5455
136 -5455 150428 96138 -27993 -39148 -7897 -11319 -46683 -59855 30555 100842 137 -72024
148 -72024 21765 46189 -45122 -37656 40829 50897 2844 -61452 -59805 45567 85387 -12
160 -12 -26654 18181 -4989 -69108 -78225 -874 109749 95314 -29800 -43023 11850 -53571
172 -53571 -108673 -15201 84594 104819 70208 -17056 -67233 -46145 -62509 -61294 58646 136446
184 136446 61701 -30964 -52420 -30299 -20413 -62488 -48820 84616 129950 6118 -71240 -46867
196 -46867 -30090 -3939 23505 12830 26025 33030 -28119 -34884 34855 21419 -39194 -14243
208 -14243 36071 28934 -26882 -73352 -12220 98224 67932 -43746 -60903 -35275 -28661 6041
$$ packed form
125e1448j03916J00589J63092k6920p3388K4933K1188n4583j07065m1390J43453
136e455J55883n4290j24131j1155L1251l422l5364j3172R0410P0287j00705p2161
148g2024R3789K4424r1311P466P8485J0068m8053o4296J647J05372L9820q5399
160a2k6642M4835k3170o4119r117P7351J10623j4435j25114j3223N4873o5421
172e3571n5102R3472R9795K0225l4611q7264n0177K1088j6364J215J19940P7800
184A36446p4745r2665k1456K2121R886m2075J3668J33436M5334j23832p7358K4373
196d6867J6777K6151K7444j0675J3195P005o1149o765O9739j3436o0613K4951
208a4243N0314p137n5816m6470O1132J10444l0292j11678j7157K5628O614L4702
$$ plain form
220 6041 30982 33140 56820 28083 -51008 -50775 -24161 -53719 -17497 97637 124858 39613 -66530
233 -66530 -112570 -49014 24547 8184 7930 67118 63385 85 -48104 -85472 -65055 16261 48397
246 48397 48374 65395 7017 -83235 -51906 24741 21427 -2761 -1501 16783 44494 12576 -59487
259 -59487 -39412 31041 31472 4619 -13594 -38183 -20288 18165 16582 29207 39109 -30311 -70921
272 -70921 -11963 15389 -6577 15830 48971 51907 25526 -53970 -104749 -39654 36381 50905
284 50905 59526 45892 -6874 -41368 -63979 -67068 -2079 49366 35292 47017 53522 -28416 -91836
297 -91836 -60668 -8085 40863 65851 27149 -1553 8984 -21269 -53222 -18798 17227 25982
309 25982 31162 6698 -17993 -7423 -18219 -25875 24001 35794 -20369 -31515 -5500 -521 17335
$$ packed form
220F041K4941K158K3680k8737p9091K33K6614k9558L6222J15134K7221q5245j06143
233f6530m6040O3556P3561j6363k54N9188l733o3300m8189l7368K0417Q1316L2136
246D8397k3J7021n8378r0252L1329P6647l314k4188J260J8284K7711l1918p2063
259e9487K0075P0453M31k6853j8213k4589J7895L8453j583J2625R902o9420m0610
272g0921N8958K7352k1966K2407L3141K936k6381p9496n0779O5095P6035J4524
284E0905Q621j3634n2766l4494k2611l089O4989N1445j4074J1725O505q1938o3420
297i1836L1168N2583M8948K4988l8702k8702J0537l0253l1953L4424L6025Q755
309B5982N180k4464k4691J0570j0796p656M9876J1793n6163j1146K6015M979J7856
$$ plain form
322 17335 27111 3309 6588 8153 -40876 -49746 3947 33147 42151 45380 9196 -26744 -43040
335 -43040 -64673 -32852 47841 62619 32361 25199 -10784 -62364 -58925 -34388 1008 66003
347 66003 74878 16168 -12247 -26663 -58643 -42119 9675 37819 54397 39306 -13827 -29489
359 -29489 -20049 -35964 -17248 31379 29545 8829 3626 -21495 -25021 6758 3014 -6141 18995
372 18995 8603 -26747 -12501 11204 15898 28122 15349 -17259 -17275 -21329 -33857 5046 46415
385 46415 36109 21769 -1055 -48496 -53260 -23514 -8566 32453 73696 38026 -14374 -30701
397 -30701 -51614 -49521 -1306 32054 49688 60590 16711 -40255 -44509 -37995 -24544 24844 48297
410 48297 30539 18892 -10838 -48702 -30629 -2874 -5130 17352 36939 6393 -13670 -10213
$$ packed form
322A7335R776k3802L279J565m9029q870N3693K9200R004L229l6184l5940j6296
335d3040k1633L1821Q0693J4778l0258p162l5983n1580L439K4537L5396O4995
347F6003Q875n8710k8415j4416l1980J6524N1794K8144J6578j5091n3133j5662
359b9489R440j5915J8716M8627j834k0716n203k5121l526L1779l744r155K5136
372A8995j0392l5350J4246K3705M694J2224j2773l2608j6m054j2528L8903M1369
385D6415j0306j4340k2824m7441m764K9746J4948M1019M1243l5670n2400j6327
397c0701k0913K093M8215L3360J7634J0902m3879n6966m254O514J3451M9388K3453
410D8297j7758j1647k9730l7864J8073K7755k256K2482J9587l0546k0063L457
$$ plain form
422 -10213 -18202 -2813 22828 7084 -5194 3241 -11024 -12009 16804 18955 9527 11061 -16319
435 -16319 -38471 -16329 -4842 2972 41337 43942 -329 -23730 -39544 -50540 -11379 31980
447 31980 37698 44942 31993 -21856 -48524 -39852 -30487 8881 54181 48151 26526 2279 -46178
460 -46178 -58511 -18658 3683 19883 46181 28022 -9144 -16852 -31383 -37066 1546 25652
472 25652 18125 21478 8471 -21282 -13728 1681 -1192 12018 13806 -12463 -10202 3021 -7316
485 -7316 3789 24712 6655 -9673 -11781 -32387 -26557 15436 28787 27241 29720 -4136 -40790
498 -40790 -35020 -22546 -3473 38961 49753 26168 8980 -24355 -59148 -38351 177 20885
510 20885 48423 46645 488 -26571 -34498 -46854 -19284 26073 32225 29640 24180 -12937 -35401
$$ packed form
422a0213p989J5389K5641j5744j2278Q435j4265r85K8813K151r428J534k7380
435a6319k2152K2142J1487P814L8365K605m4271k3401j5814j0996L9161M3359
447C1980N718P244j2949n3849k6668Q672R365L9368M5300o030k1625k4247m8457
460d6178j2333L9853K2341J6200K6298j8159l7166p708j4531n683L8612K4106
472B5652p527L353j3007k9753P554J5409k873J3210J788k6269K261J3223j0337
485g316J1105K0923j8057j6328k108k0606N830M1993J3351j546K479l3856l6654
498d0790N770J2474J9073M2434J0792k3585j7188l3335l4793K0797L8528K0708
510B0885K7538j778m6157k7059p927j2356K7570M5357O152k585n460l7117k2464
$$ plain form
523 -35401 -21964 -14102 3846 33454 23642 968 1376 -11149 -21289 1736 9658 10 7620
536 7620 -1995 -22174 -4803 11840 4107 12731 12414 -17317 -23960 -13926 -12238 14541 41111 24880
550 24880 6289 -6702 -38468 -41495 -5806 16789 34874 47556 15463 -23065 -30567 -41239
562 -41239 -35915 12151 41527 36652 30058 -2167 -43066 -39873 -20413 -5235 30285 45476 18650
575 18650 918 -10756 -32878 -23539 2156 9064 23200 28706 -4194 -22250 -9275 -8772 -3986
588 -3986 13803 4106 -8876 -354 -6948 -9345 14090 16687 1385 3702 -6833 -26873 -13377
601 -13377 6010 16891 37042 27497 -15136 -29626 -25875 -27844 -1901 31606 31367 26305 12006
614 12006 -30414 -47179 -27365 -11448 16739 51132 37937 3115 -16408 -36745 -36519 -3306
$$ packed form
523c5401J3437P862J7948K9608r812k2674M08j2525j0140K3025P922r648P610
536G620r615k0179J7371J6643p733Q624l17k9731o643J0034J688K6779K6570j6231
550B4880j8591j2991l1766l027L5689K2595J8085J2682l2093l8528p502j0672
562d1239N324M8066K9376m875o594l2225m0899L193J9460J5178L5520J5191k6826
575A8650j7732j1674k2122R339K5695O908J4136N506l2900j8056J2975N03M786
588c986J7789r697j2982Q522o594k397K3435K597j5302K317j0535k0040J3496
601a3377J9387J0881K0151r545m2633j4490L751j969K5943L3507k39n062j4299
614A2006m2420j6765J9814J5917K8187L4393j3195l4822j9523k0337K26L3213
$$ plain form
626 -3306 14837 21605 38436 22873 -15906 -25845 -24890 -20977 9411 25666 12049 8389 37 -22935
640 -22935 -15202 5174 831 2995 10093 -3435 -6755 2139 -3494 5295 24227 7497 -14717 -13243
654 -13243 -16876 -11171 17725 24931 16156 13365 -12151 -40266 -26771 -6790 4287 31112 39514
667 39514 12570 -9147 -28835 -44823 -19269 17497 26507 35068 31958 -5565 -30926 -30235 -27697
680 -27697 -2146 31926 29042 15846 9728 -17831 -36481 -17651 -2513 6726 24439 16808 -4512
693 -4512 -4972 -10485 -17493 3736 16156 2753 1731 565 -9927 1011 11715 2519 6477 8786
707 8786 -15748 -23371 -7794 -1836 12943 29946 13809 -7995 -15987 -31686 -27076 8433 25092
720 25092 24889 28838 7542 -23999 -29654 -28183 -15340 24996 43363 24698 8723 -12207 -38844
$$ packed form
626c306J8143O768J6831j5563l8779r939R55L913L0388J6255j3617l660q352k2972
640b2935P733K0376m343K164P098j3528l320Q894n633Q789J8932j6730k2214J474
654a3243l633N705K8896P206q775k791k5516k8115J3495J9981J1077K6825Q402
667C9514k6944k1717j9688j5988K5554L6766R010Q561l110l7523k5361O91K538
680b7697K5551L4072k884j3196o118k7559j8650J8830J5138R239J7713p631k1320
693d512m60n513p008K1229J2420j3403j022j166j0492J0938J0704r196L958K309
707H786k4534p623J5577N958J4779J7003j6137k1804p992j5699M610L5509J6659
720B5092k03L949k1296l1541n655J471J2843M0336J8367j8665j5975k0930k6637
$$ plain form
733 -38844 -29987 -5648 5637 25046 33014 7827 -9550 -15630 -30351 -19888 11806 19453 17187
746 17187 14336 -7458 -17254 -1821 -1275 -3135 11636 7945 -5952 -673 -2475 -8029 8340 13186
760 13186 -1464 -3884 -11153 -25274 -7306 16987 17987 19105 10960 -16637 -24402 -15006 -13829 5936
774 5936 33885 29132 12849 -1525 -30718 -39388 -12890 7449 22731 37651 19307 -12285 -20532
787 -20532 -27915 -28692 196 22056 23303 25477 7930 -23898 -24885 -12570 -6844 13599 25826 9670
801 9670 1278 -967 -15449 -11496 5074 2507 3076 10009 -5197 -13425 -309 2252 3537 13358
815 13358 260 -17240 -10419 -7256 -3445 18595 23876 8712 2782 -11732 -30059 -16975 4505
828 4505 13406 29054 28598 -2242 -21439 -25898 -30263 -9406 22309 26793 22950 14618 -15736 -33353
$$ packed form
733c8844Q857K4339J1285J9409P968k5187j7377o080j4721J0463L1694P647k266
746A7187k851k1794r796J5433N46j860J4771l691j3897N279j802n554J6369M846
760A3186j4650k420p269j4121J7968K4293J000J118q145k7597p765R396J177J9765
774E936K7949m753j6283j4374k9193q670K6498K0339J5282J4920j8344l1592q247
787b0532p383p77K8888K1860J247K174j7547l1828r87J2315N726K0443J2227j6156
801I670q392k245j4482L953J6570k567N69O933j5206q228J3116K561J285R821
815A3358j3098j7500O821L163L811K2040N281j5164n930j4514j8327J3084K1480
828D505Q901J5648m56l0840j9197m459m365K0857L1715M484l843q332l0354j7617
$$ plain form
842 -33353 -21811 -11856 5668 31538 27429 7346 -1805 -18806 -27849 -7208 8245 10615 20510
855 20510 13059 -9310 -10877 -8265 -11740 2232 12155 377 -1673 55 -10088 -3176 11544 5512
869 5512 2410 3454 -12716 -16387 1512 7574 13208 23095 7388 -14398 -15910 -20230 -16637 11042
883 11042 25017 18755 15364 -4132 -31133 -27594 -12257 -101 24396 34607 13269 -2939 -14470
896 -14470 -31185 -20452 5513 15214 23903 26405 1271 -18257 -17156 -19094 -8382 15800 16865
909 16865 7259 6552 -6872 -18210 -6350 -416 -724 10722 7368 -7092 -3470 635 -2791 8658
923 8658 12415 -2885 -6916 -6246 -12344 -341 17089 12427 8477 4645 -16945 -25005 -11493 -3310
937 -3310 10848 29291 18750 -2066 -10937 -25276 -26909 -941 16695 21222 27376 11517 -16322
$$ packed form
842c3353J1542R955J7524K5870m109k0083r151j7001r043K0641J5453K370R895
855B0510p451k2369j567K612l475J3972R923j1778k050J728j0143O912J4720o032
869E512l102J044j6170l671J7899O062N634R887j5707k1786j512m320L593K7679
883A1042J3975o262l391j9496k7001L539J5337J2156K4497J0211k1338j6208j1531
896a4470j6715J0733K5965R701Q689K502k5134j9528J101j938J0712K4182J065
909A6865r606p07j3424j1338J1860N934l08J1446l354j4460L622M105l426J1449
923H658L757j5300m031O70o098J2003J7430m662l950l832k1590q060J3512Q183
937c310J4158J8443j0541k0816q871j4339j633K5968J7636M527O154j5859k7839
$$ plain form
950 -16322 -21510 -20215 -16009 9861 27067 18003 10224 -2014 -23310 -21397 -6142 -1433 11075
963 11075 21232 5808 -6018 -5029 -12260 -9111 7517 6893 3219 7331 -2947 -9665 3622 6541
977 6541 1546 6587 -472 -14013 -8004 -2326 -1075 14176 17537 80 -7444 -12699 -22288 -9834
991 -9834 11374 16224 21039 17326 -8770 -22564 -17032 -14628 373 24682 24802 12670 3002 -18367
1005 -18367 -29252 -13103 -638 8607 25171 19651 -2890 -11050 -17111 -20250 -1537 11816 9481
1018 9481 14278 9295 -10585 -12122 -3182 -3843 4580 12048 1513 -2507 890 -6683 -3444 10244
1032 10244 4367 -4115 -2577 -9466 -11391 2875 7929 8221 14804 2780 -16974 -14959 -9607 -4556
1046 -4556 14846 23795 13194 4914 -8571 -27014 -18640 324 7434 19031 24720 5408 -11611
$$ packed form
950a6322n188J295M206K5870J7206r064p779j2238k1296J913J5255M709J2508
963A1075J0157j5424j1826R89p231L149J6628o24l674M112j0278o718J3287K919
977F541m995N041p059j3541O009N678J251J5251L361j7457p524n255r589J2454
991i834K1208M850M815l713k6096j3794N532K404J5001K4309J20j2132r668k1369
1005a8367j0885J6149J2465R245J6564n520k2541q160o061l139J8713J3353k335
1018I481M797m983j9880j537Q940o61Q423P468j0535m020L397p573L239J3688
1032A0244n877q482J538o889j925J4266N054K92O583j2024j9754K015N352N051
1046d556J9402Q949j0601q280j3485j8443Q374J8964P110J1597N689j9312j7019
$$ plain form
1059 -11611 -18218 -24801 -11819 12418 16656 14938 14978 -3474 -19966 -14649 -8902 -68 16717 15598
1073 15598 3666 2935 -5549 -16098 -4935 5709 3199 5968 3642 -7611 -3797 1534 -3647 3101
1087 3101 9164 -4003 -9653 -4462 -5658 2334 15149 9934 3947 1670 -13992 -20162 -2907 7546
1101 7546 12376 19926 10144 -7759 -13600 -20238 -19072 4629 20144 15851 13330 2721 -17905 -20919
1115 -20919 -13041 -5323 14105 24959 11167 892 -3623 -17315 -16706 -505 6842 12910 15766
1128 15766 694 -9473 -4831 -8547 -8513 6090 8689 549 806 -4050 -7680 2993 5328 -1318
1142 -1318 3533 2180 -10160 -6888 3262 5099 11827 11645 -3270 -8390 -8417 -15550 -5645 14667 16215
1157 16215 10291 4701 -11797 -20084 -12049 -7501 4124 23774 19549 1843 -5749 -14402 -19985 -6656
$$ packed form
1059a1611o607o583J2982K4237M238j718M0j8452j6492N317N747Q834J6785j119
1073A5598j1932p31q484j0549J1163J0644k510K769k326j1253L814N331n181O748
1087C101O063j3167n650N191j196P992J2815n215n987k277j5662o170J7255J0453
1101G546M830P550r782j7903n841o638J166K3701J5515m293k521j0609k0626l014
1115b0919P878P718J9428J0854j3792j0275m515j3692O09J6201P347O068K856
1128A5766j5072j0167M642l716L4J4603K599q140K57m856l630J0673K335o646
1142a318M851j353j2340L272J0150J837O728j82j4915n120k7p133R905K0312J548
1157A6215n924n590j6498q287Q035M548J1625J9650m225j7706p592q653n583J3329
$$ plain form
1171 -6656 6131 12900 21562 12835 -9349 -13110 -10049 -11945 -623 12622 10729 7954 1640 -13079
1185 -13079 -11021 184 -1742 710 9785 3530 -4286 -2185 -3565 43 9375 2986 -5242 -27
1199 -27 -2685 -8036 2701 10462 7307 6071 -3843 -16171 -10078 -3127 -2205 10933 19949 6708 -5584
1214 -5584 -11657 -18485 -9306 5896 9787 16044 19226 -507 -16784 -14506 -11368 -3180 12218 14993
1228 14993 10595 7708 -8832 -21195 -9967 -82 2019 10394 11615 1795 -2344 -8191 -12819 -130
1242 -130 8765 2191 2222 5290 -3195 -4568 779 533 4130 6355 -5856 -9023 238 -555 -222 9283
1258 9283 7723 -1116 -5309 -13535 -12792 3165 9539 7767 13141 7379 -10071 -14882 -11597 -5505 10005
1273 10005 17284 9888 6885 -395 -18061 -19110 -4657 4347 11744 15653 4894 -3019 -6565 -15977
$$ packed form
1171f656J2787O769Q662q727k2184l761L061j896J1322J3245j893k775o314j4719
1185a3079K058J1205j926K452R075o255p816K101j380L608R332o389q228N215
1199b7k658n351J0737P761l155j236r914j2328O093O951R22J3138R016j3241j2292
1214e584o073o828R179J5202L891O257L182j9733j6277K278L138Q188J5398K775
1228A4993m398k887j6540j2363J1228R885K101Q375J221r820m139n847m628J2689
1242a30Q895o574L1L068q485j373N347k46L597K225j2211l167R261p93L33R505
1258I283j560q839m193q226P43J5957O374j772N374n762j7450m811L285O092J5510
1273A0005P279p396l003p280j7666j049J4453R004P397L909j0759p913l546r412
$$ plain form
1287 -15977 -12641 5767 11019 7310 8000 570 -7255 -5506 -5843 -3289 9183 8725 -2306 -1308 455
1302 455 -4458 -498 3206 403 1838 -1154 -10295 -4666 6663 4470 3860 6380 -2393 -9017 -8135
1317 -8135 -7821 1845 15757 11423 2725 1357 -8107 -16614 -8436 1498 9444 17212 9615 -4892 -7603
1332 -7603 -11147 -16075 -3464 11335 12905 11109 3544 -9503 -10529 -6543 -7169 3520 15463 9236
1346 9236 695 -2073 -7485 -6972 141 333 3004 9011 792 -7636 -1808 655 -904 2932 1593
1361 1593 -3192 -1275 -3174 -5860 5175 10950 2928 -153 -2248 -9003 -6930 -54 3389 11712 13639
1376 13639 -676 -9300 -8451 -10912 -6750 6497 11566 11405 7609 -6955 -15100 -8727 -4884 -877
1390 -877 11650 15124 6228 -882 -9184 -13252 -3771 3167 2916 9661 9845 -2128 -7286 -6022 -5772
$$ packed form
1287a5977L336J8408N252l709O90p430p825J749l37K554J2472m58j1031R98J763
1302D55m913L960L704k803J435k992r141N629J1329k193o10K520q773o624Q82
1317h135L14R666J3912m334q698j368r464q507Q178R934P946P768p597j4507k711
1332g603l544m928J2611J4799J570j796p565j3047j026L986o26J0689J1943o227
1346I236q541k768n412N13P113J92K671O007q219q428N828K463j559L836j339
1361A593m785J917j899k686J1035N775q022l081k095o755K073O876L443Q323J927
1376A3639j4315q624Q49k461M162J3247N069j61l796j4564q145O373L843M007
1390h77J2527L474q896p110q302m068R481O938k51O745J84j1973n158J264K50
$$ plain form
1405 -5772 -97 5194 1817 1980 3325 -5248 -6524 2638 3020 765 1702 -2733 -4432 1016 469 1186
1421 1186 8900 5505 -4839 -5916 -6055 -5993 2282 7688 6465 7714 492 -13220 -12302 -3915 -414
1436 -414 6829 13074 7455 1032 -5172 -14354 -10268 2584 6453 8469 11751 3775 -6774 -8750 -9756
1451 -9756 -4377 6734 7886 3693 4695 -524 -9478 -6520 -1127 448 5637 4975 -2008 -932 -109
1466 -109 -4342 -190 5451 1482 -1186 -973 -3963 -747 4956 2575 2238 4232 -3856 -9888 -4870 -995
1482 -995 2958 9514 6718 -181 -2324 -8787 -12043 -2057 6773 7878 9878 6058 -4510 -8197 -8769
1497 -8769 -8142 2803 11757 8203 4358 638 -8080 -10630 -4776 -1210 5009 10215 4038 -2378 -2171
1512 -2171 -5507 -6566 1018 4263 3222 4308 129 -4607 -264 1135 -1170 2650 3094 -3030 -2811
$$ packed form
1405e772N675N291l377J63J345q573j276R162L82k255R37m435j699N448n47P17
1421A186P714l395j0344j077j39O2Q275N406j223J249p222j3712R18Q387L501
1436d14P243O245n619o423o204r182M086J2852L869K016L282p976j0549j976j006
1451i756N379J1111J152m193J002n219q954K958N393J575N189o62o983J076Q23
1466a09m233M152N641l969k668K13k990L216N703k381l37J994q088o032N018L875
1482i95L953O556k796o899k143o463l256R986Q830J105K000l820j0568l687n72
1497h769O27J0945Q954l554l845l720q718k550N854L566O219N206o177o416K07
1512b171l336j059P584L245j041J086m179m736M343J399k305L820M44o124K19
$$ plain form
1527 -2811 -1070 -1302 3487 5753 32 -1798 -2429 -7610 -5121 3104 5570 6993 6572 -1643 -7722 -6010
1543 -6010 -5916 -940 9134 10358 4766 1630 -5448 -11097 -6178 -1324 2619 10355 9134 -392 -4796
1558 -4796 -6836 -8984 -2425 4667 5197 6530 4918 -3663 -5823 -2622 -2894 519 6095 3303 -136
1573 -136 -118 -3360 -3134 2138 1688 -822 1032 -1391 -4336 -105 1972 1227 4190 1967 -4806 -4435 -3232
1590 -3232 -2933 3767 8482 5122 1885 -2101 -8499 -7370 -737 2144 6458 9816 2721 -4049 -5969
1605 -5969 -8993 -6242 3175 6532 6723 6531 -568 -8108 -6161 -3733 -1343 5638 7748 3082 1383
1620 1383 -2547 -6910 -3230 1217 1281 3758 3819 -1746 -2817 -925 -2213 -129 3376 118 -1995 -246
1636 -246 -2384 -1505 3985 3359 1010 1074 -3174 -6018 -1695 1510 3014 6920 4671 -2334 -4540 -6200
$$ packed form
1527b811J741k32M789K266n721j830o31n181K489Q225K466J423m21q215o079J712
1543f010R4M976J0074J224n592l136p078n649M919M854L943P736j221r526m404
1558d796k040k148O559P092N30J333j612q581k160L201k72L413N576k792l439
1573a36J8l242K26N272m50k510J854k423k945M231K077p45K963k223o773L71J203
1590c232K99O700M715l360l237l986o398J129O633K881M314L358p095o770j920
1605e969l024K751R417L357J91j92p099p540J947K428K390O981K110m666j699
1620A383l930m363L680M447O4K477O1n565j071J892j288K084L505l258k113J749
1636b46k138Q79N490o26k349O4m248k844M323L205J504L906k249p005k206j660
$$ plain form
1652 -6200 -6404 249 6254 5787 5459 1943 -6293 -8079 -4602 -2515 3549 9300 6247 1413 -1442 -6860
1668 -6860 -7028 -603 2491 4373 6890 2642 -2961 -3566 -4333 -3932 1807 3933 1444 1674 -86 -4094
1684 -4094 -1563 1040 119 1631 1627 -2002 -1533 815 -159 2041 4307 665 -2350 -2114 -4193 -2299 3943
1701 3943 4784 3514 2955 -3100 -7305 -4428 -1943 333 6683 6920 1974 -796 -4902 -7820 -3208 2471
1717 2471 4179 7100 5529 -1536 -4806 -4790 -5050 -451 4932 4101 3139 1865 -3955 -5905 -2239 -849
1733 -849 1307 4460 2256 -794 -145 -1700 -2490 1642 2454 -252 330 -415 -2339 351 2176 865
1749 865 2042 950 -4072 -3830 -1178 -601 2767 5424 2047 -916 -2580 -6182 -4631 1346 3511 4896
1765 4896 5679 1187 -4192 -4762 -4666 -2185 4405 6012 3720 2252 -2033 -6793 -4898 -1456 789 4719
$$ packed form
1652f200k04O653O005m67l28l516q236j786L477K087O064N751l053m834k855n418
1668f860j68O425L094J882K517m248n603o05p67M01N739K126k489K30j760m008
1684d094K531K603r21J512ml629M69K348r74K200K266l642l015K36k079J894O242
1701C943Q41j270n59o055m205K877K485K276O350K37m946k770m106k918M612N679
1717B471J708K921j571p065l270J6k60M599N383q31r62j274n820j950L666J390
1733h49K156L153k204l050O49j555p90M132Q12k706N82p45j924K690J825j311
1749H65J177j092n022K42K652N77L368K657l377k963j664l602J551N977K165J385
1765D896P83m492n379n70R6K481O590J607k292j468m285m760J895L442K245L930
$$ plain form
1781 4719 5117 800 -1085 -2357 -4594 -2357 2303 2257 2374 2310 -1180 -2137 -157 -659 336 2684 522
1798 522 -1976 -326 -483 -602 2220 1679 -514 -129 -2276 -4525 -846 2847 2696 3965 2305 -2702
1814 -2702 -3973 -3283 -2601 1751 5657 3978 2039 20 -4975 -5800 -2449 -4 3723 6662 2788 -1972
1830 -1972 -2762 -4573 -4330 386 3239 3239 3988 1021 -3250 -2789 -1921 -1422 2170 4161 1300 109 -956
1847 -956 -2555 -626 1077 -197 221 935 -1343 -1839 375 326 1062 2398 -205 -2490 -1657 -2141 -885
1864 -885 3705 3896 1798 450 -2148 -4646 -2235 21 1498 5063 4578 -720 -3189 -4216 -4890 -1288
1880 -1288 3077 3479 3898 2301 -2617 -4531 -2894 -1745 793 4584 3791 1673 -81 -3259 -4109 -346
1896 -346 1032 1114 2668 1505 -1677 -1247 -1129 -1570 1140 1365 -485 22 -121 -2005 -271 2289 1410
$$ packed form
1781D719L98m317j885j272k237K237M660m6J17o4l490r57J980n02R95K348k162
1798E22k498J650j57j19K822n41k193L85k147k249L679L693j51J269j660n007
1814b702j271O90O82M352L906j679j939k019m995q25L351K445L727K939l874m760
1830a972p90j811K43M716K853%P49k967m271M61Q68M99L592J991k861j191j065
1847i56j599J929J703j274M18P14k278m96K214m9P36J336k603k285Q33m84J256
1864h85M590J91k098j348k598k498K411K256J477L565m85n298k469j027o74L602
1880a288M365M02M19j597m918j914J637J149K538L791p93k118j754l178q50L763
1896c46J378Q2J554j163l182M30J18m41K710K25j850N07j43j884J734K560q79
$$ plain form
1913 1410 765 9 -2770 -2098 309 884 2081 3768 1292 -1801 -2493 -3659 -2440 1790 3339 3075
1929 3075 2664 -810 -4766 -3796 -1806 -116 3477 4533 2067 437 -1971 -4822 -2383 928 1928
1944 1928 3237 3167 -185 -2114 -2223 -2947 -778 2529 1753 761 1092 -1149 -2351 -278 -106 366 1851
1961 1851 39 -1579 117 253 -198 1525 1643 -366 -822 -1745 -2286 301 2276 1746 1591 522 -2699
1978 -2699 -3452 -1795 -734 1859 4022 2175 180 -1044 -3718 -3946 120 2084 3082 3614 1092 -2203
1994 -2203 -2407 -2892 -2399 1767 3476 2164 1528 -441 -2985 -2459 -926 -184 1915 2550 60 -608 -77
2011 -77 -1167 -593 813 456 675 897 -924 -1332 1018 1080 608 1140 -591 -2284 -1299 -714 404 2306
2029 2306 2051 -253 -424 -1625 -3285 -1253 1348 2236 3211 2212 -1743 -2532 -2120 -2228 140 3107 3055
$$ packed form
1913A410o45p56k779O72K407N75J197J687k476l093o92j166J219M230J549k64
1929C075m11l474l956R70J990J690L593J056k466j630k408k851K439L311J000
1944A928J309p0l352j929j09p24K169L307p76r92L31k241j202K073J72M72J485
1961A851j812j618J696J36m51J723J18k009m56r23n41K587J975n30j55j069l221
1978b699p53J657J061K593K163j847j995j224k674k28M066J964R98N32k522l295
1994b203k04m85M93M166J709j312o36j969k544N26J533P42K099O35k490o68N31
2011g7j090N74J406l57K19K22j821m08K350O2m72N32j731j693R85N85J118J902
2029B306k55k304j71j201j660K032K601Q88R75r99l955p89M12j08K368K967n2
$$ plain form
2046 3055 1511 359 -2547 -3425 -1687 -765 1347 3559 2209 -678 -1449 -2373 -1894 470 1335 1087 1744
2063 1744 839 -1583 -1174 -179 -747 707 1370 19 -320 -320 -917 255 1802 366 -751 -296 -1440 -1308
2081 -1308 536 933 1383 1980 8 -2448 -1649 -1469 -565 2035 2949 1566 409 -1514 -3413 -1475 -64
2098 -64 504 2444 2987 501 -1242 -2332 -2997 -931 1479 1603 1871 1817 -989 -2133 -1213 -764 218 1955
2116 1955 1309 384 464 -1120 -1805 -165 655 247 569 -135 -1130 -240 436 -161 907 899 -992 -1051 -588 -878
2136 -878 405 1778 1162 751 -73 -2209 -2037 -92 563 1361 2350 991 -954 -1571 -2579 -1987 876
2153 876 1771 1461 1837 135 -2104 -2207 -1517 -341 2072 2556 979 586 -484 -2309 -1371 299 557
2170 557 1362 1503 -205 -1002 -669 -1029 -540 1107 421 -76 30 -575 -644 612 523 216 703 -461 -1505
$$ packed form
2046C055j544j152k906q78J738R22K112K212j350k887p71r24M79K364Q65k48O57
2063A744r05k422M09R95n68J454O63j351l39%n97J172J547j436j117M55j144J32
2081a308J844L97M50N97j972k456P99J80R04K600R14j383j157j923j899J938J411
2098f4N68J940N43k486j743j090o65K066K410J24K68n4k806j144R20M49R82J737
2116A955o46r25Q0j584o85J640Q20m08L22p04r95Q90O76n97J068qj891n9M63k90
2136h78J283J373o16m11q24k136J72J945O55P98R89j359j945o17j008N92K863
2153H76Q95l10L76j702k239j03O90J176K413M84j577l93j070j825R38J670K58
2170E57Q05J41j708p97L33l60M89J647o86m97J06o05o9J256q9l07M87j164j044
$$ plain form
2189 -1505 -262 349 330 1796 1288 -309 -809 -1312 -1715 -65 1704 1324 1380 525 -1288 -2048 -1260 -749
2207 -749 869 2331 1519 140 -270 -1869 -1991 -122 739 1041 1977 692 -1073 -773 -1080 -1257 410
2224 410 1173 696 622 -83 -1350 -697 -23 -115 554 924 -272 -474 165 -239 363 901 75 -539 -184 -1041
2244 -1041 -733 762 929 470 615 -579 -1574 -944 -421 132 1410 1833 269 -766 -1133 -1692 -825 556
2262 556 1067 1458 1551 -546 -1261 -1122 -1124 -43 1522 1174 914 430 -1019 -1573 -572 -265 581 1170 844
2281 844 -119 -390 -479 -1003 444 473 244 275 90 -616 304 311 -86 468 617 -446 -849 -496 -256 573 1195
2302 1195 350 -405 -491 -1153 -1052 -12 855 810 1421 309 -918 -1019 -870 -515 1011 1472 709 246 -544
2321 -544 -1616 -803 -304 194 1199 1387 61 -472 -664 -1262 -818 591 643 791 807 -556 -744 -176 -203
$$ packed form
2189a505J243O11j9J466n08j597n00n03m03J650J769l80N6q55j813p60P88N11
2207g49J618J462q12j379m10j599j22J869Q61L02R36j285j765L00l07j77J667
2224D10P63m77p4p05j267O53O74r2O69L70j196k02O39m04O02N38q26o14L55q57
2244a041L08J495J67m59J45j194r95O30N23N53J278M23j564j035l67n59Q67J381
2262E56N11L91R3k097p15J39kJ081J565l48k60m84j449n54J001L07Q46N89l26
2281H44r63k71q9n24J447K9k29L1j85p06R20Pl97N54J49j063m03L53K40Q29O22
2302A195q45p55q6o62J01J040Q67m5O11j112j227j01J49L55J526M61p63m63p90
2321e44j072Q13M99M98J005J88j326n33j92n98M44J409N2J48J6j363j88N68k7
$$ plain form
2340 -203 -142 743 445 -365 204 -245 -413 584 386 -195 99 -51 -659 -228 491 233 633 629 -755 -822 -337
2361 -337 -616 319 1090 969 451 30 -1059 -1306 -390 191 752 1454 574 -454 -626 -920 -874 18 520 703
2381 703 819 17 -1074 -518 -376 -278 264 1054 335 -20 15 -697 -478 109 204 -18 64 -315 -284 90 -301
2402 -301 -159 393 89 -469 -256 -388 -299 445 440 158 322 -108 -971 -471 150 401 955 974 -153 -345 -633
2423 -633 -893 -357 604 603 560 504 -708 -989 -679 -490 98 946 594 253 -22 -636 -991 -137 84 315 807
2444 807 282 -325 -247 -409 -702 -70 379 20 -136 -214 -107 -169 232 176 166 251 -386 -346 -203 143 363 361 239
2467 239 -530 -81 -593 -505 211 523 518 289 138 -951 -478 -406 32 790 1024 266 -4 -375 -882 -560 293
2488 293 397 520 869 164 -289 -441 -570 -217 333 345 414 245 -148 -504 176 26 -84 529 243 -323 -38
$$ packed form
2340b03O1Q85k98q10N69m49j68R97j98n81K94j50o08M31P19k58M00mj384o7M85
2361c37k79R35P71j21n18m21j089k47R16N81N61P02q80j028j72k94M6Q92N02J83
2381G03J16q02j091N56J42R8N42P90p19l55L5p12K19N87R5k22Q2l79L1L74l91
2402c01J42N52l04n58K13j32Q9P44nk82J64m30q63N00O21K51N54J9j127j92k88
2423f33k60N36R61jm3n6j212k81L10J89N88Q48l52l41k75o14l55Q54K21K31M92
2444H07n25o07P8j62k93O32M49l59j56p8J07o2M01n6j0Q5o37M0J43L46K20kj22
2467B39p69M49n12Q8P16L12nk29j51j089M73P2M38P58K34p58k70l71n07L22Q53
2488B93J04J23L49p05m53j52j29L53N50J2O9j69l93l56O80j50j10O13k86n66K85
$$ plain form
2509 -38 90 12 118 276 -9 -243 -367 -368 11 288 138 150 220 -524 -532 -502 -341 301 522 265 -93 -210 -732
2532 -732 -695 -91 346 350 676 217 -556 -421 -401 -258 63 659 410 418 28 -408 -458 -60 -60 274 417 77 47
2555 47 -169 -568 -122 350 -79 -14 200 -231 -280 -30 329 374 129 107 -20 204 -56 -199 332 463 -179 -265
2577 -265 -272 -438 -66 355 513 482 413 99 -379 -328 -378 140 555 406 292 -33 -413 -689 -375 51 281 653
2599 653 221 -119 61 -246 -220 -116 272 247 216 314 -244 -536 -3 24 29 242 -39 114 -58 -280 30 249
2621 249 -34 51 -143 -276 82 6 -6 213 7 -178 72 -306 -94 -152 379 592 329 156 -322 -532 -174
2642 -174 18 37 304 373 205 -168 -304 -417 -465 262 316 561 330 -54 -434 -51 -210 236 353 311 54 236
2664 236 -363 -338 143 44 163 441 -53 25 -164 -207 -10 61 129 -127 -1 33 -288 -14 155 94 114 187 -247
$$ packed form
2509c8J28p8J06J58k85k34j24jL79K77j50J2P0p44qL0J61O42K21k57l58j17n22
2532g32L7O04M37ML26m59p73J35K0J43L21N96k49Ql90m36n0L98%L34J43l40l0
2555D7k16l99M46M72m29O5K14m31m9K50L59M5k45k2j27K24k60j43N31J31o42q6
2577b65pj66L72M21J58l1o9l14m78N1n0N18M15j49j14l25l80k76L14M26K30L72
2599F53m32l40J80l07K6J04L88k5l1R8n58k92N33K7NK13k81J53j72k22L10K19
2621B49k83Q5j94j33L58p6j2K19k06j85K50l78K12n8N31K13k63j73m78k10L58
2642a74J92J9K67O9j68l73j36j13m8P27N4K45k31l84l80L83j59M46J17m2k57J82
2664B36n99K5M81r9J19K78m94P8j89m3J97P1O8k56J26L4l21K74J69o1K0P3m34
$$ plain form
2687 -247 -52 218 47 222 373 261 152 28 -242 -267 224 403 404 105 4 -219 -124 -106 -67 155 37 288
2709 288 48 69 -200 31 -43 153 16 274 -38 -183 43 -38 64 177 30 21 -63 58 -220 184 268 92
2731 92 195 -138 -79 -20 178 193 -85 127 -27 -37 -163 -92 146 403 150 314 88 -283 -333 53 -182 -55
2753 -55 366 282 117 -45 -10 -438 46 -128 74 475 171 -121 -180 -92 -175 -61 130 147 225 191 -232 -303 -177
2776 -177 -75 156 324 -113 -26 29 10 -309 29 60 59 114 15 38 -89 231 -151 100 45 -187 -172 127 -89 -7
2800 -7 -26 62 -37 -100 -178 82 64 -107 251 97 24 -336 -299 32 -267 163 -80 126 -84 -27 -73 87 174 -55
2824 -55 -21 96 2 1 -160 -215 -288 158 -20 55 163 -24 60 75 74 150 -63 164 39 -65 -150 79 74 -160 -173 -46
2850 -46 14 88 -234 -226 99 24 18 -34 -33 -72 85 96 79 -26 65 27 -159 -65 -175 -104 179 -23 -50 -166 -189 68 12
$$ packed form
2687b47J95K70j71J75J51j12j09j24k70k5M91J79Jk99j01k23R5J8L9K22j18K51
2709B88k40K1k69K31p4J96j37K58l12j45K26q1J02J13j47rq4J21k78M04Q4j76
2731I2J03l33N9N9J98J5k78K12j54j0j26P1K38K57k53J64k26l71n0L86k35J27
2753e5M21q4j65j62L5m28M84j74K02M01l04k92n9Q8q3J14J91J7P8l4m23p1J26
2776a77J02K31J68m37Q7N5j9l19L38L1jN5r9K3j27L20l82K51n5k32J5K99k16Q2
2800gj9Q8r9o3p8K60j8j71L58j54p3l60L7L31k99M30k43K06k10N7m6J60Q7k29
2824e5L4J17r4jj61n5p3M46j78P5J08j87Q4J5jP6k13K27j25j04q5K29nk34j3J27
2850d6O0P4l22QL25p5on2Jl9J57J1j7j05R1l8j86R4j10P1K83k02k7j16k3K57n6
$$ plain form
2877 12 -33 71 3 174 -98 94 -44 -59 -51 -180 26 -193 -125 41 -96 -94 -50 -249 -23 6 -204 121 -5 136
2901 136 -39 309 56 -313 -99 184 18 92 -124 175 -164 -119 -103 -93 203 113 146 119 185 -39 36 -44 39 86
2925 86 -10 57 44 -207 -118 46 -74 -122 219 135 -109 51 -39 -65 4 18 74 10 -109 -45 -123 65 94 93 -59 132
2951 132 -96 -15 -226 142 36 110 -150 110 140 -157 145 -13 118 -239 178 237 41 -28 61 6 12 89 8 37
2975 37 -21 77 -216 123 -14 -92 183 -111 -90 -241 38 213 -143 -34 43 -148 -227 -125 29 -6 -28 -200 214
2998 214 190 206 243 -19 0 61 34 143 -112 -147 33 -174 21 -42 -91 177 315 58 186 -36 -110 -186 53 235
3022 235 150 10 -96 0 -36 -179 168 64 21 234 -62 -9 -2 -184 -299 107 -60 75 -25 -113 -3 -68 -104
3045 -104 -116 -21 -223 162 -89 100 -108 -81 47 9 -15 77 -56 -23 187 140 -58 -146 -50 -7 -53 -11 -7 -66 -105 102
$$ packed form
2877A2m5J04o8J71k72J92j38j5Qj29K06k19O8J66j37KM4j99K26K9k10L25j26J41
2901A36j75L48k53l69K14K83j66P4k16K99l39M5J6J0K96r0L3k7O6k24P5q0Q3M7
2925H6r6O7j3k51Q9J64j20m8L41q4k44J60r0k6O9J4N6o4j19O4p8J88K9jj52J91
2951A32k28Q1k11L68j06P4k60K60L0k97L02j58J31l57M17N9j96o9Q9n5OP7q1K9
2975C7n8R8k93L39j37p8K75k94K1j51K79J75l56J09P7j91p9J02J54l5k2j72M14
2998B14k4J6L7k62J9O1k7J09k55l5J80k07J95o3m9K68J38k57J28k22p4p6K39J82
3022B35q5j40j06R6l6j43L47j04m3K13k96N3Pj82j15M06j67J35j00q8J10o5l6
3045a04j2R5k02L85k51J89k08K7J28l8k4R2j33L3K10m7j98q8R6M3m6M2Mn9l9K07
$$ plain form
3071 102 -127 61 20 19 -112 127 92 74 56 -224 -66 -102 -99 115 64 49 -43 115 2 -39 72 18 118 -159 38
3096 38 -104 -109 -55 17 139 79 63 -50 -48 -197 112 225 -19 -1 -74 334 -148 -26 188 89 -83 58 -77 -201
3120 -201 -18 -150 -63 51 31 -205 147 -103 -145 -63 8 265 -225 324 -64 -49 -82 -148 111 230 -101 89 -114
3143 -114 -87 -396 67 96 271 -76 48 -161 -260 -75 -16 -134 110 186 262 66 -243 -56 250 -135 -7 -16 -262
3166 -262 -98 207 -34 -135 179 -89 170 168 11 102 -63 -168 140 68 -271 -79 -13 -123 115 263 8 160
3188 160 -173 -156 -106 -9 190 66 216 215 3 -149 -254 -279 -87 25 -180 136 42 -141 -146 -255 -140 -7 252
3211 252 194 -179 -128 -35 7 313 119 77 108 107 -88 -214 151 -66 367 272 56 -46 91 -53 131 -53 -74
3234 -74 81 -96 -265 42 296 -21 139 86 -204 3 -304 -160 -153 -95 164 -81 118 -210 -226 23 71 75 144
$$ packed form
3071A02k29J88m1jj31K39l5j8j8k80J58l6LK14n1j5r2J58j13m1J11n4J00k77J97
3096C8j42nN4P2J22o0j6j13Kj49L09J13k44J8p3M08m82J22K14r9j72J41j35j24
3120b01J83j32Q7J14k0k36L52k50m2Q2P1K57m90N49l88J5l3o6K59J19l31J90k03
3143a14K7l09M63K9J75l47J24k09r9J85N9j18K44P6P6j96l09J87L06l85J28rk46
3166b62J64L05k41j01L14k68K59kj57R1j65j05L08p2l39J92O6j10K38J48k55J52
3188A60l33J7N0R7J99j24J50jk12j52j05k5J92J12k05L16r4j83nj09J15J33K59
3211B52n8l73N1R3M2L06j94m2L1jj95j26L65k17M33r5k16j02J37j44J84j84k1
3234g4J55j77j69L07K54l17J60n3k90K07l07J44PN8K59k45J99l28j6K49M8MO9
$$ plain form
3257 144 221 54 -228 -169 -255 25 11 229 69 249 76 -172 -288 31 -189 -78 65 -120 -19 -116 122 -74
3279 -74 -111 43 164 28 -83 295 266 39 11 79 87 60 -36 -61 61 222 47 190 -209 -2 -34 129 252 322
3303 322 90 18 -240 -128 -205 72 53 57 261 140 53 -221 103 -21 -100 63 247 223 126 -132 -292 -157 -42
3326 -42 195 -30 104 -234 -229 -6 -119 -74 -93 -2 151 -146 -75 -261 245 277 35 -66 -211 -119 -120 247 -122 154
3350 154 -74 -239 -244 -110 -284 -45 228 416 192 4 -330 -58 -294 -12 96 311 298 -114 -141 -95 -217 -314
3372 -314 124 192 94 133 -114 -7 -327 -306 29 43 52 147 -108 -253 -68 102 53 172 33 -182 99 142 210 297
3396 297 346 212 130 -411 -335 -3 32 81 2 79 -145 -275 -19 27 76 153 201 -22 95 -239 -303 105 302 178
3420 178 311 -14 14 -134 -236 -6 -8 60 95 252 -28 -189 -353 -374 -123 34 115 -227 -159 66 248 -96 -83
$$ packed form
3257A44P7j67k82N9q6K80j4K18j60J80j73k48j16L19k20J11J43j85J01r7K38j96
3279g4l7J54J21j36j11L78k9k27k8O8Qk7r6k5J22J61j75J43l99K07l2J63J23P0
3303C22k32p2k58J12p7K77j9MK04j21q7k74L24j24p9J63J84k4r7k58j60J35J15
3326d2K37k25J34l38NK23j13M5j9R1J53k97P1j86N06L2k42j01j45R2jL67l69K76
3350A54k28j65nJ34j74K39K73J88k24j88l34K72k36K82J08K15j3m12k7M6j22r7
3372c14M38O8r8L9k47J07l20K1L35J4RR5k55j45J85J70m9J19j39k15K81M3O8Q7
3396B97M9j34q2n41P6L32L5M9p9P7k24j30K56M6M9P7M8k23J17l34o4M08J97j24
3420A78J33l25K8j48j02K30kO8L5J57k80j61j64k1K51J57Q1l42O8K25J82l44J3
$$ plain form
3443 -83 -128 385 -154 -85 36 -15 54 -155 126 -72 -272 -237 117 -1 103 302 37 -26 -28 -173 -25 249 333
3466 333 366 170 78 -236 -155 -43 -156 294 471 -5 78 55 -277 -185 52 320 310 185 -261 -125 106 107 58
3489 58 136 2 271 17 -285 30 -26 242 -33 8 -99 -147 90 49 7 234 107 58 122 -165 -84 -4 128 207
3513 207 309 -33 -396 12 -392 -107 304 276 -21 220 -193 -362 -453 86 178 36 227 54 10 -221 -487
3534 -487 -80 190 131 148 193 28 -175 -73 -225 69 244 193 113 93 -124 -202 -47 222 -58 248 -31 -24 -45
3557 -45 182 265 76 88 -100 -225 -170 -289 -147 146 105 56 75 -76 -258 -53 89 -140 218 211 -267 65 -51
3580 -51 -150 93 192 81 122 50 -141 -84 152 -92 359 235 212 320 -152 63 -72 59 142 152 300 32 -105
3603 -105 -160 -30 10 -115 72 -114 -62 -266 108 82 236 -35 62 -74 -231 -188 350 129 121 325 -79 -239 -333
$$ packed form
3443h3m5N13n39O9J21n1O9k09K81j98k00L5L54j18J04J99k65o3kj45J48K74Q4
3466C33L3j96r2l14Q1J12j13M50J77m76Q3k3l32R2K37K68j0j25m46J36K31Jm9
3489E8P8j34K69k54l02L15n6K68k75M1j07m8K37m1m2K27j27m9O4k87Q1Q0J32P9
3513B07J02l42l63M08m04K85M11k8k97K41m13j69r1N39R2j42J91j73m4k31k66
3534d87M07K70n9J7M5j65k03J02j52K94J75n1q0k0k17p8J55K69k80L06k79Pk1
3557d5K27Q3j89J2j88j25N5j19J42K93m1m9J9j51j82K05J42k29L58pm78L32j16
3580e1r9K43R9j11M1p2j91N7K36k44M51j24k3J08m72K15j35J31Q3J0J48k68j37
3603a05n5J30M0j25J87j86N2k04L74k6J54k71R7j36j57M3N38k21qK04m04j60r4
$$ plain form
3626 -333 -355 61 231 244 121 95 -222 -335 -28 -161 159 159 242 24 -121 -285 23 -16 84 -32 262 117
3648 117 62 48 71 -123 182 106 159 -46 -232 -89 52 253 86 84 300 -122 -75 207 -1 87 71 -37 -102 -96
3672 -96 -86 -150 205 19 -91 38 -260 -190 -281 -235 -364 247 389 55 -274 19 -447 40 240 -73 365 157
3694 157 -244 18 -300 -89 6 260 33 15 182 -252 -319 -44 1 3 27 129 -229 -93 -168 19 112 174 212 154
3718 154 -96 4 5 166 -87 32 164 -241 -431 -259 -64 185 184 77 22 -235 -252 -244 -17 -101 254 180 -129
3741 -129 -146 -208 -43 165 284 364 237 -9 51 -253 -354 -59 53 237 76 -131 -225 -75 -141 -134 156 99 0
3764 0 236 -86 -175 92 -108 -20 124 135 -152 -133 142 -52 36 352 44 -8 -97 -204 -111 208 174 109 5 -193
3788 -193 -451 -94 -87 66 364 103 -82 -168 -262 -265 -82 -22 242 474 159 -292 -3 -210 -211 -2 196 223 118
$$ packed form
3626c33k2M16J70J3j23k6l17j13L07j33L20%Q3k18j45j64L08l9J00j16K94j45
3648A17n5j4K3j94L05p6N3k05j86J43J41K01j67kK16m22M7K82k08Q8j6j08o5O
3672i6J0o4L55j86j10J29k98P0r1M6j29O11J42l34l29K93m66M87K00l13M38k08
3694A57m01K62l18K11R5K54k27j8J67m34o7K75M5KK4J02l58J36p5J87R3O2L8n8
3718A54k50J00JJ61k53J19J32m05j90J72J95K49jj07n5k57j7QK27q4L55p4l09
3741a29j7o2J65K08J19Q0j27k46O0l04j01K95J12J84j61k07r4J50o6PK90n7r9
3764@K36l22q9K67k00Q8J44J1k87J9K75j94Q8L16l08n2q9j07R3L19l4o5j04j98
3788a93k58L57PJ53K98k61j85q6r4lJ83O0K64K32l15m51K89k07jK09J98K7j05
$$ plain form
3811 118 119 -321 -373 -48 -124 289 116 117 137 -191 -263 146 134 49 241 52 -79 159 -79 185 258 -47 74 -248
3835 -248 -21 -72 -16 74 64 133 218 -62 -202 -141 95 86 274 377 -250 -51 -4 -321 11 403 118 255 28
3858 28 -87 -307 -121 -199 -76 250 179 52 -76 -145 -210 133 -87 4 187 176 15 -70 -127 -114 -87 261 -296 -16
3882 -16 74 69 285 137 171 -182 189 -52 -253 -58 343 141 215 39 41 -428 -308 -1 66 143 119 121 -116 -385
3906 -385 -428 -137 161 165 77 128 187 -163 -238 -353 -105 159 302 447 37 -248 -209 -232 -127 303 -40 137 145 -89
3930 -89 -388 -13 -247 -61 -45 78 -233 168 -81 234 192 158 159 -199 -166 21 -34 260 71 121 16 -126 -257
3953 -257 -167 -45 38 360 -71 -96 -189 -206 -445 -38 37 14 292 268 -81 -213 -264 -130 156 140 458 324 -43
3976 -43 -169 -586 24 10 -234 82 -71 71 -30 -305 -109 169 207 340 270 -12 -70 35 -51 -15 207 62
$$ packed form
3811A18Jm40n2L25p6M13j73JK0l28p2M09j2q5J92j89j31K38k38K64P3l05J21l22
3835b48K27n1N6R0j0O9Q5k80j40O1K36rJ88J03o27J99M7l17L32L92k85J37k27
3858B8j15k20J86p8J23L26p1j27j28o9o5L43k20R1J83j1j61q5n7J3K7L48n57K80
3882a6R0nK16j48L4l53L71k41k01J95M01k02P4j76Km69J20L07O7P7k4Kk37k69
3906c85m3K91K98Mq8N1N9l50p5j15K48K64J43J45m10k85L9k3J05M30l43J77Qk34
3930h9k99L75k34J86J6J23l11M01k49L15m2l4Jl58L3J87n5K94j89N0j05j42j31
3953b57R0J22Q3L22m31k5r3j7k39M07P5k3K78k4l49j32n1J34K86j6L18j34l67
3976d3j26m17O10j4k44L16j53J42j01k75J96K78L8J33p0k82n8J05q6L6K22j45
$$ plain form
3998 62 53 -85 -100 14 186 147 112 -84 -197 -77 136 -23 147 395 168 -33 -100 -444 -28 31 226 288 137
4021 137 114 -176 -243 11 -179 111 181 59 -159 -65 -370 -106 148 5 74 356 162 -186 -68 -192 -165 -69
4043 -69 76 99 31 -46 -191 -2 457 9 7 -231 -191 -376 149 197 -45 230 -80 -88 -69 37 -140 255 225 -29
4067 -29 94 -33 -96 -106 125 78 373 -128 105 -104 -202 -441 -28 116 -98 39 199 -154 -421 -141 -80 144
4089 144 238 -95 11 -199 -573 -215 -203 303 -70 116 386 -164 -104 -30 113 5 -62 -102 64 137 -100 26
4111 26 128 -76 -102 114 -267 -243 -81 124 92 71 -40 -73 -196 -234 -190 -75 313 253 64 201 -578 -206 154
4134 154 -68 -20 188 177 40 49 -376 -187 122 111 337 142 -157 11 -68 -76 -27 225 57 -113 143 -64 -280
4157 -280 150 -93 -223 -136 -4 -412 87 220 -98 445 213 -197 -7 -277 234 365 242 119 131 47 -263
$$ packed form
3998F2rj38j5J14J72l9l5j96j13J20K13j59J70K48k27k01o7l44M16N9J95O2j51
4021A37k3k90o7K54j90K90P0j22k18R4l05K64K54j43O9K82j94l48J18j24K7R6
4043f9J45K3o8p7j45J89M59m48kk38M0j85N25M8k42K75l10qJ9J06j77L95l0k54
4067b9J23j27o3j0K31m7K95n01K33k09r8k39M13J44k14J37J60l53k67K80O1K24
4089A44R4l33J06k10l74L58J2N06l73J86K70n50O0P4J43j08o7m0J66P3k37J26
4111B6J02k04k6K16l81K4J62K05l2k1j11l3j23l8M4J15L88o0j89J37p79L72L60
4134A54k22M8K08j1j37Rm25J89L09j1K26j95k99J68p9qM9K52j68j70K56k07k16
4157b80M30k43j30Q7J32m08M99J33l18N43k32m10J90k70N11J31j23j23J2q4l10
$$ plain form
4178 -263 -359 -265 -39 94 291 58 -155 -257 -135 -255 -223 119 437 113 284 -368 -380 98 -53 176 271 145
4200 145 88 66 -200 -99 -28 54 -176 140 78 26 -90 58 60 100 281 217 241 -137 -95 35 90 71 -65 69 -235
4225 -235 -99 58 156 326 350 -50 -184 -220 -278 -103 298 207 192 125 -119 -145 -40 -186 163 204 210 -133 -24 -266
4249 -266 -141 -298 -145 35 167 230 -65 60 -289 -104 97 41 204 293 -77 20 110 7 195 91 183 42
4271 42 -129 -288 -166 48 84 115 -153 -247 -185 -192 177 340 219 52 -293 -46 -70 14 177 132 244 40 176
4294 176 58 -210 -292 42 90 -3 63 -96 -11 -166 -393 -229 87 71 395 113 -112 -158 134 12 -156 320
4316 320 51 -158 24 -24 -26 88 -65 -49 -44 125 -270 139 53 167 131 215 -77 -299 35 -156 145 14 430
4339 430 9 75 38 -212 -219 31 302 155 387 -221 -73 -297 -150 158 135 -42 140 -44 -166 -456 15 -148
$$ packed form
4178b63r6R4K26J33J97k33k13j02J22j20L2L42L18l24J71o52j2M78j51K29R5j26
4200A45n7k2k66J01P1Q2k30L16o2n2j16J48KM0J81o4K4l78M2J30N5j9j36J34l04
4225b35J36J57R8J70K4m00j34l6n8J75M01r1j5o7k44k6J05j46L49M1Ol43J09k42
4249b66J25j57J53J80J32O3k95J25l49J85K01n6J63Q9l70R7R0j03J88j04R2j41
4271D2j71j59J22K14L6L1k68r4O2pL69J63j21j67l45K47k4Q4J63m5J12k04J36
4294A76j18k68q2L34M8r3O6j59Q5j55k27J64L16j6L24k82k25m6K92j22j68M76
4316C20k69k09J82m8kJ14j53J6NJ69l95M09q6J14l6Q4k92k22L34j91L01j31M16
4339D30m21O6l7k50pK50K71j47K32o08J48k24J47L08k3j77J82j84j22k90M71j63
$$ plain form
4361 -148 64 359 -65 130 -18 -142 -239 -32 254 129 51 -246 -83 150 40 -20 139 287 98 16 40 -260
4383 -260 261 -148 140 33 44 -272 -32 111 212 333 313 43 -69 -60 -338 -43 292 406 133 -38 -184
4404 -184 -398 -60 -37 -23 174 65 -105 -86 13 -267 -120 167 -153 75 23 -38 9 -19 -144 -8 14 3 223
4427 223 -26 -50 -25 255 122 197 -191 -165 28 -190 249 60 297 19 248 -10 -150 41 92 59 117 423
4449 423 -68 -83 -243 -152 -194 -17 346 289 -166 -188 -334 -283 -2 -56 147 370 -55 -293 -272 -213 -37 327 144
4472 144 -225 55 -61 -275 49 -268 -189 108 185 127 -25 -83 -160 131 27 -247 -28 366 -241 -88 166 203
4494 203 -7 -18 5 -350 24 93 -80 183 -48 -159 18 -343 -19 39 109 199 516 38 -275 -191 -153 -171 45
4517 45 273 317 210 -77 -473 -7 -19 142 167 -111 26 63 7 -22 14 38 5 211 -11 -22 -112 -67 -164 159 184
$$ packed form
4361a48K12K95m24J95j48j24r7K07K86j25p8k97J63K33j10o0J59J48j89q2K4l00
4383b60N21m09K88j07J1l16K40J43J01J21k0k70j12Rk78K95L35J14k73j71j46
4404a84k14L38K3J4J97j09j70J9R9k80J47K87l20K28n2o1M7k8j25J36K2j1K20
4427B23k49k4K5K80j33P5l88K6J93k18M39j89K37k78K29k58j40J91N1l3N8L06
4449D23m91j5j60R1m2J77L63n7m55k2j46N1K81n4K03K23m25k38K1N9J76L64j83
4472A44l69K80j16k14L24l17P9K97P7n8j52n8p7K91j04k74K19L94o07J53K54L7
4494B03k10j1K3l55L74O9j73K63k31j11J77l61L24N8P0R0L17m78l13Q4L8j8K16
4517D5K28M4j07k87l96M66j2J61K5k78J37L7n6k9L6K4l3K06k22j1r0M5r7L23K5
$$ plain form
4542 184 143 -346 105 54 -64 275 315 109 -85 -175 -135 37 156 217 118 372 137 -250 -148 -117 -51 259 247
4565 247 189 -134 -425 -189 -116 90 170 129 -63 -345 50 -91 -57 -15 349 -71 279 147 -291 -43 -113 -81 88
4588 88 -167 27 127 75 -72 -23 89 304 41 76 220 -188 207 235 183 253 117 -299 -64 -59 -164 318 316 56
4612 56 391 -83 -287 -115 173 14 87 187 -255 97 -290 -243 -53 -25 178 144 61 -277 -197 91 -18 127
4634 127 190 188 35 -43 -204 -37 -142 -24 248 2 39 -64 -130 -166 -199 -164 182 -24 -138 -127 -36 219 21 47
4658 47 25 95 21 -111 158 0 155 248 -2 -115 -56 -336 -193 339 135 0 147 -185 -266 -326 -64 -125 192
4681 192 255 24 -208 -205 81 -164 336 88 289 137 116 -31 -45 -273 -184 241 78 25 226 -20 115 -10
4703 -10 -36 35 -59 21 -168 -182 30 160 109 16 -254 164 -56 -41 -123 64 -4 102 8 -174 -105 200 100 126 186
$$ packed form
4542A84m1m89M51n1j18L39M0k06j94r0M0J72J19O1r9K54k35l87J02L1O6L10j2
4565B47n8l23k91K36P3K06Q0m1j92k82L95j41L4M2L64m20L50j32m38K48p0L2J69
4588H8k55J94J00n2j47M9J12K15k63L5J44m08L95K8n2P0j36m16K35Nj05M82kk60
4612E6L35m74k04J72K88j59P3J00m42L52l87M7J90K8K03l4q3l38Q0K88j09J45
4634A27O3kj53p8j61J67j05J18K72k46L7j03o6l6l3L5L46k06j14J1R1K55j98K6
4658D7k2P0p4j32K69j58J55R3k50j13N9k80J43N32k04j35J47l32q1o0K62o1L17
4681A92O3k31k32LK86k45N00k48K01j52k1j47j4k28Q9M25j63n3K01k46J35j25
4703a0k6P1r4Q0j89j4K12J30n1r3k70M18k20J5q2J87o8J06r4j82O9L05j00K6O0
$$ plain form
4728 186 125 -227 39 -302 -208 20 165 201 153 59 -70 -50 -97 -97 172 74 -141 6 -146 -201 90 67 -11 40 -7
4753 -7 42 -126 102 -62 -151 114 86 -27 139 -146 -82 6 103 52 107 48 32 156 -87 25 18 107 -47 -87 16
4778 16 -38 85 134 -90 137 177 -327 -202 30 -206 197 190 114 70 79 -314 -72 -127 374 -146 -96 150 -110 -69
4802 -69 -64 -80 77 1 -69 -134 -41 131 -80 23 -70 183 187 -181 1 -211 -43 -213 -8 66 -1 -120 51 -256
4826 -256 62 328 -125 -55 -230 -65 -73 -109 -208 -70 269 65 -80 1 -220 -64 -211 -85 136 -43 35 -141
4848 -141 -312 -42 91 134 76 255 259 11 -159 -6 -92 147 113 41 -252 114 -114 -55 247 0 40 168 -105
4871 -105 -54 -79 167 -121 -214 42 -8 -132 151 -13 -45 268 11 -144 -27 -66 -113 -346 165 257 277 46 -114
4894 -114 47 -157 25 235 212 -80 27 9 -335 -49 -292 -193 109 226 -94 -167 -35 -396 -164 -87 -15 323
$$ packed form
4728A86o1l52K66l41R4K28J45L6m8r4j29K0m7%K69r8k15J47j52n5K91k3p8N1m7
4753gM9j68K28j64q9K65k8j13J66k85O4Q8R7n1N5n9j6J24k43J12pQ9j54m0J03
4778A6n4J23M9k24K27M0n04J25K32k36M03pp6m4Rl93K42n5N01n20N0K46k60M1
4802f9Nj6J57p6p0o5R3J72k11J03r3K53Ml68J82k12J68j70K05P4o7j19J71l07
4826b56L18K66m53P0j75J65ql6r9J38L39k04j45Q1k21J56j47J26K21j79P8j76
4848a41j71K70J33M3n8J79Mk48j70J53q6K39l4p2k93L66k28N9L02k47M0J28k73
4871a05N1k5K46k88r3K56n0j24K83j64l2L13k57j55J17l9m7k33N11R2K0k31j60
4894a14J61k04J82K10k3k92J07j8l44K86k43R9L02J17l20p3J32l61K32P7P2L38
$$ plain form
4916 323 -14 -11 -274 242 -218 -180 375 50 210 75 -107 -102 221 44 117 49 -87 -17 -103 -35 27 101 145 -187
4940 -187 -45 46 -54 55 31 204 -7 298 -41 61 281 -44 1 79 167 -148 -30 -177 -107 62 10 -49 93
4963 93 143 100 -44 57 -79 -269 9 -111 60 204 20 48 99 6 85 -71 8 -137 30 -84 -5 20 483
4986 483 -3 174 254 -277 119 94 -26 15 -434 -182 -126 -96 -123 -147 69 173 -279 9 -122 -17 262 98
5008 98 233 48 38 12 -158 88 -127 4 -123 19 141 -20 -32 8 -77 -79 26 37 193 -47 19 -159 -185 95
5032 95 78 24 118 28 -268 -3 35 15 114 0 -81 93 53 -102 -90 142 19 -66 -98 192 -37 216 -36 -93 -28
5057 -28 -21 -136 -25 -278 128 155 39 142 -143 -111 -115 -128 -168 188 92 182 -123 70 90 -227 313 143 123 14
5081 14 -3 -12 8 173 4 -141 -137 -177 309 -23 -34 -22 26 -189 -344 166 -244 38 26 -65 14 81 -154 67 39
$$ packed form
4916C23l37Lk63N16m60L8N55l25J60j35j82NL23j77P3o8j36P0q6O8O2P4M4l32
4940a87J42R1j00J09k4J73k11L05l39J02K20l25M5P8Q8l15J18j47P0J69n2n9J42
4963I3N0m3j44J01j36j90K78j20J71J44j84K8N1r3P9j56P9j45J67j14P9K5M63
4986D83m86J77Q0n31L96k5j20M1m49K52N6L0k7k4K16J04m52K88j31J05K79j64
5008I8J35j85j0k6j70K46k15J31j27J42J22j61j2M0q5kJ05J1J56k40O6j78k6K80
5032I5j7n4R4r0k96K65L8k0R9j14q1J74m0j55J2K32j23q5l2K90k29K53k52n7O5
5057b8Pj15J11k53M06K7j16J03k85L2mj3m0L56r6R0l05J93K0l17N40j70k0j09
5081A4j7rK0J65j69j45Mm0M86l32j1J2M8k15j55N10m10K82j2r1P9O7k35K21k8
$$ plain form
5106 39 -238 25 3 212 77 66 68 -5 -12 40 -69 -79 256 -284 -51 70 -389 -80 299 154 75 173 -187 6
5130 6 47 25 115 130 30 43 132 86 -11 223 25 74 -216 122 -13 -108 281 66 90 -48 -115 -39 174 -200 200
5155 200 185 215 -143 162 -87 -54 221 20 190 298 -76 -255 151 -152 188 206 173 -415 -84 -195 111 -193
5177 -193 -208 31 55 -6 -168 247 -279 -133 179 206 147 150 8 61 9 86 -244 133 72 -35 112 166 -10 -130
5201 -130 130 -78 -25 81 -208 -70 176 46 -94 8 236 -75 72 -162 99 77 -55 130 56 82 -416
5222 -416 -165 -73 -200 157 134 -32 -35 -227 -292 -51 106 198 81 4 -155 -25 83 6 119 94 134 157 106 -195
5246 -195 1 -75 28 -102 60 -172 30 -49 -160 -245 -25 95 156 28 171 61 9 -30 -60 160 251 71 -280
5269 -280 -140 222 17 128 42 -32 1 -414 -61 5 46 -71 31 -24 -42 29 -86 -129 1 187 47 58 -73
$$ packed form
5106C9k77K63k2K09j35j1Kp3pN2j09j0L35n40K33J21m59L09L79j45p9R8l60J93
5130FM1k2R0J5j00J3Q9m6r7K34j98M9k90L38j35r5L89k15K4j38o7P6K13l74M00
5155B00j5L0l58L05k49L3K75k01J70J08l74j79M06l03L40J8l3n88L31j11L06l04
5177a93j5K39K4o1j62M15n26J46L12K7n9Lj42N3n2P7l30L77o1j07J47N4j76j20
5201a30K60k08N3J06k89J38K46j30j40J02K28l11J47k34K61k2j32J85p4K6m98
5222d16K51R2j27L57k3j66lj92o5K41J57R2j17p7j59J30J08p7J13k5M0K3n1l01
5246a95J96p6J03j30J62k32K02p9j11q5K20J20O1j28J43j10n2l9l0K20R1j80l51
5269b80J40L62k05J11q6p4L3m15L53O6M1j17J02n5j8P1j15m3J30J86j40J1j31
$$ plain form
5292 -73 -209 -253 -129 136 279 204 -42 101 99 -98 -52 -2 -7 30 55 -127 121 169 18 54 -69 -331 -196 -50
$$ packed form
5292g3j36m4J24K65J43p5k46J43kj97M6N0nL7K5j82K48M8j51L6j23k62J35J46
$$ [...]
8191B25
##END NTUPLES=NMR FID
##END=
