##TITLE=1H_CA-8531-pc
 CDCl3, 8 sc, 
 15.1.2019
##JCAMPDX= 6.0         $$ Bruker NMR JCAMP-DX V2.0
##DATA TYPE= NMR FID
##DATA CLASS= NTUPLES
##ORIGIN= UXNMR, Bruker Analytische Messtechnik GmbH
##OWNER= root
$$ XWIN-NMR		Version 3.5
$$ Tue Jan 15 14:56:40 2019 Russian Standard Time (UT+4h)  she@DPX200
##.OBSERVE FREQUENCY= 200.1313
##.OBSERVE NUCLEUS= ^1H
##.DELAY= (6, 6)
##.ACQUISITION MODE= SIMULTANEOUS
##.ACQUISITION SCHEME= undefined
##.AVERAGES= 8
##.DIGITISER RES= 18
##SPECTROMETER/DATA SYSTEM= spect
##.PULSE SEQUENCE= zg30
##.SOLVENT NAME= CDCl3
##.SHIFT REFERENCE= (INTERNAL, CDCl3, 0, 15.7039)
##AUDIT TRAIL= $$ (NUMBER, WHEN, WHO, WHERE, WHAT)
$$ ##TITLE= Audit trail, XWIN-NMR		Version 3.5
$$ ##JCAMPDX= 5.01
$$ ##ORIGIN= Bruker BioSpin GmbH
$$ ##OWNER= she
$$ F:/spectra/data/she/nmr/H-F/1/audita.txt
$$ ##AUDIT TRAIL=  $$ (NUMBER, WHEN, WHO, WHERE, WHAT)
(   1,<2019-01-15 14:55:49.14 +0400>,<she>,<DPX200>,
      <created by zg, POWCHK disabled, PULCHK disabled
       configuration hash MD5:
       00 E9 B6 7A A2 85 ED C7 34 08 36 98 17 FE 4E 26
       data hash MD5: 16K
       5F 79 20 F6 1A 6F A6 8B EF C0 12 0F F1 9C 21 A5>)
$$ ##END=
$$ 
$$ hash MD5
$$ F2 57 FE 45 CE B7 6D 42 05 CE A5 CD D6 87 02 55
##$RELAX= 
##$RELAX= 
##$RELAX= 
##$RELAX= 
##$RELAX= 
##$RELAX= 
$$ Bruker specific parameters
$$ --------------------------
##$DU= <F:/spectra>
##$EXPNO= 1
##$NAME= <H-F>
##$PROCNO= 1
##$TYPE= <nmr>
##$USER= <she>
##$AMP= (0..31)
100 100 100 100 100 100 100 100 100 100 100 100 100 100 100 100 100 100 
100 100 100 100 100 100 100 100 100 100 100 100 100 100 
##$AQSEQ= 0
##$AQ_mod= 1
##$AUNM= <au_zg>
##$AUTOPOS= <>
##$BF1= 200.13
##$BF2= 200.13
##$BF3= 200.13
##$BF4= 200.13
##$BF5= 200.13
##$BF6= 200.13
##$BF7= 200.13
##$BF8= 200.13
##$BYTORDA= 1
##$CFDGTYP= 0
##$CFRGTYP= 5
##$CHEMSTR= <none>
##$CNST= (0..31)
1 1 145 1 1 1 1 1 1 1 1 1 1 1 1 1 1 1 1 1 1 1 1 1 1 1 1 1 1 1 1 1 
##$CPDPRG= <>
##$CPDPRG1= <>
##$CPDPRG2= <>
##$CPDPRG3= <>
##$CPDPRG4= <mlev>
##$CPDPRG5= <mlev>
##$CPDPRG6= <mlev>
##$CPDPRG7= <mlev>
##$CPDPRG8= <mlev>
##$CPDPRGB= <>
##$CPDPRGT= <>
##$D= (0..31)
0 1.2 0 0 0 0 0 0 0 0 0 0.03 0 0 0 0 0 0 0 0 0 0 0 0 0 0 0 0 0 0 0 0 
##$DATE= 1547549748
##$DBL= (0..7)
120 120 120 120 120 120 120 120 
##$DBP= (0..7)
150 150 150 150 150 150 150 150 
##$DBP07= 0
##$DBPNAM0= <>
##$DBPNAM1= <>
##$DBPNAM2= <>
##$DBPNAM3= <>
##$DBPNAM4= <>
##$DBPNAM5= <>
##$DBPNAM6= <>
##$DBPNAM7= <>
##$DBPOAL= (0..7)
0.5 0.5 0.5 0.5 0.5 0.5 0.5 0.5 
##$DBPOFFS= (0..7)
0 0 0 0 0 0 0 0 
##$DE= 6
##$DECBNUC= <off>
##$DECIM= 24
##$DECNUC= <off>
##$DECSTAT= 4
##$DIGMOD= 1
##$DIGTYP= 9
##$DL= (0..7)
0 120 120 120 120 120 120 120 
##$DP= (0..7)
150 150 150 150 150 150 150 150 
##$DP07= 0
##$DPNAME0= <>
##$DPNAME1= <>
##$DPNAME2= <>
##$DPNAME3= <>
##$DPNAME4= <>
##$DPNAME5= <>
##$DPNAME6= <>
##$DPNAME7= <>
##$DPOAL= (0..7)
0.5 0.5 0.5 0.5 0.5 0.5 0.5 0.5 
##$DPOFFS= (0..7)
0 0 0 0 0 0 0 0 
##$DQDMODE= 0
##$DR= 18
##$DS= 0
##$DSLIST= <SSSSSSSSSSSSSSS>
##$DSPFIRM= 0
$$ [...]
##$SUBNAM2= <"">
##$SUBNAM3= <"">
##$SUBNAM4= <"">
##$SUBNAM5= <"">
##$SUBNAM6= <"">
##$SUBNAM7= <"">
##$SUBNAM8= <"">
##$SUBNAM9= <"">
##$SW= 24.933730806125
##$SWIBOX= (0..15)
0 0 2 0 0 0 0 0 0 0 0 0 0 0 0 0 
##$SW_h= 4990.01996007984
##$TD= 16384
##$TD0= 1
##$TE= 0
##$TE2= 300
##$TE3= 300
##$TEG= 300
##$TL= (0..7)
0 120 120 120 120 120 120 120 
##$TP= (0..7)
150 150 150 150 150 150 150 150 
##$TP07= 0
##$TPNAME0= <>
##$TPNAME1= <>
##$TPNAME2= <>
##$TPNAME3= <>
##$TPNAME4= <>
##$TPNAME5= <>
##$TPNAME6= <>
##$TPNAME7= <>
##$TPOAL= (0..7)
0.5 0.5 0.5 0.5 0.5 0.5 0.5 0.5 
##$TPOFFS= (0..7)
0 0 0 0 0 0 0 0 
##$TUNHIN= 0
##$TUNHOUT= 0
##$TUNXOUT= 0
##$USERA1= <user>
##$USERA2= <user>
##$USERA3= <user>
##$USERA4= <user>
##$USERA5= <user>
##$V9= 5
##$VALIST= <valist>
##$VCLIST= <CCCCCCCCCCCCCCC>
##$VD= 0
##$VDLIST= <DDDDDDDDDDDDDDD>
##$VPLIST= <PPPPPPPPPPPPPPP>
##$VTLIST= <TTTTTTTTTTTTTTT>
##$WBST= 1024
##$WBSW= 4
##$XGAIN= (0..3)
0 0 0 0 
##$XL= 0
##$YL= 0
##$YMAX_a= 197525
##$YMIN_a= -265472
##$ZGOPTNS= <>
##$ZL1= 120
##$ZL2= 120
##$ZL3= 120
##$ZL4= 120
##$ABSF1= 10
##$ABSF2= 0
##$ABSG= 5
##$ABSL= 3
##$ALPHA= 0
##$AQORDER= 0
##$ASSFAC= 0
##$ASSFACI= 0
##$ASSFACX= 0
##$ASSWID= 0
##$AUNMP= <proc_1d>
##$AZFE= 0.1
##$AZFW= 0.1
##$BCFW= 1
##$BC_mod= 2
##$BYTORDP= 1
##$COROFFS= 0
##$CY= 11.3945322036743
##$DATMOD= 1
##$DC= 2
##$DFILT= <>
##$DTYPP= 0
##$F1P= 18.9103706918063
##$F2P= -1.10871071338519
##$FCOR= 0.5
##$FTSIZE= 0
##$FT_mod= 4
##$GAMMA= 1
##$GB= 0.15
##$INTBC= 1
##$INTSCL= 1
##$ISEN= 128
##$LB= 0.24
##$LEV0= 0
##$LPBIN= 0
##$MAXI= 10000
##$MC2= 0
##$MEAN= 0
##$ME_mod= 0
##$MI= 1.114404
##$NCOEF= 0
##$NC_proc= 0
##$NLEV= 6
##$NOISF1= 3.799351
##$NOISF2= 2.8
##$NSP= 1
##$NTH_PI= 0
##$NZP= 0
##$OFFSET= 15.70392
##$PC= 1
##$PHC0= -8874.758
##$PHC1= 12.40006
##$PH_mod= 1
##$PKNL= yes
##$PPARMOD= 0
##$PSCAL= 0
##$PSIGN= 0
##$REVERSE= no
##$SF= 200.130013532006
##$SI= 16384
##$SIGF1= 3
##$SIGF2= 2
##$SINO= 400
##$SIOLD= 16384
##$SREGLST= <1H.CDCl3>
##$SSB= 0
##$STSI= 0
##$STSR= 0
##$SW_p= 3612.71676300578
##$SYMM= 0
##$S_DEV= 0
##$TDeff= 0
##$TDoff= 0
##$TI= <>
##$TILT= no
##$TM1= 0
##$TM2= 0
##$TOPLEV= 0
##$USERP1= <user>
##$USERP2= <user>
##$USERP3= <user>
##$USERP4= <user>
##$USERP5= <user>
##$WDW= 1
##$XDIM= 8192
##$YMAX_p= 0
##$YMIN_p= 0
$$ End of Bruker specific parameters
$$ ---------------------------------
##NTUPLES= NMR FID
##VAR_NAME=  TIME,          FID/REAL,        FID/IMAG
##SYMBOL=    X,             R,               I
##VAR_TYPE=  INDEPENDENT,   DEPENDENT,       DEPENDENT
##VAR_FORM=  AFFN,          ASDF,            ASDF
##VAR_DIM=   8192,          8192,            8192
##UNITS=     SECONDS,       ARBITRARY UNITS, ARBITRARY UNITS
##FACTOR=    0.0002004,     1,               1
##FIRST=     0,             0,               0
##LAST=      1.6414764,     0,               0
##MIN=       0,             -265472,         0
##MAX=       1.6414764,     197525,          0
$$ Real data points
##PAGE= N=1
##DATA TABLE= (X++(R..R)), XYDATA
$$ [...]
312 101553 27177 -54431 -98893 -63644 46980 127168 78954 -44748 -111856 -77897 5335
323 5335 81301 104073 33025 -86905 -129216 -41965 74010 104732 49599 -34250 -98915 -92871
335 -92871 4622 110959 107007 -2041 -92854 -87831 -17818 63200 108224 65606 -50555 -125152
347 -125152 -71908 46582 106633 75459 -2824 -81003 -105759 -34495 80472 114572 29919
358 29919 -74171 -100103 -51271 27189 91651 85127 -11657 -108542 -94866 9857 91320 89528
370 89528 29095 -50191 -100771 -63784 46825 116454 69063 -32956 -85768 -64983 -2098 70021
382 70021 96142 28323 -79114 -108087 -31206 58496 84068 48117 -22482 -91006 -89657 3947
394 3947 97869 88890 -1674 -73794 -80524 -34450 41238 96816 64175 -40483 -103195 -57270
406 -57270 34177 84184 71240 10568 -69480 -101075 -32087 76090 104750 33814 -51671 -84176
418 -84176 -58075 13265 88743 88902 -5257 -95656 -86603 -2933 66781 80223 37790 -43709 -101721
431 -101721 -63723 44620 106354 62908 -24906 -79072 -75623 -16522 68891 101624 31211 -72844
443 -72844 -97885 -32713 46036 81508 59123 -14401 -91492 -87638 7715 92006 80161 1572
455 1572 -64793 -80915 -39252 45584 103820 62005 -44082 -99090 -56405 23999 75405 75115
467 75115 15837 -70066 -97484 -23002 75340 93027 28502 -45645 -80594 -59999 15995 92003
479 92003 81390 -16338 -94533 -78411 -3669 60996 80602 39571 -47384 -102398 -55966 45950
491 45950 93475 51858 -21598 -71158 -70827 -9428 76266 96808 19263 -73126 -86218 -26532
503 -26532 42884 79033 59566 -18756 -93024 -78951 13977 83759 68387 2632 -56393 -76842
515 -76842 -37370 47562 96271 47572 -46514 -85641 -45940 21784 72031 75916 14391 -70777
527 -70777 -90018 -15970 67826 79215 27212 -36631 -76227 -61361 14521 84668 67765 -19480
539 -19480 -81114 -67222 -8553 50265 75354 36101 -50022 -96510 -45631 45192 83814 51880
551 51880 -9855 -62812 -70810 -9885 74036 88594 15908 -61344 -71888 -25376 37278 78940
563 78940 61625 -20095 -90589 -69792 17055 76061 64080 8413 -53525 -82686 -41256 47315
575 47315 91738 40640 -45150 -79969 -50977 9440 65167 73690 8478 -75213 -85216 -11740
587 -11740 61784 73547 31854 -30380 -76594 -59863 22570 89456 66972 -14952 -69459 -61920
599 -61920 -11221 50817 80403 37038 -50543 -88663 -37299 41603 73371 46982 -11443 -69727
611 -69727 -76648 -7989 74698 81232 10701 -58090 -69842 -31315 32172 79724 59599 -24588
623 -24588 -86961 -60346 17979 69406 62872 13393 -51697 -82802 -35705 51766 85459 32328
635 32328 -43231 -74369 -51426 7073 67528 73821 4261 -73139 -75254 -8080 54120 67166
647 67166 33629 -27476 -74517 -51835 30017 84983 55759 -16404 -62049 -57398 -12182 50877
659 50877 79097 30521 -52725 -81092 -32464 32622 61624 45164 -8401 -66131 -69571 -1830
671 -1830 68874 67263 6655 -47856 -61834 -33131 27393 74826 53689 -23695 -74180 -49360
683 -49360 12700 55695 57677 17608 -46075 -76227 -31315 45062 70389 28144 -27895 -56507
695 -56507 -46477 3870 61282 65320 442 -65267 -64306 -10288 41349 60692 37036 -22957 -71261
708 -71261 -49706 24404 69231 45740 -9955 -50339 -55935 -17001 47639 75839 28491 -46484
720 -46484 -69559 -30476 25015 58308 51503 -1214 -63140 -67192 -2218 60217 59538 12223 -36912
733 -36912 -60908 -40341 22107 72256 50402 -22362 -66026 -46119 4482 46904 57848 20992
745 20992 -45027 -72498 -25785 43965 65020 31377 -19228 -54893 -52452 -640 59828 61193
757 61193 -2197 -58911 -56417 -11544 36063 60529 37646 -26914 -73452 -46393 24545 64602
769 64602 46255 -2142 -45755 -57363 -16262 51520 75305 25051 -43480 -62372 -30107 19884
781 19884 56628 52385 -3645 -64217 -62137 161 53409 51908 11451 -36423 -63627 -40893 25181
794 25181 69423 42072 -23597 -58452 -41906 982 43844 57875 19838 -44048 -63666 -16963
806 -16963 41450 56631 28931 -15703 -53095 -50150 4074 60549 55528 -2062 -48126 -47878 -15177
819 -15177 27822 55844 35602 -26204 -66153 -38651 21024 52772 40991 3387 -40214 -56214
831 -56214 -18119 44249 62375 18565 -34786 -51410 -30154 11496 51975 52384 -1045 -56463
843 -56463 -53214 -1762 41169 45011 17368 -26644 -57512 -36828 24684 61884 35520 -19481
855 -19481 -50036 -42867 -6776 39706 58416 19422 -42698 -59424 -17563 33102 51028 33522
867 33522 -8776 -50586 -49218 6039 58918 53074 1732 -40676 -48394 -22367 25758 59725 37851
880 37851 -26552 -64283 -38457 14118 45569 42065 6523 -43326 -62160 -20577 41663 57908
892 57908 19263 -27676 -48132 -34286 9507 55484 53288 -3632 -55549 -49030 -431 40276
904 40276 50151 25407 -23913 -58960 -35658 26831 59571 33479 -15956 -47549 -45659 -8970
916 -8970 43409 59970 14852 -45561 -57988 -18912 27295 49026 36282 -9314 -55296 -50316
928 -50316 7000 56043 48878 3991 -36220 -48963 -25213 26270 60408 35029 -25729 -56612
940 -56612 -33776 10270 40943 43535 9562 -42279 -58758 -16667 39365 51721 19614 -20980
952 -20980 -45114 -37385 5628 51241 47704 -4651 -46856 -40737 -4135 31520 47276 27500 -22436
965 -22436 -56480 -33390 22422 50882 31798 -6549 -38642 -45136 -12875 38643 54844 14301
977 14301 -37142 -49512 -22290 15766 43500 39393 -4519 -51082 -47164 4760 46396 43618 9735
990 9735 -27593 -47975 -29059 23596 58170 34411 -19824 -47937 -33292 2354 37583 47415
1002 47415 13072 -40662 -56042 -14735 35358 47217 22066 -16617 -46646 -42004 5382 52802
1014 52802 46822 -3718 -43598 -41435 -10197 28645 50592 29140 -25515 -57291 -30539 23015
1026 23015 48294 33713 -2594 -39185 -48247 -11910 41601 53581 11658 -35954 -47330 -23926
1038 -23926 14992 46380 40385 -8857 -53169 -43430 6021 42152 39948 10610 -27545 -49006
1050 -49006 -25571 28998 57265 28994 -20891 -43962 -31161 3270 39874 48246 8820 -42508
1062 -42508 -50753 -9665 32407 41763 20877 -16377 -47633 -40133 9287 49962 38049 -8284
1074 -8284 -40456 -38921 -11450 27279 49133 24973 -27451 -51412 -23304 21175 41997 32778
1086 32778 1298 -35715 -44834 -7097 41193 46916 9563 -28723 -39364 -23056 11955 43525
1098 43525 36403 -10663 -48162 -37173 3188 32631 35212 12982 -24853 -47766 -24931 25447
1110 25447 47962 23839 -15459 -36042 -30687 -1097 36463 45847 8998 -37243 -43057 -9655
1122 -9655 25349 38598 24771 -11570 -45400 -38068 8983 45198 34306 -3603 -32835 -37663
1134 -37663 -15383 25025 48530 23405 -26068 -46792 -22808 15136 37556 34273 3125 -37762
1146 -37762 -45391 -5913 39769 43251 10254 -23775 -38819 -26527 11911 46165 35758 -12170
1158 -12170 -45827 -33944 2328 31343 37800 14937 -27554 -49014 -21779 26907 45014 21582
1170 21582 -13896 -35891 -33777 -1102 39205 44668 4632 -36898 -38693 -8333 23817 38764
1182 38764 26122 -13131 -45459 -32744 13276 42646 30279 -2657 -30487 -38068 -15319 26095
1194 26095 45779 17510 -27735 -42683 -20724 11743 33722 32208 586 -38120 -40671 -1144
1206 -1144 36240 37283 10181 -19846 -36130 -24704 14355 44608 31146 -12563 -38540 -27945
1218 -27945 875 27088 35913 13851 -27302 -45259 -17540 23496 36922 18685 -9873 -32584
1230 -32584 -33502 -1724 36673 39281 2675 -31154 -32574 -10435 17689 36271 26831 -11221 -41412
1243 -41412 -28375 11083 34269 26778 2399 -24638 -37291 -16877 24119 41545 15419 -22046
1255 -22046 -34942 -21329 5138 30926 34006 3262 -34487 -37123 -2583 29144 33236 14570
1267 14570 -13440 -35058 -26351 12739 42094 29087 -9145 -32337 -27652 -5246 23768 37514
1279 37514 15287 -26236 -42436 -16761 19032 32669 21401 -5146 -32578 -35577 -2662 34952
1291 34952 35714 2313 -27618 -31928 -14023 14955 37701 27855 -12657 -40079 -25660 9991 31511
1304 31511 28145 6535 -22940 -37184 -13796 26650 39498 13944 -18778 -31464 -22091 3460
1316 3460 31200 32985 -669 -35274 -33685 -2332 24034 28973 14179 -14368 -36533 -24938 13849
1329 13849 38300 23511 -8336 -27185 -25930 -6001 24158 37012 13303 -24782 -35885 -12292
1341 -12292 16740 28991 21668 -3786 -31775 -33496 -460 31950 29524 1723 -22085 -28608 -15597
1354 -15597 13138 35212 23592 -13315 -35079 -21259 7683 26452 27291 8594 -21722 -34910
1366 -34910 -11502 24216 33548 12067 -14339 -27599 -22918 1555 29750 30393 -1542 -31767 -29240
1379 -29240 -4525 18323 27241 16533 -12663 -35267 -22785 13378 33358 21491 -3630 -22967
1391 -22967 -26653 -8765 23096 36577 13172 -21617 -30852 -12869 11222 26549 24129 -1201
1403 -1201 -30831 -31697 128 28468 26767 4729 -17353 -28766 -19109 11477 34240 21842 -12993
1416 -12993 -31411 -20507 3022 22821 28322 9557 -22944 -34861 -10512 22256 30064 13260
1428 13260 -10053 -26523 -24162 2672 31742 29892 -2574 -28977 -26620 -5526 17164 29176
1440 29176 17893 -14221 -35535 -20873 12748 30034 19940 -2575 -22997 -28600 -8363 24781
1452 24781 34754 9719 -21149 -28193 -13257 9193 27246 25188 -2505 -30846 -28046 2391 26228
1465 26228 24440 6034 -16149 -29938 -18532 13288 33296 18305 -13174 -27938 -19737 761
1477 761 21430 28330 7941 -24135 -31940 -7203 20624 27323 14629 -7045 -25902 -24158 4191
1490 4191 31215 26596 -2837 -24496 -23853 -7129 14930 29136 17321 -15177 -34194 -18789 10593
1503 10593 25079 18723 40 -21981 -29176 -7570 23964 30648 7433 -18203 -25044 -14288 7167
1516 7167 27184 25924 -2557 -28735 -24279 2612 22625 23559 8755 -14779 -29594 -17450 14559
1529 14559 31379 16413 -10312 -24199 -20556 -2612 20445 28168 6852 -23572 -29713 -7393
1541 -7393 16633 25181 16369 -5608 -26836 -24875 3870 28890 24103 -865 -19477 -22419 -9981
1554 -9981 14348 29750 17100 -14749 -30865 -16575 8497 22645 19989 2572 -21775 -28783
1566 -28783 -6902 22270 27290 6515 -15379 -23768 -16330 6437 27883 24503 -4789 -27543 -21364
1579 -21364 1631 20239 23128 10133 -14524 -29413 -14826 15799 29038 14478 -8920 -22790
1591 -22790 -21523 -2775 22205 27562 4065 -23311 -26204 -6649 13596 22955 15730 -6846 -27685
1604 -27685 -22531 6032 26868 20973 -83 -17367 -22093 -9958 15146 29185 13764 -14981
1616 -14981 -26285 -12944 7314 20555 20300 2376 -22009 -26740 -4132 20812 22718 5612 -12881
1629 -12881 -22344 -16116 6585 26736 20385 -6504 -25056 -18299 501 17272 22404 10144 -14425
1642 -14425 -27427 -11857 15307 25101 12623 -6071 -20009 -20282 -2130 22190 25197 2280 -20663
1655 -20663 -22307 -7491 9912 21040 15746 -6621 -26318 -19630 6535 23199 17487 993 -15010
1668 -15010 -21813 -9834 15108 27253 11815 -13115 -21604 -11878 5029 19358 20837 2429 -21208
1681 -21208 -24210 -2603 18051 19862 6637 -10053 -21792 -16807 5802 24571 17682 -6737 -21126
1694 -21126 -17178 -1963 14658 22414 10347 -14539 -25475 -9899 12915 21475 12954 -3050 -18170
1707 -18170 -19834 -1425 21610 22705 1768 -17626 -19476 -7890 9072 21435 15760 -7623 -25104
1720 -25104 -16786 6259 19557 16035 1837 -14992 -22377 -9129 15629 24717 9118 -12084 -19917
1733 -19917 -12194 3677 19292 20285 482 -21512 -20899 -310 16446 18886 7930 -8915 -21750
1746 -21750 -15410 8004 23494 15117 -6332 -18832 -16272 -2823 14519 21979 8034 -15888 -23370
1759 -23370 -7767 11513 18531 12529 -2219 -18247 -19148 417 20820 19805 1359 -14664 -17376
1772 -17376 -8131 8758 21332 14093 -8661 -22907 -13968 4999 16114 14944 2940 -14146 -21980
1785 -21980 -7702 15214 21426 7145 -9869 -17545 -12427 2539 18821 19213 -57 -18939 -17420
1798 -17420 -591 13821 17151 9296 -7683 -21008 -13944 7712 21013 12852 -4323 -15602 -15698
1811 -15698 -4549 12652 20561 6472 -14608 -20018 -7715 7555 16011 13369 -1121 -17513 -18172
1824 -18172 820 18411 16936 2287 -10733 -15947 -9325 7542 20544 13437 -7335 -19135 -12626
1837 -12626 2544 13523 15599 4772 -13315 -20967 -6960 13477 18423 7298 -7286 -15946 -13453
1850 -13453 1241 18108 18383 -657 -16994 -16078 -2349 10967 16812 10154 -7683 -20360 -12324
1863 -12324 7985 18587 11651 -2727 -14025 -16176 -4764 13478 19948 5460 -13510 -17891 -7422
1876 -7422 6409 15566 13850 -1810 -18057 -16401 1744 16635 14916 2761 -9886 -16106 -9409
1889 -9409 8721 20362 11869 -7361 -16780 -10810 1966 13236 15632 4007 -13834 -18901 -4595
1902 -4595 11936 15449 6637 -5805 -15543 -14033 1487 16963 15322 -2003 -15005 -13811 -3024
1915 -3024 9370 16406 9812 -7690 -18513 -9708 7760 15800 10884 -525 -12186 -15729 -3846
1928 -3846 13571 18118 4397 -11281 -15000 -7452 4323 14361 13007 -2495 -17195 -14945 1414
1941 1414 13214 13089 3707 -8277 -16105 -9489 8318 18131 9772 -5981 -13808 -10548 112 12143
1955 12143 15808 4138 -12981 -16670 -4164 9931 13740 7749 -4120 -14880 -13712 1584 15951
1968 15951 13368 -1187 -12281 -12701 -4693 7721 16149 9462 -7722 -16782 -8932 5853 13229 11354
1982 11354 1085 -11544 -15466 -3618 13096 16183 3899 -9176 -13527 -8389 3474 14503 12863
1995 12863 -2692 -16187 -13011 883 11508 12297 4438 -8492 -16345 -8744 8704 16630 8220
2008 8220 -5288 -12739 -10762 -346 12777 15816 2822 -13109 -14975 -3104 8923 13210 8231
2021 8231 -3700 -15098 -12336 3095 15049 11387 -1477 -10893 -12430 -4968 8265 15434 7413
2034 7413 -9282 -15528 -7423 5006 12276 10878 864 -11946 -14636 -1830 12716 13915 3449
2047 3449 -7966 -12286 -8334 3961 14941 11717 -3435 -14385 -10882 822 9633 11604 4643
2060 4643 -8813 -15975 -7237 8223 14302 6901 -4110 -11499 -10570 -446 12091 14074 1721 -11470
2074 -11470 -12544 -2752 7599 12440 8804 -3710 -14309 -11064 3976 13285 9859 -526 -9501
2087 -9501 -12018 -5600 8192 14564 6186 -8512 -13775 -7033 3467 11047 10857 786 -12295 -13322
2101 -13322 -1121 11542 12263 3844 -6594 -11631 -8299 4015 14594 10499 -3286 -12432 -9775
2114 -9775 -463 8656 11969 4841 -8665 -14681 -6337 7551 12326 6487 -3119 -11053 -11050 -609 11914
2129 11914 12730 851 -10112 -11003 -3309 6225 11902 8457 -4355 -13838 -9308 4119 12117 9124
2143 9124 684 -8419 -11729 -4731 8587 13600 4872 -7701 -11825 -6463 2620 10687 10305 -215
2157 -215 -12025 -11831 -536 9905 10489 3740 -5453 -11761 -7819 5064 13459 8774 -3834 -10823
2171 -10823 -8495 -237 8389 11685 4175 -8444 -12843 -4125 6854 10282 6084 -2342 -10257 -10607
2185 -10607 106 11125 10745 14 -8933 -9460 -3671 5038 11105 7623 -4358 -12243 -7278 3659
2199 3659 10229 8787 1188 -7646 -11064 -3538 8400 11917 3537 -6233 -9638 -6427 1493 9804 9720
2214 9720 -648 -10992 -10139 -330 7487 9302 3797 -4899 -10983 -7231 4436 11884 7220 -2821
2228 -2821 -8492 -7848 -1402 7657 11343 3822 -7692 -10930 -3478 5546 8899 6160 -1493 -9923 -9563
2243 -9563 540 10288 8966 -212 -7401 -9164 -4563 4316 10714 6572 -4707 -11091 -6334 2867
2257 2867 8260 8258 1607 -7356 -10620 -2824 8017 10528 3425 -4814 -8497 -6453 1366 9438 8894 -1200
2273 -1200 -10021 -8946 -286 6410 8446 4089 -4683 -10890 -6392 4823 10035 5746 -2288 -7571 -7432
2288 -7432 -1414 7907 10474 2829 -7274 -9244 -3078 4725 8251 6476 -1618 -9545 -8189 1251 8970
2303 8970 7383 280 -6502 -8453 -4458 4705 10153 5535 -4908 -9693 -5716 1942 7078 7392 1555
2318 1555 -7359 -9759 -1794 7385 8816 3369 -3370 -7902 -6257 1490 9405 7857 -1592 -8502 -7106
2333 -7106 -610 5246 7737 3991 -4849 -10148 -5257 3854 8208 4932 -1255 -6677 -7692 -1605 7108
2348 7108 9122 1948 -6105 -7545 -3108 3213 7849 6573 -1272 -8726 -7162 1383 7641 6840 933
2363 933 -5144 -7790 -4153 4459 9301 4532 -4354 -8341 -5027 820 6351 7572 1571 -6965 -8450
2378 -8450 -1354 6345 7636 3308 -2716 -7353 -5986 1793 8622 6961 -1347 -6957 -6176 -1459 4809
2393 4809 7788 4186 -4623 -9023 -4083 3605 6757 4551 -888 -6446 -7622 -1432 6501 7978 1447
2408 1447 -5373 -6851 -3281 2712 7312 6307 -1442 -8015 -5897 1410 6481 6184 1637 -4240 -7672
2423 -7672 -3902 4314 8264 3767 -3630 -6631 -4985 66 5785 6969 807 -6623 -7637 -1436 4659
2438 4659 6278 3110 -2440 -7265 -5820 2075 7945 5533 -1177 -5930 -5596 -1799 4545 7670 3301
2453 3301 -4629 -7820 -3447 2939 6147 4776 -323 -6023 -7178 -893 6260 6440 1073 -4325 -6017
2468 -6017 -3565 2104 7048 5471 -1982 -7021 -5006 1009 5412 5857 1883 -4051 -7234 -3135 4395
2483 4395 7230 3308 -2778 -5571 -4786 -95 5789 6540 632 -6104 -6186 -1360 3681 5662 3371 -2205
2499 -2205 -6965 -5287 2012 6576 4861 -711 -4841 -5210 -1932 4117 7235 3021 -3867 -6344 -2976
2514 -2976 1892 5639 4833 287 -5721 -6514 -464 5582 5658 1116 -3682 -5487 -3672 1940 6551 4591
2530 4591 -2097 -6346 -4382 579 4674 5287 2209 -3987 -6748 -2298 4197 6309 2903 -2002 -4887
2545 -4887 -4510 -44 5324 5726 -47 -5234 -5387 -1384 3107 5185 3252 -2416 -6931 -4322 1977 5712
2561 5712 3899 -401 -4144 -5206 -1844 4103 6544 2413 -3743 -5359 -2440 2020 4898 4477 -309
2576 -309 -5427 -5460 -25 5011 4744 1019 -3034 -5129 -3454 2211 5997 3682 -2240 -5415 -3833 311
2592 311 3971 5185 1707 -4265 -5644 -1738 3627 4872 2322 -1066 -4412 -4535 148 5536 5137 -475
2608 -475 -4494 -4524 -1232 2629 5003 3330 -2458 -5964 -3537 1924 4591 3137 -321 -3865 -4896 -1332
2624 -1332 4190 5524 1584 -3141 -4501 -2140 1527 4780 4245 -407 -5099 -4311 814 4063 4081 1344
2640 1344 -2622 -5007 -3170 2467 5561 2836 -2092 -4338 -3333 -241 3439 4709 1244 -3935 -5069
2655 -5069 -1122 2709 3968 2237 -1183 -4560 -4035 734 5048 3971 -463 -3679 -3688 -1368 2309 4601
2671 4601 2697 -2533 -5278 -2917 1662 3969 2990 -21 -3919 -4756 -977 3936 4422 1119 -2605 -3815
2687 -3815 -2422 1362 4364 3748 -600 -4743 -3286 453 3254 3910 1324 -2257 -4384 -2422 2433
2702 2433 4776 2363 -1647 -3594 -3259 -488 3399 4111 792 -3689 -3831 -762 2421 3405 2240 -1259
2718 -1259 -4118 -3592 1162 4352 3164 -333 -2876 -3237 -1123 2616 4144 2306 -2398 -4189 -1823
2733 -1823 1536 3057 2934 -51 -3372 -4054 -461 3501 3569 619 -2104 -3404 -2283 906 3989 3131
2749 3131 -1132 -3878 -2579 519 2768 3407 1292 -2133 -4246 -1658 2503 4010 1880 -1170 -3058
2764 -3058 -2770 -250 3277 3685 123 -3303 -3511 -679 1827 3014 2044 -1129 -4028 -2787 1093 3669
2780 3669 2829 -201 -2349 -3004 -1442 2410 3847 1621 -2206 -3420 -1544 1163 2825 2620 -26 -3392
2796 -3392 -3396 -199 3052 2828 521 -1631 -3236 -2205 1003 3645 2569 -1299 -3228 -2232 86 2073
2812 2073 3130 784 -2313 -3550 -1424 2399 3242 1645 -765 -2730 -2543 88 3078 3435 -348 -2767
2828 -2767 -2675 -576 1297 3002 2103 -1553 -3501 -2371 887 2589 1851 58 -2208 -2741 -953 2419
2844 2419 3500 1090 -1805 -2761 -1656 972 2943 2738 -258 -2984 -2793 38 2624 2525 727 -1288
2860 -1288 -2755 -2052 1405 3039 1830 -1396 -2568 -1939 -35 2104 2712 794 -2320 -2806 -828 2071
2876 2071 2662 1372 -565 -2327 -2256 193 3033 2769 -235 -2381 -1923 -695 1245 2861 1588 -1399
2892 -1399 -3117 -1646 1364 2292 1736 72 -2162 -2877 -347 2132 2771 442 -1607 -2150 -1382 679
2908 679 2552 2200 -350 -2942 -2080 15 2069 2239 696 -1176 -3033 -1509 1419 2596 1016 -1123
2924 -1123 -2146 -1670 -33 2203 2508 399 -2446 -2400 -570 1264 1831 1106 -639 -2485 -1874 707 2604
2941 2604 1899 -148 -1839 -1845 -935 1170 2717 1150 -1201 -2697 -1127 613 1846 1705 39 -2036
2957 -2036 -2437 -197 2390 2365 335 -1453 -1939 -1226 395 2512 1731 -641 -2564 -1400 103 1751
2973 1751 2119 953 -1543 -2405 -1141 1614 2426 1204 -875 -1657 -1716 -232 1880 2171 131 -2194 -2132
2990 -2132 -326 1234 1826 1381 -819 -2354 -1925 585 2101 1571 -572 -1185 -1786 -1002 1408 2339 1012
3007 1012 -1442 -1923 -854 714 1968 1300 91 -1742 -2125 -152 1833 1715 281 -1191 -1706 -1251
3023 -1251 510 1919 1461 -775 -2079 -1352 384 1294 1705 607 -1377 -2215 -687 1578 2014 999
3039 999 -740 -1557 -1195 -36 1818 1692 99 -1912 -1477 -335 1049 1808 800 -859 -2405 -762
3055 -762 864 1771 1256 -435 -1333 -1825 -476 1323 2093 422 -1155 -1477 -604 769 1547 1352 -273
3072 -273 -1833 -1600 272 1718 1629 -48 -687 -1776 -1050 957 2009 1042 -1102 -1892 -1256 43 1201
3089 1201 1971 262 -1547 -1990 -317 1493 1820 982 -385 -1686 -1144 238 1824 1644 -256 -1521
3105 -1521 -1123 -146 997 1561 524 -740 -1950 -995 850 1604 743 -400 -1500 -1577 -232 1497 1701
3122 1701 -96 -1531 -1560 -618 324 1363 1347 -206 -1703 -1152 691 1243 1288 554 -688 -1649 -660 910
3140 910 1675 400 -857 -1352 -791 -3 1024 1239 115 -1594 -1669 -40 1197 1426 442 -654 -1495 -1068
3158 -1068 770 1400 1152 -241 -1146 -1115 -91 1075 1554 553 -1086 -1568 -491 934 1406 762 -167
3175 -167 -1397 -1394 76 1506 1258 -67 -954 -1022 -446 632 1380 668 -713 -1250 -854 416 1126 1132 244
3194 244 -774 -1332 -402 1227 1460 481 -717 -1168 -737 213 951 1324 -334 -1265 -920 42 886 683 128
3213 128 -991 -1427 -678 645 1591 664 -332 -1203 -1153 115 1100 1633 108 -1106 -1165 -212 645 928 661
3232 661 -569 -1092 -981 417 1068 1070 0 -922 -990 -619 765 1520 750 -733 -1298 -784 441 1262 897
3251 897 125 -945 -1074 71 1245 1247 61 -707 -1175 -655 455 1414 727 -401 -1400 -816 367 967
3269 967 1029 549 -975 -1214 -212 912 1274 467 -287 -1065 -594 8 1239 1258 -20 -1041 -891 21 578
3288 578 810 753 -624 -1186 -694 583 1058 680 -235 -828 -980 -16 789 1191 58 -1043 -1039 -243 626 983
3308 983 727 -244 -1050 -1161 165 1192 581 -172 -796 -958 -157 512 1156 625 -704 -1029 -612 422 1053
3327 1053 790 264 -1145 -746 -316 926 1307 411 -471 -664 -710 420 970 1146 -150 -1253 -754 -127
3345 -127 732 941 258 -790 -1041 -362 593 1029 111 -365 -985 -769 149 899 1084 107 -1218 -1053 -492
3364 -492 350 1088 352 -303 -1183 -493 378 899 623 -229 -529 -1101 -245 1061 1355 293 -452 -891 -423
3383 -423 474 931 680 151 -1019 -822 331 1196 723 -83 -668 -1417 -613 599 1101 451 -606 -948 -630
3402 -630 102 847 1092 318 -855 -1199 -321 657 847 431 -416 -832 -988 296 1048 868 -385 -902 -921
3421 -921 -460 317 942 419 -638 -1063 -553 418 1059 616 -126 -954 -735 -60 819 691 -96 -695 -881 -243
3441 -243 433 1133 448 -403 -896 -715 305 1260 783 -76 -526 -673 -516 730 1121 5 -575 -940 -602
3460 -602 -82 849 807 -64 -1290 -1110 -62 689 824 404 -366 -1303 -595 709 1231 400 -164 -889 -758
3479 -758 130 869 1130 122 -674 -1034 -119 517 1045 550 -278 -856 -911 71 1044 877 -262 -780 -623 -249
3499 -249 461 945 448 -573 -1183 -522 620 779 566 -43 -753 -860 -190 983 954 -34 -670 -944 -466
3518 -466 446 858 728 -325 -1134 -868 173 655 802 63 -754 -1077 -252 831 1087 346 -633 -784 -808
3537 -808 65 1107 990 148 -925 -924 127 752 1016 583 -288 -1171 -724 489 1006 725 -222 -763 -879
3556 -879 -221 476 1173 157 -758 -1293 -276 412 926 921 -334 -1004 -928 323 854 618 140 -410 -795 -155
3576 -155 405 899 546 -447 -950 -638 195 793 771 148 -787 -1101 -291 662 851 371 -642 -916 -651 147
3596 147 1058 937 -87 -901 -733 51 901 750 199 -654 -1356 -170 590 985 693 -155 -797 -617 10
3615 10 918 906 -223 -767 -1085 -238 492 1059 747 -214 -1174 -780 612 1066 798 -84 -902 -824 -292 910
3635 910 813 684 -482 -688 -297 337 1078 723 -172 -1174 -1020 -18 860 539 124 -648 -672 -480 477 1133
3655 1133 781 -156 -914 -760 -188 856 685 105 -873 -1234 -497 675 854 494 -290 -929 -740 -108 1073
3674 1073 891 -16 -1173 -969 -81 257 946 569 -590 -1181 -867 531 981 727 -26 -609 -810 -301 936
3693 936 910 103 -982 -923 -419 75 968 801 125 -908 -1060 -175 977 747 48 -665 -1038 -458 607
3712 607 1014 382 -362 -1021 -412 148 720 1147 248 -747 -994 -57 692 994 692 -69 -1016 -516 288 1227
3732 1227 449 -21 -766 -791 2 590 985 378 -744 -1177 -619 307 752 467 -256 -815 -1040 -256 1025
3751 1025 914 261 -615 -679 -459 347 988 438 -488 -991 -481 66 821 466 285 -705 -1115 -598 665 804
3771 804 458 -378 -844 -489 222 900 786 34 -961 -1172 -35 619 663 184 -265 -1055 -285 612 1095 614
3791 614 -262 -501 -613 -22 523 692 44 -721 -1122 -242 516 969 893 -226 -1200 -876 362 902 769 -100
3811 -100 -568 -900 -532 579 1149 833 -686 -1039 -450 187 634 620 163 -851 -901 253 837 810 32 -863
3831 -863 -548 -356 213 1093 625 -114 -982 -589 193 679 642 303 -436 -885 -442 733 936 292 -479 -675
3851 -675 -764 -260 1118 846 -74 -823 -1123 -139 537 974 525 -345 -1164 -684 297 860 546 -19 -601 -1231
3871 -1231 -561 897 1085 385 -476 -586 -321 377 1195 821 92 -981 -759 33 747 754 271 -416 -829 -513
3891 -513 498 980 646 -364 -732 -696 -15 750 1102 62 -951 -865 -716 683 753 515 -243 -981 -643
3910 -643 278 1109 912 -237 -737 -817 -267 647 1070 780 -586 -971 -687 783 878 821 167 -769 -873 -166
3930 -166 751 1180 98 -621 -758 -560 500 849 774 -317 -1126 -953 378 638 930 273 -640 -1161 -450
3949 -450 739 970 501 -532 -895 -665 0 796 831 211 -766 -1157 205 573 851 286 -429 -1187 -607
3968 -607 296 1054 667 -206 -615 -744 -115 618 786 446 -738 -1092 -282 747 1023 546 -174 -1046 -894
3987 -894 -273 960 983 179 -552 -1027 -257 432 756 679 -196 -1107 -734 452 605 844 128 -622 -879 -258
4007 -258 1038 838 387 -708 -703 -544 48 897 964 -249 -1005 -1077 34 637 1126 396 -228 -1131 -796 379
4027 379 1157 519 -593 -635 -944 -59 693 996 148 -787 -1218 -305 694 837 639 -215 -1014 -1270 -81 1108
4047 1108 995 -109 -939 -1119 -442 392 1435 413 -714 -1172 -661 52 881 650 49 -721 -1150 -208
4065 -208 790 900 364 -775 -965 -406 98 1233 682 8 -971 -748 -178 1013 983 305 -758 -1394 -260
4084 -260 650 760 455 -267 -834 -1002 -82 1043 1069 118 -912 -994 -132 671 856 677 -372 -1159 -1004 295
4104 295 1215 911 -105 -467 -908 -403 815 971 528 -838 -1111 -623 433 721 553 -208 -1101 -1088 -58
4123 -58 883 892 262 -684 -884 -770 625 1258 720 -500 -1358 -928 49 779 1066 583 -611 -1355 -366 785
4143 785 991 548 -388 -1054 -1049 260 1088 1158 -69 -1029 -876 -169 533 1139 623 -227 -1070 -534 432 1087
4163 1087 960 -33 -864 -996 -415 971 1292 181 -715 -901 -363 342 923 982 -343 -1376 -910 360
4181 360 884 999 189 -630 -1053 -581 703 1335 511 -531 -1073 -989 48 1042 1200 199 -1081 -1123 31
4200 31 656 1137 659 -456 -848 -1201 220 1160 573 -371 -977 -899 -277 812 1209 374 -640 -1307 -738
4219 -738 611 1014 587 -379 -1079 -1046 109 1117 1383 136 -813 -958 -461 489 1044 985 -396 -1518 -942
4238 -942 31 934 1011 549 -537 -1267 -553 900 1432 452 -406 -1039 -801 257 1090 1047 27 -962 -1182
4257 -1182 142 819 933 586 -346 -1165 -592 265 1121 692 -201 -938 -705 -330 483 1227 396 -1091 -1357
4276 -1357 -681 573 958 764 -77 -1103 -1188 -137 1187 1082 45 -753 -833 -495 550 1501 821 -830
4294 -830 -1246 -1045 262 776 1012 271 -852 -1197 -728 941 1112 305 -653 -1058 -788 95 1264 1008 -154
4313 -154 -1326 -1137 -91 944 1100 624 -461 -1355 -913 659 1267 635 -19 -861 -857 -219 947 1279 205
4332 205 -998 -1099 -624 400 989 935 -350 -1318 -1144 478 1044 956 219 -889 -1021 -470 601 1579 706
4351 706 -712 -1183 -528 402 1233 1154 158 -940 -1219 -257 1521 1151 215 -327 -1104 -883 84 1512 1137
4370 1137 -344 -1379 -857 -309 893 1112 553 -732 -1624 -772 745 1335 731 -130 -1050 -995 76 1210
4388 1210 1455 129 -1146 -998 -282 400 1081 702 -265 -1388 -931 489 1160 857 -139 -792 -1430 -473
4406 -473 705 1495 802 -837 -1179 -623 86 962 1269 81 -1154 -1499 -54 935 983 380 -347 -1380
4424 -1380 -885 579 1466 674 -479 -1308 -1024 -123 712 1429 370 -1076 -1470 -338 710 1143 891 -11
4442 -11 -1015 -1204 -3 1371 1268 275 -1028 -982 -394 543 1261 905 -960 -1745 -989 369 1025 799 16
4461 16 -854 -1365 -643 958 1277 414 -736 -1176 -723 189 1228 1086 -157 -1350 -1397 143 1082 1280 98
4480 98 -806 -1282 -834 428 1517 797 -465 -1187 -694 -69 697 1466 278 -1003 -1712 -232 707 1078
4498 1078 748 -467 -1352 -1201 272 1601 1073 52 -1035 -902 -428 732 1393 780 -636 -1522 -613
4515 -613 331 1055 1055 134 -1100 -1295 -564 1288 1326 206 -864 -1052 -982 432 1294 1264 -247 -1233 -1182 148
4535 148 875 1176 593 -756 -1446 -800 821 1406 589 -557 -1290 -940 -44 1133 1448 16 -1406 -1439
4553 -1439 -429 618 1312 716 -260 -1502 -1459 308 1560 940 -79 -793 -1328 -215 971 1404 678
4570 678 -713 -1500 -766 532 1349 1134 164 -1384 -1654 54 1263 1219 191 -636 -1240 -936 202 1482
4588 1482 946 -582 -1569 -1057 8 1159 1246 351 -842 -1753 -415 879 1312 824 -483 -1290 -949 -73
4606 -73 1545 1595 -163 -1131 -1366 -332 651 1314 774 -358 -1877 -1172 433 1515 859 95 -740 -1165
4624 -1165 -582 987 1576 320 -898 -1207 -836 559 1427 1041 68 -1315 -1595 231 1341 1045 380
4641 380 -635 -1415 -826 790 1774 1048 -681 -1227 -1059 -129 1077 1689 493 -1017 -1825 -471 1039
4658 1039 1389 587 -281 -1322 -1330 269 1484 1462 191 -1081 -1444 -396 895 1461 1018 -686 -1864 -1288
4676 -1288 783 1145 706 -40 -1106 -1309 -639 1063 1611 262 -1300 -1399 -670 377 1398 1328 -307 -1487
4694 -1487 -1000 145 1264 1457 87 -1018 -1598 -831 592 1804 960 -621 -1210 -1000 -70 1066 1613
4711 1613 477 -1529 -1529 -529 1021 1158 866 -368 -1480 -1467 174 1652 1341 -99 -1260 -1161 -303 887
4729 887 1548 1114 -636 -1787 -894 723 1035 1128 73 -1184 -1431 -457 1206 1460 308 -1057 -1376 -1009
4747 -1009 402 1378 1155 -129 -1583 -987 116 980 1554 570 -927 -1911 -624 958 1741 835 -367
4764 -367 -1203 -1009 -166 1231 1550 291 -1327 -1563 -78 955 1291 736 -349 -1629 -1243 190 1513
4781 1513 926 -163 -957 -1247 -339 771 1830 578 -1118 -1400 -837 548 1160 1291 -104 -1307 -1836
4798 -1836 -156 1267 1635 361 -1117 -1575 -889 294 1620 1401 -499 -1743 -1289 175 1073 1132 658
4815 658 -728 -1597 -720 1172 1777 599 -428 -1319 -1170 229 1361 1650 80 -1622 -1720 -582 964
4832 964 1393 1098 -652 -1660 -1415 588 1758 984 -203 -1109 -1506 -306 1101 1720 809 -1131 -1653
4849 -1653 -727 138 1515 1616 50 -1333 -1866 -125 1546 1244 311 -900 -1496 -966 484 1703 1350
4866 1350 -719 -1569 -1286 -172 1174 1438 417 -1179 -1993 -525 1150 1499 893 -75 -1532 -1269 97
4883 97 1712 1492 47 -1289 -1502 -508 684 1687 1131 -601 -1882 -1099 337 1358 922 -105 -1429
4900 -1429 -1661 -536 1105 1774 499 -940 -1309 -535 452 1454 1600 -378 -1549 -1614 330 1623 1337
4917 1337 417 -992 -1691 -996 438 1890 1116 -755 -1557 -980 71 1038 1562 260 -1550 -1704 -224
4934 -224 1272 1516 890 -398 -1199 -1529 244 1982 1478 -94 -1666 -1258 -372 798 1842 1286 -1064
4951 -1064 -1855 -1071 688 1420 1317 148 -1219 -1809 -416 1418 2010 414 -1111 -1526 -1083 332 1561
4968 1561 1633 25 -1653 -1287 93 1494 1380 312 -989 -1910 -1104 847 1666 878 -528 -1346 -1095
4985 -1095 -232 1483 1714 390 -1778 -1836 -500 851 1350 684 -72 -1497 -1698 360 1773 1477 88
5002 88 -1252 -1404 -602 1021 2021 1046 -905 -1934 -1004 879 1368 1267 195 -1584 -2028 -490 1039
5019 1039 1651 177 -748 -1373 -1094 119 1524 1455 -329 -1740 -1296 120 1293 1409 766 -779 -1736
5036 -1736 -1066 906 1864 1054 -487 -1525 -1123 -434 1311 1821 218 -1559 -1604 -383 779 1363 945
5053 945 -294 -1701 -1462 350 1619 1059 -42 -1161 -1365 -947 1000 1833 907 -932 -1892 -867 677
5070 677 1421 1511 217 -1749 -1496 -472 1559 1582 385 -855 -1702 -1438 306 1650 1327 -616 -1573 -1170
5088 -1170 -20 1090 1725 581 -944 -1879 -807 1211 1795 822 -329 -1172 -1443 -156 1544 1670 6
5105 6 -1492 -1573 -674 656 1819 1303 -702 -2073 -1543 922 1502 1409 43 -1360 -1703 -912 1375 1925
5123 1925 923 -1034 -1829 -932 314 1345 1776 130 -1716 -1721 -66 1539 1766 414 -746 -1824 -1272
5140 -1272 649 2051 1259 -637 -1580 -1251 -230 1074 1773 388 -1207 -2190 -674 1344 1574 954 -295
5157 -295 -1470 -1747 96 2073 1844 156 -1351 -1479 -555 651 1751 1324 -822 -1924 -1243 348 1409
5174 1409 1322 82 -1293 -2121 -511 1079 1968 656 -912 -1890 -1079 367 1800 1709 9 -1883 -1751
5191 -1751 159 1325 1627 529 -786 -2012 -1137 950 1995 1195 -488 -1509 -1482 -249 1275 1898
5207 1898 756 -1637 -1906 -734 1217 1497 972 16 -1848 -1699 172 1974 1529 58 -1152 -1329 -524
5224 -524 908 2039 1353 -700 -2166 -1045 335 1718 1424 9 -1527 -1997 -572 1538 1942 505
5240 505 -872 -1681 -1202 359 2133 1855 -153 -1844 -1708 13 1251 1631 759 -856 -1834 -1200 938
5257 938 1942 1117 -251 -1575 -1206 -285 1581 1796 310 -1619 -2002 -481 783 1498 951 -722 -2028
5274 -2028 -1608 159 1760 1677 52 -1271 -1658 -628 1042 2016 1053 -899 -2079 -1145 439 1582 1398
5291 1398 779 -1574 -1823 -272 1582 1585 573 -815 -1611 -1316 324 2065 1453 -705 -1910 -1319 -330
5308 -330 1321 1852 737 -1205 -2145 -1114 1002 1830 1257 -315 -1508 -1494 -321 1551 1873 221 -1653
5325 -1653 -2128 -573 753 1703 1362 -327 -2091 -1636 324 2010 1552 -178 -1095 -2014 -972 1046 2198
5342 2198 917 -1161 -1963 -1056 236 1547 1705 136 -1686 -1946 -384 1418 1873 648 -682 -1828
5358 -1828 -1369 519 1920 1632 -445 -1789 -1463 -366 1440 1811 794 -1051 -2038 -1335 1182 2185
5374 2185 1161 -368 -1548 -1815 -117 1690 2044 12 -1612 -1741 -745 768 1932 1521 -491 -1983
5390 -1983 -1518 435 1568 1620 191 -1152 -1954 -990 1195 2071 959 -797 -1748 -1379 234 1649 2034
5407 2034 23 -1952 -1993 -96 1714 1624 945 -692 -1587 -1438 608 1939 1056 -473 -1686 -1456 -503
5424 -503 1107 2028 858 -1571 -2044 -881 853 1652 1266 -324 -1915 -1908 -340 1983 1923 219 -1468
5441 -1468 -1722 -988 629 2115 1446 -651 -2387 -1592 293 1431 1495 278 -1117 -2183 -749 1561
5457 1561 2054 566 -945 -1687 -1416 206 1745 2239 43 -1746 -1700 -149 1419 1368 758 -697 -1861
5474 -1861 -1280 841 2154 1483 -210 -1567 -1432 -657 1251 2198 672 -1704 -2358 -1019 807 1296 1651
5491 1651 -215 -1986 -2145 111 1981 1830 524 -1514 -1508 -1101 906 2342 1367 -957 -2093 -957 338
5508 338 1655 1602 364 -1489 -2174 -710 1288 2013 780 -924 -1619 -1482 62 1652 1629 -26 -1677
5525 -1677 -1545 -49 1260 1814 1024 -651 -2234 -1274 1010 1848 1476 -379 -1581 -1920 -588 1358 2150
5542 2150 236 -1421 -1840 -517 742 1642 1546 -133 -2133 -1839 159 1603 1572 416 -988 -1957 -951
5559 -951 831 2519 1391 -708 -2047 -1205 133 1596 1932 538 -1506 -2201 -693 1555 2043 970
5575 970 -839 -1840 -1587 473 2263 1730 -205 -2035 -1798 -246 1110 1853 1167 -1079 -2165 -1102
5591 -1102 1162 1933 1327 -126 -1390 -1952 -590 1601 2487 554 -1679 -1709 -1039 687 2030 1462 -292
5608 -292 -2059 -1893 169 1651 1607 443 -1030 -2146 -1011 1121 2198 860 -980 -2066 -1203 266
5624 266 1850 2022 534 -1534 -2284 -456 1482 1845 1093 -678 -2084 -1950 163 2042 1762 -379 -1732
5641 -1732 -1603 -486 1230 2086 1069 -1197 -2312 -1037 749 1935 1412 -15 -1714 -2047 -408 1726
5657 1726 2111 171 -1288 -1705 -1110 905 1937 1670 -338 -2390 -1711 119 1488 1580 330 -1021 -2036
5674 -2036 -1087 1095 2175 1222 -917 -1559 -1689 -180 1595 2133 227 -1718 -1984 -423 1232 1855 1248
5691 1248 -542 -1952 -1846 143 2220 1671 -377 -1604 -1734 -683 1489 2195 1187 -1300 -2094 -1162
5707 -1162 796 1781 1331 251 -1509 -1833 -37 1774 2058 173 -1346 -1780 -1476 469 1764 1811 -497
5724 -497 -2125 -1671 114 1748 1959 669 -1420 -2229 -1101 1110 1725 987 -853 -1611 -1519 -158 1900
5741 1900 2163 117 -1731 -1959 -619 1224 2054 1191 -611 -2375 -1353 681 1895 1189 -128 -1490
5757 -1490 -2103 -893 1407 2130 990 -1477 -2239 -1060 404 1621 1525 80 -1850 -2185 -238 2095
5773 2095 1829 711 -925 -1861 -1538 730 2412 1529 -845 -1951 -1481 40 1369 1903 897 -1265
5789 -1265 -2249 -800 1127 1993 1106 -556 -1608 -1849 -72 1803 1980 168 -1539 -1892 -307 1149
5805 1149 1983 1406 -689 -2179 -1479 789 2101 1486 76 -1160 -1944 -985 1575 2378 613 -1371 -2127
5822 -2127 -1311 352 1498 1870 -320 -2315 -2166 120 1789 1791 413 -855 -1825 -1247 882 2275 1412
5839 1412 -624 -1737 -1393 6 1304 2086 756 -1509 -2309 -681 1158 1503 922 -487 -1589 -1860
5855 -1860 -183 1956 1732 -115 -1548 -1688 -451 678 1831 1459 -604 -2170 -1393 779 2011 1312
5871 1312 276 -1453 -2055 -606 1714 2245 604 -1099 -1851 -1023 240 1698 1733 -234 -2240 -1727 121
5888 121 1224 1821 556 -889 -2084 -1588 952 2213 1391 -549 -1914 -1338 -265 1599 2003 691
5904 691 -1613 -2143 -366 1204 1544 1158 -528 -2001 -1828 64 1998 1857 114 -1601 -1623 -489 878
5921 878 2238 1329 -1317 -2063 -1221 780 1763 1587 375 -1567 -1915 -612 1809 2136 504 -1172 -1624
5938 -1624 -1347 209 2195 1614 -410 -1896 -1392 16 1277 1623 853 -1113 -2172 -1415 1131 2130 1107
5955 1107 -515 -1488 -1148 -294 1737 2536 706 -1707 -1860 -478 931 1704 1228 -350 -1917 -1573 73
5972 73 2021 1498 -77 -1142 -1697 -807 1109 2281 1124 -977 -2046 -1076 564 1451 1637 345 -1614
5989 -1614 -2005 -108 1521 1675 772 -683 -1615 -1344 400 2120 1740 -186 -1878 -1535 -320 1270 1769
6006 1769 892 -1011 -2198 -1005 1070 1869 1153 -402 -1822 -1731 -291 1646 2193 423 -1723 -1829 -466
6023 -466 789 1732 1448 -451 -2045 -1650 468 1577 1645 405 -1446 -1706 -741 1177 2377 969 -1218
6040 -1218 -1873 -1106 266 1432 1947 263 -1604 -2024 -465 1438 1643 609 -758 -1896 -1470 776
6056 776 2501 1558 -183 -1682 -1548 -15 1167 2196 876 -1379 -2352 -884 1307 2046 1086 -253
6072 -253 -1865 -1850 -454 1824 1887 166 -1419 -1843 -695 521 1766 1568 -462 -2009 -1399 711 2119
6089 2119 1639 272 -1101 -2075 -855 1340 2227 881 -1218 -1853 -1198 127 1642 1899 56 -2170
6105 -2170 -2091 -89 1279 1561 996 -780 -1795 -1357 707 2208 1346 -382 -1627 -1693 -406 1269 2160
6122 2160 872 -1520 -1993 -997 1147 1693 1482 -33 -2019 -1920 -214 1814 1893 287 -1427 -1781 -732
6139 -732 652 1954 1789 -674 -2277 -1253 297 1563 1445 383 -1232 -2248 -846 1630 2225 606
6155 606 -518 -1394 -1552 41 1696 1860 -104 -1987 -1673 -190 1232 1668 943 -752 -2068 -1292 655
6172 655 1817 1468 -356 -1467 -1566 -518 1575 2295 924 -1153 -2010 -560 1155 1713 1158 -153 -1747
6189 -1747 -1915 32 1924 1639 25 -1314 -1690 -838 1055 2158 1398 -952 -1958 -1060 428 1485
6205 1485 1599 635 -1494 -2302 -505 1538 1839 759 -916 -1546 -1469 110 2238 2004 -60 -2130 -1828
6222 -1828 -360 860 1526 966 -1168 -2524 -1299 786 1905 1199 -486 -1356 -1613 -374 1398 2114
6238 2114 455 -1386 -1589 -749 892 1913 1483 -443 -2071 -1730 429 1942 1442 321 -1082 -1536
6254 -1536 -983 1003 2375 1426 -833 -1759 -1143 255 1570 1602 311 -1592 -1979 -258 1045 1683 958
6271 958 -604 -1666 -1327 299 1969 1725 60 -1716 -1474 -243 1244 1841 1126 -1201 -2203 -1004
6287 -1004 1020 1559 1324 -260 -1555 -1974 -394 1642 2105 468 -1301 -1455 -830 426 1785 1559 -259
6304 -259 -2430 -1415 190 1615 1538 462 -951 -1836 -1136 985 2012 755 -925 -1591 -1378 162 1510
6321 1510 1865 233 -1901 -1852 -323 1276 1722 1116 -456 -1726 -1704 232 1970 1512 -420 -1471 -1448
6338 -1448 -220 1177 2103 727 -1123 -1996 -1129 702 1672 1202 -33 -1224 -2035 -366 1693 1982 215
6355 215 -1232 -1435 -949 486 1766 1387 -448 -2184 -1529 264 1344 1556 626 -995 -2030 -592 1448
6372 1448 2015 873 -737 -1581 -1336 -115 1704 1880 75 -1438 -2005 -426 1380 1616 952 -563 -1922
6389 -1922 -1395 494 1917 1274 -194 -936 -1545 -538 1309 2170 985 -1312 -1822 -763 500 1613
6405 1613 1597 214 -1621 -1639 -118 1649 1583 297 -1106 -1814 -1138 639 1788 1398 -620 -1794 -1196
6422 -1196 254 1272 1374 499 -964 -2139 -745 1097 1802 884 -452 -1585 -1382 -76 1600 1707
6438 1707 100 -1644 -1825 -334 899 1279 1083 -695 -1904 -1414 798 1711 1286 -69 -1244 -1604 -726
6455 -726 1348 2306 677 -1295 -1625 -930 624 1614 1480 -42 -1631 -1651 -7 1287 1294 513 -930 -1553
6473 -1553 -895 662 1872 1065 -386 -1631 -1180 50 1271 1694 657 -1413 -2063 -819 1266 1824
6489 1824 766 -315 -1595 -950 15 1714 1839 -21 -1642 -1533 -456 1049 1688 852 -886 -2066
6505 -2066 -1017 473 1532 1148 -81 -1186 -1729 -727 1321 2132 316 -1205 -1620 -877 609 1750
6521 1750 1532 -8 -1615 -1565 -43 1249 1461 445 -818 -1845 -1042 676 1866 1125 -686 -1552 -1218
6538 -1218 -56 1335 1731 480 -1327 -1901 -518 1096 1577 874 -218 -1403 -1197 104 1797 1623
6554 1623 -180 -1273 -1549 -506 986 1774 992 -544 -1965 -1010 406 1630 1391 69 -1089 -1714
6570 -1714 -469 1484 1684 413 -1057 -1471 -943 505 1642 1518 -21 -1787 -1421 22 983 1531 691
6587 691 -1167 -1923 -959 809 1925 1196 -702 -1472 -1403 -61 1245 1615 591 -1462 -1867 -520 1114
6604 1114 1409 926 -184 -1613 -1294 243 1666 1199 -42 -1116 -1499 -629 1092 1918 969 -733 -1866
6621 -1866 -874 574 1419 1103 245 -1260 -1822 -390 1510 1707 235 -1130 -1169 -1143 257 1517 1586 -335
6639 -335 -1533 -1312 91 1228 1487 534 -769 -1798 -998 867 1966 746 -394 -1428 -1285 45
6655 45 1399 1566 236 -1461 -1622 -695 865 1435 1127 -488 -1883 -1397 277 1464 1209 -2 -974
6672 -974 -1304 -868 1082 1742 950 -1277 -1716 -818 446 1600 1277 -61 -1540 -1756 -195 1373 1553
6689 1553 331 -909 -1562 -1070 384 1709 1246 -444 -1524 -1293 -14 1045 1706 557 -657 -1631
6705 -1631 -778 1200 1571 875 -232 -1119 -1211 -68 1569 1499 145 -1307 -1346 -516 658 1473 976 -670
6723 -670 -1809 -1452 488 1516 1161 183 -1128 -1385 -471 1115 1829 746 -898 -1741 -1060 376 1194
6740 1194 1288 297 -945 -1614 -204 1214 1588 261 -671 -1539 -1162 619 1605 1006 -400 -1606 -1061 133
6758 133 1041 1603 655 -1372 -1801 -647 780 1358 828 -266 -1273 -1552 -291 1596 1891 330 -1072
6775 -1072 -1312 -554 561 1236 1116 -608 -1833 -1004 444 1461 1100 161 -1312 -1603 -684 1040 1770
6792 1770 700 -891 -1328 -1114 129 1403 1277 -54 -1464 -1706 -76 1370 1483 569 -636 -1849
6808 -1849 -1125 447 1616 1149 -151 -1309 -976 -51 1263 1558 694 -1195 -1624 -735 930 1392 1104
6825 1104 -391 -1477 -1615 59 1587 1439 -41 -1246 -1140 -842 820 1526 1310 -457 -1515 -1016 435
6842 435 1104 1146 129 -835 -1568 -633 1197 1406 410 -776 -1419 -955 279 1250 1390 -164 -1387 -1190
6860 -1190 -3 902 1070 768 -607 -1504 -1123 653 1376 1071 -473 -1058 -954 -304 1125 1638 507 -1273
6878 -1273 -1523 -265 523 1548 957 -353 -1376 -1477 -48 1712 1178 -310 -872 -1127 -877 494 1638
6895 1638 884 -698 -1620 -742 531 1114 1263 146 -1397 -1589 -747 1212 1783 422 -686 -1217 -1022
6912 -1022 244 1422 1124 -391 -1568 -1255 272 867 1256 821 -655 -1566 -765 725 1591 772 -395
6929 -395 -1091 -1142 -330 1166 1633 341 -1059 -1243 -418 657 1394 962 -252 -1657 -1474 227 1302 975
6947 975 -25 -862 -1638 -617 628 1650 933 -828 -838 -843 418 1225 1413 27 -1387 -1340 -286 1158
6965 1158 1241 298 -647 -1197 -1197 246 1412 1249 -554 -1240 -1011 -266 595 1308 557 -679 -1637 -680 798
6984 798 1234 1051 38 -1107 -1240 -75 1227 1593 203 -1270 -1177 -688 463 1294 1175 -367 -1781
7001 -1781 -1118 211 1160 1096 470 -1078 -1320 -484 1083 1517 684 -800 -1291 -609 153 1006 1336 -132
7019 -132 -1528 -1576 -211 1064 1300 801 -347 -1300 -1239 560 1697 1061 -443 -1126 -1196 -352 890 1368
7037 1368 770 -819 -1451 -747 705 1283 1153 90 -1296 -1268 94 1079 1453 186 -1061 -1181 -410 512
7055 512 1096 810 -174 -1443 -958 349 899 1230 295 -1154 -1550 -546 881 1424 652 -741 -1033 -862
7073 -862 319 1241 1339 108 -1254 -1404 -75 931 1252 800 -305 -1405 -879 688 1439 836 -129 -1099
7091 -1099 -893 -628 753 1489 646 -881 -1428 -579 1012 1288 933 -105 -1055 -1297 32 1377 1257 287
7109 287 -808 -997 -757 726 1667 1114 -322 -1283 -834 460 964 1004 528 -875 -1556 -612 1262 1467
7127 1467 501 -710 -1314 -853 208 1233 1299 -21 -1164 -968 -254 962 953 863 -405 -1469 -799 663
7145 663 1451 943 -219 -1066 -1126 -474 1024 1491 474 -1082 -1389 -365 277 1215 775 -207 -1443 -1414 -55
7164 -55 1287 1137 210 -834 -1132 -668 383 1637 971 -529 -1250 -580 208 875 1079 188 -1263 -1437
7182 -1437 -319 914 1082 525 -616 -1118 -1062 156 1456 1111 -126 -961 -1021 -182 793 1225 677 -183
7200 -183 -1437 -872 711 1033 822 50 -1031 -1145 -143 1169 1409 212 -1206 -1217 -632 536 1205 1073
7218 1073 -382 -1228 -998 126 1038 831 212 -667 -1379 -790 418 1289 635 -545 -1309 -892 210 950
7236 950 1000 337 -1230 -1415 -253 899 860 573 -112 -1036 -1059 475 1258 816 -34 -976 -875 -412 278 1210
7256 1210 783 -562 -1186 -669 659 815 755 -95 -1069 -1278 -288 1410 1747 97 -941 -1171 -605 706
7274 706 1306 1055 -320 -1405 -1158 324 1105 984 117 -825 -1220 -519 694 1413 721 -630 -1077 -620
7292 -620 -175 1033 1190 264 -1001 -930 -58 660 1037 721 -327 -1034 -1154 187 1326 882 -204 -763
7310 -763 -738 -439 864 1493 363 -679 -1662 -653 302 832 832 -5 -1212 -1020 -63 1033 1319 48 -724
7329 -724 -1246 -771 341 1240 1005 -422 -1162 -1100 636 1299 869 262 -583 -1355 -749 924 1121 647 -672
7348 -672 -955 -1117 -38 1159 1357 -26 -1247 -933 -74 818 1189 1070 -510 -1169 -1096 274 1065 883
7366 883 -186 -1118 -1000 -434 735 1261 582 -894 -1273 -544 364 1012 1067 57 -997 -1562 -61 893
7384 893 1051 135 -524 -1082 -659 373 1436 698 -387 -1279 -864 -12 961 1274 336 -626 -1081 -274 976
7403 976 1300 608 -346 -961 -1144 -81 1119 1000 176 -1489 -915 -102 900 1051 691 -451 -1152 -889
7421 -889 450 1016 684 -247 -833 -955 -514 844 1375 781 -602 -916 -626 -82 1001 1128 -10 -1151
7439 -1151 -1143 280 1025 537 401 -485 -1244 -695 657 1389 667 -311 -1233 -792 163 848 922 411 -709 -1267
7459 -1267 -198 872 749 600 -363 -1175 -1188 193 1056 1186 13 -925 -1199 58 836 1141 696 -559
7477 -559 -1353 -694 586 1113 790 14 -952 -1394 -68 967 1378 54 -832 -926 -560 107 819 922 -537
7496 -537 -1366 -1081 224 789 756 288 -444 -1211 -1133 530 1238 820 -573 -826 -860 -51 630 1332 56 -1149
7516 -1149 -1108 -438 791 1120 486 -119 -1133 -979 375 1219 861 -429 -985 -1150 -99 633 1037 530
7534 530 -578 -1183 -779 422 978 815 552 -999 -1136 -79 1146 1346 313 -419 -722 -727 325 1395
7552 1395 1320 -280 -1374 -981 -18 812 907 424 -631 -1124 -537 796 1286 517 -392 -873 -738 65 1100
7571 1100 1022 261 -1052 -1179 -124 627 795 631 -316 -1321 -897 244 1313 705 183 -729 -847 -419
7589 -419 726 1215 825 -654 -1173 -661 450 942 871 66 -939 -1286 37 877 1324 296 -509 -1085
7607 -1085 -750 195 1265 792 -501 -1305 -828 310 812 729 267 -286 -1146 -532 635 744 511 -225 -1226
7626 -1226 -988 -2 921 1012 217 -846 -952 -12 586 1096 851 -384 -1270 -564 370 923 751 -46 -944
7645 -944 -882 -386 772 1254 174 -638 -1142 -560 402 918 1137 208 -1273 -1035 -60 1124 772 349 -418
7664 -418 -744 -781 621 1252 792 -174 -1107 -552 -131 810 899 428 -846 -1226 -478 682 1110 524 -353 -943
7684 -943 -912 52 1061 1365 65 -917 -885 -141 616 1114 577 -111 -1051 -861 237 949 519 -249 -782 -1213
7704 -1213 -442 1198 1155 306 -710 -985 -467 225 792 1103 -149 -1015 -1013 -19 805 621 409 -480 -891 -714
7724 -714 389 1196 610 -424 -822 -666 0 804 1137 270 -982 -1044 23 512 861 277 -24 -699 -1165
7743 -1165 -138 937 637 -114 -1002 -830 -517 258 1202 500 -522 -1426 -723 261 498 800 375 -903
7761 -903 -913 -298 958 1230 398 -430 -957 -758 38 1181 840 -13 -948 -912 112 761 772 385 -473 -1074
7781 -1074 -705 645 1083 744 -526 -712 -975 -159 578 1038 445 -711 -992 -371 503 642 802 -290
7799 -290 -916 -952 217 927 868 13 -539 -732 -471 436 779 462 -535 -1023 -323 354 553 1096 150 -977
7819 -977 -791 -68 1045 1070 244 -394 -964 -755 148 1147 732 -68 -1039 -938 -33 785 869 396 -380 -1262
7839 -1262 -496 547 723 434 -163 -771 -808 -419 860 932 117 -596 -853 -311 139 1156 662 -365 -841
7858 -841 -837 186 945 764 373 -735 -1079 -451 558 910 640 -537 -869 -345 199 814 673 351 -592
7877 -592 -1121 -409 909 849 669 -335 -894 -687 98 966 879 -288 -827 -948 101 714 864 469 -469
7896 -469 -897 -307 527 856 563 -23 -827 -873 113 796 1042 81 -700 -810 -343 473 764 820 -120 -1039 -753
7917 -753 370 906 724 118 -836 -1162 -481 602 1124 406 -361 -775 -400 95 505 511 151 -757 -980 145
7937 145 724 867 515 -512 -908 -596 290 1101 675 -329 -612 -794 -10 394 922 257 -638 -1045 -421
7956 -421 586 701 582 -445 -728 -831 -474 838 960 223 -794 -1036 -215 276 920 501 -455 -958 -573
7975 -573 351 748 909 -15 -377 -815 -506 850 943 238 -320 -797 -574 6 765 781 141 -1120 -1003 -260
7995 -260 709 696 199 -416 -855 -649 288 813 390 -184 -718 -728 -20 654 996 561 -678 -955 -317 635
8015 635 899 854 -53 -970 -696 -129 676 581 131 -484 -411 -471 405 887 854 -526 -908 -380 278 643 774
8036 774 361 -715 -617 -399 431 725 272 -327 -722 -480 147 684 759 -41 -714 -591 -323 497 771 255
8056 255 -321 -618 -265 294 1075 449 -71 -644 -740 -175 399 1143 307 -701 -836 -204 317 646 813 -55
8076 -55 -675 -821 -53 933 664 94 -488 -645 -254 217 822 570 -236 -907 -557 -140 534 669 371 -689
8096 -689 -710 -55 373 680 534 -364 -978 -531 187 743 769 -91 -884 -617 -134 711 693 621 -494 -870 -385
8117 -385 114 586 528 -177 -863 -667 -83 677 1063 386 -545 -912 -13 317 946 660 -121 -565 -751 75
8137 75 800 698 -125 -553 -955 -389 399 893 360 -356 -894 -511 49 654 773 169 -743 -1133 -168 535
8157 535 636 314 -92 -593 -829 99 1030 711 -155 -637 -587 -18 529 789 460 -427 -807 -332 387 739
8177 739 613 114 -624 -700 -85 710 896 61 -531 -760 -523 249 600 525
8191E25
$$ Imaginary data points
##PAGE= N=2
##DATA TABLE= (X++(I..I)), XYDATA
0 0 0 0 0 0 0 0 -3 8 -8 8 -8 8 -16 16 -19 24 -32 35 -42 49 -58 69 -78 91 -106 119 -138 155 -173 198 -222
31 -222 249 -281 313 -348 388 -434 480 -534 591 -654 724 -802 887 -985 1093 -1215 1354
48 1354 -1512 1700 -1922 2187 -2518 2933 -3482 4245 -5375 7226 -10811 20341 -101883 -265472
62 -265472 -90012 94613 190247 126734 -9663 -156856 -155439 10102 190133 178682 19005
73 19005 -125049 -141884 -53266 97916 197525 131733 -67279 -188160 -115379 47258 137691
84 137691 117077 10461 -122800 -172633 -55824 119740 163473 43986 -94293 -140285 -88708
95 -88708 29275 142693 130788 -25349 -163104 -131940 14316 124409 132907 53921 -76769
106 -76769 -164251 -98735 74149 168196 94804 -43522 -123008 -112007 -19641 108609 152982
117 152982 39150 -121055 -153249 -44709 76543 126305 92052 -18995 -139175 -138423 5453
128 5453 137798 124325 10977 -85606 -112869 -59185 62775 152439 95752 -59421 -140821
139 -140821 -80405 31212 103498 107787 29661 -96268 -144210 -39302 106145 132941 39310
150 39310 -69244 -124003 -100393 9903 130100 125385 -13233 -131104 -113475 -9984 81369
161 81369 115109 62935 -65039 -152139 -85801 71870 149453 89511 -23619 -105711 -115797
172 -115797 -26856 110152 154029 40642 -105271 -135892 -52584 52614 117238 97698 -20144
183 -20144 -141638 -127045 17395 130421 111659 10060 -86077 -123912 -63759 75512 160578
194 160578 87056 -66475 -137753 -82473 24474 109988 122734 27937 -111465 -146789 -32263
205 -32263 100346 118665 37363 -62042 -122959 -96231 27807 143263 116544 -26365 -128660
216 -128660 -109272 -16613 78604 124454 69171 -63708 -138358 -64898 69424 122143 71176
227 71176 -19039 -95395 -108859 -19494 106710 128561 18556 -96404 -111115 -44262 44193
238 44193 107644 88882 -26380 -130238 -103269 19582 102809 87862 17245 -63396 -107641
249 -107641 -55444 69506 134209 62278 -57965 -106391 -67028 13829 94717 113231 24642
260 24642 -99724 -122783 -24265 78610 99467 49647 -33602 -106241 -95713 15171 115164
271 115164 90068 -21725 -98485 -91032 -26571 61140 114490 62657 -63295 -127595 -62074 48448
283 48448 99816 76164 3529 -82766 -106939 -18716 101952 120189 26334 -69860 -93810 -51440
295 -51440 32145 107031 90754 -26008 -121757 -93397 13847 88902 89018 28043 -67696 -125029
307 -125029 -67573 62159 123031 58371 -45987 -96743 -77158 -999 93162 116035 22080
318 22080 -96850 -110414 -19342 72949 101022 61196 -31098 -113878 -93960 27359 120686 90358
330 90358 -12528 -87518 -95770 -38534 59754 116314 54589 -69861 -120853 -55393 42809 94039
342 94039 78311 253 -94435 -109900 -9742 103536 110764 23397 -63739 -94640 -58787 34135
354 34135 115061 91103 -26405 -109932 -80228 9676 75529 83719 27892 -69013 -118692 -52747
366 -52747 66030 109080 49035 -38307 -89304 -81444 -7123 88230 105985 14125 -86248 -92199
378 -92199 -20250 54187 88307 62985 -22719 -99737 -76225 30111 100479 72875 -5171 -67912
390 -67912 -86655 -38645 57988 110367 50313 -58207 -99385 -52930 20232 72961 75706 7632
402 7632 -85106 -100688 -12674 79896 86573 25306 -44672 -85731 -63833 26117 105983 81631
414 81631 -23304 -93448 -74236 -5042 62184 90754 44811 -55005 -107396 -48347 53379 92338
426 92338 51100 -20414 -79069 -84569 -10448 87419 101009 13533 -75842 -86035 -31057 40756
438 40756 89529 69263 -24142 -103566 -78057 21463 86794 72137 9294 -58815 -89990 -41204
450 -41204 59250 104970 42575 -54831 -90973 -54463 14654 77056 83907 7460 -87613 -95221
462 -95221 -9256 73199 82064 31871 -38831 -88990 -66291 28940 102387 71284 -23491 -81100
474 -81100 -65690 -5568 63591 93045 38008 -63995 -104217 -39309 52309 85267 52488 -14519
486 -14519 -79417 -84318 -4776 86261 87571 3630 -70747 -79005 -32608 37145 87251 61159 -33717
499 -33717 -98931 -62132 28280 80996 68423 10549 -60906 -91198 -35491 62338 96202 34557
511 34557 -47138 -77009 -49773 12739 74855 76815 -3004 -86582 -82490 -4133 62989 72803 32631
524 32631 -36298 -86651 -58269 35603 96531 62483 -18294 -67497 -61742 -11891 58128 88169
536 88169 32389 -59548 -87651 -29756 43195 71984 49189 -14008 -80682 -82315 -1944 78316
548 78316 73515 2011 -60824 -74634 -38434 32713 86179 57899 -33191 -87645 -52983 21629
560 21629 68547 65794 14704 -58790 -86980 -25031 67618 91874 34622 -37412 -70790 -53990
572 -53990 9942 78606 78186 -3918 -80474 -73490 -5606 54231 71641 36688 -37775 -90536 -57944
585 -57944 33578 84042 50070 -19285 -66839 -67898 -16697 60569 88788 26968 -60301 -81872
597 -81872 -30342 35332 69813 55733 -8993 -76949 -72476 8932 78471 69199 6267 -51631
609 -51631 -72006 -37890 38000 88867 51333 -38059 -84764 -51880 14631 63319 67972 15138
621 15138 -62410 -85678 -21217 62074 79415 30049 -33028 -70019 -55823 13206 82275 73550
633 73550 -8719 -74981 -65266 -6751 49583 71218 35825 -42316 -90623 -50957 34300 75545
645 75545 45867 -12930 -59532 -66123 -13974 61889 80176 15645 -59331 -70943 -24593 33955
657 33955 70456 57535 -10258 -75282 -63961 12299 68476 58823 8145 -44628 -68763 -36680
669 -36680 38182 81182 40502 -36612 -71011 -44396 7994 54559 63644 13266 -59584 -76161
681 -76161 -16279 51899 65775 30170 -22266 -62380 -53918 10953 72323 60789 -7749 -58580
693 -58580 -53232 -11958 37645 64628 34911 -36942 -77199 -38839 31478 64013 43929 -3942
705 -3942 -53261 -65803 -16050 55025 69849 14095 -46379 -58754 -28026 22005 63417 53870
717 53870 -13207 -73261 -59724 7930 57251 55992 17105 -36185 -67923 -36984 36868 75863
729 75863 38571 -27386 -59889 -45981 -1140 51286 66743 16403 -55278 -68947 -15928 41121
741 41121 57363 31789 -18283 -63296 -55167 11622 68964 55781 -4843 -50109 -52536 -18772
753 -18772 34942 67443 36036 -36107 -71126 -34219 26468 56014 43284 -2128 -55530 -67331
765 -67331 -12725 56072 64963 12877 -41807 -58580 -34440 18391 65264 53596 -15273 -68274
777 -68274 -51076 9373 53747 57153 21877 -34644 -67042 -32352 38954 70006 33804 -23443
789 -23443 -54060 -45901 -1152 53413 63975 8325 -57006 -63832 -16148 32633 50537 32421
801 32421 -17418 -61889 -49217 15475 62165 45580 -6172 -44358 -50203 -19037 36675 66709
813 66709 31734 -34993 -60586 -28031 20123 47983 43779 3072 -50111 -60185 -8059 50318
825 50318 54932 12838 -30828 -51023 -35664 14519 59678 47573 -14332 -57409 -42762 2276
837 2276 39697 51244 23936 -31874 -64068 -30352 32427 57730 30726 -13149 -43602 -44224 -4787
850 -4787 48873 57409 5976 -48996 -53493 -16203 26319 50145 37153 -14685 -61795 -48429 11693
863 11693 52828 40899 -440 -38500 -51397 -22390 35516 65291 29682 -31350 -55093 -30280
875 -30280 13245 47881 51354 7854 -49542 -58138 -6304 47346 53000 18348 -24743 -53269 -41719
888 -41719 12549 59402 44792 -13987 -53455 -44296 -6231 34644 52529 23299 -36865 -65200
900 -65200 -27907 31379 54403 32680 -8132 -44903 -49036 -4021 52287 57872 6960 -43152
912 -43152 -48413 -17294 25546 54636 39951 -17844 -63126 -44641 13717 50453 41729 4642
924 4642 -37381 -55739 -24615 36224 62005 25483 -30419 -52671 -33004 8056 47296 51892
936 51892 5736 -49831 -53624 -5653 39938 47012 20844 -20312 -52071 -40244 15303 57901
948 57901 41320 -10890 -44903 -41357 -10694 30623 51820 23034 -33277 -56487 -23511 24673
960 24673 44872 32400 -2930 -42278 -49064 -5138 47536 51169 7886 -33590 -42830 -22596 17522
973 17522 51476 40098 -14180 -54247 -39062 7333 39547 40040 12662 -31037 -54970 -25942
985 -25942 31331 54550 23655 -22056 -44717 -35928 229 44017 51535 6729 -45678 -49322 -8908
998 -8908 31421 45174 27991 -14702 -51887 -39454 15539 54350 38292 -7012 -39915 -43089
1010 -43089 -14914 31842 55378 23634 -33587 -54601 -24690 18915 42958 36383 -1516 -45983
1022 -45983 -50831 -2839 47296 48359 8874 -29913 -44104 -26020 19101 54951 38987 -16750
1034 -16750 -52500 -36363 6368 38578 42859 13715 -34204 -56243 -21596 33037 50202 20434
1046 20434 -20169 -43853 -37313 1399 45789 48137 276 -45872 -44197 -6745 30087 45364
1058 45364 27787 -17787 -52393 -33555 20292 51135 33679 -5076 -35311 -40626 -12209 35067
1070 35067 53272 16950 -34882 -48764 -21344 16200 39635 34400 -4110 -47120 -46523 554
1082 554 41825 39654 7520 -25881 -42454 -26594 18621 51709 33287 -15981 -43586 -29128
1094 -29128 4659 33874 41756 14561 -31808 -49605 -16242 29893 42442 20270 -13160 -38448
1106 -38448 -37396 -238 42275 41925 -1280 -38655 -38221 -10772 21486 40896 27433 -17148 -48640
1119 -48640 -30311 16707 42048 31031 311 -30431 -41550 -14372 33010 49308 15992 -28274
1131 -28274 -41467 -21883 10568 38274 36953 -1993 -44858 -42620 425 36515 36893 11357 -22613
1144 -22613 -43853 -27861 19520 50621 30237 -15746 -40399 -30276 -305 32277 43679 14043
1156 14043 -33757 -47707 -13511 28495 40493 22134 -10848 -40163 -37795 3552 44211 39496
1168 39496 -3016 -35972 -37116 -12897 21063 43163 26099 -20942 -48588 -26872 16085 38187
1180 38187 29717 1494 -31516 -42005 -10508 35572 45805 12300 -25380 -36687 -21158 10808
1192 10808 39658 36535 -5434 -43067 -36347 2593 32221 33141 11454 -22045 -43642 -25099 21002
1205 21002 44765 22818 -15938 -35696 -28969 -2273 31181 41867 10700 -32850 -40573 -9505
1217 -9505 24545 35247 22537 -8013 -37421 -34129 6433 40545 33169 -2183 -28930 -32922 -14557
1230 -14557 18347 40624 22822 -21062 -42821 -22733 11267 31138 28832 5063 -28887 -39774
1242 -39774 -9235 31420 39013 11682 -18221 -31468 -22930 6643 37431 34477 -4946 -37561
1254 -37561 -32068 -1495 24022 31415 15569 -18486 -42072 -24464 17468 38391 21640 -8860
1266 -8860 -29806 -30310 -6461 29441 40771 10535 -28697 -35963 -11236 17613 33178 26284 -4939
1279 -4939 -37135 -33365 5557 36920 31018 2486 -23795 -33809 -18028 18038 41177 21893
1291 21893 -19551 -38796 -22240 6956 28359 30451 5685 -31159 -40491 -8717 28410 34808
1303 34808 12317 -15342 -31759 -25154 6957 38480 32646 -5928 -33427 -27159 -1709 23206
1315 23206 33136 17757 -18747 -40033 -19968 18651 34377 19774 -6494 -27995 -31196 -6269
1327 -6269 29200 36461 5716 -27824 -32032 -12230 13551 30784 25129 -6475 -36093 -28454 7323
1340 7323 32261 26620 4088 -20285 -32309 -16521 19094 38805 18414 -17231 -31989 -20145
1352 -20145 3538 25453 29048 4581 -29881 -35476 -6223 24345 29155 12551 -11190 -29501
1364 -29501 -24955 7279 35868 28008 -5452 -27610 -23802 -4073 19609 32701 17305 -18447
1376 -18447 -36286 -16775 15224 28684 19108 -2450 -25773 -31718 -6534 27284 32273 4373
1388 4373 -22974 -28678 -14635 9249 30275 26295 -6074 -33726 -26091 4829 26005 25371 8162
1401 8162 -17132 -32210 -16580 19411 36063 17113 -13117 -27265 -20982 -472 24721 31375
1413 31375 5471 -27912 -31833 -5763 20374 26862 14850 -9472 -31474 -26243 7205 33485
1425 33485 24541 -4804 -24361 -24262 -7661 18705 33959 16179 -19628 -34519 -14933 13812 27515
1438 27515 21698 -316 -26478 -31300 -4001 28359 30313 4517 -19915 -27202 -16270 9325 31671
1451 31671 24969 -8849 -33327 -23846 3612 23337 25083 9086 -17901 -32422 -14551 20024
1463 20024 33065 14756 -10770 -24989 -21492 -139 26307 30577 3341 -27066 -28383 -5409
1475 -5409 16829 24706 15461 -10319 -32239 -24620 8633 30360 21349 -3512 -21652 -25197 -9653
1488 -9653 18560 32975 13869 -18943 -29570 -12427 11422 25638 23265 1553 -25786 -29454
1500 -29454 -2064 26144 26802 5219 -16043 -26042 -17832 8627 30696 22122 -10119 -29773 -21416
1513 -21416 1303 19889 25102 10379 -18259 -32127 -12767 18606 28853 14061 -7786 -22735
1525 -22735 -22249 -457 26883 29457 1870 -24152 -24848 -6727 13459 24943 17726 -8888 -31065
1538 -31065 -22122 8318 27105 19615 -827 -19643 -26551 -11236 18353 31691 12317 -16751
1550 -16751 -26252 -13698 6859 23260 24242 1513 -26313 -27690 -1294 23592 24767 8075 -12407
1563 -12407 -25638 -18316 9271 29908 19730 -9374 -26190 -19885 -1181 18321 25729 9808
1575 9808 -20061 -31456 -11074 17007 25244 13536 -6155 -23046 -22939 883 27447 26613 319
1588 319 -21732 -22708 -7056 13229 26789 18212 -10524 -30009 -18510 9030 23799 17918 273
1601 273 -19066 -26583 -9490 19281 28934 8743 -16457 -24155 -14014 4791 22672 22659 -950
1614 -950 -25583 -23582 1183 20730 21612 8605 -11308 -24883 -16558 11207 28526 16531 -8406
1627 -8406 -21957 -17849 -1647 17801 25413 7655 -20285 -27645 -8407 14366 21497 13127 -4498
1640 -4498 -22837 -21973 2062 25392 22206 -256 -18562 -20158 -7856 12301 26226 16302 -11061
1653 -11061 -26866 -14818 7762 20220 17622 2955 -17509 -25547 -7688 18399 24590 6914
1665 6914 -13647 -21302 -14424 3481 22133 21401 -2316 -23359 -20266 328 16610 20135 9766
1678 9766 -9925 -24354 -14682 11798 25920 14820 -5524 -18195 -17411 -3194 17036 24198 6443
1691 6443 -18424 -23722 -7544 10839 19243 14186 -3762 -22972 -21849 2461 22163 18961 355
1704 355 -15082 -18975 -9505 10970 25138 14433 -11028 -23412 -13036 6027 18227 18250 3712
1717 3712 -17474 -23902 -5452 18034 22072 6404 -11224 -19456 -14723 3451 22561 19648 -4079
1730 -4079 -22282 -18054 -966 14580 19257 9515 -11819 -24695 -12438 12424 22785 12397 -4914
1743 -4914 -16853 -17608 -3281 17908 23432 4674 -17506 -20217 -6692 9913 18794 14261 -4654
1756 -4654 -22697 -18811 3852 20137 16196 1107 -13184 -19029 -9683 11393 23768 11603 -11310
1769 -11310 -20277 -11409 4206 16862 18221 3306 -16970 -21261 -3158 16511 18786 6130 -8723
1782 -8723 -18282 -14878 4188 21203 16862 -4661 -19273 -15803 -2078 11869 18542 9182 -11638
1795 -11638 -23110 -10512 10611 18903 11694 -2350 -15212 -17465 -2554 18008 21303 3902 -14721
1808 -14721 -17013 -6814 7031 18050 14697 -4114 -20855 -16486 3250 16209 14396 2933 -11290
1821 -11290 -19366 -10386 10416 21383 9560 -9293 -17319 -11462 1315 14695 18204 3727 -16129
1834 -16129 -19226 -3070 13337 16317 8175 -5587 -17711 -14679 4048 19689 14883 -3406 -15617
1847 -15617 -14470 -4431 10350 18906 9516 -11262 -20897 -9382 8312 16324 12073 -825 -15216
1860 -15216 -17413 -2297 17102 18748 3214 -12388 -15765 -8085 6163 18344 14649 -4805 -19779
1873 -19779 -14093 2908 14785 14123 3901 -11380 -19122 -9031 11393 19124 8101 -8169 -15605
1886 -15605 -11968 461 14864 17178 1773 -16319 -16877 -2107 11919 15279 8906 -5374 -17395
1899 -17395 -13281 5641 18903 13225 -2685 -12861 -13780 -4776 10699 18300 7485 -11531 -18628
1912 -18628 -8079 6599 13672 11402 -599 -14853 -16857 -1622 14835 15392 2664 -9480 -13953
1925 -13953 -8654 5610 17764 13309 -4606 -16596 -11480 2339 12190 14177 5058 -10337 -18003
1938 -18003 -7399 10757 16518 7234 -5881 -13973 -12311 -507 14075 15785 926 -14407 -14703
1951 -14703 -2877 8745 14185 9553 -4869 -16805 -12055 5334 16477 11415 -814 -10658 -13671
1964 -13671 -5271 10062 17277 6903 -10177 -16000 -7747 4363 12415 12078 386 -14395 -15761
1977 -15761 -1069 12915 13768 3423 -7776 -13764 -9376 5453 17500 11884 -4962 -14917 -10635
1990 -10635 704 11077 14238 5269 -10355 -17227 -5892 9977 15068 6903 -4595 -13308 -12795
2003 -12795 106 14447 14645 -309 -13325 -13337 -3642 7565 13898 9172 -5958 -16893 -10694 5581
2017 5581 14603 10443 -277 -10527 -13840 -4543 11255 16666 5387 -9297 -13439 -6840 3887
2030 3887 12936 12231 -832 -14978 -14130 265 12085 11674 3121 -7692 -14176 -9108 6128 15992
2044 15992 9384 -5537 -12995 -9598 301 10521 13921 4408 -10765 -15183 -4097 9031 13022
2057 13022 7271 -3330 -12580 -11989 1176 13771 12801 -572 -11198 -11888 -4402 6576 13545 8694
2071 8694 -6438 -15476 -8771 4843 12148 9949 914 -9899 -13516 -3699 10884 14899 4483 -7800
2085 -7800 -11653 -7031 3091 12642 11937 -1437 -14160 -11913 374 10144 10804 4312 -6742 -14139
2099 -14139 -8480 6083 14450 7855 -4416 -11268 -9858 -883 9957 13502 3816 -10123 -13316 -3927
2113 -3927 7635 11676 7675 -2124 -12268 -11147 1555 13143 11275 -14 -9547 -11109 -4776 6073
2127 6073 13583 7672 -6506 -14011 -7807 3839 10489 9261 1225 -10185 -13347 -3008 10553 13070
2141 13070 3856 -6650 -10602 -7311 2953 12621 10998 -1956 -12638 -9816 485 8933 10518
2154 10518 4699 -7057 -13529 -6882 6355 12678 6726 -3819 -10302 -9601 -1398 9909 12298 2395
2168 2395 -10120 -11606 -3097 6527 10701 7622 -2435 -11878 -9744 2636 11657 9469 -215 -8006
2182 -8006 -10222 -4556 6464 12781 6253 -6652 -12073 -6451 3005 8598 8735 825 -9575 -11862
2196 -11862 -1935 9471 10416 3280 -5361 -9670 -7340 2897 11930 9688 -2340 -10565 -7929 154
2210 154 7369 9918 4454 -6342 -12132 -5943 6016 10744 6054 -2471 -9044 -9142 -1161 8900 10618
2225 10618 1503 -8616 -9819 -3104 4927 9492 7326 -2347 -10943 -8577 2246 10125 8070 884
2239 884 -6662 -9560 -4241 6459 11796 4910 -5986 -10228 -5758 1797 8237 9045 784 -9500 -10778
2254 -10778 -1438 7691 8807 3199 -4395 -9612 -7298 3046 11080 8214 -2078 -8566 -7271 -766
2268 -766 6501 9934 4582 -6346 -11128 -4384 5514 9204 5889 -1590 -8259 -9056 -988 8620 9896
2283 9896 831 -7337 -8480 -3488 3756 9200 6819 -3207 -10734 -7296 2600 8900 7413 1378 -6053
2298 -6053 -9354 -3460 6690 10590 3955 -4806 -8506 -5341 1285 7973 8464 340 -8981 -9466 -952
2313 -952 6449 7521 3258 -4120 -9486 -6910 3032 9733 6194 -2291 -7592 -7007 -1628 6100 9327
2328 9327 3433 -6136 -9324 -3357 4563 7793 5756 -664 -7821 -8161 -259 8405 8091 813 -6029
2343 -6029 -7587 -3978 3157 8632 5860 -3365 -9325 -6183 1601 6641 6596 2051 -5550 -9009 -3321
2358 -3321 6017 8935 3393 -3647 -6817 -5387 667 7586 8008 26 -8178 -7485 -845 5139 6955
2373 6955 3820 -3274 -8580 -6107 2878 8522 5461 -1702 -6321 -6750 -1863 5599 8775 3041 -5518
2388 -5518 -8279 -2897 3594 7118 5587 -216 -7144 -7246 544 7610 6811 800 -4681 -7432 -3818
2403 -3818 2872 8217 5339 -3357 -8279 -5356 556 5735 6486 1763 -5745 -8350 -2733 5365 7731
2418 7731 3357 -2747 -6131 -5406 612 7352 7354 -283 -6773 -6270 -957 4450 7031 4041 -3314 -8184
2434 -8184 -5048 3171 7395 4748 -815 -5390 -6175 -2228 5717 7936 2217 -5144 -7186 -2909 2343
2449 2343 6273 5489 -745 -7012 -6572 739 6464 6164 1249 -3871 -6624 -3957 3304 8057 4814 -2959
2465 -2959 -6832 -5006 622 5150 6205 1566 -5803 -7707 -2178 4741 6024 2809 -2038 -6025 -5320
2480 -5320 505 7168 6423 -343 -5352 -5280 -1300 3575 6614 3911 -3210 -7158 -4150 2647 5931 4110
2496 4110 -275 -4990 -6357 -2047 4956 7130 1664 -4497 -5836 -3245 1623 6012 5318 -848 -6344
2511 -6344 -5346 770 5352 5224 1347 -3304 -6170 -3356 3426 7124 3849 -2599 -5625 -4097 126
2526 126 4548 5871 1363 -5201 -6395 -1564 3715 5330 2853 -1813 -5718 -5142 905 6193 5044
2541 5044 -196 -4718 -4951 -1658 3262 6279 3711 -3205 -6349 -3155 2500 5128 3997 166 -4674
2556 -4674 -5950 -1270 4744 5801 1006 -3827 -4996 -3243 1573 5406 4687 -940 -6132 -4727 890
2571 890 4569 4673 1524 -3174 -5898 -2953 3199 6109 2659 -1967 -4433 -3933 -82 4699 5678 1050
2587 1050 -4785 -5640 -1143 3433 4637 2922 -1569 -5620 -4487 1134 5464 4060 -627 -3991 -4559
2602 -4559 -1591 3077 6031 2842 -3103 -5693 -2370 1800 4489 4150 276 -4320 -5200 -411 4684
2617 4684 4847 954 -2787 -4546 -2943 1280 5318 4107 -1708 -5306 -3678 240 3885 4300 1710
2632 1710 -3210 -5272 -2150 3208 5180 2407 -1684 -4036 -3658 175 4604 5034 490 -4516 -4433 -844
2648 -844 2595 4329 2798 -1632 -5214 -3852 1371 4855 3174 -276 -3591 -4590 -1305 2979 5441
2663 5441 2357 -2984 -4540 -2121 1676 4167 3739 131 -4091 -4625 -172 4133 4105 1154 -2400 -3996
2679 -3996 -2870 1640 5000 3296 -1454 -4412 -3104 143 2976 3958 1321 -3133 -5324 -2019 2753
2694 2753 4013 1904 -885 -3531 -3628 -12 4251 4383 171 -3533 -3593 -963 2166 3881 2752 -1811
2710 -1811 -4700 -2955 1675 3977 2563 -113 -3223 -3880 -1334 3100 4540 1307 -2967 -3590 -2045
2725 -2045 1207 3323 3554 -194 -4050 -3777 472 3472 3459 1169 -2013 -3775 -2409 1800 4652 2477
2741 2477 -1619 -3513 -2630 177 2656 3588 990 -3104 -4780 -1269 2418 3453 1708 -875 -3328
2756 -3328 -3536 313 3996 3156 -80 -2835 -3104 -723 2106 3841 2381 -1935 -3972 -2407 1497 3151
2772 3151 2270 203 -2824 -3777 -1256 3112 3835 785 -2157 -3164 -1705 792 3236 3158 -320 -3457
2788 -3457 -3085 306 2920 2334 1182 -1736 -3619 -2020 1891 3904 2121 -1283 -2828 -2478 -68 2569
2804 2569 3462 747 -2821 -3356 -836 1817 2694 2021 -1081 -2972 -2782 457 3400 2656 -484 -2569
2820 -2569 -2722 -1113 1921 3564 1827 -1836 -3389 -1547 1109 2874 2339 294 -2385 -3184 -494 2927
2836 2927 3144 633 -2228 -2641 -1575 932 3152 2309 -797 -3334 -2206 39 2026 2372 1071 -1758
2852 -1758 -3188 -1550 1954 3190 1311 -966 -2336 -2149 -141 2647 2893 295 -2570 -2879 -656 1684
2868 1684 2409 1390 -787 -2804 -2506 950 2554 1944 -48 -2032 -2333 -955 1910 3038 1324 -1794
2884 -1794 -3013 -1110 908 2143 2245 303 -2504 -2936 36 2420 2443 771 -1174 -2456 -1541 662
2900 662 3162 2109 -942 -2400 -1949 126 1526 2279 891 -1918 -2965 -991 1975 2555 1096 -690
2916 -690 -1865 -2031 119 2453 2618 -8 -2281 -2138 -294 1545 2329 1550 -928 -2668 -1834 970 2420
2933 2420 1630 -199 -1500 -2340 -1071 1812 2547 808 -1428 -2241 -976 497 1890 1992 -167 -2699
2949 -2699 -2161 93 2087 1790 626 -1365 -2268 -1411 1115 2851 1722 -973 -2337 -1457 -100 1746
2965 1746 2268 456 -1953 -2676 -896 1485 1981 789 -691 -2068 -1807 47 2192 2254 -436 -1993
2981 -1993 -1895 -451 1120 2156 1342 -990 -2573 -1136 1313 1874 1474 -255 -1507 -2297 -551 1793
2997 1793 2280 388 -1407 -1680 -1066 517 1780 1805 -406 -2359 -1783 624 1663 1644 533 -1119 -2144
3014 -2144 -1169 1207 2568 1013 -1129 -1524 -1391 -3 1793 2169 147 -1791 -2211 -238 1566 1454
3030 1454 967 -429 -2108 -1751 426 1948 1372 -363 -1527 -1597 -418 1010 1883 1185 -1385 -2240 -716
3047 -716 1031 1558 1235 -211 -1474 -1979 -175 1707 1725 201 -1002 -1713 -730 886 2040 1436 -494
3064 -494 -2222 -1369 466 1416 1604 668 -1085 -1963 -944 1447 2135 881 -965 -1343 -1114 -12 1820
3081 1820 1756 21 -1863 -1700 -67 1016 1687 668 -757 -1876 -1377 876 1677 974 -257 -1285 -1544
3098 -1544 -139 1054 2035 402 -1166 -1478 -320 940 1438 1214 -176 -1664 -1526 256 1627 1489
3114 1489 -139 -1065 -1642 -806 644 1651 978 -741 -1661 -830 180 1157 1206 209 -1483 -1793 -418 1423
3132 1423 1432 800 -689 -1707 -943 352 1679 1509 -247 -1578 -1148 -420 986 1561 486 -1128 -1887
3149 -1887 -775 984 1605 579 -495 -1165 -1106 -72 1158 1440 78 -1357 -1407 -651 796 1435 1170
3166 1170 -561 -1681 -1151 248 1700 975 -93 -955 -1259 -334 953 1332 858 -1025 -1423 -760 487
3183 487 1377 1302 216 -1772 -1362 4 1293 1327 328 -878 -1184 -947 436 1502 1120 -480 -1302 -765
3201 -765 216 1029 1190 786 -1062 -1168 -654 957 1130 535 -354 -1265 -1012 -385 1308 1191 -63 -1072
3219 -1072 -1102 -252 613 1307 728 -523 -1137 -965 697 1389 958 -118 -936 -1151 -564 1062 1574 386
3237 386 -873 -800 -528 556 1016 930 -94 -1218 -1146 142 1197 1026 141 -817 -1073 -805 639 1548 490
3256 490 -605 -973 -719 -9 799 1062 303 -916 -974 -21 709 1160 515 -238 -1372 -812 321 1395 964
3275 964 -287 -1193 -797 -611 637 977 703 -616 -1415 -636 564 903 678 -168 -973 -652 -82 1159
3293 1159 1044 151 -972 -960 -453 446 1165 876 -398 -1144 -801 310 880 888 111 -981 -1179 -635 796
3312 796 1271 147 -572 -970 -674 16 1101 1155 -260 -867 -856 162 841 1041 195 -615 -1111 -762 491
3331 491 933 944 -304 -849 -447 -51 831 921 32 -809 -1132 -290 844 999 527 -54 -1103 -812 496
3350 496 1136 752 -229 -913 -787 -247 659 874 645 -933 -1187 -630 346 1106 685 -24 -861 -973 55
3369 55 842 818 -30 -657 -872 -591 325 867 832 -364 -1045 -661 367 588 663 310 -724 -1172 -671 576
3389 576 1104 403 -184 -881 -498 -156 890 797 -31 -949 -743 70 510 945 469 -640 -1217 -442 294 1178
3409 1178 520 -465 -851 -705 -327 668 1004 146 -915 -950 -271 248 1066 743 69 -1136 -1064 -71 1168
3428 1168 929 225 -690 -911 -477 344 1230 630 -259 -1001 -627 315 859 846 229 -620 -1210 24 905 747
3448 747 440 -268 -846 -698 184 943 1003 -336 -830 -744 274 488 1077 462 -547 -994 -282 738 981
3467 981 366 -315 -658 -887 63 719 946 -11 -706 -515 -215 644 681 502 -140 -852 -1058 378 900 727
3487 727 -335 -611 -682 -353 548 1002 658 -610 -716 -385 245 1058 789 -236 -902 -757 -111 967 869
3506 869 -16 -362 -1148 -799 448 1253 800 -425 -1069 -653 28 984 718 284 -742 -1145 -229 727 678
3525 678 396 -149 -895 -597 298 1276 595 -52 -966 -670 -263 435 929 393 -762 -1159 -650 572 1070
3544 1070 717 -44 -624 -1159 -212 767 867 201 -850 -968 -628 144 1115 932 -344 -1146 -810 193 851
3563 851 441 26 -628 -922 -381 562 1079 165 -355 -828 -779 13 1008 770 97 -844 -868 80 708 831 203
3584 203 -241 -984 -779 475 965 642 -425 -845 -661 -14 648 940 385 -819 -1027 -477 411 816 592
3603 592 -142 -831 -1018 -18 901 972 135 -706 -852 -477 477 862 666 -425 -1148 -711 42 899 887 -216
3623 -216 -762 -1119 -414 632 826 208 -714 -806 -524 307 944 762 -66 -853 -818 -32 734 986 201 -618
3643 -618 -803 -617 534 1090 425 -33 -649 -728 -17 734 1215 296 -811 -1137 -366 606 697 296 -165 -1305
3663 -1305 -684 32 1155 976 32 -813 -1011 -222 533 1129 556 -728 -1133 -295 182 1236 870 -99 -666
3682 -666 -939 -387 802 838 212 -615 -950 -458 289 963 426 -328 -1031 -795 167 553 836 214 -504 -1110
3702 -1110 -290 672 697 473 -265 -721 -578 64 1054 963 -163 -1047 -631 -65 539 920 265 -504 -998 -818
3722 -818 529 625 810 21 -716 -1035 -4 883 1130 317 -566 -768 -229 310 950 716 -141 -767 -750 -191
3742 -191 806 773 70 -600 -984 -237 488 951 638 -576 -904 -468 51 557 839 250 -686 -1003 -194 642
3762 642 946 290 -325 -898 -582 -73 1080 852 -48 -906 -785 -120 800 930 563 -498 -680 -514 699
3781 699 839 397 -347 -862 -415 -26 725 1004 134 -780 -845 -581 599 958 550 -312 -1212 -866 384 885
3801 885 724 204 -610 -1027 -451 339 1116 301 -531 -882 -805 -23 656 944 -116 -984 -1221 229 872 923
3821 923 582 -475 -1113 -433 168 984 790 -157 -889 -628 39 828 662 334 -806 -907 -489 566 1171
3840 1171 384 128 -1037 -917 115 897 1110 -27 -813 -722 -317 374 824 713 -476 -1273 -726 302
3858 302 1083 638 32 -692 -1233 -340 877 921 256 -568 -1027 -775 242 1044 621 -249 -1121 -840 -55 828
3878 828 882 197 -511 -1162 -574 684 1001 489 -543 -766 -462 11 550 1006 174 -858 -925 -310 601 684
3898 684 267 -350 -1003 -610 77 1073 539 7 -856 -963 -305 418 901 350 -462 -1041 -492 296 892 638
3918 638 -13 -787 -970 113 1055 771 -112 -719 -1051 -326 401 1026 805 -230 -1028 -570 119 739 838 219
3938 219 -908 -1124 -486 774 1011 406 -517 -977 -743 -56 1163 1132 -124 -841 -817 138 740 926 596
3957 596 -566 -914 -619 309 1018 599 -241 -905 -582 56 796 1120 343 -711 -974 -148 563 796 909
3976 909 -20 -1050 -814 -9 784 767 -80 -837 -736 -489 653 1108 690 -454 -1247 -631 338 511 601 102
3996 102 -1046 -1185 -55 888 824 214 -360 -956 -815 486 1202 924 -191 -712 -973 -167 584 804 230
4015 230 -399 -957 -211 747 1309 750 -102 -632 -870 -414 908 1024 52 -866 -882 -330 474 961 620 -180
4035 -180 -1180 -655 234 1119 808 58 -1033 -1158 -252 693 1048 479 -478 -1368 -363 -12 666 791 92
4054 92 -1123 -1201 142 1061 988 239 -438 -1133 -743 437 1237 790 -519 -932 -981 30 801 1313 178
4073 178 -698 -1088 -303 720 810 720 -115 -1176 -761 129 919 1157 -114 -817 -1032 86 624 1221 614
4092 614 -775 -998 -653 607 1046 728 -155 -703 -1002 -106 847 1086 290 -744 -1129 -454 357 1181 1082
4111 1082 -311 -910 -721 -23 921 857 152 -672 -1343 -355 814 1291 562 -431 -915 -654 178 879 1134
4130 1134 171 -910 -1074 -112 753 989 622 -243 -1313 -1149 270 1307 949 11 -1015 -1085 -306 703
4148 703 1215 341 -655 -1198 -601 556 885 884 -280 -936 -1238 11 1026 1132 63 -487 -1019 -657 444
4167 444 1263 810 -217 -1094 -968 91 994 1061 488 -745 -1197 -471 1053 1624 490 -522 -833 -675
4185 -675 -104 1003 1300 177 -923 -1185 -266 706 795 701 -728 -1282 -771 319 1217 715 -378 -999 -1056
4204 -1056 -347 633 1243 149 -812 -1136 -276 274 807 708 -170 -1259 -1269 -2 1073 799 164 -779 -983
4223 -983 -873 619 1585 857 -432 -1166 -739 357 1008 1047 459 -986 -1256 -375 880 1237 246 -482 -1218
4242 -1218 -980 -63 1350 1043 -395 -1375 -1076 -41 660 976 461 -795 -1295 -527 473 1165 733 -47
4260 -47 -1045 -742 -289 1073 1606 287 -736 -1164 -447 584 1409 748 -315 -1335 -866 182 1163 740
4278 740 89 -796 -1145 -704 659 1296 721 -679 -1098 -693 350 847 1079 95 -800 -1159 -3 1084
4296 1084 969 558 -643 -1048 -850 314 1237 720 -145 -961 -1155 -143 366 1332 665 -824 -1475 -476
4314 -476 678 1175 773 -351 -957 -1283 -63 1351 1275 89 -790 -989 -120 538 1184 753 -538 -981
4332 -981 -919 598 1094 940 46 -638 -1348 -167 876 1269 61 -849 -1200 -420 105 1121 1066 -13 -1175
4351 -1175 -1100 145 992 1107 493 -604 -1379 -607 517 1388 980 -274 -1204 -1220 -9 778 1480 523 -919
4370 -919 -1389 -418 785 808 759 -164 -1089 -981 -97 1215 1094 -138 -1099 -1079 -403 716 1227 709 -626
4389 -626 -1495 -723 476 889 742 236 -1040 -1541 -561 953 1466 294 -579 -1165 -982 295 1244 1018
4407 1018 -239 -1096 -1103 14 1094 1125 318 -698 -1358 -616 545 1367 786 -213 -1171 -957 -153 1162 1285
4426 1285 301 -1054 -1317 -352 542 1139 812 -455 -1467 -1241 242 1224 907 -327 -985 -1004 -376 627
4444 627 1519 981 -814 -1365 -726 456 1077 1204 15 -1083 -1373 -40 1194 926 155 -721 -1484 -676
4462 -676 439 1524 1052 -438 -1262 -835 34 951 1168 616 -605 -1402 -558 965 1227 661 -403 -853
4480 -853 -1179 -29 1523 1337 208 -1239 -907 -589 429 1213 873 -232 -1527 -1053 376 1223 707
4497 707 -165 -1041 -1596 -697 819 1460 499 -820 -1296 -715 409 1004 1257 -91 -1231 -1472 44 1105
4515 1105 1177 578 -732 -1237 -798 249 1597 1026 -595 -1139 -949 -325 1097 1387 402 -891 -1710 -851
4533 -851 666 1276 371 -262 -991 -1251 -193 1407 1378 7 -1030 -1109 -188 714 1205 979 -572 -1266 -712
4552 -712 948 1079 1011 -102 -809 -1283 -463 1087 1474 472 -838 -1176 -729 436 1230 952 96 -1682
4570 -1682 -1256 3 1284 1219 598 -940 -1332 -942 870 1671 862 -430 -1165 -841 -64 1216 1425 245
4588 245 -1361 -1589 -468 1039 1263 691 -216 -1166 -1213 257 1357 1378 -86 -1339 -1036 -270 629 1490
4606 1490 1003 -850 -1371 -846 666 1181 1102 98 -930 -1566 -400 1001 1300 283 -663 -1278 -816 456
4624 456 1562 1049 -276 -1567 -1287 72 1158 1297 615 -955 -1715 -680 823 1653 951 -321 -1189
4641 -1189 -965 -179 1104 1407 430 -1254 -1672 -285 914 1118 899 -186 -1595 -1332 227 1472 1143
4658 1143 -91 -952 -1299 -633 686 1684 711 -971 -1505 -1070 487 1190 1192 194 -1371 -1563 -272 1412
4676 1412 1413 312 -800 -1269 -1066 321 1525 1010 -491 -1651 -1113 142 1098 1238 436 -862 -1652 -587
4694 -587 1194 1485 776 -176 -1229 -1040 83 1220 1757 -41 -1172 -1496 -273 943 1281 1011 -356
4711 -356 -1588 -1135 551 1573 1061 -232 -991 -1279 -399 793 1584 767 -856 -1654 -730 595 1452 1168
4729 1168 -35 -1269 -1549 19 1334 1396 421 -725 -1681 -987 589 1751 1149 -536 -1501 -1180 246
4746 246 1194 1386 599 -1300 -1647 -492 1139 1304 1093 -427 -1589 -1333 -3 1385 1635 84 -1473
4763 -1473 -1346 -412 849 1482 820 -709 -1747 -978 642 1494 1153 -144 -1254 -1542 -401 1133 1741
4780 1741 171 -960 -1288 -712 276 1459 1415 -202 -1753 -1557 131 1339 1482 672 -857 -1633 -890
4797 -890 665 2024 958 -300 -1514 -1064 54 1239 1483 679 -1371 -1676 -356 943 1183 572 -652
4814 -652 -1402 -1304 413 1892 1217 2 -1464 -1267 -324 790 1513 1012 -919 -1920 -941 649 1308 1048
4832 1048 -334 -1369 -1744 -314 1462 1675 452 -1370 -1189 -858 257 1453 1184 34 -1752 -1276
4848 -1276 278 1226 1286 649 -637 -1629 -668 909 1705 1177 -557 -1228 -1088 40 1293 1739 242 -1395
4866 -1395 -1637 -376 870 1148 1095 -494 -1474 -1067 321 1781 1301 -84 -1421 -1398 -704 779 1775 1013
4884 1013 -932 -1777 -639 541 1236 1270 119 -1400 -1950 -310 1556 1653 72 -770 -1204 -1240 312 1520
4902 1520 1083 -400 -1807 -1153 93 1131 1505 284 -880 -1674 -1044 918 1669 934 -812 -1217 -1192
4919 -1192 113 1382 1812 351 -1449 -1521 -349 1004 1086 939 -372 -1646 -1329 314 1397 1079 -8
4936 -8 -1030 -1491 -745 866 1975 570 -1061 -1636 -746 581 1415 1412 203 -1391 -1997 -83 1892 1718
4954 1718 465 -854 -1579 -956 360 1900 1160 -467 -1899 -1217 -42 1009 1232 593 -877 -2110
4970 -2110 -790 1048 1812 980 -511 -1442 -1584 -32 1557 1755 -51 -1192 -1467 -279 939 1622 1096
4987 1096 -558 -1927 -1373 421 1465 1169 81 -1147 -1558 -498 1224 1994 605 -1333 -1617 -853
5003 -853 254 1380 1838 289 -1666 -1729 -121 1464 1713 257 -704 -1788 -863 743 2093 1410 -760
5020 -760 -1579 -1191 -104 1179 1810 565 -1288 -2000 -744 944 1798 868 -407 -1685 -1495 338 1825
5037 1825 1604 -170 -1478 -1582 -770 956 1573 1311 -649 -1975 -1063 679 1307 1190 -61 -1276 -1810
5054 -1810 -713 1533 1730 609 -1234 -1403 -1037 422 1677 1629 82 -1754 -1769 -166 1293 1696 525
5071 525 -942 -1669 -1026 968 1562 1290 -599 -1578 -1006 -146 1177 1908 656 -1649 -1896 -689 1012
5088 1012 1450 1306 -279 -1514 -1573 -56 1624 1644 159 -1293 -1455 -731 763 1929 1213 -767 -1983
5105 -1983 -1060 603 1498 1045 6 -1129 -1884 -512 1477 1687 617 -935 -1909 -1138 403 1962 1400
5122 1400 -99 -1556 -1264 20 1123 1599 643 -1074 -1987 -1046 917 1747 1008 -540 -1289 -1359 -167
5139 -167 1389 1893 358 -1371 -1762 -689 981 1722 1179 -449 -1982 -1514 216 1732 1326 173 -1192
5156 -1192 -1720 -990 945 2268 999 -1091 -1603 -824 600 1693 1432 52 -1501 -1870 -632 1455
5172 1455 1798 585 -1077 -1336 -1173 180 2118 1569 -639 -1884 -1281 -127 1039 1549 797 -1195 -1985
5189 -1985 -966 878 1879 1091 -555 -1334 -1179 -477 1597 2149 468 -1321 -1912 -363 728 1644 1381
5206 1381 -870 -2058 -1617 267 2082 1385 158 -1197 -1822 -608 996 2145 686 -1212 -1962 -1298
5222 -1298 489 1546 1631 209 -1747 -2027 -309 1487 1853 610 -849 -1786 -1352 422 1844 1372 -701
5239 -701 -1901 -1150 -381 1276 1866 865 -1089 -2074 -945 1009 1880 1090 -499 -1414 -1561 -165 1963
5256 1963 1957 34 -1357 -1517 -742 793 1917 1292 -451 -2261 -1547 177 1773 1572 368 -1209 -1809
5273 -1809 -885 1404 2250 956 -1001 -2024 -1002 230 1435 1838 188 -1693 -1939 -309 1269 1611
5289 1611 771 -744 -1681 -1432 800 2256 1648 -478 -1712 -1345 -35 1205 1823 823 -1279 -1938 -602
5306 -602 1075 1786 967 -309 -1934 -1596 141 1839 1693 -113 -1324 -1549 -769 773 2132 1347 -704
5323 -704 -2075 -1202 215 1545 1566 258 -1380 -2004 -569 1232 1701 660 -829 -1705 -1235 289 1935
5340 1935 1549 -58 -1950 -2127 -184 1299 1626 745 -850 -1928 -1350 796 2283 1172 -429 -1390
5356 -1390 -1158 -322 1060 2237 793 -1670 -2086 -886 1066 1546 1167 -355 -1756 -1606 291 1669
5372 1669 1744 178 -1281 -1738 -1127 931 1927 1610 -896 -1910 -1130 622 1552 1446 348 -1421 -2234
5389 -2234 -632 1518 2034 823 -822 -1640 -1544 420 1886 1952 -106 -1897 -1633 -125 967 1669 1233
5406 1233 -880 -2200 -1361 1016 2069 1255 -247 -1453 -1579 -93 1448 2027 446 -1560 -2022 -848
5422 -848 1002 1825 1684 -119 -1992 -1921 -75 1928 1655 123 -1305 -1809 -708 1078 2081 947 -1053
5439 -1053 -1785 -1258 328 1578 1835 399 -1535 -2119 -752 1557 1893 807 -970 -1606 -1603 543 2343
5456 2343 1953 -261 -1831 -1555 -269 1059 1883 1055 -930 -2179 -1273 1204 1846 1247 -171 -1251 -1964
5473 -1964 -380 1690 2001 427 -1678 -1812 -891 842 1922 1682 -325 -2182 -1633 493 1805 1468
5489 1468 207 -1261 -1869 -949 1170 2111 963 -921 -1861 -1133 103 1794 1650 558 -1883 -1967 -276
5506 -276 1442 1673 930 -444 -1846 -1562 328 2138 1761 -233 -1759 -1444 -295 828 1896 1043 -1452
5523 -1452 -2462 -1193 1074 1718 1274 -167 -1562 -1679 -240 1865 2057 371 -1356 -1711 -690 758
5539 758 2058 1425 -552 -2173 -1847 525 1352 1327 593 -1134 -2119 -1068 1127 2368 886 -783 -1866
5556 -1866 -1313 -20 1541 2018 87 -1902 -1929 -238 1316 1977 848 -627 -2087 -1496 751 2183
5572 2183 1602 -395 -1665 -1525 -368 1217 1939 771 -1436 -2301 -1052 904 1664 1313 -9 -1898
5588 -1898 -2244 -247 1719 1696 337 -1464 -1773 -1007 544 1978 1678 -431 -2057 -1250 465 1795 1764
5605 1764 620 -1497 -2244 -1045 1372 1844 968 -829 -2020 -1789 -82 1735 1997 193 -1927 -1730
5621 -1730 -401 1030 1889 1158 -656 -2192 -1593 522 2067 1436 1 -1489 -1886 -639 1361 2433
5637 2433 965 -1339 -2049 -1052 613 1814 1409 -84 -1815 -1850 66 1596 1686 37 -1105 -1670 -1150
5654 -1150 954 2424 1420 -656 -1962 -1459 210 1584 1807 540 -1293 -2156 -807 1314 1904 793
5670 793 -814 -1818 -1835 86 2042 1981 142 -1715 -1833 -518 829 1786 1119 -709 -2195 -1450 736
5687 736 1866 1281 -192 -1313 -1813 -572 1543 2032 828 -1391 -1923 -926 685 1678 1680 -303 -2362
5704 -2362 -2033 5 1610 1619 415 -1030 -2268 -1587 1157 2298 1200 -964 -1918 -1313 240 1500 2163
5721 2163 852 -1685 -1846 -585 1260 1776 1015 -513 -1903 -1610 377 2160 1950 -208 -1727 -1736 -560
5738 -560 957 2121 1440 -829 -2200 -1162 1074 1838 1363 254 -1496 -2293 -496 1757 2447 861
5754 861 -1146 -1804 -1024 833 1697 1804 -209 -1914 -1972 177 1757 1414 747 -1031 -2113 -1215 914
5771 914 2169 1084 -888 -1717 -1467 -168 1414 2078 513 -1694 -2007 -544 1325 1705 1215 -337 -1719
5788 -1719 -1684 -18 2104 1934 -184 -1568 -1520 -649 1329 2268 1226 -1227 -2401 -1143 821 1453 1492
5805 1492 129 -1840 -2185 -637 1828 2293 434 -864 -1853 -1171 593 1913 1856 -450 -2250 -1816 152
5822 152 1386 1698 605 -1058 -2219 -1100 1284 2143 1051 -482 -1607 -1355 -271 1391 2211 229
5838 229 -1764 -2074 -522 1329 1591 1191 -599 -1980 -1705 189 2033 1545 28 -1303 -1581 -825 967
5855 967 2291 885 -839 -2042 -994 404 1443 1554 308 -1685 -2139 -446 1833 2057 317 -953
5871 -953 -1708 -1191 811 2309 1674 -436 -1883 -1579 95 1599 1702 1054 -1200 -2017 -941 1119 1863
5888 1863 1065 -715 -1824 -1484 2 1767 2199 84 -1832 -1839 -797 752 1704 1178 -805 -2292 -1442
5905 -1442 823 1911 1733 254 -1237 -1915 -948 1340 2410 1031 -1303 -2014 -1117 284 1789 1709 416
5922 416 -1751 -1924 -237 1463 1623 535 -842 -1728 -1351 1089 2486 1571 -629 -1600 -1269 -88 1681
5939 1681 2204 992 -1223 -2153 -808 1325 1828 1077 -339 -1798 -1781 -355 1856 2063 120 -1504 -1834
5956 -1834 -561 876 2096 1333 -839 -2493 -1427 422 1694 1405 379 -1277 -2013 -710 1411 2176
5972 2176 792 -1102 -2106 -1268 571 1668 2007 79 -1819 -1943 -359 1464 1551 726 -885 -2143
5988 -2143 -1598 689 2403 1282 -607 -1667 -1495 -268 1178 2097 442 -1373 -2131 -709 1023 1776
6004 1776 1061 -243 -1746 -1802 -40 1998 1796 11 -1385 -1946 -919 804 2307 1268 -808 -1933
6020 -1933 -1421 658 1554 1610 496 -1280 -2355 -642 1590 2451 817 -814 -1541 -1218 239 1939 1882
6037 1882 -104 -1821 -1763 388 1468 2188 767 -837 -2211 -1503 1013 2054 1244 -554 -1533 -1710 -606
6054 -606 1719 1901 575 -1597 -2182 -700 950 1523 1466 -188 -1732 -1867 359 1948 1710 393 -1340
6071 -1340 -1557 -1113 619 1899 1572 -1145 -2107 -1133 618 1639 1467 435 -1442 -2124 -617 1488 1855
6088 1855 595 -818 -1728 -1365 293 1879 1886 -304 -1773 -1432 -102 1338 1470 1142 -972 -2070 -1308
6105 -1308 817 2133 1418 -224 -1244 -1655 -278 1419 2362 618 -1726 -1823 -839 599 1710 1526 -397
6122 -397 -2032 -1807 425 1669 1674 395 -1077 -1808 -1030 971 2222 1225 -1033 -1975 -946 465 1547
6139 1547 1635 274 -1860 -2272 -342 1302 1619 397 -558 -1834 -1635 375 1963 1622 -385 -1916 -1523
6156 -1523 -151 1191 1914 954 -1005 -2309 -1110 994 2037 989 -250 -1739 -2102 -293 1612 1822
6172 1822 114 -1411 -1666 -878 600 1688 1417 -766 -2135 -1696 481 1908 1041 251 -993 -1891 -1107
6189 -1107 1153 2243 1104 -1218 -1581 -1028 285 1515 1750 473 -1452 -1868 -356 1370 1447 607 -706
6206 -706 -1799 -1878 273 2014 1894 -421 -1670 -1490 -451 1239 2048 978 -1165 -2365 -761 895
6222 895 1752 1377 16 -1347 -1811 -361 1858 1855 83 -1367 -1624 -1012 729 1918 1354 -690 -1974
6239 -1974 -1415 261 1366 1285 466 -1168 -2050 -918 1411 2053 701 -851 -1655 -1180 66 1763 1793
6256 1793 137 -1959 -1666 -257 1235 1719 948 -413 -2055 -1707 734 1949 1061 -418 -1612 -1334
6272 -1334 -706 1318 2294 689 -1019 -1705 -821 793 1702 1138 -96 -1792 -2004 13 1920 1567 123
6289 123 -1357 -1454 -937 733 2081 1477 -914 -2067 -1189 296 1435 1546 472 -1417 -1718 -864 1209
6306 1209 1747 966 -565 -1575 -1163 -14 1826 1809 20 -1432 -1502 179 1116 1270 1064 -813 -1896
6323 -1896 -1332 764 2053 1127 -335 -1408 -1788 -551 1060 2075 582 -1230 -1955 -687 553 1612
6339 1612 1682 -62 -1462 -1808 210 1984 1673 497 -868 -1475 -1255 707 2117 1436 -1028 -1826 -1200
6356 -1200 186 1351 1558 163 -1599 -2003 -721 1438 1496 812 -628 -1444 -1347 27 1662 1518 14
6373 14 -1793 -1525 -224 897 1826 1190 -625 -2046 -1263 755 1771 1298 -238 -1504 -1617 -598 1410
6390 1410 1700 351 -1397 -1908 -917 463 1578 1415 -83 -1894 -1742 59 1586 1601 556 -1037 -1815
6407 -1815 -1207 845 2027 1114 -948 -1539 -1136 211 1345 1987 240 -1596 -2016 -734 1181 1593 802
6424 802 -676 -1755 -1612 64 1996 1685 -85 -1362 -1333 -325 1101 2103 1221 -1059 -2293 -798
6440 -798 809 1734 1387 74 -1494 -1941 -514 1559 1917 280 -1119 -1743 -886 530 1892 1235 -373
6457 -373 -1898 -1367 395 1415 1377 541 -991 -1927 -1156 1125 2086 1024 -749 -1626 -1150 -117 1338
6474 1338 1466 273 -1486 -1841 -290 1078 1495 1043 -607 -1492 -1485 226 1842 1285 -41 -1184 -1103 -610
6492 -610 922 1942 942 -769 -1851 -766 584 1608 1275 375 -1085 -1463 -320 1396 1913 420
6508 420 -921 -1591 -1182 388 1687 1681 -440 -1937 -1478 140 1273 1392 633 -1107 -1868 -948 1209 1691
6526 1691 836 -423 -1296 -1465 -14 1474 1924 400 -1355 -1707 -470 1031 1444 1225 -460 -1976 -1360
6543 -1360 275 1678 1094 -273 -1095 -1602 -686 743 1977 898 -834 -1479 -687 397 1396 1625 -29
6560 -29 -1566 -1756 -189 1639 1618 317 -750 -1571 -930 320 1983 1456 -519 -1588 -1049 39 1398
6577 1398 1625 663 -871 -1851 -687 951 1928 713 -775 -1364 -1323 256 1947 1830 274 -1267 -1537
6594 -1537 -378 542 1578 1149 -526 -1981 -1462 368 1464 1208 -46 -1178 -1628 -569 1214 1751
6610 1751 583 -973 -1759 -693 393 1255 1359 -112 -1537 -1552 1 1601 1756 530 -411 -1823 -993
6627 -993 525 1961 1258 -316 -1564 -1061 -58 1023 1711 786 -1066 -1981 -548 917 1463 610 -137
6644 -137 -1266 -1417 126 1509 1572 -15 -1330 -1277 -399 446 1662 1190 -551 -1899 -967 547 1391 990
6662 990 0 -1417 -1802 -600 1231 1498 581 -1129 -1687 -957 237 1320 1318 -39 -1575 -1889 151 1215
6680 1215 1272 658 -824 -1460 -1237 676 1979 953 -401 -1339 -1125 -256 924 1771 605 -1285 -1662
6697 -1662 -441 705 1384 456 -104 -1495 -1619 92 1510 1574 -143 -1146 -1247 -452 784 2094 1219
6714 1219 -491 -1740 -861 528 1274 1333 285 -1118 -1425 -398 1321 1693 606 -824 -1558 -1056 36
6731 36 1603 1044 -168 -1426 -1129 -272 1155 1478 786 -672 -1648 -700 855 1698 907 -192 -1172 -1028
6749 -1028 -61 1399 1765 584 -1560 -1462 -362 709 1538 854 -104 -1579 -1325 361 1632 1206 33
6766 33 -958 -1222 -388 734 1823 1214 -539 -1796 -878 445 1311 1225 292 -1244 -1604 -637 1273 1527
6784 1527 418 -690 -1171 -1142 26 1593 1250 -221 -1747 -993 237 740 955 746 -614 -1776 -792
6801 -792 1005 1444 718 -689 -1098 -1294 -353 1016 1574 375 -872 -1119 -639 757 1475 1048 -253 -1509
6819 -1509 -1375 281 1236 836 164 -999 -1528 -991 765 1779 641 -682 -1589 -729 197 909 1177 555
6837 555 -1544 -1555 -116 1144 1244 544 -385 -1472 -1218 325 1745 1059 -103 -1347 -1056 -242 989
6854 989 1609 687 -1277 -1716 -485 790 1659 817 -319 -1047 -1187 -276 1272 1458 -69 -1084 -1617 -464
6872 -464 550 1513 885 -61 -1859 -919 79 1269 1432 150 -1202 -1514 -610 801 1579 742 -921 -1450
6890 -1450 -792 205 1058 1252 204 -1554 -1598 -75 1287 1373 718 -530 -1510 -996 291 1821 1086 -529
6908 -529 -1051 -992 -378 926 1458 403 -1020 -1845 -645 557 1374 940 -281 -1641 -1443 127 1179
6925 1179 1420 141 -886 -1290 -970 763 1687 1244 -439 -1464 -878 422 1251 1136 129 -1178 -1501
6942 -1501 -637 976 1375 621 -617 -1255 -1191 -158 1536 1325 -100 -1512 -1276 -44 1057 1316 828
6959 828 -613 -1595 -858 551 1479 916 -179 -1050 -950 -374 869 1422 574 -1091 -1596 -415 751 928
6977 928 648 65 -1433 -1479 269 1168 1038 117 -1036 -1056 -692 608 1309 849 -664 -1318 -749 498 1167
6996 1167 1268 125 -1065 -1431 -170 975 1322 636 -483 -1237 -1191 -7 1171 1293 -70 -1250 -896
7013 -896 -297 761 1135 752 -610 -1719 -693 816 1608 697 -212 -980 -1138 -637 1161 1808 303 -1045
7031 -1045 -1451 -433 337 1173 970 -224 -1511 -1317 197 1244 1105 172 -890 -1354 -644 738 1660
7048 1660 754 -796 -1367 -865 294 1299 1634 263 -934 -1492 -268 909 967 345 -438 -1267 -1032 195
7066 195 1417 1342 -196 -1310 -1002 -141 520 1220 582 -390 -1749 -664 597 1351 893 -186 -864 -1581
7084 -1581 -449 1055 1503 339 -1011 -1344 -422 308 1443 1231 -74 -1608 -1085 353 996 1056 270
7101 270 -958 -1372 -624 875 1470 586 -518 -1271 -961 202 1074 1347 218 -1327 -1585 -228 949
7118 949 1164 536 -700 -888 -1156 376 1693 1009 -386 -1262 -1030 -278 805 1394 642 -879 -1708 -765
7136 -765 685 1261 649 -33 -854 -1191 -183 1349 1595 265 -745 -1212 -432 460 1323 1254 -413 -1177
7154 -1177 -1224 446 1129 1123 236 -783 -1620 -470 706 1631 507 -724 -1094 -1018 193 1012 1460 -17
7172 -17 -1262 -1441 -362 831 1226 628 -502 -1402 -970 487 1486 910 -441 -1003 -947 -443 670 1544
7190 1544 335 -886 -1372 -474 449 1082 854 -130 -1117 -1290 -270 1274 1304 -26 -609 -1111 -765 357
7208 357 1416 1123 -563 -1374 -863 275 1016 1442 649 -942 -1495 -624 957 1331 527 -539 -1210 -910
7226 -910 131 1336 1007 92 -1271 -1159 -141 1021 1069 620 -333 -1728 -1052 707 1315 668 -111 -1072
7244 -1072 -795 -281 898 1547 557 -1153 -1416 -657 198 1167 874 -362 -1215 -1120 -5 1102 982 45
7262 45 -1041 -990 -948 615 1431 878 -149 -1295 -651 -2 712 1131 311 -1019 -1513 -522 1244 1277 574
7281 574 -373 -1195 -882 258 1174 1192 245 -1112 -1107 -198 603 1317 738 -669 -1531 -547 718 1145 774 13
7301 13 -628 -1195 -485 1004 1413 306 -1140 -1226 -365 576 1012 999 63 -1728 -1163 121 970 876 164 -889
7321 -889 -1186 -681 765 1365 846 -632 -1046 -657 184 928 1048 251 -856 -1250 -270 563 983 698 -420
7340 -420 -1181 -965 367 1204 1024 -199 -1138 -923 -153 640 1038 910 -782 -1191 -554 550 1026 750 125
7359 125 -1101 -858 -33 993 1414 82 -727 -958 -657 300 1108 881 -320 -1188 -641 49 912 1155 237
7378 237 -702 -1175 -484 744 1337 732 -869 -1059 -548 170 967 1069 320 -1145 -1494 -82 821 1072 613
7397 613 -60 -1229 -844 209 1406 1135 -73 -756 -935 -184 714 1401 594 -749 -1305 -613 480 901
7415 901 911 69 -850 -1351 -122 1322 1302 138 -788 -1035 -831 347 987 1224 -348 -1276 -920 233 953
7434 953 769 301 -838 -1433 -542 743 1400 744 -445 -1092 -765 34 1087 1270 357 -1085 -1035 50
7452 50 755 926 819 -362 -1199 -995 204 1137 756 -112 -890 -977 -58 559 1223 648 -680 -978 -521 118
7472 118 920 786 -51 -1015 -971 -53 983 1076 243 -669 -902 -898 508 1451 881 -156 -1336 -745 -105 749
7492 749 1106 451 -854 -1247 -345 757 1127 463 -349 -1140 -896 -193 858 1176 17 -937 -849 105 277
7511 277 1140 767 -312 -1248 -900 536 1195 777 -95 -858 -925 -191 690 1377 729 -914 -1026 -492 321
7530 321 1075 991 -45 -1076 -1002 -5 825 918 13 -488 -989 -852 449 1286 582 -536 -1194 -586 -16 556
7550 556 979 375 -687 -1478 -528 737 1352 497 -468 -1018 -807 -42 1008 951 42 -1083 -835 -328 445
7569 445 1216 764 -495 -1110 -643 560 1178 563 302 -670 -861 -355 1197 1415 143 -738 -941 -345 89
7588 89 941 979 -250 -1345 -1013 97 860 947 414 -505 -1069 -645 238 1326 871 -494 -1093 -686 7
7607 7 754 829 401 -1022 -1198 -92 581 1207 329 -85 -1007 -931 76 1003 1046 -97 -831 -850 -278 497 1015
7628 1015 515 -553 -1236 -690 241 1095 742 180 -874 -1286 -147 1179 1028 368 -293 -884 -481 392
7646 392 1174 825 -229 -1005 -965 68 757 845 477 -463 -1160 -410 587 1100 449 -607 -876 -725 -119 975
7666 975 1177 17 -850 -919 61 1078 1255 651 -329 -1103 -1035 310 1215 983 -4 -671 -807 -458 586
7685 586 1137 588 -673 -1063 -617 193 723 513 -113 -1184 -1217 -342 1006 990 384 -479 -1012 -528 263 1059
7705 1059 1072 -564 -943 -867 76 972 727 378 -385 -1204 -725 465 1188 681 -560 -860 -563 -202 1074
7724 1074 1202 -56 -1046 -963 -147 603 938 822 -465 -1181 -698 228 1295 749 -280 -911 -947 -768 488
7743 488 1126 459 -438 -901 -656 224 694 1042 -56 -917 -1052 5 777 763 610 -629 -905 -435 425
7762 425 1199 701 -467 -901 -645 142 486 956 469 -996 -1233 -671 516 1060 389 -173 -649 -845 -60
7781 -60 1044 1161 -111 -850 -1031 -619 497 824 575 -200 -1287 -763 -3 742 861 260 -500 -1181 -602
7800 -602 687 1159 489 -306 -946 -641 90 715 1129 355 -1044 -1002 -98 765 655 270 -432 -1194 -547 488
7820 488 1208 807 -701 -842 -591 -46 719 1105 291 -571 -831 -330 370 1037 634 -142 -875 -890 -141 742
7840 742 1091 44 -878 -738 -462 234 1014 804 -461 -985 -698 178 833 855 21 -545 -776 -313 749
7859 749 914 289 -409 -760 -460 138 820 1171 -46 -971 -1201 -68 873 955 485 -379 -1013 -742 543
7878 543 1109 530 -152 -1109 -631 119 395 929 607 -993 -894 -616 380 983 568 251 -763 -1105 52
7897 52 1169 956 86 -779 -840 -424 338 1252 464 -304 -924 -495 354 610 839 353 -561 -1030 -270 603
7917 603 932 356 -506 -597 -714 78 961 847 18 -870 -727 -130 608 825 281 -330 -1242 -406 390 1219
$$ [...]
8191b94
##END NTUPLES=NMR FID
##END=
