##TITLE=1H_CA-8530
 CDCl3, 8 sc, 
 14.1.2019
##JCAMPDX= 6.0         $$ Bruker NMR JCAMP-DX V2.0
##DATA TYPE= NMR FID
##DATA CLASS= NTUPLES
##ORIGIN= UXNMR, Bruker Analytische Messtechnik GmbH
##OWNER= root
$$ XWIN-NMR		Version 3.5
$$ Mon Jan 14 15:40:21 2019 Russian Standard Time (UT+4h)  she@DPX200
##.OBSERVE FREQUENCY= 200.1313
##.OBSERVE NUCLEUS= ^1H
##.DELAY= (6, 6)
##.ACQUISITION MODE= SIMULTANEOUS
##.ACQUISITION SCHEME= undefined
##.AVERAGES= 8
##.DIGITISER RES= 18
##SPECTROMETER/DATA SYSTEM= spect
##.PULSE SEQUENCE= zg30
##.SOLVENT NAME= CDCl3
##.SHIFT REFERENCE= (INTERNAL, CDCl3, 0, 15.7039)
##AUDIT TRAIL= $$ (NUMBER, WHEN, WHO, WHERE, WHAT)
$$ ##TITLE= Audit trail, XWIN-NMR		Version 3.5
$$ ##JCAMPDX= 5.01
$$ ##ORIGIN= Bruker BioSpin GmbH
$$ ##OWNER= she
$$ F:/spectra/data/she/nmr/H-F/1/audita.txt
$$ ##AUDIT TRAIL=  $$ (NUMBER, WHEN, WHO, WHERE, WHAT)
(   1,<2019-01-14 15:39:01.89 +0400>,<she>,<DPX200>,
      <created by zg, POWCHK disabled, PULCHK disabled
       configuration hash MD5:
       00 E9 B6 7A A2 85 ED C7 34 08 36 98 17 FE 4E 26
       data hash MD5: 16K
       63 AE F5 62 B0 E8 FE BC 79 CF 91 18 D2 8F 51 F6>)
$$ ##END=
$$ 
$$ hash MD5
$$ E3 DF 4E C0 24 BD 9E 4F 58 44 94 09 18 62 23 E4
##$RELAX= 
##$RELAX= 
##$RELAX= 
##$RELAX= 
##$RELAX= 
##$RELAX= 
$$ Bruker specific parameters
$$ --------------------------
##$DU= <F:/spectra>
##$EXPNO= 1
##$NAME= <H-F>
##$PROCNO= 1
##$TYPE= <nmr>
##$USER= <she>
##$AMP= (0..31)
100 100 100 100 100 100 100 100 100 100 100 100 100 100 100 100 100 100 
100 100 100 100 100 100 100 100 100 100 100 100 100 100 
##$AQSEQ= 0
##$AQ_mod= 1
##$AUNM= <au_zg>
##$AUTOPOS= <>
##$BF1= 200.13
##$BF2= 200.13
##$BF3= 200.13
##$BF4= 200.13
##$BF5= 200.13
##$BF6= 200.13
##$BF7= 200.13
##$BF8= 200.13
##$BYTORDA= 1
##$CFDGTYP= 0
##$CFRGTYP= 5
##$CHEMSTR= <none>
##$CNST= (0..31)
1 1 145 1 1 1 1 1 1 1 1 1 1 1 1 1 1 1 1 1 1 1 1 1 1 1 1 1 1 1 1 1 
##$CPDPRG= <>
##$CPDPRG1= <>
##$CPDPRG2= <>
##$CPDPRG3= <>
##$CPDPRG4= <mlev>
##$CPDPRG5= <mlev>
##$CPDPRG6= <mlev>
##$CPDPRG7= <mlev>
##$CPDPRG8= <mlev>
##$CPDPRGB= <>
##$CPDPRGT= <>
##$D= (0..31)
0 1.2 0 0 0 0 0 0 0 0 0 0.03 0 0 0 0 0 0 0 0 0 0 0 0 0 0 0 0 0 0 0 0 
##$DATE= 1547465941
##$DBL= (0..7)
120 120 120 120 120 120 120 120 
##$DBP= (0..7)
150 150 150 150 150 150 150 150 
##$DBP07= 0
##$DBPNAM0= <>
##$DBPNAM1= <>
##$DBPNAM2= <>
##$DBPNAM3= <>
##$DBPNAM4= <>
##$DBPNAM5= <>
##$DBPNAM6= <>
##$DBPNAM7= <>
##$DBPOAL= (0..7)
0.5 0.5 0.5 0.5 0.5 0.5 0.5 0.5 
##$DBPOFFS= (0..7)
0 0 0 0 0 0 0 0 
##$DE= 6
##$DECBNUC= <off>
##$DECIM= 24
##$DECNUC= <off>
##$DECSTAT= 4
##$DIGMOD= 1
##$DIGTYP= 9
##$DL= (0..7)
0 120 120 120 120 120 120 120 
##$DP= (0..7)
150 150 150 150 150 150 150 150 
##$DP07= 0
##$DPNAME0= <>
##$DPNAME1= <>
##$DPNAME2= <>
##$DPNAME3= <>
##$DPNAME4= <>
##$DPNAME5= <>
##$DPNAME6= <>
##$DPNAME7= <>
##$DPOAL= (0..7)
0.5 0.5 0.5 0.5 0.5 0.5 0.5 0.5 
##$DPOFFS= (0..7)
0 0 0 0 0 0 0 0 
##$DQDMODE= 0
##$DR= 18
##$DS= 0
##$DSLIST= <SSSSSSSSSSSSSSS>
##$DSPFIRM= 0
$$ [...]
##$SUBNAM2= <"">
##$SUBNAM3= <"">
##$SUBNAM4= <"">
##$SUBNAM5= <"">
##$SUBNAM6= <"">
##$SUBNAM7= <"">
##$SUBNAM8= <"">
##$SUBNAM9= <"">
##$SW= 24.933730806125
##$SWIBOX= (0..15)
0 0 2 0 0 0 0 0 0 0 0 0 0 0 0 0 
##$SW_h= 4990.01996007984
##$TD= 16384
##$TD0= 1
##$TE= 0
##$TE2= 300
##$TE3= 300
##$TEG= 300
##$TL= (0..7)
0 120 120 120 120 120 120 120 
##$TP= (0..7)
150 150 150 150 150 150 150 150 
##$TP07= 0
##$TPNAME0= <>
##$TPNAME1= <>
##$TPNAME2= <>
##$TPNAME3= <>
##$TPNAME4= <>
##$TPNAME5= <>
##$TPNAME6= <>
##$TPNAME7= <>
##$TPOAL= (0..7)
0.5 0.5 0.5 0.5 0.5 0.5 0.5 0.5 
##$TPOFFS= (0..7)
0 0 0 0 0 0 0 0 
##$TUNHIN= 0
##$TUNHOUT= 0
##$TUNXOUT= 0
##$USERA1= <user>
##$USERA2= <user>
##$USERA3= <user>
##$USERA4= <user>
##$USERA5= <user>
##$V9= 5
##$VALIST= <valist>
##$VCLIST= <CCCCCCCCCCCCCCC>
##$VD= 0
##$VDLIST= <DDDDDDDDDDDDDDD>
##$VPLIST= <PPPPPPPPPPPPPPP>
##$VTLIST= <TTTTTTTTTTTTTTT>
##$WBST= 1024
##$WBSW= 4
##$XGAIN= (0..3)
0 0 0 0 
##$XL= 0
##$YL= 0
##$YMAX_a= 238513
##$YMIN_a= -404259
##$ZGOPTNS= <>
##$ZL1= 120
##$ZL2= 120
##$ZL3= 120
##$ZL4= 120
##$ABSF1= 10
##$ABSF2= 0
##$ABSG= 5
##$ABSL= 3
##$ALPHA= 0
##$AQORDER= 0
##$ASSFAC= 0
##$ASSFACI= 0
##$ASSFACX= 0
##$ASSWID= 0
##$AUNMP= <proc_1d>
##$AZFE= 0.1
##$AZFW= 0.1
##$BCFW= 1
##$BC_mod= 2
##$BYTORDP= 1
##$COROFFS= 0
##$CY= 11.3945322036743
##$DATMOD= 1
##$DC= 2
##$DFILT= <>
##$DTYPP= 0
##$F1P= 18.9103706918063
##$F2P= -1.10871071338519
##$FCOR= 0.5
##$FTSIZE= 0
##$FT_mod= 4
##$GAMMA= 1
##$GB= 0.15
##$INTBC= 1
##$INTSCL= 1
##$ISEN= 128
##$LB= 0.24
##$LEV0= 0
##$LPBIN= 0
##$MAXI= 10000
##$MC2= 0
##$MEAN= 0
##$ME_mod= 0
##$MI= 1.114404
##$NCOEF= 0
##$NC_proc= 0
##$NLEV= 6
##$NOISF1= 3.799351
##$NOISF2= 2.8
##$NSP= 1
##$NTH_PI= 0
##$NZP= 0
##$OFFSET= 15.70392
##$PC= 1
##$PHC0= -8873.231
##$PHC1= 15.60006
##$PH_mod= 1
##$PKNL= yes
##$PPARMOD= 0
##$PSCAL= 0
##$PSIGN= 0
##$REVERSE= no
##$SF= 200.130013532006
##$SI= 16384
##$SIGF1= 3
##$SIGF2= 2
##$SINO= 400
##$SIOLD= 16384
##$SREGLST= <1H.CDCl3>
##$SSB= 0
##$STSI= 0
##$STSR= 0
##$SW_p= 3612.71676300578
##$SYMM= 0
##$S_DEV= 0
##$TDeff= 0
##$TDoff= 0
##$TI= <>
##$TILT= no
##$TM1= 0
##$TM2= 0
##$TOPLEV= 0
##$USERP1= <user>
##$USERP2= <user>
##$USERP3= <user>
##$USERP4= <user>
##$USERP5= <user>
##$WDW= 1
##$XDIM= 8192
##$YMAX_p= 0
##$YMIN_p= 0
$$ End of Bruker specific parameters
$$ ---------------------------------
##NTUPLES= NMR FID
##VAR_NAME=  TIME,          FID/REAL,        FID/IMAG
##SYMBOL=    X,             R,               I
##VAR_TYPE=  INDEPENDENT,   DEPENDENT,       DEPENDENT
##VAR_FORM=  AFFN,          ASDF,            ASDF
##VAR_DIM=   8192,          8192,            8192
##UNITS=     SECONDS,       ARBITRARY UNITS, ARBITRARY UNITS
##FACTOR=    0.0002004,     1,               1
##FIRST=     0,             0,               0
##LAST=      1.6414764,     0,               0
##MIN=       0,             -404259,         0
##MAX=       1.6414764,     238513,          0
$$ Real data points
##PAGE= N=1
##DATA TABLE= (X++(R..R)), XYDATA
$$ [...]
2548c152N46L692K162m40j095j27k330l176m79K804K220K90J517J381j858l552
$$ -3152 -2606 1086 3248 2808 1713 1586 -744 -3920 -4399 -1595 625 915 2432 3813 1955 -1597
2564a597j608O56J69J036L089K390r86k205n41m93l155q28L027K871M83J81P83
$$ -1597 -3205 -2549 -2380 -1344 1745 4135 3149 944 403 -90 -3245 -4073 -1046 1825 2308 2489 3272
2581C272k022l827r63J357Q50NK132L199j99l369j860l87j461k97K899L332L76
$$ 3272 1250 -2577 -3540 -2183 -1333 -1328 804 4003 3804 435 -1425 -1812 -3273 -3570 -671 2661 3037
2598C037j194L20o40l589k043J897K412M60R95K150m40l105k245j8m40r44K523
$$ 3037 1843 2163 1523 -2066 -4109 -2212 200 660 1655 3805 3365 260 -1985 -2003 -2443 -3387 -864
2615h64L857R23k348j239o24k142j373J234K676R05M50J978J40l490l155K84J207
$$ -864 2993 3916 1568 329 -295 -2437 -3810 -2576 100 1005 1455 3433 3573 83 -3072 -2788 -1581
2632a581k09J648L310J076j954k274j015j501j186J562L557J359j122n2N96k572
$$ -1581 -1790 -142 3168 4244 2290 16 -999 -2500 -3686 -2124 1433 2792 1670 1618 2214 -358
2648c58k827k29J768N07J493L013Q76k723k956o45J72j107J092L432J660m44j019
$$ -358 -3185 -3414 -1646 -1139 354 3367 4243 1520 -1436 -2081 -1909 -3016 -1924 1508 3168 2724 1705
2665A705m24k053k470J51K487J141P3J963J596k346m006j250P87L33R18L245J886
$$ 1705 1281 -772 -3242 -3091 -604 537 610 2573 4169 1823 -2183 -3433 -2646 -2313 -1395 1850 3736
2682C736j349k128Q4j265k561n58K930L157n4K90P68j433l718j234J336R64N32
$$ 3736 2387 259 343 -922 -3483 -4041 -1111 2046 1992 2282 3050 1617 -2101 -3335 -1999 -1035 -503
2699e03K137K437p61k971j819o8j213l74K798K361j91pK3q40l622j992K100K303
$$ -503 1634 4071 3310 339 -1480 -1548 -2761 -3135 -337 2024 1833 1826 1849 1009 -2613 -4605 -2505 -202
2717b02M36J191K010o06k713j802p8n31l7K204L108O92k086q38l53k529j793J666
$$ -202 234 1425 3435 2829 116 -1686 -1764 -2295 -2332 -128 2980 3672 1586 748 395 -2134 -3927 -2261
2735b261K889N55O88J442j197k792k189M79Q73m00J830K956R80j842k193p13j366
$$ -2261 628 1183 1871 3313 2116 -676 -2865 -2386 -1513 -1913 -83 2873 3853 2011 -182 -895 -2261
2752b261j456J720L324R84n94N51J49k599k716m4J806O43R83K208R88k259k500
$$ -2261 -3717 -1997 1327 2311 1717 2268 2417 -182 -2898 -2942 -1136 -493 490 2698 3686 1427 -1073
2769a073l06m81j217R68L625J484q85q88l11j826k362K17K222J335J37K043P96
$$ -1073 -1379 -1860 -3077 -2109 1516 3000 2115 1227 916 -910 -3272 -3055 -833 502 639 2682 3478
2786C478j869l293m95K80p7Q62K805J933j361k005j79j145j956jK383K118p7L73
$$ 3478 1609 -1684 -2179 -1899 -1976 -1114 1691 3624 2263 258 79 -1066 -3022 -3023 -640 1478 1401 1774
2804A774O85j554l053q53J160N77N40K361J768o97k746p02k81j379l24K411L002
$$ 1774 2459 905 -2148 -3001 -1841 -1264 -724 1637 3405 2708 -38 -740 -1021 -2400 -2724 -313 2689
2821B689m29o98M90j529k703j344J582J756M55J268J765j038k820j609L55l9o21
$$ 2689 2260 1562 2052 523 -2180 -3524 -1942 -186 269 1537 3302 2264 -556 -2165 -1810 -1849 -2470
2838b470K403K941j79j603n77k01k377j333J928K119L93N92J116p52k685j939
$$ -2470 -67 2874 2695 1092 515 314 -2063 -3396 -1468 651 1044 1636 2752 2000 -685 -2624
2854b624N77P18lJ525K399O94k628j264M0j470j322J493L003Q86l72J64j28k592
$$ -2624 -2047 -1329 -1332 193 2592 3286 658 -606 -566 -2036 -3358 -1865 1138 2024 1652 1816 1688 -904
2872i04k399J027J416L55Q98K438M61k031k061k00n46j163J296L155R90j042l83
$$ -904 -3303 -2276 -860 -505 393 2831 3292 1261 -800 -1000 -1546 -2709 -1413 1742 2732 1690 1307
2889A307k55k002k225O13K214R70R4J174P73j754k759o02P39j83P84K895J632
$$ 1307 1052 -950 -3175 -2562 -348 622 716 1890 2663 909 -1850 -2452 -1713 -1896 -1112 1783 3415
2906C415j598j647k13p97j767J15K380J439K70M07M53j639k983n26J654K09J06
$$ 3415 1817 170 -43 -840 -2607 -2492 -112 1327 1597 2004 2457 818 -2165 -2691 -1037 -828 -722
2923g22K350J451j024k535o10l44r51m4K856J753j89p73K62r20k733j034J835
$$ -722 1628 3079 2055 -480 -1090 -1434 -2385 -2429 427 2180 1991 1218 1480 560 -2173 -3207 -1372
2940a372J573L56R11J754j109k797j010L91m59o5K266K343j91j523m73r34k055
$$ -1372 201 557 1468 3222 2113 -684 -1694 -1303 -1762 -1827 439 2782 2591 1068 595 -339 -2394
2957b394p66J646K286J53M66J038n25l144j306M46J016P6J379K506p4k105r12
$$ -2394 -3160 -1514 772 925 1391 2429 1904 -1240 -2546 -2100 -1084 -1008 371 2877 2803 698 -214
2974b14l01j196j255J935K969L07q27j7l41k310j431N03J507J93J057K076Q5k633
$$ -214 -515 -1711 -2966 -1031 1938 2245 1418 1401 1060 -1250 -2681 -2178 -671 -478 579 2655 2740 107
2992A07j871M70l46q09J357K648R74r94k10p18j728k034J293K160N56L4J366P52
$$ 107 -1764 -1294 -1640 -2449 -1092 1556 2530 1536 1326 608 -1120 -3154 -1861 299 855 889 2255 3007
3010C007k480k239k78N39j90J122K586P98j479j280l59j108j553R2K865J407L6
$$ 3007 527 -1712 -1990 -1451 -1641 -519 2067 2865 1386 106 -253 -1361 -2914 -2822 43 1450 1486
3027A486J50L22j695k671K2J534K86O6K287J606j411k215n80l43j041M73K361
$$ 1486 1636 1958 263 -2408 -2386 -852 -566 -500 1787 3393 1982 -233 -813 -1156 -2197 -1724 637
3044F37J583n74o00P62j728k542n61J929J186J09J236J384j284k425n92R7p68
$$ 637 2220 1646 1046 1808 80 -2462 -3023 -1094 92 201 1437 2821 1537 -888 -1480 -1383 -2151
3061b151K05K369K483n34j230o97p44j617o11J689J808K1O47R94p05k985j290
$$ -2151 -1946 423 2906 2372 1142 445 -299 -1916 -2527 -838 970 991 1638 2632 1927 -1058 -2348
3078b348Q85M82k67J568K164K0k045o57q51j391l55J913K621k65k83N13n79j774
$$ -2348 -1463 -981 -1248 320 2484 2504 459 -198 -1049 -2440 -2795 -882 1739 1474 1191 1704 1125 -649
3096f49k010N89J559J47J469J650l10k241j334K49l65j075J350K737L57q12n66
$$ -649 -2659 -2070 -511 -364 1105 2755 2445 204 -1130 -881 -1246 -2321 -971 1766 2123 1311 745
3113G45j79k065j398R73J757K85J81J829M55k384k163P2M71L53P56K521K81j409
$$ 745 566 -1499 -2897 -1924 -167 118 299 2128 2583 199 -1964 -1892 -1421 -1068 -312 2209 2490 1081
3131A081p19Qj195k007Q48K358R73P2k40M98j492k204l6Q77J1P04K106J136j351
$$ 1081 362 370 -825 -2832 -1984 374 1347 1419 1179 1677 185 -2019 -2055 -1178 -1167 -463 1643 2779 1428
3150A428k178k76M1r37l0K401J136j44j44K59j429k469j89J887R99J01J079Q96
$$ 1428 -750 -1026 -985 -1922 -1952 449 1585 1441 1297 1556 127 -2342 -2531 -644 355 456 1535 2431
3168B431j273j667q62l2q15Q02J991J755l56j541k9p73j771m14J864J390L60L38
$$ 2431 1158 -509 -1371 -1403 -2218 -1416 575 2330 1974 433 404 -369 -2140 -2554 -690 700 1060 1398
3186A398J041j258k377p99R14K09k9J647J795j90j797p21m76j368m28J788K264
$$ 1398 2439 1181 -1196 -1995 -1081 -872 -901 746 2541 2351 554 -167 -643 -2011 -2439 -651 1613
3203A613m22k24L42m18k132j545J052J533j14J189J161j17j707j169L7k74p42
$$ 1613 1191 967 1309 891 -1241 -2786 -1734 -201 -315 874 2035 1918 211 -958 -921 -1195 -1937
3220a937J330K343M53r80k81o32j379j381J187J554K88K03J379J9k475j523L22
$$ -1937 -607 1736 2189 1209 928 296 -1083 -2464 -1277 277 565 768 2147 2166 -309 -1832 -1510
3237a510N49k78N68K244M99j314j069Q2p96j454J072K100N88l89O40P2j767k016
$$ -1510 -961 -1239 -671 1573 2072 758 -311 -229 -1025 -2479 -1407 693 1281 892 1532 1604 -163 -2179
3255b179M78J040r5Q03K056O81j976j463q5m35q74K49K192J142j78n25n2j296
$$ -2179 -1701 -661 -756 47 2103 2784 808 -655 -740 -1175 -2049 -1800 392 1534 1356 831 779 -517
3273e17j891L15J786M95J61J117R84j508j869k31l1l58M69K251J225r28j045p
$$ -517 -2408 -2093 -307 188 349 1466 2450 942 -927 -1158 -1189 -1547 -1078 1173 2398 1470 425 418
3291D18r89j382k98K021J047N0K35N85j031k375j40P79K99j2J602J264l69j456
$$ 418 -571 -1953 -2251 -230 817 867 1102 1687 656 -1719 -1859 -1080 -781 -793 809 2073 1704 248
3309B48o27j22j182k74J781J585j52q2J74p42j913m92R82N75L36P30J298n28j608
$$ 248 -379 -501 -1683 -1957 -176 1409 1257 1175 1349 607 -1306 -1798 -816 -241 95 825 2123 1595 -13
3328a3j334J54m83l14J795J829N0j004k55k17j573j062J044J830J54L60J189l97
$$ -13 -1347 -1193 -1676 -1990 -195 1634 1684 680 425 208 -1365 -2427 -1383 447 601 961 2150 1753
3346A753k147j358P72J10K46O69K046r1j296m35m32j145j108J083K063M32k72
$$ 1753 -394 -1752 -980 -870 -624 45 2091 2000 704 269 -163 -1308 -2416 -1333 730 1162 890
3363H90L82k9j745j345K29P29N47L96J674O24j615j329K1l04j013Q75K119N94
$$ 890 1272 1243 -502 -1847 -1618 -889 -342 54 1728 2352 737 -592 -571 -875 -1888 -1013 1106 1700
3381A700k76l15k16j179j751M03J224O34K15R06O66j340j700m73K01j72N87K030
$$ 1700 1424 1109 893 -286 -2037 -1634 -410 224 439 1345 2011 671 -1029 -1502 -1301 -1473 -886 1144
3399A144Q37r25o75M3j005j244J31J375J294j23M68M48j297j710j69N07L42JJ551
$$ 1144 1981 1056 381 424 -581 -1825 -1694 -319 975 852 1320 1768 471 -1239 -1408 -901 -559 -558 993
3418I93J282j041j215n56j01r38l74J896J318j94j52L20p99k109k13Q49J027J27
$$ 993 2275 1234 19 -537 -638 -1576 -1950 -54 1264 1070 918 1238 439 -1670 -1883 -1034 -7 120
3436A20J107R30q88j407p26L80p01j77J317J764r3r03j36k71j259r04O65J258
$$ 120 1227 2157 1269 -138 -864 -484 -1185 -1362 -45 1719 1626 723 587 316 -943 -1847 -1182 76
3454G6K29M15R58l65j684j149P96k23p6R71J615L53j278p35j39q38q26J198J592
$$ 76 305 720 1678 1313 -371 -1520 -724 -947 -1023 -52 1563 1916 638 -97 -236 -1074 -1900 -702 890
3473H90K15m90O54k93j411j076K60Q14J87L30J319L81j523m96j72o51p47R48J797
$$ 890 1105 615 1269 976 -435 -1511 -1251 -437 -250 80 1399 1780 257 -239 -411 -1062 -1809 -861 936
3492I36P83j072J69k02j303j151M29J229K30L72J206N1j118j545L1J28l73L69
$$ 936 1719 647 816 614 -689 -1840 -1411 -182 48 420 1626 1677 559 -986 -955 -827 -1200 -831
3510h31J894P43q18p06l03p12j234N35J532O63k91M14N95j293j455l8O15JK05
$$ -831 1063 1806 988 282 -21 -733 -1967 -1432 100 763 472 886 1481 188 -1267 -1305 -690 -689 -484
3529d84J613Q03j112q67Ql37j419O45J683O23Jl38J59q21j520m04Q26P95N9J084
$$ -484 1129 1932 820 -47 -39 -376 -1795 -1150 533 1156 1157 819 978 157 -1363 -1767 -941 -146 -87 997
3549I97P63r20j122p18O8l43k7J404J460k67o47l11K0j801m97J487R56P1J60Q11
$$ 997 1760 840 -282 -1000 -932 -1275 -1302 102 1562 1295 648 337 357 -1444 -1941 -454 502 573 733 1544
3569A544n28j666j035P56K55j23P48J573j06q50m89l32q52n73R33J496K35k66
$$ 1544 1016 -650 -1685 -929 -674 -797 -49 1524 1418 568 79 -253 -1105 -1678 -745 751 986 720
3587G20K91j35j673p83L84N35K60J000J001j14j077j012p7j64n53J027J256M31
$$ 720 1011 876 -797 -1580 -1196 -661 -401 599 1600 1486 409 -603 -680 -844 -1397 -370 886 1317
3605A317n08k09n2j254j090O86J101J05N73Q85j51j210j353L3K54l78P65J185
$$ 1317 809 600 548 -706 -1796 -1110 -9 96 669 1554 1403 193 -1160 -1127 -873 -1251 -486 699
3623F99J109r96n32j74o97j120Q83J086N69q0K38L97j362j375J9N03K16K60J304
$$ 699 1808 812 280 106 -591 -1711 -828 258 827 747 985 1382 20 -1355 -1336 -833 -617 -357 947
3642I47P64j175p38l11l62p61M55J855O30l69p5j79n22j625L2J042L74J01J165
$$ 947 1711 536 -202 -513 -875 -1636 -1181 674 1304 935 860 681 159 -1466 -1434 -392 -18 83 1248
3661A248O16j253j023j48J2p73N80R12J543m01j093kj94j374j21R33J234l45N44
$$ 1248 1864 611 -412 -560 -548 -1321 -741 171 1714 1313 220 218 24 -1350 -1471 -538 696 351 895
3680H95P44j012j410m42L82K26L25P18J282o41m00p64l62n53m91J273J022L78
$$ 895 1639 627 -783 -1225 -843 -617 -292 426 1708 1067 667 -97 -459 -1012 -1503 -230 792 1170
3698A170k95J30m94j277q37P13N49m8R11Q42o3j518n24K82k52q96J398J308K91
$$ 1170 875 1005 511 -766 -1603 -890 -341 -389 522 1364 1301 -217 -741 -459 -711 -1607 -209 1099 1390
3717A390n68J21n43j370p29Q63J123k55L35J066j61j143r80o3J86m1P84J133K83
$$ 1390 822 943 400 -970 -1699 -836 287 32 367 1433 1272 129 -851 -914 -728 -769 15 1148 1431
3736A431q21k91k44j042p02Q18J257M29j78K70K63j361r47K19M32M2L44J133R00
$$ 1431 610 319 75 -967 -1669 -851 406 835 657 927 1190 -171 -1118 -899 -467 -425 -81 1052 1952
3755A952j208r53l89J35p24K03J359Q07n88K28j95r31j300O6R16M98L21P93O31
$$ 1952 744 -209 -598 -463 -1187 -984 375 1182 594 822 627 -304 -1604 -1538 -622 -124 197 990 1621
3774A621r39j273m04O22q46N43J481R51p99n84j8o29j198J92R04R44k12N43N18
$$ 1621 682 -591 -995 -373 -1219 -676 805 1756 957 373 355 -274 -1472 -1280 -376 568 356 899 1417
3793A417q32j300m24L74n6J21J288O17j08j055k42j68j096Q5J228J112k32m8L28
$$ 1417 585 -715 -1139 -765 -821 -700 588 1205 1097 42 -200 -368 -1464 -1379 -151 961 729 681 1009
3812A009l68j491l14K82O59J70K42J081l13p80p14J64n38l68J338R32J90n67m27
$$ 1009 641 -850 -1164 -882 -223 -53 189 1270 957 177 -537 -373 -911 -1279 59 991 1181 614 187
3831A87Mj315k30N10Q10K27K46Q10j05j631n29N23k07K0P69J237L4q72k24l23
$$ 187 191 -1124 -1354 -844 -34 193 439 1249 1144 -487 -1016 -493 -700 -680 89 1326 1360 488 264 -59
3851e9q69p10P25J400K9j35L51J62j325q64N26K44J44L87J004N11j352p36L20
$$ -59 -928 -1638 -913 487 516 381 732 894 -431 -1295 -769 -525 -381 6 1010 1521 169 -567 -247
3870b47m14m94L23J246O90k96m1p5j107r24J55J000M96l82J017M18q50j244k79
$$ -247 -661 -1155 -832 414 1104 808 767 692 -415 -1339 -1184 -184 312 -70 947 1365 515 -729 -1008
3889a008P2j65M14J655L74o08k21l15o05p58r4Q85O50L92M04Q3r86j089J88L18
$$ -1008 -936 -1101 -687 968 1342 734 513 198 -407 -1165 -1259 -374 276 668 1072 1155 169 -920 -732 -414
3909d14K25k95R58J277m87j421k31j46o34J6J143R60l22OL70n36j700j55Q79N09
$$ -414 -189 -484 474 1751 1264 -157 -388 -534 -1168 -1152 -9 951 629 635 1005 469 -1231 -1386 -507 2
3929Bk24R33O68l18j139k63k82r5m6O15J312k30m06j17k37j067l48N07Q91J8M85
$$ 2 -222 711 1379 1061 -78 -341 -623 -718 -764 -149 1163 933 527 410 173 -894 -1242 -735 156 174 659
3950F59P30m24j529q19O29J32J07M90J071L41j172Ok85r03o67J147J253kk21K76
$$ 659 1389 965 -564 -1383 -754 -622 -515 -25 1046 1387 215 221 -64 -967 -1634 -487 766 764 543 819
3970H19J57j334n84P4P35k57N11J406j24j177p36J08o54l11N89R91R11n53J31
$$ 819 976 -358 -942 -868 -133 -390 121 1527 1403 226 -510 -402 -1056 -1367 -778 213 1124 571 702
3989G02k39j118p23M83Q60r0M61P59L44j211r12k6L5k35P48R23N71j169j8L55
$$ 702 463 -655 -1378 -895 -35 -125 336 1095 1439 228 -684 -710 -675 -910 -162 761 1332 163 145 500
4009E00r74o38l34J542N08k01O10j6o36j349J09M32l1K68J057O85n81j025k15
$$ 500 -474 -1112 -1446 96 604 403 1013 997 361 -988 -879 -447 -478 -210 847 1532 951 -74 -289
4028b89j04o51J75J090Q63m90K54K46p69j407m44J046K96J26M95R24n52j012k92
$$ -289 -393 -1044 -869 221 1084 594 848 1094 325 -1082 -1526 -480 -184 -58 437 1361 809 -203 -495
4047d95k72n83J77J475J009n58m79K40m01j077m85P35Q16J46Q02N70j001r06p52
$$ -495 -767 -1350 -1173 302 1311 753 274 514 113 -964 -1449 -714 102 248 1050 1620 619 -287 -1039
4066a039M64J26o72J457J021k10o81n66M3r43o09J375R54l46J41M89k03j193p29
$$ -1039 -575 -449 -1121 336 1357 1147 466 -100 -57 -1000 -1609 -234 720 374 515 1004 801 -392 -1121
4085a121L78P23l28Q52R16j63j173l88j87k28o28P56J271M14k64j25l50j011n22
$$ -1121 -743 -20 -348 504 1420 1257 84 -304 -491 -719 -1347 -591 680 1094 830 705 355 -656 -1178
4104a178M12Q30o1M28N84K83j113q65K23k44n04O21J356M99n94k46m9n97j109
$$ -1178 -766 64 3 431 1015 1298 185 -680 -457 -701 -1205 -584 772 1271 677 431 382 -215 -1324
4123a324M46J150M24l04N83l1r98j009L38J56K94j42J125P24r81o35J6l73q73
$$ -1324 -878 272 696 392 975 944 -54 -1063 -725 -569 -275 -417 708 1432 451 -184 -168 -541 -1414
4142a414K93J459M07j00K3K85p95j088j20P79L69q5R02Q38j105j035q8Oq60N82
$$ -1414 -1121 338 745 645 668 953 158 -930 -1050 -271 98 13 915 1753 648 -387 -475 -469 -1329 -747
4162g47J161R34l88o87K87o03j070k30P83Q83J3L40N09p33j285k07M91p8J11N33
$$ -747 414 1348 960 273 560 -43 -1113 -1343 -560 323 336 676 1185 452 -833 -1040 -549 -627 -516 17
4182A7J447k07j024L4m33r15j5O03J095K2N2M20n27j212o25P13J42O2O59R22j00
$$ 17 1464 1257 233 267 -166 -1081 -1096 -493 602 624 676 1096 569 -643 -1268 -555 -413 -351 308 1230 1130
4203A130j199k74n7l13m16R34J058k17j79K13l17r14q03O97P23j34M53P56K1q10
$$ 1130 -69 -343 -400 -713 -1129 -195 863 646 467 680 363 -551 -1354 -657 66 -68 385 1141 1162 352
4223C52j219K31Q0n44P38J199J96m52k64m80l96j019O46J129R3r0N58K53j146
$$ 352 -867 -636 -556 -1100 -362 837 1033 581 317 -163 -559 -1578 -932 197 290 200 758 1011 -135
4242a35o80o4K98M0N76J072J97j025n83N21o12q01K78J462M73m46k09L74j047
$$ -135 -815 -879 -581 -541 35 1107 1304 279 -304 217 -395 -1196 -918 544 1017 571 362 736 -311
4261c11p64p6R23j26O9J014O26q40r87k43j9k43Q2J169O99k63m92J1j43r07l82
$$ -311 -1075 -1151 -228 -354 -285 729 1355 515 -472 -715 -734 -977 -895 274 973 710 218 229 86 -821 -1203
4282a203J061N87q6M30N05q23r57m36O37m49N3J187N34m70n24k23R7j185j17J298
$$ -1203 -142 445 359 789 1294 471 -486 -922 -285 -734 -681 506 1040 570 46 -177 -80 -1265 -1382 -84
4302h4Q28l9k78N96n99j313j49N93L36l6N84R81l78r56l39p8p02P2J032R47j76
$$ -84 744 705 427 1023 424 -889 -1038 -445 -109 -145 439 1420 1042 86 -253 -331 -1033 -961 71 1018 842
4323H42n81J63k73o72j123J366M35K0J22R63l96q64q01L07Jl26R26J106j97p33
$$ 842 261 424 151 -521 -1644 -278 157 177 299 1262 866 2 -799 -492 -491 -817 109 1215 1018 285
4343B85Q3k46o42n81M62Q67L98r3Q33n69q25j133L06M90k73N78J077L91q45n74
$$ 285 368 122 -520 -1101 -639 228 626 533 1366 797 -28 -1161 -855 -365 -638 -60 1017 1408 563 -11
4363a1j58n98o30M55J390O18o09K56L28j044j118J98P50R0J96J005J78p70r78
$$ -11 -169 -767 -1397 -942 448 1066 457 713 1041 -3 -1121 -923 -173 -83 113 1118 1296 526 -452
4382d52J02k15n71L14J067R88n15l76L6m46j442K93J184K89k00P35M34q55j087
$$ -452 -350 -565 -1136 -822 245 1233 718 342 378 -68 -1510 -1217 -33 256 56 791 1225 370 -717
4401g17j07M43k73J61J161Q45o52q57J59m73q46J8J188P42k98Q6M43n68j358n7
$$ -717 -824 -381 -654 -493 668 1513 861 4 163 -310 -1156 -1138 50 792 494 580 1023 455 -903 -960
4421i60L62K01J85Q96O54m96p92m35J14m89m16J049J261j50n21L11j87j300n85
$$ -960 -598 -397 -212 684 1338 842 50 -385 -271 -760 -1176 -127 1134 984 463 774 587 -713 -1298
4440a298R67N82l13M06J025n90j261l13L29j93l29Q28R89K73r85M1K6j073l72
$$ -1298 -331 251 -62 344 1369 779 -482 -795 -466 -659 -988 -160 829 1102 117 158 184 -889 -1261
4459a261N54R09L81k05O80L38j552j051O89L70l68N19J073N67j407n36J00m81
$$ -1261 -707 202 583 378 1058 1396 -156 -1207 -518 -148 -516 3 1076 1643 236 -300 -200 -681
4477f81n24L68J433J69k86J31n8q45p63L31M39Q9M57N19M78q95p62J77k53m00
$$ -681 -1205 -837 596 765 479 610 552 -293 -1056 -725 -286 -197 260 779 1257 362 -400 -223 -476 -876
4497h76N34R49M18l77l13J66r99q66L06J103L13p4M13M01q81p67l07K84k64P9
$$ -876 -342 607 1025 648 335 501 -498 -1364 -1058 45 358 284 697 1098 217 -550 -857 -573 -837 -758
4517g58J264P49p80m05j67k8j053K21J165O75o32N23L72q32r09m91O12j61L66
$$ -758 506 1255 475 70 -97 -125 -1178 -957 208 883 251 774 1146 314 -595 -1086 -474 -635 -269
4536b69P18Q90p94q40l31M18q89j03J254P63q4o13O00p93q84J4M40Q11l64N52
$$ -269 449 1339 545 -295 -626 -208 -1097 -1200 54 817 733 120 720 -73 -957 -943 -503 308 -56 496
4556D96O10o02m95p98L23M2o22J191R41O4r19J42l68n93p75Q44Q44J6J19L40J30
$$ 496 1106 504 9 -789 -466 -424 -1046 145 1086 1150 231 373 5 -588 -1363 -519 325 341 460 800 930
4577I30j255o01j10O28r1M44J157J25j010n87L36l66o88Q84Q72l3k13L37j2r08
$$ 930 -325 -926 -1036 -408 -499 -55 1102 1227 217 -370 -34 -400 -1088 -204 668 635 422 759 747 -161
4597a61j164N54O98J24J33Q28J74j177q69L37J50p84N43J309R5m24m4J16p50q39
$$ -161 -1325 -771 -73 51 184 1012 1186 9 -860 -523 -373 -1157 -614 695 790 366 322 438 -312 -1151
4617a151M19R24Q7oO76L85j269q04M6N22k57K3J184N89r16o60K34o28n80lJ318
$$ -1151 -732 192 279 273 949 1334 65 -739 -693 -171 -428 -405 779 1368 452 -208 26 -602 -1182 -1185 133
4638A33N36k40j96N35m66j372P0Q15j59O2Q56Q80q52p99k57K43o40p8J397M61
$$ 133 669 429 233 768 302 -1070 -1000 -185 -344 -282 574 1454 602 -197 -454 -211 -851 -929 468 929
4658I29l1n02L9m77p72l36Q45K6L68L66M90k66j104o23O21l44k3R68Q71m2q77
$$ 929 898 396 435 -42 -814 -1150 -305 -279 89 455 945 679 -425 -1048 -427 -771 -794 174 1045 1003 126
4679A26J30j21j063k52P21J130k61Q7N49l17j144n66J30N04j23P49Q15k0j172
$$ 126 256 135 -928 -1180 -459 671 410 497 1046 729 -415 -981 -851 -347 -470 279 1094 1074 -98
4698i8l85K46n79l60P16R38L03l10J3o5o65j211P77O72M8J25O50M99j188n56k91
$$ -98 -483 -237 -816 -1176 -460 478 781 471 484 419 -246 -1457 -680 -8 40 165 815 1314 126 -430 -721
4719g21L19o66O21J367r9n34J79k20o94j110Q78N90N60k99M52K22q30q50J87K90
$$ -721 -402 -1068 -447 920 821 287 466 246 -448 -1558 -680 -90 470 171 623 845 15 -835 -648 -358
4739c58m72M44J077M49p53k35n6j67j188N48R87L99k84L69J23o87j189L26O33
$$ -358 -830 -386 691 1140 387 152 96 -71 -1259 -711 276 675 391 760 883 196 -993 -667 -34
4758c4k31R5O88P18q58r27l4N1n49PJ296Q43n44q5J0l85r73j13P99K97J28L15
$$ -34 -265 -170 518 1236 378 -549 -583 -532 -1081 -1074 222 1065 521 436 446 61 -912 -1025 -226 71 199 514
4780E14P03n29j003k62L66n87K15O94Q03l21k91k46k56q18k02J070M81m1j20N24
$$ 514 1217 688 -315 -577 -211 -798 -583 111 914 593 302 56 -200 -1018 -1220 -150 331 290 170 694
4800F94k10q27m53K71L02m55R81O42p2p06m22L16m98o50Q67P47K17m67Q9K28j080
$$ 694 484 -343 -796 -525 -223 -678 303 945 873 167 -255 61 -437 -1087 -220 527 744 277 366 594 -486
4821d86p10M99M75NM95Q07O8j251m74L54l76l02N46J146J32m55R8q8r00o97N12
$$ -486 -1196 -697 -222 -217 278 1085 1153 -98 -572 -218 -594 -896 -350 796 928 473 571 483 -417 -1114 -602
4842f02Q09p2J64N38P5n87j180L30P5j84M02P04O50p32o04M13m07r23L33R57N39
$$ -602 207 135 299 837 912 325 -855 -525 -450 -634 -232 472 1122 390 -214 199 -208 -1131 -798 159 698
4863F98k25K24K5o81q71K55N34j03P7Q95K73p67p19K43K0m76k56J145J74qk50
$$ 698 473 697 722 41 -830 -575 -41 -144 -67 828 1101 334 -385 -142 -122 -598 -854 291 465 457 207
4884B07J30k81j106K77M07L74Q8M12M13j50j339J68J79n43K19P22Q24k95k71l69
$$ 207 337 56 -1050 -773 -366 8 96 508 921 771 -568 -400 -221 -764 -545 177 1001 706 435 66
4904F6l2r23k18Q82O99k81K59L58m12p44n65M81o6J1O55Q88k34r13J35j86m22
$$ 66 34 -889 -1107 -225 474 193 452 810 398 -346 -911 -430 -496 -485 170 1058 824 -89 46 -140 -562
4925e62l87Q14Q70n3l50L16j73j201k5M50M32l31N55P44k85o58l54o7j61l95N03
$$ -562 -949 -135 735 682 332 648 475 -726 -751 -301 131 -200 355 1099 814 156 -198 -265 -426 -821 -318
4946c18J157k59n25L08k78m84p82N96M98K31J79N68l6j032o81M06K97k72R1J416
$$ -318 839 580 55 363 85 -399 -1181 -585 -87 144 323 891 855 -177 -858 -452 -155 -427 -336 1080
4966A080k6o24n33j80j69n53Q0J169J37j95K14L52q81p01k6N29JL96Q49N0n65
$$ 1080 1054 430 -103 -283 -452 -1005 -925 244 381 186 400 752 -129 -830 -856 -327 -326 70 919 969 404
4987D04q16L95n23l33L09R72O60o25l0K48r14q17K1P18M14k9M20K18l07q39nK12
$$ 404 -412 -17 -540 -873 -564 408 1068 443 413 661 -253 -1070 -1049 -331 83 54 474 692 385 -454 -459 -247
5009b47l05q6R73M86j49l77j59l63o79J7Q56K61N2M9O68l87j083j68M51o9J06
$$ -247 -552 -638 335 821 672 295 136 -227 -906 -889 -33 228 280 329 997 610 -473 -641 -190 -259 -153
5030a53O24M10O3j211N8m5o32l19R13O22J98k16K31j90q81n49O09M11L8K82O29
$$ -153 471 881 944 -267 -209 -254 -886 -1205 -292 330 528 312 543 353 -528 -1077 -468 -57 -19 263 892
5051H92j04p75m40j52L9l11Q60R40j94n55J38r2r20m58N33P78j24L2P12L3r94
$$ 892 788 13 -427 -579 -540 -851 9 949 755 200 338 246 -674 -1132 -599 179 55 87 799 832 -162
5072a62p83N7M60j25M49P84K19q59J6Q2o82m77L18R97J28R7J92N2p47j007K76
$$ -162 -945 -888 -428 -553 -104 680 899 40 56 138 -544 -1021 -703 294 422 519 711 763 16 -991 -715
5093g15O60j6R1Q75J04o15p90K02j33n53L11Q47M44k98j95J17l29r27K14M91K66
$$ -715 -55 -71 20 895 999 384 -406 -204 -337 -890 -579 268 712 414 219 336 7 -920 -706 -215 51
5114E1L10L37L33o42q50j1K42m94K00Q15N06k03l82j64o8q07n1N52O43j34J63
$$ 51 361 698 1031 389 -461 -472 -230 -724 -524 291 797 594 212 48 -20 -827 -878 -326 317 183 346
5135C46M17l79r72k04M73J45j13N38P51l12p28L1j57o02M2P85O65j79k59L71j73
$$ 346 763 384 -588 -792 -319 -174 -287 251 1002 690 -38 -7 -164 -766 -724 61 726 547 288 659 486
5156D86j057l25K92P48o0K18N40j27j017k67J39j44k47Q27O70o5m45J43m8n24
$$ 486 -571 -896 -604 144 84 302 842 715 -302 -569 -430 -574 -821 6 676 611 166 309 261 -263
5176b63n66L32N34K35K61J33o6r31k55J64j1l7N16O29J01l85m92o8l35m94M69
$$ -263 -829 -497 37 272 533 666 600 -331 -586 -422 -433 -470 46 675 776 391 -101 -169 -504 -998 -529
5197e29N80K86q7K80j11p59m42K89L56j3L32N75J58q58l58N2j89l32L16Q57K99
$$ -529 51 337 250 530 419 -340 -782 -493 -137 -150 182 757 915 57 -301 -249 -438 -770 -454 403 702
5218G02l58J16j1p47n23N4Q63k64P9N14M52l88r34J87J88n43J38R68K23m11k59
$$ 702 344 460 449 -298 -821 -767 96 -168 -89 425 877 489 -445 -258 -70 -613 -475 493 716 305 46
5239D6L12n62o93L83Q41j34j4M18N7o35o14j6K43K8l5P05M80l35o81j34Q5m14
$$ 46 358 -204 -897 -514 327 193 179 597 654 19 -595 -611 -368 -340 -375 330 810 475 -206 -340 -255 -669
5261f69N8O30M55n1l13M46k65j196qN22N25k43M03Q84l97q07n51J33r2j93Q55
$$ -669 -611 19 474 423 110 556 291 -905 -913 -391 134 -109 294 1178 781 -26 -577 -444 -536 -729 126
5282A26O83l15j11j49k23n94m86P07M80J09k48Q63N5j122m45K69P8l44O15R94
$$ 126 809 494 383 234 11 -583 -1069 -362 118 227 -21 842 897 -225 -670 -401 -323 -667 -52 942
5302I42j61p58j73J88m50m36L76R24l26J45L04k49o39o67O52J24J94j42Q24M7
$$ 942 781 23 -150 38 -412 -848 -472 452 126 271 575 326 -313 -980 -328 -204 -10 -152 672 719
5322G19o52p3m70J05o71O25J182Q5m75n8J31q25n90K98O82J64Q4L64J48o77o72
$$ 719 67 -6 -476 -371 -1042 -417 765 850 375 317 448 -377 -967 -669 13 177 261 625 773 96 -576
5343e76Q2J7k56m4J216N11l33p28j4k06p00J85O15M30j17M21R6k26j034J6Q6J07
$$ -576 -494 -477 -733 -777 439 950 617 -111 -125 -331 -1031 -846 -231 199 82 503 599 373 -661 -645 -559 -452
5365d52K51O01N23k76o61k48j72j48n0O82M17ml85O72m33p33n25M81L33r2M52
$$ -452 -201 400 923 647 -14 -262 -434 -582 -632 50 467 463 78 750 317 -416 -941 -460 -127 -219 233
5386B33M73l44m92j76L2j00PM83P25k87m34M14n39p51r4O96J88K43k80P99l41
$$ 233 706 362 -130 -306 -274 -374 -367 116 841 554 120 534 -5 -756 -850 -154 34 277 -3 796 455
5407D55r16l93M74K25l05L11O61J70n13j97p7l99l10M49P62J58j2p0K40r04n70
$$ 455 -461 -854 -380 -155 -460 -149 512 682 169 -28 -105 -504 -814 -365 397 555 543 473 713 -191 -761
5428g61J69M52k05K80R62q2p37l99M05p62lJ87J049pm19J86j30m35p12L21L73
$$ -761 -592 -140 -345 -65 897 815 78 -321 84 -678 -681 -494 555 548 129 315 185 -250 -962 -641 -268
5449b68M22k04O44j6k16p56mn1j60L7J158N72p67l08J86j43r08J25Q82J41j53
$$ -268 154 -50 594 578 362 -394 -398 -449 -609 -572 586 1158 391 83 269 126 -782 -657 225 366 213
5470B13L12L8m65o95K2L09k5p4P91N62n79k71j01j31p65j1R63L40j45p6L70k69
$$ 213 525 563 98 -597 -575 -266 -291 -365 426 988 409 138 37 -94 -859 -870 93 433 288 212 582 313
5492C13p57l04R12k04O7L44O04n25p18k05j53J05j10N89Q60n49J3j21m65j4m61
$$ 313 -444 -748 164 -40 27 371 975 450 -268 -473 -626 -521 -631 -42 818 269 282 161 -304 -318 -779
5513g79Q02M61l30l2Q39o68l26l25J3K5r3L78Q06P6o04o4l14l32m40O52O88j11
$$ -779 23 484 154 122 961 293 -33 -358 -345 -320 -413 -35 771 847 243 179 -135 -467 -907 -255 433 322
5535C22k11L15p9p72l08J62J76K41J08P35j4n45m27Kk24k03M18M98L24j87j09
$$ 322 111 426 347 -425 -733 -571 -395 -154 -46 689 675 130 -297 -295 -519 -722 -304 194 518 331 222
5556B22p0l52o15L70L57J15r6P02n9m28p72M70k05k95M10O08L27n30l05N02n77
$$ 222 152 -200 -815 -445 -88 27 -69 633 574 146 -626 -156 -361 -656 -246 362 689 159 -146 356 -221
5577b21o47K60O70K34j07K79O9n10n59q6K89q5J36R18N1k31n86J99m72m30K7J073
$$ -221 -868 -608 62 296 189 468 537 27 -532 -618 -329 -414 -278 640 691 460 -126 73 -399 -829 -802 271
5599B71M17m20k07L58l23q68L53K94L44l31L66O39o43m35l00K34k22J34M60Q13
$$ 271 688 268 61 419 96 -772 -419 -125 219 -112 254 893 250 -185 -485 -251 -473 -339 121 934
5619I34n94l37L32l74n01j44K69Q28n93O52M08p88l55l26O5m5M45K44O70n02k75
$$ 934 340 3 335 -39 -540 -684 -415 413 -180 472 880 92 -263 -589 -524 -569 -124 120 790 288 13
5640A3K37j24p83j98O61O76j35j40N44m69l89n19M06O2j76M40P47r0q46r0k21
$$ 13 250 126 -657 -855 -194 482 347 207 751 282 -107 -626 -220 -158 -334 106 853 763 -83 -173 -394
5661c94K89l58L11O45Jl99j77L73n22q14M95N77J17O9N09J1n79m71r7L74o98L34
$$ -394 -105 -463 -152 493 494 95 -82 291 -231 -1045 -550 27 144 213 722 733 154 -317 -414 -40 -738 -404
5683d04P91K38l88q4p9J43r02NP80j00L12K86J23q06o39K47M13j02k07Q23M33
$$ -404 387 625 237 153 74 217 -685 -680 100 0 312 598 721 -85 -724 -477 -64 -166 -373 450 883
5704H83p16M0j36l42m89M83M36L25k83K15P9l34r62K21L26O2K05J38O31k55j061
$$ 883 167 207 71 -271 -760 -277 159 484 201 416 495 161 -801 -580 -254 -192 13 151 782 527 -534
5725e34K24R5l52R5P22L84k22k20J18k5p60j94P39O4j32M21M42m47p46l6L2K02
$$ -534 -310 -215 -567 -472 250 634 412 192 310 285 -475 -669 70 134 2 423 865 418 -328 -364 -332 -130
5747a30j40M04N11k31n68R1J82p15k74O37O08k31k0O4Q2p29k23M76L93m27M03
$$ -130 -270 134 645 414 -154 -63 119 -596 -870 -233 375 144 124 188 270 -459 -682 -206 187 -240 163
5768A63P77l13o45k01L15k16m91L16O36j7l84L53K4o55m59K44L48K54M7O95l18
$$ 163 940 627 -18 -219 96 -120 -611 -295 341 324 -60 293 317 -338 -797 -553 -205 49 96 791 473
5789D73o76k36K92j07k27M77K67L48j71j63Lp22m60P35J91K37k95N31q2l49n16
$$ 473 -203 -439 -147 -254 -481 -4 263 611 440 277 280 -442 -902 -167 24 261 -34 497 415 66 -450
5810d50n1K96r6K70N53J39l71k74J27m51m88K46M93N84n33L54L97p61n24K95L99
$$ -450 -501 -205 -301 -31 522 661 290 16 143 -308 -796 -550 -57 527 -6 348 745 -16 -540 -245 154
5831A54j23k50M85L30k39n81o4J39o13L29N24M58l18j47Q4l17o17l7P41J31l08
$$ 154 31 -219 266 596 357 -224 -288 -149 -762 -433 91 549 231 84 168 -149 -766 -803 -62 69 -239
5852b39L26N67k84p11p8K40j34p9Q12L52k12k48q1l6n83m10Q15L73j36J70l9j46
$$ -239 87 654 370 -341 -419 -179 -313 -392 420 772 560 312 231 195 -388 -798 17 390 254 424 385 239
5874B39n89q6L7J99j07L87L57Q7n24p2Q9q0q40R97M07l60J94j52J29o49l45K45
$$ 239 -350 -436 -399 -200 -307 80 437 524 0 -72 17 -63 -903 94 501 141 335 183 312 -337 -682 -437
5896d37M77L41j70M94M5o50n09J83j04m2K25N40Ll48J2k32j58k14p6R55r9k51
$$ -437 40 381 211 705 750 100 -409 -226 -330 -372 -147 393 396 48 60 -172 -330 -544 -620 335 236 -15
5918a5M80O0n79m28K89J54k48J03Q53L02q28m81K95L5r04O38L99L11k45j16P9
$$ -15 465 525 -54 -482 -193 -39 -287 -184 669 971 143 -338 -43 -8 -912 -274 125 436 191 75 154
5939A54r4p50N6O44m20K17N78M44p37m32J5M25l72j36N71N96l80j58L23n57n75
$$ 154 60 -690 -634 10 -410 -193 385 829 92 -340 -325 100 -272 -408 163 759 379 221 544 -13 -588
5960e88o0Q78j75j17N99N80p89p26J74l06K01pL23P46o90o4pK40q68J77N04J04
$$ -588 -648 230 55 -62 537 1117 328 -398 -224 -530 -329 -336 -13 733 43 -21 -28 212 -656 -479 25 129
5982A29J59J52M65o06m86l63M2O32m80O28O41o97r9m33L50p80L94J84P29l67n2
$$ 129 288 440 905 299 -187 -550 -508 124 -356 272 913 216 117 -316 34 -746 -352 -168 561 194 142
6003A42J81k10k97n01L58L11m4J57O44k28n60j19j02mk93N87M75K18m73K6J9m82
$$ 142 323 113 -184 -685 -327 -16 -60 97 741 513 -47 -166 -268 -272 -565 22 497 715 242 268 287 -195
6025a95l87J56N41r1O4K99J40p46l06J98k29Q8L95O51j79k17n23N74k94q32M31
$$ -195 -582 -426 115 24 88 387 527 -219 -525 -327 -556 -468 -73 578 399 182 -341 233 -61 -893 -462
6046d62Q06J79j79Q6R1m73q52M49K21J87j24K39J08j04o28J51J59m64L16N64J21
$$ -462 344 523 344 430 521 48 -804 -355 -134 53 -71 168 276 172 -456 -305 -146 -610 -294 270 391
6067C91k61k25N00n08m76J56M21J76J29j30O79n42n16J38j3m9m17N00P34k80p26
$$ 391 130 -95 405 -103 -579 -423 -2 174 303 173 852 310 -206 -68 -81 -130 -547 -47 687 407 -319
6088c19N00l15m80j44N02L38j32L57L15l75m77m77M23O3K57P3N02j05l23k51l20
$$ -319 181 -134 -614 -758 -256 82 -50 307 622 247 -230 -707 -284 -221 36 109 611 506 183 -68 -388
6109c88P5r3P79J49j46l30K86J39q37M6K40J03Q8k0J79L62p85k57L24j80l56M52
$$ -388 -313 -406 373 522 376 46 332 471 -366 -320 -80 23 111 91 270 632 -153 -410 -86 -266 -622 -170
6131a70N40lm82J6M40o07k43L40O40n2n37P96j50m86n15J88n7k46M14O65q6k57
$$ -170 370 367 -115 -99 341 -266 -509 -169 471 419 -118 678 528 42 -473 -285 -342 -588 -174 491 405 148
6153A48l12J20k29k69J98N68K7N9k53L81m05q81L80J52M11j43M00O05p73n18L90
$$ 148 -164 -44 -273 -542 -344 224 251 310 57 438 33 -848 -468 -316 95 -48 352 957 184 -334 56
6174E6l89M6l22P94Q5k60K98R5l68q05K31N87N6j48N44o3l69l53l36O67k16l16
$$ 56 -333 -287 -609 185 270 10 308 403 35 -770 -539 48 104 -44 500 437 68 -285 -621 46 -170 -486
6196d86O13N62m13l54J72m56j74J43L95M69n82K02O33o22n13k81L44J84l02Q21
$$ -486 127 689 276 -78 94 -362 -536 -393 2 471 -111 91 724 102 -411 -692 -348 -164 -466 355
6216C55M39l88o37J46Q1l67m69J019L26l68j7K26j01m35n21L70L52m4K48K32q
$$ 355 794 406 -231 -85 -4 -371 -840 179 505 137 120 346 245 -190 -711 -341 11 -33 215 447 439
6237D39o56J50J82l60m50Q55J98q3j30l15j80K72o03N71L58j67P1J86n7l07l99
$$ 439 -217 -67 115 -245 -695 160 358 275 145 -170 -350 -78 -681 -110 248 81 152 338 281 -26 -425
6258d25o4M29m30M19L63L94n47l38L16k92l66M99M62l8r9Q8k04m48l72L78J38
$$ -425 -489 -60 -490 -71 292 686 139 -199 117 -175 -541 -42 420 382 283 371 167 -281 -653 -275 -137
6279a37J41k23P04K23n82o09M46k36qr1L93O12m67j00J94J9q79N33L5J17k62M87
$$ -137 4 -219 485 708 126 -483 -37 -273 -281 -372 21 633 166 66 260 279 -600 -67 -32 85 -177 310
6301C10L06m42n44J93P7k27r9Q43R7l2n52m2L7m22j36P09J48j88M0K11k30m07
$$ 310 616 174 -370 -177 -100 -327 -426 417 514 482 -70 -112 -75 -497 -633 76 224 36 76 287 57 -350
6323c50j80N43j98K95K35J67j67n72K96j58k11k34Q76K32l89q1J60l04l16m02
$$ -350 -530 13 -185 110 345 512 345 -227 69 -89 -300 -534 342 574 185 104 264 -40 -356 -758
6343g58Q71K0k46M26M65m81m70q0L3pl48P24J14M2l24l7L39p70R4J69L25Q4j65
$$ -758 113 133 -113 313 778 297 -173 -253 -220 -227 -575 149 263 305 -19 -56 283 -487 -393 -224 101 185 20
6366B0M70np23j96J54O2J79n0P33m65k79N0J31m26k04M22L90j38L6J26M87q66
$$ 20 490 485 -238 -434 -280 -218 -39 -89 644 179 -100 -50 81 -345 -549 -127 263 125 161 287 774 -92
6388i2l41J42J19K51k9M65j15l25k99N1J63m96q5R26k07j33K40O6l27n93K66M32
$$ -92 -433 -291 -172 79 50 515 400 75 -224 -173 -10 -506 -591 335 128 -5 235 301 -26 -619 -353 79
6410G9M8J1J8J80l44j93j25N2m8Q2N78J48k98J6j59m37P0K8O20J7p2k09J86k80
$$ 79 127 138 156 336 -8 -201 -326 -274 -322 -240 338 486 188 204 45 -392 -322 -294 326 343 271 62 248 -32
6434c2m57M38L5j57k08N45M38m02k79J82j62m35o5N70M32j40o6L9j36o87J11K27
$$ -32 -489 -51 -16 -173 -381 164 602 200 -79 103 -59 -494 -559 11 443 303 237 276 140 -547 -436 -209
6456b09N12k72J21L56j38l18j07p8k73N1N33L31q8m42O7K97o80r3N37J80j83j48
$$ -209 303 31 152 508 370 52 -55 -133 -406 -355 178 509 421 -21 46 343 -337 -430 107 287 104 -44
6478d4L98n0l04m19K35P7l19N67J42n7J19m14J74n90J79N0M55J14o7o5l2j70m55
$$ -44 354 304 0 -419 -184 -107 -426 141 283 226 345 -69 105 -485 -306 -256 199 313 246 181 149 -21 -476
6501d76M77J58j56P3N03N4l00p13M01j93m22K53Q46k7m01l0J64m99j82m8N83P
$$ -476 1 159 3 76 579 633 333 -380 21 -172 -594 -341 505 478 77 47 211 -288 -470 -518 65 72
6523G2l7L68R5j58n50j65r3K07n2M27P93o85l26J24J1l66J08J24K96j01J96j38
$$ 72 35 403 498 340 -210 -375 -468 -261 -313 114 907 222 -104 20 31 -335 -227 -103 193 92 288 150
6545A50q1q9m90M90k63K6L04L54j64l00o5K58o25K75K20M90k34J1P0j63o05J05
$$ 150 69 -20 -510 -20 -283 -257 47 401 237 -63 -128 130 -495 -220 0 490 256 267 337 174 -431 -326
6567c26J63M9j68L92L42k00n37L34n4k06l9K15J80K2j85K4J22l39m46P96j85N7
$$ -326 -163 -114 -282 110 452 252 -285 49 -5 -211 -250 -35 145 167 -18 6 128 -211 -657 139 -46 11
6589A1K63K8J5k63n45M60j82j02N93j8J27m60J27J01l87k87N28L20j15l70L96
$$ 11 274 302 317 54 -491 -31 -213 -315 278 260 387 -73 54 155 -232 -519 9 329 214 -156 240
6610B40R5p67J06j53M42j68J01L46K03m88j26K18l12JmL34M44m86Q8J93l86l99
$$ 240 335 -432 -326 -479 -37 -205 -104 242 445 -43 -169 49 -263 -262 -266 68 512 26 114 307 -79 -478
6632d78K84L10j48O2K43K77o05j34k7P7k05K38O42j47r1k62J95l09j25l55N72
$$ -478 -194 116 -32 30 273 550 -55 -189 -216 -139 -344 -106 536 389 298 36 231 -78 -203 -558 14
6653A4M65n22K78L0k44k69j39N62k76J50M53j37j91l49J15r8m8O8J48N19j98j71
$$ 14 479 -43 235 265 21 -248 -387 175 -101 49 502 365 174 -175 -60 -158 -206 -138 10 529 331 160
6675A60l3k48l83J0M09J44k77K75k2J00l08L8j36l4J80K15J17J39m06K59k15l41
$$ 160 127 -121 -504 -494 -85 59 -218 57 35 135 -173 -135 -271 -305 -125 90 207 346 -60 199 -16 -357
6697c57j22N67K75l08L2O3J32m54J69j30M4j70J73N51k51j24r7k05j7j27K75L30
$$ -357 -479 88 363 55 87 150 282 -172 -3 -133 -89 -259 -86 465 214 90 -7 -212 -229 -356 -81 249
6719B49k37J82j22K68n10n7L7J11r5J6O36q5m54J41j97K8k70O18j44J5P7k11L26
$$ 249 12 194 72 340 -170 -227 -190 -79 -174 -158 478 393 -61 80 -117 -89 -359 259 115 130 207 -4 322
6742C22n46j92K21M5K83o9J38J17l81j7Pj83J17J46L72j17k52N7J28l04q1Q1J33
$$ 322 -224 -416 -195 -150 133 64 202 319 -62 -79 -72 -255 -138 8 380 263 11 68 196 -108 -189 -108 25
6765B5K29k64K63p7o9k56k21K62K20n34N92K85m97P1J16k31l93K8N45M7k86lM73
$$ 25 254 -10 253 176 107 -149 -370 -108 112 -422 170 455 -42 29 145 -86 -479 -451 94 141 -145 -148 325
6788C25m44l9l57M12K33j70K93m7k77R3k23K59k67j10N89Kl53j0L03j12k51k66
$$ 325 -119 -158 -515 -103 130 -40 253 206 -71 22 -201 58 -209 -319 270 272 -81 -91 212 100 -151 -417
6810d17M08M55r32N63K60k98k14l40M70P1l75N01L46l84k47L12o50K30k37M95
$$ -417 -9 446 -486 77 337 39 -175 -515 -45 26 -349 152 498 114 -133 179 -471 -241 -478 17
6830A7j8L98m35J96k37k75J54N8J71k3J04J47k37O9J3N1m64l5K63M40k52N5j26
$$ 17 -1 397 -38 158 -79 -354 -200 -142 29 6 110 257 20 89 102 153 -311 -346 -83 357 105 160 34
6853C4J95n34j60L56J33j00K39L11n5n23j13N9J74k94M14J70J2k54k24K94j61
$$ 34 229 -305 -465 -109 24 -76 163 474 419 -104 -217 -158 16 -278 136 306 318 64 -160 134 -27
6874b7n3J5O3p7K80n2k06J03l00J56O0q8PL60J23j25k02k8j26l47M72K67l98k6
$$ -27 -80 -65 -2 -79 201 149 -57 46 -254 -98 -38 -126 -119 241 364 239 37 9 -117 -464 8 275 -123 -149
6898a49L74Lj15n18J46O45l85r8L39L02m41j65q5K8j59J64L1M33Nl89j58q8J1
$$ -149 225 228 113 -405 -259 386 1 -97 242 544 103 -62 -147 -119 -278 -114 -83 350 355 -34 -192 -280 -269
6921b69L10k0L92m26J85K06j48m62J09J06l63k4N87L5P1l7q3p4m86P3N06K07l64
$$ -269 41 21 413 -13 172 378 230 -232 -123 -17 -380 -404 183 218 289 252 169 95 -391 -318 188 395 31
6944C1J59J28p0o02j12M43k03J22J56L79p9n20J19j48j4L4K92N5J81k84K82l79
$$ 31 190 318 248 -354 -466 -23 -226 -104 52 431 352 -168 -49 -197 -211 -177 115 170 351 67 349 -30
6966c0k40K2J11%J09K21m4J11m27l3J6J46m64L68K45L86k93p7l77J1j37L31K11
$$ -30 -270 -248 -137 -137 -28 193 149 260 -167 -200 -184 -38 -502 -134 111 497 204 127 -250 -239 -376 -45 166
6989A66Nk3J30Pl52l68L28j2p3K3L85j4k53j99M1K17k33J32K43K66k07o5R8m8
$$ 166 171 148 278 285 -67 -435 -107 -119 -192 -169 216 202 -51 -250 -209 8 -225 -93 150 416 209 144 242 194
7013A94m95L00j09K22k00L63K93p03n5q2K05J54k68L94j33K29k01J1l02j77j94
$$ 194 -301 -1 -110 112 -88 275 568 -135 -190 -272 -67 87 -181 213 80 309 108 119 -183 -360 -554
7034e54N16J04o3O1J23r3r2q2N3ko0J63K9J80l46L99l18n28J93J33N21j48LJ97
$$ -554 -38 66 3 64 187 94 2 -80 -27 -29 -89 74 103 283 -63 336 18 -510 -317 -184 337 189 192 389
7058C89k89j68r4K66P0m60K37M28r2m05J73k66Q4k27M19K94m35J60O1l4m36j67
$$ 389 100 -68 -162 104 174 -286 -49 379 287 -118 55 -211 -127 -354 65 359 -76 84 145 111 -325 -492
7080d92K63K45M8J16J33l1m04j79J84K0m2J27Q8K55m13j42J66Lk04K68N5r6L80
$$ -492 -229 16 64 180 313 282 -122 -301 -117 -97 -139 -12 76 331 -82 -224 -58 -55 -259 9 64 -32 348
7103C48k45Q4j62L8k37K14K17j46L7pj31P5j84L6j79K8L32q7J43j69R1j19j87
$$ 348 103 187 25 63 -174 40 257 111 148 141 10 85 -99 -63 -242 -214 118 31 174 5 96 -23 -210
7126b10m1L21l26K92K15n0m26K2L0R4J26l77N13O1J9k42J99O0m79J0K92L4j63
$$ -210 -251 70 -256 36 251 201 -225 -203 -173 -79 47 -330 183 244 263 21 220 280 -199 -189 103 137 -26
7149b6R4O1J97o75k49J36J64L10p6O18n60J03j83L40n14O4L26L58l95O7O2j15
$$ -26 68 129 326 -349 -598 -462 -298 12 -64 554 -6 97 -86 254 -260 -196 130 488 93 160 222 107
7171A07k32k03K18K05l39M56K62j85k80m22O6K27l29M81QL30n12K69K06p75L81
$$ 107 -125 -328 -110 95 -244 212 474 289 9 -413 -347 -120 -449 32 40 370 -142 127 333 -442 -61
7192f1kM09o66M52J24l0l05k52J64J61j52k1P74n40m5K0L16o03K65l70P10k53
$$ -61 -63 346 -320 132 256 226 -79 -331 -167 -6 -158 -179 595 55 10 30 346 -257 8 -362 348 95
7214I5j13O6J90n47R4K7N41k44j85M31r5l18P1K7P8n06M55k49Q9J33j86J74j01
$$ 95 -18 48 238 -309 -215 -188 353 109 -76 355 260 -58 13 40 118 -388 67 -182 -93 40 -146 28 -73
7237g3j47Q9L47j18K02J6K2m64L26m15J35N1J55k11N20k79q8m8j1q0j55J52L07
$$ -73 -220 -131 216 98 300 316 338 -126 200 -215 -80 -29 126 -85 435 156 68 20 9 -71 -226 -74 233
7260B33m81M78p9l66J17N1L9K19k86L93M2l81N9k43ok00J05K06J79J59j33K43
$$ 233 -248 230 151 -215 -98 -47 -8 211 -75 318 360 -21 38 -205 -211 -411 -306 -100 79 238 105 348
7282C48j34l02k48K58J09j59K57K95l09j92J53q2Nm25M88L13l28J9Q0j33j05K1
$$ 348 214 -88 -336 -78 31 -128 129 424 115 -77 76 -6 -1 -426 62 375 47 66 146 13 -92 -71
7304g1k33K88j0K55J33l53j65k23N61q0k14K79L2M2k59O2r8j76J29l7N13k11K59
$$ -71 -304 -16 -26 229 362 9 -156 -379 182 102 -112 167 199 241 -18 44 -54 -230 -101 -138 375 164 423
7327D23k63r3j60l13PM60j96L88J45k79Q3k84K9k23K03m66N68K21k92Q2j40kp1
$$ 423 160 67 -93 -406 -399 61 -135 253 398 119 202 -82 -53 -276 -73 -539 29 250 -42 40 -100 -102 -173
7350a73J98n7J45k87Q6J50n2j5k43j10J01J94J64N0j25P5O3l45j64L53Q8p5J14
$$ -173 25 -32 113 -174 -88 62 10 -5 -248 -358 -257 -63 101 151 26 101 164 -181 -345 8 96 21 135
7373A35o5L59o13O7O6l3j73L56p9R6j96L48k61M1j61mJ41K33n1l71K71j32k52
$$ 135 70 429 -184 -117 -51 -84 -257 99 20 116 -80 268 7 48 -113 -117 24 257 206 -165 106 -26 -278
7396b78N7K37k35M46j76L22l57j87J59o2l84J14J84L90K2j19P1k00j76j53L67
$$ -278 -221 16 -219 227 51 373 16 -171 -12 -74 -458 -344 -160 230 252 133 204 4 -172 -325 42
7417D2%l86O38p2k4n11L92l73J81N8K38j22l8M9k53j46j41M37j92M02J20k80K39
$$ 42 42 -344 294 222 198 -313 79 -294 -113 -55 183 61 23 72 -181 -327 -468 -31 -223 179 299 19 258
7440B58j40l36K3R3K0j29J67J81m4Q3m61J66L1j66k22O39K6l39J30J11l6l24Q1
$$ 258 118 -218 -195 -102 -82 -211 -44 137 93 176 -285 -119 -88 -254 -476 163 189 -150 -20 91 55 -269 -188
7463a88L51m64J63K42L04l46k77K33q1kJ47N39m60k71L38l8j97j95n1J24J17K10
$$ -188 163 -301 -138 104 408 62 -215 18 -63 -65 82 621 161 -110 228 190 -7 -202 -253 -129 -12 198
7485A98o9Q3j27j80Q1o1K1j39M04l3m10J12J51p8j20M00j21L0j33J26J33j28m75
$$ 198 129 212 85 -95 -14 -75 -54 -193 211 178 -232 -120 31 -47 -167 233 112 142 9 135 268 140 -335
7508c35N0K14J06m0J31J63l25j9J83j75j3j37L25J24k23j39L55j45l23j12N11
$$ -335 -285 -71 35 -5 126 289 -36 -55 128 -47 -60 -197 128 252 29 -110 245 100 -223 -335 176
7529A76m22L49N4J58j76l94K63K4K00k94r0M54m0k90J31m6j81j19j20N59J6k29
$$ 176 -246 103 157 315 139 -255 8 32 232 -62 -152 302 262 -28 103 57 -124 -243 -363 196 212 -17
7551a7N1N7k18Q8J26jm71K03K02J12k16J11K31l99Q2On9J1J44k48M33l60n4J53
$$ -17 34 91 -127 -39 87 86 -385 -182 20 132 -84 27 258 -141 -59 -53 -112 -101 43 -205 228 -132 -186 -33
7575c3o4L43k55K11N4j25j49k37K58m6Q7J41k68J87k12P9J21k97O6L92k44K28
$$ -33 -97 246 -9 202 256 131 -18 -255 3 -43 44 185 -83 104 -108 -29 92 -205 -139 253 9 237
7597B37j1j10J54n60K62K08k24K44j62J7L0j03Q8j04k14j63N21j4r5K55k41N1
$$ 237 226 116 270 -290 -28 180 -44 200 38 55 85 -18 70 -34 -248 -411 110 96 1 256 15 66
7619F6k59P7J05P4m1J42M8o6m85J58n1L40l36L81R8j44L06k7m07l15K34J21q7
$$ 66 -193 -116 -11 63 22 164 212 146 -339 -181 -232 108 -228 153 251 107 413 386 -21 -336 -102 19 -68
7642f8J13K53k17M5l55KL7lM2K14J43l87p7P7J48k19O3M03k52K19l0R3j63j2k00
$$ -68 45 298 81 126 -229 -227 -190 -193 -151 63 206 -181 -258 -181 -33 -252 -189 214 -38 181 151 244 81 69 -131
7667a31j31K27j42K21K02k37k61K50k4K5k78K09J24r3j7K88N0k83k48j34M78q2
$$ -131 -262 -35 -177 44 246 9 -252 -2 -26 -1 -279 -70 54 -39 -56 232 282 -1 -249 -383 95 13
7689A3J28L6j67J46k93K37k54j07L03K02J05k84N3mm14J03K20J41j04L7O8J64
$$ 13 141 177 10 156 -137 100 -154 -261 42 244 349 65 118 114 -300 -197 23 164 60 97 165 329
7711C29m31k1j67L10q9j23L29j89j5LJ03r1j05j22O37m47J18l77K09j96J29J70
$$ 329 -102 -123 -290 20 -69 -192 137 -52 -67 -64 39 -52 -157 -279 358 -89 29 -348 -139 -335 -206 -36
7733c6j33M2J3M98n44J84k1J64j93k65m2M16p0J98p3j2k25j50L49l3m10K17L15
$$ -36 -169 -127 -114 384 -160 24 3 167 -26 -291 -333 83 13 211 138 126 -99 -249 100 67 -343 -126 189
7756A89n5m3m70J90J54k28L1M37j23L9j3p5Kj73J36J33P7j72o4J7j38L32l29K28
$$ 189 134 91 -379 -189 -35 -263 -232 205 82 121 108 33 35 -138 -2 131 208 36 -28 -11 -149 183 -146 82
7780H2p8j65K16L32l81n5N5m1j13J69k43J81k91N37j21j91J80k49K77l05L10N8
$$ 82 4 -161 55 387 6 -49 6 -35 -148 21 -222 -41 -332 205 84 -107 73 -176 101 -204 106 164
7802A64Q9N7m72j27L86m5n1R3m0j85L38l14J88j93p2K74k08lK53m7L40n16k23
$$ 164 253 310 -162 -289 97 52 1 94 54 -131 207 -107 81 -112 -184 90 -118 -121 132 85 425 -91 -314
7825c14L20J94l02k4M94k70r6q1n8j43p5J55J94J6P8K60j03l5l39nL03j40j48
$$ -314 6 200 -102 -126 368 98 2 -79 -137 -280 -355 -200 -6 10 88 348 245 210 -129 -134 169 29 -119
7848a19L01J42m36j02K97j44K5k6J62L1k90L54q3l27L1M0K43R1l24N32j60n8l26
$$ -119 182 324 -112 -214 83 -61 -36 -62 100 131 -159 195 112 -215 -184 -144 99 190 -134 398 238 180 -146
7871a46K36r6k93L94k42K21l9K00l74J51p6k24j7N76k36R2k20M1k22m2J75m5K82
$$ -146 90 -6 -299 95 -147 74 35 235 -139 12 -64 -288 -305 271 35 127 -93 -52 -274 -316 -141 -186 96
7894I6P6M40q49J61J04J38m90J95K45p2k5m2j4l7k90M15n5L14j76l10L92j45k73
$$ 96 172 612 -237 -76 28 166 -324 -129 116 44 19 -23 -37 -74 -364 51 -4 310 134 -176 216 71 -202
7917b02l4J30J55M1K4O4l14mJ6mJ93k06J3J93k8l0K92k23J69k44Q5l0o9j67K40
$$ -202 -236 -106 49 90 114 178 -136 -140 -124 -128 65 -141 -128 65 37 7 299 76 245 1 86 56 -13 -180 60
7942F0K66k83j54J30j90J80j00K35j37k7%mL25n60K64O9m1r2R8K31k05j86P5L8
$$ 60 326 43 -111 19 -171 9 -91 144 7 -20 -20 -24 301 -259 5 74 33 -59 39 270 65 -121 -46 -8
7966hm5j52K94J43k93M74m66j84J23J84n6p1k9n2M18k04j07j31n5K28j08j41N16
$$ -8 -53 -205 89 232 -61 413 -53 -237 -114 70 14 -57 -86 -138 280 76 -31 -162 -217 11 -97 -238 278
7989B78l45L2j69K73j27k7K6J37k68R5M5K90m77M0R1L17l22L08J65l11rm10L84
$$ 278 -67 -35 -204 69 -58 -85 -59 78 -190 -95 -50 240 -237 -197 -106 211 -111 197 362 51 42 -368 16
8012A6j47K09l41K39J59j96J94l36j32P6K90k64K07J10J50l64k9j66J37K60n0
$$ 16 -131 78 -263 -24 135 -61 133 -203 -335 -259 31 -233 -26 84 234 -130 -159 -325 -188 72 22
8033B2k9N6L2j70J68p9p9j42K87K50k75k81O48l87o5j60L2K27j80K40j54Q4j5
$$ 22 -7 49 81 -89 79 0 -79 -221 66 316 41 -240 408 21 -44 -204 -172 55 -125 115 -39 45 30
8056C0q1j18J18j33L47Rj66P5k5r7j98J09K07j12k67L33K53n9j89m41N10j83L30
$$ 30 -51 -169 -51 -184 163 172 6 81 56 -41 -239 -130 77 -35 -302 31 284 225 36 -405 105 -78 252
8079B52k98J64L7j43j63L16j88m00P6L27R4r4K09R4j15l94j20L98%j98N7L55j72
$$ 252 -46 118 155 12 -151 165 -23 -423 -347 -20 74 -20 189 283 168 -226 -346 52 52 -146 -89 266 94
8102I4R5j31P9k31P6r1K07L8m46L73j01n3J7j4K31j88J89p6k25O3L24k61O8k7
$$ 94 189 58 137 -94 -18 -109 98 136 -310 63 -38 -91 -74 -88 143 -45 144 68 -157 -94 230 -31 37 10
8126A0J1J06k23j37J67k5p1Q1P3O3Q3k2j57K74j77j05q7l0m4L19K59k05j72K49
$$ 10 21 127 -96 -233 -66 -91 -162 -81 -8 55 138 116 -41 233 56 -49 -136 -166 -210 109 368 163 -9 240
8150B40m11o3J66L78l11M4K03j49K62l28j95K28K0n3no9J7m4O6J79m19R5L59j45
$$ 240 -171 -234 -68 310 -1 43 246 97 359 31 -164 64 84 31 26 -43 -26 -70 -4 175 -244 -149 210 65
8174F5j5J79l35L61k97j83K26K08k14O8q8K94j34k64K45l18J5
$$ 65 50 229 -106 255 -42 -225 1 209 -5 63 -25 269 135 -129 116 -202 -187
8191a87
$$ Imaginary data points
##PAGE= N=2
##DATA TABLE= (X++(I..I)), XYDATA
0@%%%%%%qJ6j6J6k4L2l9M7n6O7p8R2j10J33j55J80k09K43k79L19l66M14m69N32
$$ 0 0 0 0 0 0 0 -8 8 -8 8 -16 16 -23 24 -32 35 -43 49 -61 72 -83 97 -112 131 -148 171 -195 219 -250 282
30B82n97O70p55Q47r43J052j172J301j445J602j772J963k173K403k665K957l284
$$ 282 -315 355 -400 447 -496 556 -616 685 -760 842 -930 1033 -1140 1263 -1402 1555 -1729
47a729L655m081M576n159N855o705P772r155J1034j3742J8022k5847M4786j75742
$$ -1729 1926 -2155 2421 -2738 3117 -3588 4184 -4971 6063 -7679 10343 -15504 29282 -146460
61a46460k57799K34406K41488Q8527j25285j25600m8638P3062P6625j3962j19832
$$ -146460 -404259 -169853 71635 160162 34877 -90723 -139361 -66299 10326 -3636 -123468
72a23468m7073R5784J27398M886m6122R471L6334n5740j15302n1432Q5471J71097
$$ -123468 -170541 -74757 52641 57527 11405 20876 57210 1470 -113832 -165264 -79793 91304
84I1304J47209j5137j93245j87273L3987J96183R9079j03969j31120J6728J35263
$$ 91304 238513 223376 30131 -157142 -123155 73028 172107 68138 -62982 -46254 89009
95H9009J05805k1607j45922j54531j4791J34867J13871k2964o5082J8041M2654
$$ 89009 194814 173207 27285 -127246 -142037 -7170 106701 83737 18655 36696 79350
106G9350n5952j23496n7491N4898J04795P2789j4831r2514o3520N2115P9973m7775
$$ 79350 23398 -100098 -157589 -102691 2104 74893 60062 -32452 -95972 -43857 36116 -11659
118a1659j42682l9104J34951J57561K9358q7837j05953m4927M1442P3063M484
$$ -11659 -154341 -193445 -58494 99067 128425 40588 -65365 -110292 -68850 4213 8697
129H697o1998M617J27901J02365o7886j61163p4523N6225R6396N5465q384m8351
$$ 8697 -53301 -48684 79217 181582 113696 -47467 -121990 -65765 30631 86096 77712 29361
141B9361j7979N4988M8152o7910j30364k9745R8805R0489M44l1098n798l640k9328
$$ 29361 11382 66370 114522 46612 -83752 -113497 -14692 75797 76241 45143 39345 35705 6377
154F377n0104n5435j6702Q1814J38735M0375j20044j35092L788R5193M0466n0269
$$ 6377 -43727 -99162 -115864 -34050 104685 145060 25016 -110076 -106288 -11095 29371 -20898
166b0898o4940q152P0253J11056M4731r6755j51403m3663Q3583Q5246K1095Q401
$$ -20898 -85838 -93990 -23737 87319 132050 35295 -116108 -159771 -76188 9058 30153 38554
178C8554K2082p940n0088m6032j5398J3275M7794N8026o17n8598j2274P8060N5060
$$ 38554 60636 52696 2608 -43424 -58822 -45547 2247 60273 59656 1058 -11216 66844 121904
191A21904p5042j33812m6951P7871J28640Q8948j6969j20518j15734K912Q5325
$$ 121904 46862 -86950 -133901 -56030 72610 161558 144589 24071 -91663 -88751 -3426
202c426L5170l9770k1355L7895L4315q128k3631k5272l6000k2839J3984K4307
$$ -3426 31744 -8026 -29381 8514 42829 34701 11070 -14202 -50202 -73041 -59057 -34750
214c4750J7317M4003O3087q802j14385j04886J6184R7376P3099J0903k8273m0496
$$ -34750 -17433 26570 89657 80855 -33530 -138416 -122232 -24856 48243 59146 30873 -9623
226i623j1974L8530L0002n0296q2254L428R3886P3597k355l4290l1642l6479k6061
$$ -9623 -21597 16933 46935 -3361 -85615 -82187 11699 85296 82941 48651 17009 -19470 -45531
239d5531O728K0227J4508L4643N4375K746p4591o6687R975L8857L52j5394J4449
$$ -45531 -38803 -18576 -4068 30575 84950 87696 13105 -53582 -43607 -4750 -4398 -19792 -5343
252e343L2857K4610Q417k5763p3427o2466K5119Q1160L7381k0991j0679J6962
$$ -5343 27514 52124 60541 34778 -38649 -101115 -75996 5164 42545 21554 10875 27837
264B7837n338l9636l7064j5913N411M4911O9863K4466m8994n1364K731J2758k3258
$$ 27837 22499 -17137 -54201 -70114 -64703 -19792 50071 74537 25543 -25821 -23090 -10332 -33590
277c3590k1264K6468M7476K8843J1030q237m3316m9136j989L0005O757l457L8426
$$ -33590 -54854 -28386 19090 47933 58963 50726 7410 -41726 -43715 -13710 -6953 -10410 28016
290B8016N6905k580o5679n7455j5225J2819L3181M2261J0256k8696j1132K8906
$$ 28016 84921 82341 16662 -40793 -56018 -43199 -10018 32243 42499 13803 2671 31577
302C1577N653n6626n7211P010M7964M0550K9132J2057k9377n3517k5103N840l87
$$ 31577 37230 -19396 -76607 -69597 -21633 18917 48049 60106 30729 -22788 -47891 -42051 -42438
315d2438K637M3014N4349o2m5851k6945J391o624j5613L342J5878J7108L4372
$$ -42438 -39801 3213 57562 57500 11649 -15296 -13905 -20529 -36142 -32800 -16922 186 34558
328C4558M2306j1522p8867o5805J0319M8875L0873J8158J7230m002k5674j6022
$$ 34558 76864 65342 -13525 -79330 -69011 -20136 10737 28895 46125 42123 16449 427
340D27o107k3626k2435K4314N1668K0412j0907J46K910l2644n0733j5466K3410
$$ 427 -5680 -29306 -51741 -27427 24241 44653 33746 33892 36802 4158 -46575 -62041 -38631
353c8631L3790L8697L3989j1557n9236m2516J0104J7777j0079m432L0337L3512
$$ -38631 -4841 33856 67845 56288 -2948 -45464 -35360 -17583 -27662 -32094 -1757 31755
365C1755O805p096j7987m1687l8824J0753M5901K5932M345J7277J4853k8336n1705
$$ 31755 38560 31464 13477 -28210 -67034 -56281 -10380 15552 19897 37174 52027 23691 -28014
378b8014k1960J2237J7127K2540L3882J4821k0493k0034n1j4535m0448j3560M1190
$$ -28014 -49974 -37737 -20610 1930 35812 50633 30140 10106 10055 -4480 -44928 -58488 -17298
391a7298M8956J5705l965j0241l1225l8602p922J8225Q912O667L3835L5959j2340
$$ -17298 31658 47363 43398 33157 1932 -36670 -44592 -26367 -17455 -10788 23047 59006 46666
404D6666m6592k8117l760m924L143L0089L0739N516k434J540k1969m9717k3795
$$ 46666 74 -28043 -31803 -36727 -33584 -3495 27244 32760 30326 31866 9897 -39820 -63615
417f3615K7779L8134J3296R028J4298o706l3230k4576o875q224K769L8198M5928
$$ -63615 -35836 2298 15594 24622 38920 32214 -1016 -25592 -32467 -40691 -37922 276 46204
430D6204L261k9456j7521n951k0785j8805J3596L0687J9172J4470J5133j2136
$$ 46204 49465 20009 2488 -3463 -24248 -43053 -29457 1230 20402 34872 50005 37869
442C7869m5801l3498P022J6782M955J6481L3864J2000k3603k7765j6368j8768
$$ 37869 -7932 -41430 -34408 -17626 -12671 3810 37674 49674 26071 -1694 -18062 -36830
454c6830j1250K3014L9945J3612p199K713M47l0563l8772m799K2964K1182K1217
$$ -36830 -48080 -25066 14879 28491 21292 24005 24452 -6111 -44883 -49682 -26718 -5536 15681
467A5681K7446L303l3161l1532m692j529r895J1528L9086K6832p039j4652j0706
$$ 15681 43127 46430 13269 -18263 -22955 -24484 -34379 -22851 16235 43067 36028 21376 10670
480A0670k3781k8084J875K7811J7859Q505J9631J1765k7698m3671j5122R962Q472
$$ 10670 -13111 -41195 -39320 -11509 6350 14855 34486 46251 18553 -25118 -40240 -30278 -21806
493b1806J3452K9962J9226j2566j9162o482j3658k6734l582L1968L0612O618K032
$$ -21806 -8354 21608 40834 28268 9106 2624 -11034 -37768 -41350 -9382 21230 27848 29880
506B9880K566k0986l7117j5330J3106J2823J0930K6430K1409j4227l3078j4658
$$ 29880 32446 11460 -25657 -40987 -27881 -15058 -4128 22302 43711 29484 -3594 -18252
518a8252j545j0739l312K4732L0740P627l848j835j7322l5892j6535K0494K5869
$$ -18252 -19797 -30536 -33848 -9116 21624 29251 25403 23568 6246 -29646 -46181 -25687 182
531A82J0748J2689J6906q423l2546k1862r43r45J635K3995L0993L543j7173r385
$$ 182 10930 23619 40525 32102 -444 -22306 -23249 -24194 -22559 1436 32429 35972 18799 9414
545I414q772k5669j9460J5516L1183J5251O295Q641r176l3193k3748M795J0507
$$ 9414 642 -25027 -44487 -28971 2212 17463 23758 32399 23223 -9970 -33718 -28923 -18416
558a8416L165J6202K9628Q712k1108j9936q179j3925j2423J5571L1986J4640k080
$$ -18416 -15251 951 30579 39291 18183 -1753 -9932 -23857 -36280 -20709 11277 25917 23837
571B3837J732m660k8532k9028K166K0204J1429J0834K0952P233k2255k5394p503
$$ 23837 25569 20909 -7623 -36651 -34485 -14281 -2852 7982 28934 36167 13912 -11482 -18985
584a8985n432q013J3044L5032K0151r380j2021n712j7714k3371M76K2060J6123
$$ -18985 -24417 -32430 -19386 15646 35797 26417 14396 8684 -9030 -32401 -31925 -9865 6258
597F258Q833J5920P423k3534l4345j0600O587K854R820K7202J9745r851j9129
$$ 6258 15091 31011 38434 14900 -19445 -30045 -23458 -20604 -10784 16418 36163 26312 7183
610G183j0038j2889j9837P42K7334K2877L623K937M882j6003l1358j4275R794
$$ 7183 -2855 -15744 -35581 -34839 -7505 15372 18995 21932 26814 10811 -20547 -34822 -25028
623b5028J1463J1512K3969J9276j2267k7990j2703k870j0428k003K3571K6308
$$ -25028 -13565 -2053 21916 41192 28925 935 -11768 -14638 -25066 -27069 -3498 22810
635B2810M290n871k498j4173k8457j3756J4846J8076Q522J3792J7438p593l0878
$$ 22810 27100 21229 18731 4558 -23899 -37655 -22809 -4733 3789 17581 35019 27426 -3452
648c452k0223j00L69K911K1505K6525L147j3919p486p962k2857j5611J4651K6838
$$ -3452 -23675 -23775 -23406 -20495 1010 27535 30682 16763 9277 1315 -21542 -37153 -22502 4336
662D336J2409N305P738p295k8459k1769K049O985L028J6283K7617O638j9634j8592
$$ 4336 16745 22050 29788 22493 -5966 -27735 -25686 -18701 -15673 610 28227 34865 15231 -3361
676c361p908j2654j0407J4548K8548J4178j077J090m676k4807k3613K848J6107
$$ -3361 -11269 -23923 -34330 -19782 8766 22944 21867 22957 18281 -6526 -30139 -27291 -11184
689a1184P505J0287K1121Q422j8473k4332j0107o280o604J3069L0460J6505q147
$$ -11184 -3679 6608 27729 36151 17678 -6654 -16761 -23041 -29645 -16576 13884 30389 22242
702B2242r644n772j6539k1312N82J9374J3103O484J4770Q795j7591k7828j0771
$$ 22242 12598 6826 -9713 -31025 -30443 -11069 2034 8518 23288 32083 14492 -13336 -24107
715b4107K157l81J0445K7866K0534q675j8587j0356j1571j5946J747K2681J7385
$$ -24107 -21950 -22331 -11886 15980 36514 27839 9252 -1104 -12675 -28621 -26874 -4193 13192
728A3192K092M285O461j3500k8902j3794O043P611R323K2760K0730q418k5394
$$ 13192 15284 19569 26030 12530 -16372 -30166 -24123 -16512 -7189 15571 36301 27883 2489
741B489j4829n727r080K152K3271K2319J707m620O94r785k4777j5090J0080J4818
$$ 2489 -12340 -18067 -27147 -24995 -1724 20595 22302 17682 18376 8591 -16186 -31276 -21196 -6378
755f378Q577J5279J6403o554k7751j8407k358j899K046J9318K4568L130j2445
$$ -6378 2199 17478 33881 27327 -424 -18831 -21189 -23088 -21042 -1724 22844 25974 13529
768A3529o715p323j8956j2834J1253K1005R989P107J0537l658k5764k1082M06
$$ 13529 6814 -509 -19465 -32299 -21046 -41 9948 17055 27592 23934 -1830 -22912 -22506
781b2506O689L785J4593K2500O061j5374j3992p667j3708j0731J2105K5442J1652
$$ -22506 -15817 -12032 2561 25061 31122 15748 1756 -5911 -19619 -30350 -18245 7197 18849
794A8849j877J378k876k1181k0956L52J2636P336J0792J8886O114j6773j8729
$$ 18849 16972 18350 15474 -5707 -26663 -26311 -13675 -6339 4453 23339 29453 12680 -6049
807f049n842n845q355R717K6732J7013m245q189o802j7083j8150L650J8122R058
$$ -6049 -11891 -17736 -26091 -16374 10358 27371 23126 14937 8135 -8948 -27098 -23448 -5326 3732
821C732K529J1759Q403j3248k2244j0081p53k043Q782K4504J7033o752j4198p103
$$ 3732 6261 18020 26423 13175 -9069 -19150 -19903 -21946 -13164 11340 28373 21621 7423 320
835C20j1190j5907J409K1895J7029J020Q30L903r593j9265q914L081R21M981K1566
$$ 320 -10870 -26777 -25368 -3473 13556 14576 15406 19309 9716 -9549 -18463 -15382 -14461 -9480 12086
850A2086K0555o484k2071j3699o279p884J972J9812J7997J059m606M04q203k0922
$$ 12086 32641 26157 4086 -9613 -15892 -23776 -21804 -1992 16005 17064 12458 12862 4659 -16263
864a6263r963R902J0990M925J1095J5873k267k0379j5898n439m091K373K1884
$$ -16263 -26226 -16324 -5334 -409 10686 26559 24292 3913 -11985 -17424 -21515 -19142 2742
877B742K2553M34j4449p114m267j3450j0369P728J4807P747O984J0245l925k3261
$$ 2742 25295 25729 11280 4166 -101 -13551 -23920 -16192 -1385 6362 13346 23591 19666 -3595
891c595j7168R65M619J487J3228K1561O014j4476j3335o207j0039o194J1500J9466
$$ -3595 -20763 -19798 -15179 -13692 -464 21097 27111 12635 -700 -6907 -16946 -23140 -11640 7826
905G826O765j643M580j91j8802k0223p72J1024P719R702J5001K785j5642j4990
$$ 7826 14591 12948 17528 17337 -1465 -21688 -22460 -11436 -3717 5985 20986 23771 8129 -6861
919f861k905m899q529P175K3512J4402m110o906n689j3617j4165K590J4457Q133
$$ -6861 -9766 -14665 -23194 -16019 7493 21895 17785 10879 5190 -8427 -22592 -20002 -5545 2588
933B588M086J2426O498j5094k1316n664L217k07M797J8734J3004m208j0207o527
$$ 2588 6674 19100 25598 10504 -10812 -16476 -13259 -13466 -8669 10065 23069 18861 8654 2127
947B127j2376j6083J865K1148J5498M03M94J957r662j7782o424M557K500N119
$$ 2127 -10249 -26332 -24467 -3319 12179 12582 13076 15033 5371 -12411 -18835 -14278 -11778 -6659
961f659J7446J5945n989j7683q553m688q847j147J7496J8599L138l665k183j1267
$$ -6659 10787 26732 20743 3060 -5493 -10181 -19028 -20175 -2679 15920 19058 15393 13210 1943
975A943j8889n241J1628Q602O89P464J4690o07j7348j4645m793m311K512J8670
$$ 1943 -16946 -22187 -10559 -1957 -1268 6196 20886 20279 2931 -11714 -16507 -20818 -18306 364
989C64K0085N46j0795m297m951j5256r538J0630J5795O203M178P489l417j8688
$$ 364 20449 20995 10200 5903 952 -14304 -23842 -13212 2583 8786 12964 20453 17036 -1652
1003a652j3130%J245m19J2807K1612N710j4048j3467p046r063n341J0932J7229
$$ -1652 -14782 -14782 -13537 -13956 -1149 20463 26173 12125 -1342 -8388 -17451 -22792 -11860 5369
1017E369N929l4M521j057j8107j7772N68J0688O046Q295J4595M909j2770j3953
$$ 5369 11298 11264 15785 14728 -3379 -21151 -20583 -9895 -3849 4446 19041 23950 11180 -2773
1031b773n797o098o159Q936K2131J0310n843n371k555j2009j4954q5J1647P929
$$ -2773 -8570 -14668 -20827 -11891 10240 20550 14707 9336 6781 -5228 -20182 -20267 -8620 -691
1045f91O216J2170N155j5311j8850n115K857o95N586J7355J2353l906q602m779
$$ -691 5525 17695 22850 7539 -11311 -16426 -13569 -14264 -8678 8677 21030 17124 8522 3743
1059C743j1039j4268Q93J8071J2947J467K918L517j0686j9140p589M939L701N714
$$ 3743 -7296 -21564 -20671 -2600 10347 11814 14732 18249 7563 -11577 -19166 -14227 -10526 -4812
1073d812J5376J2016o751j4694n814m491j0417j554J6534J7494L372k095j138
$$ -4812 10564 22580 15829 1135 -4679 -9170 -19587 -21141 -4607 12887 16259 14164 13026
1086A3026r876j7520o111R417Q311L165R719J1860l356j7299j0669k474m047k2
$$ 13026 3150 -14370 -20481 -11064 -2753 412 10131 21991 18635 1336 -9333 -11807 -15854 -15876
1100a5876J4854J6903J677o852l556o522j5281r495R899J4800N682M324O920l407
$$ -15876 -1022 15881 17558 10706 7150 628 -14653 -24148 -14249 551 6233 10557 17477 14070
1114A4070j5910j1526O32Q30j52J1649J8383M110j1116q939n105r932p547R218
$$ 14070 -1840 -13366 -12734 -11904 -12056 -407 17976 22086 10970 2031 -3074 -13006 -20553 -11335
1128a1335J6308O599R5L236k678j6104j4331J397P672K878P347J4597M784j2104
$$ -11335 4973 11572 11667 14903 12225 -3879 -18210 -16813 -9141 -6263 1084 15681 20465 8361
1142H361j2466m278n238n572Q127J8824R430m107k553k397j1892j4045N53J1613
$$ 8361 -4105 -8383 -13621 -19193 -11066 7758 17188 13081 10528 8131 -3761 -17806 -17253 -5640
1156e640O956M660J0176M325j2902j5994m185Q93k485N149J6542J1065n046p975
$$ -5640 1316 5976 16152 20477 7575 -8419 -12604 -11711 -14196 -9047 7495 18560 13514 5539
1170E539l731q509j2872J146J4464J0449J836M325M039j0044j6598n381M642K371
$$ 5539 1808 -6701 -19573 -18427 -3963 6486 8322 12647 16686 6642 -9956 -15337 -10695 -8324
1184h324M224J3956J0732n468j2534n349m038r029p73J4142J3158J255j209O38
$$ -8324 -4100 9856 20588 15120 2586 -2763 -6801 -15830 -16603 -2461 10697 11952 10743 11381
1198A1381p980j6591o545Q112P970L426Q926R599m244j4929p924n83l577n42J3058
$$ 11381 3401 -13190 -19735 -11623 -3653 -227 8699 18298 14054 -875 -8799 -9382 -12959 -13501 -443
1213d43J5217J121o224k464n577j3203p513Q706J2046L845M327O854l808j6097
$$ -443 14774 15895 9671 7207 1630 -11573 -19086 -10380 1666 5511 9838 16692 12884 -3213
1227c213j0339J557J720K28R409J4950K724r745o650l928r004o394R139J4722
$$ -3213 -13552 -11995 -10275 -10047 -638 14312 17036 7291 641 -3287 -12291 -18685 -9546 5176
1241E176M839n20L587j763j3754j2759K130O629K537P020J2197K850j1945j0305
$$ 5176 10015 9495 13082 11319 -2435 -15194 -13064 -6435 -3898 3122 15319 18169 6224 -4081
1255d081j766m189n883N997J5433Q181l034k408k137j1690j2037K319J0701M975
$$ -4081 -5847 -10036 -15919 -9922 5511 13692 10658 8250 6113 -5577 -17614 -15295 -4594 381
1269C81L455R569M678j1207j4353l504J034j040N350J4484Q256n270o320k427
$$ 381 3836 13405 18083 6876 -7477 -10981 -9947 -10987 -5637 8847 17103 11833 5513 3086
1283C086p611j2436L04J3471R935J266L306K196r697j4619m034M221J969L838
$$ 3086 -4525 -16961 -16657 -3186 6749 8015 11321 13517 3820 -10799 -14833 -10612 -8643 -4805
1297d805J3197J0357o154j1881m774k461o888n29J2157J1437J365M69J186q824
$$ -4805 8392 18749 12595 714 -4060 -6521 -13409 -13938 -1781 9656 11021 11490 12676 3852
1311C852j5958n476Q782P573K233P003Q567m320j2692p102j682m651M54J2893
$$ 3852 -12106 -17582 -8800 -1227 1006 8009 16576 12256 -436 -7538 -9220 -13871 -13417 -524
1325e24J3761k38o451j423l929j2233o940P539J1103M473N454O037n209j5059
$$ -524 13237 12999 6548 5125 1196 -11037 -17977 -10438 665 5138 10592 16629 11420 -3639
1339c639q302L008J413n34Q250J3929K589q643o974m592q669m889Q717J2825L276
$$ -3639 -11941 -8933 -7520 -8054 196 14125 16714 8071 1097 -3495 -12164 -17053 -8336 4489 7765
1354G765l25M551j672j3862j2545J537P107M356O700J0439J430j0511p399j643
$$ 7765 7440 11991 10319 -3543 -16088 -14551 -7444 -3088 3612 14051 15481 4970 -2429 -4072
1368d072n065o400O649J5900P700l344l218k377j0231r669J491P937L083M354
$$ -4072 -9137 -15537 -8888 7012 14712 11368 8150 5773 -4458 -14127 -12636 -4699 -1616 2738
1382B738J0843L591j1630j4620k401J751n38M262J2051P324l633l518k390q842
$$ 2738 13581 17172 5542 -9078 -11479 -9728 -10266 -6004 6047 13371 9738 6220 3830 -5012
1396e012j1332J766J2785Q459J04L896L474q252j3031n010K063J326N514J2980
$$ -5012 -16344 -14578 -1793 6666 6770 10666 14140 5888 -7143 -12153 -10090 -8764 -3250 9730
1410I730Q167p981j0964k160j593p716k010J0175J1327K579J661k62r089j4453
$$ 9730 17897 9916 -1048 -3208 -4801 -12517 -14527 -4352 6975 9554 11215 10953 1864 -12589
1424a2589l111Q163N458J366P758R537k870j2640p725k317k972K195J1487J0014
$$ -12589 -15700 -7537 -2079 -713 7045 16582 13712 1072 -6653 -8970 -11942 -9747 1740 11754
1438A1754j819l793J065l094j3546q655O443J0945N212M766M412n300j2668n779
$$ 11754 9935 6142 7207 4113 -9433 -18088 -11645 -700 4512 9278 13690 8390 -4278 -10057
1452a0057K198o44j477Q770J4212K116q000o175l115o791m226O137R832L024K043
$$ -10057 -7859 -8503 -9980 -1210 13002 15118 7118 943 -2172 -8963 -13189 -7052 2780 5804 7847
1467G847N611j903j4594j1835K431P009L378M068Q453J835p261o355k669o648
$$ 7847 13458 11555 -3039 -14874 -12443 -5434 -2056 2012 10465 12300 5039 -1316 -3985 -10633
1481a0633n413P685J5085N518m640k016k03p846r553P99O097L998N426R705J893
$$ -10633 -16046 -8361 6724 12242 7602 5586 5383 -2463 -12016 -11217 -5120 -1122 4304 14009 15902
1496A5902j1961j1345l97K145l071K522J0876P859k781m143l269q605r165L000
$$ 15902 3941 -7404 -7801 -5656 -8727 -6205 4671 12530 9749 5606 2337 -6268 -15433 -12433
1510a2433J1487N098r32L838N094o428j2246n040K189J700N517J1067O074o636
$$ -12433 -946 4152 3220 7058 12152 5724 -6522 -11562 -9373 -7673 -2156 8911 14985 8349
1524H349p847o01k348q071k049J0597R959J199o41k59o828j0731k276M956K226
$$ 8349 502 -99 -2447 -10518 -12567 -1970 7989 9188 8547 8288 1460 -9271 -11547 -6591 -4365
1539d365J120Q853R566l943j2940o774K22j151J807Q502Q193j067k585J800l945
$$ -4365 -3245 5608 15174 11231 -1709 -8483 -8261 -9412 -7605 897 9090 8023 5438 7238 3293
1554C293j2026o449P377R233L377K916M402l482j0602n869M69j293j31R582J2026
$$ 3293 -8733 -15182 -7805 1428 4805 7721 12123 8641 -1961 -7830 -7361 -8654 -8785 797 12823
1569A2823m59r081m563o44n746m549M485Q691L683K702M903l612j3278q424L875
$$ 12823 12364 3283 -1280 -1924 -7670 -12219 -7734 957 4640 7342 12245 8633 -4645 -13069 -9194
1584i194O041R26L941Q661K416p317o467k649n103l455O913J1605L012l901m60
$$ -9194 -3153 -2227 1714 10375 12791 5474 -993 -3642 -8745 -12200 -5287 6318 9330 5429 4969
1599D969P70q091r724K6P069M300M842P444p4r986q448R28Q58l561K893J1072
$$ 4969 5739 -2352 -12076 -12050 -4981 -681 4161 11605 11531 1545 -6903 -5975 -5117 -8678 -5785 5287
1615E287P671l351n044l070o869o437L045R032L400j11M876L187p336j2480l082
$$ 5287 12958 9607 4563 1493 -5376 -11813 -8768 264 3664 3553 8429 11616 4280 -8200 -11282
1630a1282L411K114L422Q861N419n166o328j377l909p254P02J1090Q920o41j261
$$ -11282 -7871 -5757 -2335 6526 11945 6779 451 -926 -4835 -12089 -11387 -297 8623 7982 6721
1645F721L85n192q973k575M254K108J804Q481P942n045j1512m858J58k070N64
$$ 6721 7106 1914 -7059 -9634 -5380 -3272 -1468 7013 14955 9910 -1602 -6460 -6302 -8372 -7808
1660g808P654P745N5k231J12n022j0526l356P795O776P38K962N222j402r500o670
$$ -7808 -154 7591 7646 5415 5527 505 -10021 -13377 -5582 1194 1932 4894 10116 8714 -786 -7456
1676g456l63l92J503R401R664j414p670k647j005o437m331M610Q461L441J494
$$ -7456 -7819 -8211 -6708 2693 12357 10943 3273 626 -379 -6816 -11147 -6537 1924 5365 6859
1691F859K751k934j0846o768K673L600L87M668R372K031p511o650k444l147k289
$$ 6859 9610 6676 -4170 -10938 -8265 -4665 -4278 390 9762 11793 4282 -2368 -4812 -7959 -10248
1706a0248O171R517K724k393J066K0r076r169J170P204L707L234N336R14p797
$$ -10248 -4077 5440 8164 5771 6837 6857 -2219 -11388 -10218 -3014 693 3927 9263 10177 2380
1721B380o624j240j449l094L947J1354N712m166l977j617n906n875J862P006L994
$$ 2380 -4244 -5484 -6933 -10027 -6080 5274 10986 6820 2843 1226 -4680 -10555 -8693 -1687 2307
1736B307J703M907K267p800j0255j595L071J013K218P978N325l525n200k486m717
$$ 2307 4010 8917 11184 3384 -6871 -8466 -5395 -4382 -2164 5814 11139 7614 2414 -72 -4789
1751d789o717J616J0005O682j153m03J021m325q857k963L358K924K671P213N586
$$ -4789 -11506 -9890 115 6797 5644 5241 6262 1937 -6920 -9883 -6525 -3601 -930 6283 11869
1766A1869m366q765k709j35l558q25Q336Q362P39k582j479m757q054k062N818
$$ 11869 7503 -1262 -3971 -4106 -7664 -8489 -153 8209 8948 6366 4887 130 -7924 -9986 -4168
1781d168M661L85L184N838k031q736o057m59l86J455P336P833q53n132j222j398
$$ -4168 493 878 4062 9900 7869 -867 -6924 -7383 -7769 -6314 1022 8855 8002 2870 1648 250
1797B50p026m478N381Q504K650J125J981k621q154n062J872R54K88M854Q988J436
$$ 250 -6776 -11254 -5873 2631 5281 6406 8387 5766 -2388 -7450 -5578 -4624 -4336 518 9506 10942
1813A0942p553n777j606k458k620M540P797K437j056J486j221q364p120K102O400
$$ 10942 3389 -2388 -3994 -6452 -9072 -4532 3265 5702 4646 6132 4911 -3453 -10573 -8471 -2071
1828b071K316K522M978J560n988n950j532j877k151M364J0196L470m205l116q01
$$ -2071 245 2767 7745 9305 3317 -2633 -4165 -6042 -8193 -3829 6367 9837 5632 2516 1715
1843A715m273o132J047N489L549K023M290P08p212q080k02K531k91J394P536N390
$$ 1715 -2558 -8690 -7643 -2154 1395 3418 7708 8416 1204 -6876 -7078 -4547 -4838 -3444 4092 9482
1859I482k898m537k253l968m837J849P945M768m17K31J712m627q403k598L485
$$ 9482 6584 2047 -206 -4174 -9011 -7162 783 5551 5134 5365 7077 2450 -5953 -8551 -5066
1874e066K628J957N860L728m342n986k196k03l856o86P627P491j0k314j748l792
$$ -5066 -2438 -481 5379 9107 4765 -1221 -3417 -3620 -7476 -8162 -535 6956 6946 4632 2884 -908
1890i08o060j608N207L717P35L553M839k457q727m517J156M04P31N316N895k71
$$ -908 -6968 -8576 -3369 348 1083 4636 9475 7018 -1709 -6226 -5070 -4666 -3935 1381 7276 7005
1906G005l935j384k324o370l242N768P304J237jJ816j644o893m255J669J240M87
$$ 7005 3070 1686 -638 -7008 -10250 -4482 2822 4059 4058 5874 4230 -2663 -6918 -5249 -4009 -3522
1922c522M828P323M3o350l914o83k441k532L769P031K230o13L88j652p560n429
$$ -3522 1306 8629 8672 2322 -1592 -2275 -4716 -7248 -3479 3552 5782 5169 5557 3905 -3655 -9084
1938i084K908M855J148J690M592J207n307n792r73j156j377M460P637K899l381
$$ -9084 -6176 -1321 -173 1517 6109 7316 2009 -3783 -4756 -5912 -7289 -2829 4808 7707 4326
1953D326j849m52m519n936J529O241L440J244K741L70o119o446k24K134r80K239
$$ 4326 2477 2025 -2494 -8430 -6901 -660 2780 4024 6765 7135 1016 -5430 -5654 -3520 -4500 -2261
1969b261O764M387l482m641k148l264l503J458O896L852o1Q06J190m735p260j451
$$ -2261 4503 8890 5408 767 -1381 -4645 -8148 -6690 206 4058 3997 4803 5993 1258 -6002 -7453
1985g453L625K200J981M783L596l311n637k048j243l035L89P098N514q28j941
$$ -7453 -3828 -1628 353 5136 8732 5421 -216 -2264 -3507 -6542 -6153 945 6459 5631 3690
2000C690m44l250o423j681M368L567J545L054L432l157o937l272P56j12Q27N103
$$ 3690 3246 -4 -6427 -8108 -3740 -173 1372 4426 7858 4701 -2236 -5508 -4752 -4864 -4037 1066
2016A066O119l72l648j658k308n193j798M606N667J254P30K167k183p039m290
$$ 1066 7185 6813 3165 1507 -801 -5994 -7792 -3186 2481 3735 4465 6632 4449 -2590 -6880
2031f880J446J894Q12M283N643l20n205l261p88l016k126M052O728J848r17O26
$$ -6880 -5434 -3540 -2728 1555 7198 6878 1673 -1588 -2376 -5392 -7518 -3466 3262 5110 4193 4819
2047D819j389o259m651J970L746J770K791M437L1n701m584m31j018j515L239O696
$$ 4819 3430 -2829 -7480 -5510 -1764 6 2797 7234 7265 1564 -3020 -3451 -4469 -5984 -2745 3951
2063C951K256j876j713r97n028m688J431N451K840J097L216N91n072n939m04J191
$$ 3951 6207 4331 2618 1621 -3407 -8095 -6664 -1213 1627 2724 5940 6531 1459 -4480 -4884 -3693
2079c693k08K523N688K988k538l560r84l125m142J054N922L920MQ01L78m459o093
$$ -3693 -3901 -1378 4310 7298 4760 1200 216 -2909 -7051 -5997 -75 3845 3849 4650 5028 569 -5524
2096e524j099K901J225J734M949L206l385n203j587o91k038K85N473M973L1j055
$$ -5524 -6623 -3722 -2497 -763 4186 7392 4007 -1196 -2783 -3474 -5512 -5227 246 5219 5250 4195
2112D195l03l727n894r30L957L520M54K825K637k124n793k792k22j164R35N688
$$ 4195 3892 165 -5729 -6659 -2702 818 1272 4097 6734 4610 -1183 -3975 -4197 -5361 -4426 1262
2128A262N035j157k990j385j336m756j758L672M802J309J551J700k199o018l019
$$ 1262 6297 5140 2150 765 -571 -5327 -7085 -3413 1389 2698 4249 5949 3750 -2268 -5287
2143e287J429J040L17L769N512K09m629l140j609k654j165M064N181O65n55R49
$$ -5287 -3858 -2818 -2501 1268 6780 6989 2360 -780 -2389 -5043 -6208 -2144 3037 3702 3147 4096
2159D096r38n937m252J685L632J389K213L741Q9m733l653L7j418j283L301O353
$$ 4096 3158 -2779 -7031 -5346 -1714 -325 1888 5629 5718 985 -2668 -2631 -4049 -5332 -2031 4322
2175D322J860k165j862r19l371l894J556L689J664J405L428L79n500n144n94J701
$$ 4322 6182 4017 2155 1236 -2135 -6029 -4473 -784 880 2285 5713 6092 592 -4552 -5146 -3445
2191c445M97J994M124K192j988k172j035l346l135J468N563K878l83P19R10l509
$$ -3445 -2948 -954 3170 5362 3374 1202 167 -3179 -6314 -4846 717 3595 3212 3931 4841 1332
2207A332n557r54J937J583J750M577K022l714m389n01m45k423r0M611M308K92
$$ 1332 -4225 -5179 -3242 -1659 91 4668 6690 2976 -1413 -1914 -2359 -4782 -4872 -261 4047 4339
2223D339j199m54l692m877J1L743K436M65K484K998k294n614k114L83l30J138
$$ 4339 3140 2686 -1006 -5883 -5872 -2129 307 772 3256 6254 3960 -1654 -3768 -3385 -3715 -2577
2239b577M480L304j068k310j72j682m679j807L701M492J360O85N01k213m795j710
$$ -2577 1903 5207 4139 1829 1657 -25 -4704 -6511 -2810 1682 3042 3727 4228 2015 -2780 -4490
2255d490J257M27O6L535N243l30m918k134o27j860q18L236L934J067J42O07j757
$$ -4490 -3233 -2806 -2740 795 6038 5708 790 -1344 -1971 -3831 -4649 -1413 2521 3588 3730 4337 2580
2272B580n420l136K394K905Q65J414L067N4l832k985j158j310p79L588O054O67
$$ 2580 -2840 -5976 -3582 -677 188 1602 4669 4723 891 -2094 -3252 -4562 -5341 -1753 4301 4968
2288D968k616j192n31k840l007P87M029J808J598K453m99n065m040P39J453n86
$$ 4968 2352 1160 629 -2211 -5218 -4431 -402 1406 3004 5457 4958 -107 -4147 -3408 -1955 -2541
2304b541J427M729K049k015k910j587k856k414K671M663J453q59J296R25l571
$$ -2541 -1114 3615 5664 3649 739 -848 -3704 -6118 -3447 1216 2669 1810 3106 4031 460
2319D60n208o65K241J789K124L510J405l218l466l80q39k171N23M969L876r45
$$ 460 -4748 -5413 -3172 -1383 741 4251 5656 2438 -1028 -1408 -2247 -4418 -3895 1074 4950 4005
2335D005j205r08k611l533l47K597J551Q39L177K680k967n637k155J333J93Q98
$$ 4005 2800 1892 -719 -4252 -4599 -2002 -451 388 3565 6245 3278 -2359 -4514 -3181 -2988 -2090
2351b090L529K702q03j562j43j959m613r24M342L827Q00J90R06j928m428j780
$$ -2090 1439 4141 3338 1776 1633 -326 -4939 -5863 -1521 2306 3106 3296 4202 2274 -2154 -3934
2367c934P10L13J348L913L475j266m566j273l11j916j394K889L903J192K35P55
$$ -3934 -3224 -2911 -1563 2350 5825 4559 -7 -1280 -1591 -3507 -4901 -2012 1891 3083 3318 4073
2383D073k695m900k195K628K634L43J867K775O0l526k660r82r37l07L360M225
$$ 4073 1378 -3522 -5717 -3089 -455 -112 1755 4530 4590 1064 -1596 -2578 -3515 -3822 -462 3763
2399C763L45j892j06p96l834l402J534L825K015J234J876j382m115k459O98J52
$$ 3763 4108 2216 2110 1314 -2520 -5922 -4388 -563 1452 2686 4562 3180 -935 -3394 -2696 -2544
2415b544n28J974M405J917j962k402j589j996k088J888M014J419J5J043N64m068
$$ -2544 -3072 -1098 3307 5224 3262 860 -729 -2725 -4813 -2925 1089 2508 2523 3566 4130 62
2431F2m763L85K290P39J628K980R89k282k222j231j256k336J296M962K796o88
$$ 62 -4701 -4316 -2026 -1287 341 3321 4310 2028 -194 -1425 -2681 -5017 -3721 1241 4037 3349
2447C349j307%k495l443n9K467J356J089K795J801l221m277j233Q96o01M80L540
$$ 3349 2042 2042 -453 -3896 -3955 -1488 -132 957 3752 5553 2332 -1945 -3178 -2282 -2883 -2403 1137
2464A137L134r54j668p26j989l695l6L610K356K73R64J618j809m120k034R73M63
$$ 1137 4271 3317 1649 923 -1066 -4761 -4797 -1187 1169 1442 2406 4024 2215 -1905 -3939 -2966 -2503
2481b503J256L449K964j453l202q64l20k332r35K686L426N29J96J33j681m233
$$ -2503 -1247 2202 5166 3713 511 -353 -673 -3005 -3940 -1254 2172 2701 2897 3030 1349 -2884
2497b884j826J762J743N35K185K877o29l990k269j4j48m23K861L189J08j103K37
$$ -2884 -4710 -2948 -1205 -670 1515 4392 3763 -227 -2496 -2510 -2658 -3081 -220 2969 3077 1974 2211
2514B211p46l818k855J954L473J200J093J637r75l593k799O16Q00p80K134L777
$$ 2211 1465 -2353 -5208 -3254 219 1419 2512 4149 3174 -419 -3218 -2602 -1802 -2582 -448 3329
2530C329O16k300j617l58j854k306J584L138J626M70J355m61l956l348O65K499
$$ 3329 3945 1645 28 -330 -2184 -4490 -2906 232 1858 2328 3683 3222 -734 -4082 -3417 -918
2546i18L70J200K388J064k250k351l84j395j821J654L956J975j100m46m16k450
$$ -918 -548 652 3040 4104 1854 -497 -881 -2276 -4097 -2443 1513 3488 2388 1942 1526 -924
2562i24l110N6K330J753O34K513O64k675l414k72Q87j458J184L276K578r09j674
$$ -924 -4034 -3978 -1648 105 739 3252 3916 1241 -2173 -2445 -1558 -3016 -1832 1444 4022 3113 1439
2579A439p84j931k442L11L208J980L8O63J198k160l829j286R69R71Q74K566K214
$$ 1439 655 -1276 -3718 -3407 -199 1781 1819 2482 3680 1520 -2309 -3595 -2626 -1655 -781 1785 3999
2596C999j620k390q56o26k208K3L194L116L13n51J37j587l189j225J616J482Q3
$$ 3999 2379 -11 -867 -1493 -3701 -3678 -484 2632 2945 2394 2531 944 -2245 -3470 -1854 -372 -289
2613b89K123K770j054m224j542N5m82k3K748K505K15r90m27p23l776j304K000
$$ -289 1834 4604 3550 -674 -2216 -2161 -2643 -2666 82 2587 2802 1812 1385 662 -3114 -4418 -2418
2630b418K606J105O00J761p30l539k095mK76M68K716L245l22k539j137k28j595
$$ -2418 188 1293 1893 3654 2924 -615 -2710 -2714 -2438 -1970 746 3991 3669 1130 -7 -235 -1830
2647a830j825J321K799J492M15Q53j131l320k833J118J640N74J103K335J276k453
$$ -1830 -3655 -2334 465 1957 2372 3225 2094 -1226 -4059 -2941 -1301 -727 376 2711 3987 1534
2663A534k388p27p08j288J871L226J816r55l74J19k921l136K76K776J523N80K107
$$ 1534 -854 -1581 -2289 -3577 -1706 1520 3336 2381 2007 2126 -795 -3931 -3655 -879 644 1224 3331
2680C331K3k553k602n40L84q90O08L986K178j471j418n20j781k325L63K857J925
$$ 3331 3354 801 -1801 -2341 -1957 -2847 -2239 1747 3925 2454 1036 516 -1265 -3590 -3227 -370 1555
2697A555K07J005P15k451l601n46J411P13O00K399J807j217k107o01j444j922
$$ 1555 1762 2767 3482 1031 -2570 -3116 -1705 -992 -392 2007 3814 2597 490 -111 -1555 -3477
2713c477j45L649K250L6o20J68j305l138r22J585Q14R00K270J937j246l405j276
$$ -3477 -3622 27 2277 2313 1693 1861 556 -2582 -3504 -1919 -1105 -205 2065 4002 2756 -649 -1925
2730a925K86m20n53K703L085k95j316k93j179k499j105J548K524K16R08J639q72
$$ -1925 -1639 -2059 -2612 91 3176 2881 1565 1272 93 -2406 -3511 -1963 561 777 1685 3324 2452
2747B452l546j736J43K21K25K706K955k60k083j253p1j819j794K086K896Q06J70
$$ 2452 -1094 -2830 -2687 -2466 -2241 465 3420 3160 1077 -176 -247 -2066 -3860 -1774 1122 1928 2098
2764B098Q15q02l002k121P69J131J29J686K654Q6k524j989L7j378n41J208L113
$$ 2098 2913 2111 -891 -3012 -2243 -1112 -983 703 3357 3443 919 -1070 -1033 -2411 -2952 -1744 1369
2781A369R84r12L0m9k695k194K96K223J276O38K057K08k427k693K08j08k74P79
$$ 1369 2353 1441 1471 1422 -1273 -3467 -3171 -948 328 966 3023 3231 804 -1889 -1681 -1789 -2063 -1284
2799a284L292J358j500q66m92j458k586L84K679J484L01Q86M11j926l288l07J312
$$ -1284 2008 3366 1866 1000 508 -950 -3536 -3152 -473 1011 1312 2198 2609 683 -2605 -2912 -1600
2816a600j9O82K736J629j452j735p84m42k093N83K808J880k12r5L92j856k754
$$ -1600 -1619 -937 1799 3428 1976 241 -543 -985 -3078 -2495 313 2193 1981 1886 2278 422 -2332
2833b332o26J696R43Q5J862J804j517k586r34j86o87j10K938K227k74j335M8p84
$$ -2332 -2958 -1262 -319 -234 1628 3432 1915 -671 -1605 -1791 -2478 -2588 350 2577 2303 968 1016 232
2851B32k889r39K185K143M08L34J613j180l029j197P69J91k13K195K599m67k048
$$ 232 -2657 -3596 -1411 732 1140 1474 3087 1907 -1122 -2319 -1550 -1359 -1572 623 3222 2755 707
2868G07j072j89j640q78J740K465L70m47J174m82l170k011J118J286K05J614K230
$$ 707 -365 -554 -2194 -3072 -1332 1133 1503 1056 2230 1748 -1422 -3433 -2315 -1029 -824 790 3020
2885C020J30k531j575lj009r52J934K771M28n10m53j8k499j929J114J777L1J198
$$ 3020 3150 619 -956 -959 -1968 -2920 -986 1785 2213 1703 1250 1232 -1267 -3196 -2082 -305 -274 924
2903I24J761p1k351k337J08J98l69J420K536R92j275j037j12j612j712Q55K379
$$ 924 2685 2614 263 -2074 -1966 -1768 -2137 -717 1819 2811 1536 499 387 -1225 -2937 -2082 297
2920B97J060j80R89P64k663k496j8Q39J39R68K412J228k079j759R0q24j604O45
$$ 297 1357 1177 2166 2930 267 -2229 -2247 -1408 -1269 -301 2111 3339 1260 -499 -409 -1233 -2837 -2192
2938b192K474J565k32j81L11j685k704l16K059P30M48J740J180j296k526r23L23
$$ -2192 282 1847 1615 1434 1745 60 -2644 -2960 -901 -171 277 2017 3197 1901 -625 -1548 -1225
2955a225q04N14K107K170p33r86J47j283k672m01K130J824O4O53J478j574l184
$$ -1225 -2029 -1515 592 2762 2029 1043 1190 -93 -2765 -3166 -1036 788 852 1505 2983 1409 -1775
2972a775n12O68j8k9K796J766k95j911o79n41j591m55J756K102K90MP33j021l121
$$ -1775 -2287 -1619 -1637 -1666 1130 2896 2601 690 11 -530 -2121 -2576 -820 1282 1572 1576 2309 1288 -1833
2991a833j236J289J188J79J054J946n3k201j468k82n14r23K221K570L19p42m90
$$ -1833 -3069 -1780 -592 -413 641 2587 2534 333 -1135 -1417 -1931 -2854 -633 1937 2256 1514 1024
3008A024l51k066j376P53K036P43M91J662l79k452j806O7L91p34J434K646P95
$$ 1024 673 -1393 -2769 -2016 20 763 1254 2916 2537 85 -1721 -1654 -1263 -1997 -563 2083 2878
3025B878j502j127l85j588j383J261K329M56R3P98Q14k585k141k13J129O1R54
$$ 2878 1376 249 -136 -1724 -3107 -1846 483 939 1032 1830 2644 59 -2082 -2295 -1166 -1105 -151
3042a51K375P06j465j584J39q83j935P64K797J462o31j74J01j503k573m6J438
$$ -151 2224 2930 1465 -119 20 -863 -2798 -2034 763 2225 1594 1420 1521 18 -2555 -2601 -1163
3059a163Q46K48J966J077j492k442o58K89o37M88K306J610q87l83l14j062k192
$$ -1163 -317 -69 1897 2974 1482 -960 -1618 -1329 -1966 -1478 828 2438 1551 1168 854 -208 -2400
3076b400R5J772J438J18L41J252j146k533r70M17q6N90J760K221r52j802k31m76
$$ -2400 -2305 -533 905 1023 1364 2616 1470 -1063 -2033 -1616 -1702 -1112 648 2869 1917 115 -116 -592
3094e92j578r32K084J716O37M31M58j356k683o06R86O22O6J629K013k87k234j155
$$ -592 -2170 -3102 -1018 698 1335 1766 2224 868 -1815 -2421 -1435 -813 -747 882 2895 2608 374 -781
3112g81l6j158l64K139J831M69j075N1n09k069j443Q20J913M24Q07J320m09k223
$$ -781 -817 -1975 -2339 -200 1631 2100 1025 1076 567 -1502 -2945 -2125 -212 212 1019 2339 1930 -293
3130b93j201M07j95o67J333K716P50j563j110M6j549j017Q15K020L08J49J416
$$ -293 -1494 -1087 -1282 -1949 -616 2100 2850 1287 177 223 -1326 -2343 -1528 492 800 949 2365
3147B365m91j900k371K49J299k66P37K218O98j760j128l04m94j403Q04K639J049
$$ 2365 1874 -26 -2397 -2148 -849 -1115 -378 1840 2538 778 -350 -654 -1148 -2551 -1747 892 1941
3164A941p59K59j7j510k047K29J328L28K20K164P42j724k177n3J23q40M56K138
$$ 1941 1182 1441 1424 -86 -2133 -1904 -576 -248 -28 2136 2878 1154 -1023 -1076 -953 -1793 -1337 801
3182H01J283o28p92o5j380j773L61J910P48J09J096Q61j208k398n80O14j37M22
$$ 801 2084 1456 664 599 -781 -2554 -2193 -283 465 574 1670 2531 1323 -1075 -1655 -1041 -1178 -756
3200g56J917J481j121j398O8o09j543k91J761J586J29K68J28j059k380n13J263
$$ -756 1161 2642 1521 123 191 -418 -1961 -2252 -491 1095 1224 1492 1620 561 -1819 -2332 -1069
3217a069N01m4J224K217r86j731j110L3o79j08J670J833j47n35L17n73j962j454
$$ -1069 -568 -612 612 2829 1843 112 -998 -965 -1644 -1752 -82 1751 1604 1069 1386 813 -1149 -2603
3235b603J331J481N79K85R81m06k160j126K93j08q4J258K376O2j423m95o50r53
$$ -2603 -1272 209 788 1073 2054 1648 -512 -1638 -1345 -1453 -1537 -279 2097 2159 736 241 -409 -1362
3253a362r39J013J642O28J1J089l62k304j392M94Q64J33P91J691J82j325j232
$$ -1362 -2301 -1288 354 982 993 2082 1720 -584 -1976 -1482 -618 -485 306 1997 2179 854 -378
3270c78k30q81r77J226K173Q89j028Q6J47j532j854L20J560J63P97J351N42j762
$$ -378 -608 -1489 -2466 -1240 933 1822 794 880 1027 -505 -2359 -2039 -479 -316 481 1832 2374 612
3288F12j357l27rk41L17K137J093p27o99J99j364k215O16J899O35R9P74L25j216
$$ 612 -745 -1072 -1081 -1322 -1005 1132 2225 1498 799 998 -366 -2581 -1965 -66 569 668 1442 1767 551
3307E51k129j67N70K1L25J870J546j412j177k62l18j365J69J783J432k44J00J16
$$ 551 -1578 -1745 -1175 -1154 -829 1041 2587 1175 -2 -264 -582 -1947 -1778 5 1437 1193 1293 1409
3325A409q56k136j88J108J07L33J352J227q89j841n66j25m82k98J915J529j83
$$ 1409 553 -1583 -1771 -663 -556 -223 1129 2356 1467 -374 -940 -1065 -1547 -1845 70 1599 1416
3342A416r26J47j88k532r4J337J037N8O89J243p33j832q35K85l80O3J636J808
$$ 1416 490 637 449 -2083 -2177 -840 197 255 944 2187 1454 -378 -1213 -928 -1308 -1245 391 2199
3360B199k90j383k47n23j047r40J250J521K16J06P10l89k091r86M99O26K72P18
$$ 2199 1909 526 279 -244 -1291 -2231 -981 540 756 862 1572 1183 -908 -1894 -1395 -769 -497 221
3378B21J627J28j339j040j1r19n91J071J709P07n02K95k90j361j890P91Q36Q02
$$ 221 1848 1976 637 -403 -414 -1333 -1924 -853 856 1563 1061 1356 1066 -295 -2185 -1394 -558 244
3396B44J76J246j07j265j474K3N9n33O38K214Q24j083n09J39j161j558L87J761
$$ 244 420 1666 1559 294 -1180 -1157 -1098 -1631 -993 1221 2045 962 453 592 -569 -2127 -1740 21
3414B1M20N19Q00q0j455j522K2N50k42N62J785P36j396p28j12n45j345L25J798
$$ 21 441 960 1760 1680 225 -1297 -1275 -725 -967 -405 1380 2116 720 -8 -120 -665 -2010 -1685 113
3433A13Q18p2j92O71p59k137l04J062L62K65J185J257j169j475k05L20j165J63
$$ 113 931 859 667 1338 579 -1558 -1862 -800 -438 -173 1012 2269 1100 -375 -580 -260 -1425 -1262
3451a262J707J117k17l88k36o30j576n42J350R79j51P21J327j135j810l39J26
$$ -1262 445 1562 1345 957 721 91 -1485 -2027 -677 302 151 872 2199 1064 -746 -1085 -959
3468i59N5k45J487J721n39q72m78m04j080o36J478J403J8j60Q89o13k024p68O73
$$ -959 -904 -1149 338 2059 1520 648 170 -234 -1314 -1950 -472 931 949 789 1678 1065 -959 -1727 -1054
3487a054O00k05O78J576K12j311r57k0o72n64Q49J616N52o33O51m97j656j037
$$ -1054 -454 -659 19 1595 1807 496 -461 -481 -1153 -1717 -868 748 1300 667 1318 821 -835 -1872
3505a872O86J018M2Q01R76K14j570j005M05o68n69J039J613N38j088m9j05j274
$$ -1872 -1186 -168 -126 675 1651 1865 295 -710 -305 -973 -1542 -503 1110 1648 560 511 406 -868
3523h68j102P95J246L42K36N91J26j338j371Q3N10j21N45J847M14r45q31k74o38
$$ -868 -1970 -1175 71 413 649 1240 1366 28 -1343 -1260 -750 -871 -326 1521 1935 990 159 -115 -753
3542g53j218O96J541J002m14R7Q9j017j579p3J028L49J19J138N47q03j206l02
$$ -753 -1971 -1275 266 1268 854 951 1040 23 -1556 -1629 -601 -252 -133 1005 1552 749 -457 -759
3560g59l48k87P7J537J135n63k02J65q41j356n6R96P86J58P69N40r44j532o02
$$ -759 -1107 -1394 -1317 220 1355 792 590 755 -86 -1442 -1498 -502 284 442 1211 1751 807 -725 -1327
3579a327N94k09l5J575R84m26j114J44o52r91l56J272J259K3k11Q35p28j585m96
$$ -1327 -733 -942 -977 598 1582 1156 42 186 -466 -1457 -1813 -541 718 741 530 1365 637 -948 -1444
3598a444P80M46k42R04J318l67j092p83J70p00n11R89J475K65p35L66k49j529
$$ -1444 -664 -218 -460 444 1762 1395 303 -480 -310 -1010 -1521 -532 943 1208 473 839 590 -939
3616i39p80P09P50R7N72R27L2j544p67J04K1k46R64J275K95p74j48m50j104p06
$$ -939 -1719 -1010 -260 -163 409 1336 1368 -176 -943 -839 -818 -1064 -100 1175 1470 696 548 98 -1006 -1712
3636a712O63J396NM66N31J23j790j084N72L12l18O71J181N32j170o29O6o35q14
$$ -1712 -1049 347 352 818 1349 1472 -318 -1402 -830 -518 -836 -165 1016 1548 378 -251 -185 -820 -1634
3655a634M16J851M40l40j98K75j010j142J50Q63J61M56R28O05j329r32m28n5k63
$$ -1634 -1218 633 1073 733 535 810 -200 -1342 -1192 -329 -168 288 1216 1821 492 -440 -868 -923 -1186
3674a186J83J629P59m39m30K04r46j450L01J107N77J94P50M30j184j218m57M61
$$ -1186 -1003 626 1385 946 516 720 -226 -1676 -1375 -268 309 503 1253 1683 499 -719 -1176 -715
3692g15P6J24J384P50m36j160J14o99p71N9J218J063j70K13q6n46j571p2M30L93
$$ -715 -639 -515 869 1619 1183 23 137 -562 -1333 -1274 -56 1007 837 1050 964 418 -1153 -1225 -795 -402
3712d02j18J161J070k95j603k71k60p75K30J453J066m64K2J52q38j064m17N98
$$ -402 -520 641 1711 1416 -187 -458 -718 -1493 -1263 190 1256 792 814 966 128 -936 -1353 -755
3730g55P06J75L31J215m26j581l30M2m37k75J091J478J59r41l67j31r69p59P65
$$ -755 -49 126 457 1672 1246 -335 -665 -623 -1060 -1335 -244 1234 1393 452 85 -46 -1015 -1774 -1009
3749a009J486m7J73O22k50j390j091O84L89Q5O49P47M51r50n40k33r16n01P23
$$ -1009 477 430 603 1225 975 -415 -1506 -822 -433 -348 301 1048 1499 549 9 -224 -1140 -1641 -918
3768i18J502K95n8j02j93r61q56J54P96j78M45J054O13j129r39l7l60l12M22J739
$$ -918 584 879 821 719 526 -435 -1291 -1137 -341 -519 -74 980 1593 464 -475 -512 -872 -1184 -762 977
3788I77M80m17l12j86r11j358P07J098L87j53N64N04j154j049j36L54l19L27J263
$$ 977 1457 1040 728 542 -369 -1727 -1020 78 465 312 876 1380 226 -823 -959 -605 -924 -597 666
3807F66P74q43n96l1m53p56l79J456R00J91J99l78k49j424j67N78J80O0R42R99
$$ 666 1440 597 1 -30 -483 -1239 -1618 -162 738 929 1128 750 501 -923 -1090 -512 -332 -272 670 1669
3827A669m42j333k92L3q04m2J047J032k69k9O4p07j042k96R15N81J52L03Q75n71
$$ 1669 1227 -106 -398 -365 -1169 -1211 -164 868 599 570 634 -73 -1115 -1411 -496 85 237 540 1415 844
3847H44j201m55L02m37k2J449Q44J3j053L03m73j339j77R08R86p8L19M43l61j356
$$ 844 -357 -812 -510 -947 -969 480 1324 1337 284 587 114 -1225 -1402 -494 492 414 733 1176 815 -541
3867e41q18N81J57J48P46Q19L70j204n22P8o59q27J313J060J10l52L67M2j289
$$ -541 -1359 -778 -621 -473 273 1092 1462 258 -264 -186 -845 -1672 -359 701 811 459 826 868 -421
3886d21r24O03O28j22N59J002k46j069m78q4m15j61P62R77N85m29n25L02j026
$$ -421 -1345 -742 -114 -236 323 1325 1079 10 -468 -552 -967 -1128 -366 611 1196 767 242 544 -482
3905d82j106O61Q04M23L0N72L44r03j140O2P5J3L16J297N89q08o77j15m78r04
$$ -482 -1588 -927 -123 300 330 902 1246 343 -797 -735 -660 -647 -331 966 1555 747 70 -45 -523 -1427
3925a427M66J002R26l36Q1Qo19j129k01O75mO48J113L95o06j060k97k89n30J98
$$ -1427 -961 41 967 631 712 720 101 -1028 -1229 -554 -558 90 1203 1598 992 -68 -365 -654 -1184 -986
3945i86J293O73k91R2O6q32j105l47R60Q49j91J80Q12k78j234n08J6K4q3J109
$$ -986 307 980 689 781 847 15 -1090 -1437 -477 372 181 361 1173 895 -339 -847 -831 -807 -890 219
3965B19J126n51o69K87p04p79k84J002P86J53J95L89n46j154m38L87K80p3P20
$$ 219 1345 794 125 412 -292 -1071 -1355 -353 433 586 781 1170 624 -530 -968 -581 -301 -374 346
3984C46J135n87r40j01j66j133K99N93J205L51p45M86M4j544j027P73N72K28O94
$$ 346 1481 894 -46 -147 -313 -1446 -1147 -554 651 1002 257 743 787 -757 -1784 -1011 -439 -211 483
4003D83P36m7p32j163J43o7m31O60J433K50o83l5j91r75q28N25J091M23m89J013
$$ 483 1219 1172 440 -723 -580 -647 -1078 -418 1015 1265 582 547 356 -619 -1447 -922 169 592 103 1116
4023A116O8j300r35J45N10l00O42J238M77j035k89l00m76q63J21J199J033n17
$$ 1116 1184 -116 -1051 -906 -396 -696 -54 1184 1661 626 337 37 -439 -1302 -1181 18 1051 534
4041E34L61J77j083j121j57J050l26N45Q48P97r57j037K95m32p47K83J048R23
$$ 534 895 1072 -11 -1132 -1289 -239 -565 -20 828 1625 668 -369 -74 -506 -1253 -970 78 1001
4059A001k01l65J82q79p65N1R72J51kQ60J94m11j440k1j15j23J59Q45J418o47
$$ 1001 800 435 617 -262 -1027 -976 -4 147 145 1005 1199 788 -652 -673 -788 -911 -752 93 1511 864
4079H64r14J02j03r14l98P90R17O1J05P88p26j078o10L98O46o22J163Q61m13p76
$$ 864 -50 52 -51 -965 -1363 -573 344 405 510 1298 572 -506 -1116 -718 -72 -694 469 1330 917 141
4099A41m11n0n11l47J364P18j82o0M0Q3j587m58L41R50j64O20O91j26j000q13
$$ 141 -270 -320 -831 -1178 186 904 722 662 702 785 -802 -1260 -919 31 -133 487 1178 1052 52 -761
4119g61K01k18l06P84J087L5k91j37m4r04l78P8J184o0N17M68P4j447j070L34
$$ -761 -560 -778 -1084 -300 787 822 531 394 350 -554 -932 -854 330 270 787 1255 1329 -118 -1188 -854
4139h54K21J99J03J294K56o08l78l01q11n99P02J307M6j30Q9P33j497q49J76N67
$$ -854 -633 -434 -331 963 1219 611 233 -68 -879 -1478 -776 531 577 447 536 1269 -228 -1077 -901 -334
4159c34l19O09J059K27r28o21N3j00o78K74J021O80k67j23J09j093p17q4J061
$$ -334 -653 -44 1015 1242 314 -307 -254 -354 -1032 -758 263 943 676 553 662 -431 -1148 -1232 -171
4178a71J92n6P15O83p75j076k99K07l02J90J359M82m29m59J27m09j156O1J048
$$ -171 21 -35 680 1363 588 -488 -787 -580 -882 -692 667 1149 720 261 388 -21 -1177 -1116 -68
4197f8P80m13J91Q21q57j243o0L00J04L99L33J028n04r40Q5l60o14k92J294O77
$$ -68 712 299 490 1311 454 -789 -849 -549 -445 -46 287 1315 811 -129 -44 -404 -1018 -1310 -16 661
4217F61J67m99M02k53j339k00N65M30L66K96R25q21o59j88j9k42n58J005J009
$$ 661 828 329 731 478 -861 -1061 -496 -66 300 596 1521 700 41 -147 -166 -408 -966 39 1048
4236A048q0o01j25j13j030n25P11P27L98J97L02oj211o42N09k8m2M95J173%q12
$$ 1048 968 367 242 129 -901 -1426 -715 12 410 607 909 903 -308 -950 -441 -469 -511 -16 1157 1157 345
4257C45l84J18q17n73P72J426j46m63M81Q6j315p38K93P09MK61R43J31q43p31
$$ 345 -39 79 -738 -1311 -539 887 741 278 759 845 -470 -1208 -915 -206 -202 59 1002 1133 290 -441
4277d41J05n66k50N05J296N00o02m63N80n78j120%J067J69P0N45M74r03j059n0
$$ -441 -336 -902 -1152 -647 649 1149 547 84 664 86 -1034 -1034 33 202 272 817 1291 388 -671 -721
4297g21K05k87L17R33P33m29q15J38k03j245K75R75O04Q0K9N13p04j295p5O85
$$ -721 -516 -803 -486 447 1180 751 -64 74 -129 -1374 -1099 -124 480 560 589 1102 398 -897 -972 -287
4317b87j32J57R11O98r12m68k31r3o88K8J070P39q3k57J84m57j290n78P97O68
$$ -287 -419 -262 649 1347 435 -33 -264 -357 -1045 -1017 53 792 709 452 636 179 -1111 -1689 -892 -224
4337b24J81N13O11m22r46l03K16l06j4J004M77P0m56r2j24r04n22P02J192k73
$$ -224 -43 470 1081 659 -287 -590 -374 -680 -694 310 787 857 401 309 185 -719 -1241 -539 653 380
4357C80oO95Nj575n42L31m5k5P57J005K44r94m31O1o71o04R16J015K92l48L68
$$ 380 374 1069 1074 -501 -1043 -712 -757 -782 -25 980 1224 230 -201 -140 -811 -1415 -499 516 808 460 828
4378H28n1j146p87N37Q84n55J94J218M5j126n31J61j79p15M95J428L93o27N8j73
$$ 828 777 -369 -1156 -619 265 -290 -96 1122 1167 41 -490 -329 -508 -1223 -728 700 1093 466 524 351
4398C51o92p97J36J096J52N3M12N00r56j040L12J37k55L52J114L85o50m83j25
$$ 351 -341 -1138 -1002 94 246 299 711 1211 255 -785 -473 -336 -591 -239 875 1260 610 127 2
4417Bn49p75K66J390J75k64M35K97r24o68k97L63j16L90Q00O20m96o68m34N7o67
$$ 2 -547 -1322 -1056 334 509 245 680 977 53 -615 -912 -549 -665 -275 525 1145 649 -19 -453 -396 -1063
4438a063K2J335O31k53j69J86n78j165o5R70N6l7O74P19o26p18n20Ql50j41P96
$$ -1063 -1041 294 925 672 503 689 111 -1054 -1119 -149 -93 -130 544 1263 637 -81 -601 -593 -943 -1084 -288
4459b88J267m15k38L5l73j040j57Q51P23n4J86O43n91r44o01O57k58k10J004Q75
$$ -288 979 564 326 361 -12 -1052 -1209 -358 365 311 497 1140 549 -395 -996 -339 -597 -807 197 1072
4479A072J33j035l81L07q44m80P36J105K8l59M45m7j092r59N79O27k65O46R90
$$ 1072 1205 170 -211 96 -748 -1228 -492 613 641 282 727 680 -412 -1371 -792 -165 -430 216 1206
4498A206J40j207n54J68j92p01N56J251M49o86K44k63p71j037Q19R31j83j6P25
$$ 1206 1346 139 -415 -247 -439 -1140 -584 667 1116 430 674 411 -360 -1397 -578 353 170 154 879
4517H79J62r92r13K08K70m18O04J104r9l62n01N54q31p44K26J159L76l51M04J20
$$ 879 1041 49 -864 -656 -386 -804 -200 904 805 443 -58 496 -335 -1079 -853 306 682 331 735 855
4537H55q74r15J80P05J5l36J072O71o18j017K8j25p71L53Q93P46m30J34K15o85
$$ 855 -19 -934 -754 -49 -34 -370 702 1373 755 -262 -234 -359 -1130 -777 116 862 432 566 781 96
4557I6j037k3P08J64J56N22O82p29o73l71J28j69k60J302O04k1r69M83m62j046
$$ 96 -941 -964 -256 -92 64 586 1268 539 -134 -505 -377 -546 -806 496 1100 1079 110 593 131 -915
$$ [...]
8191A41
##END NTUPLES=NMR FID
##END=
