##TITLE=1H_CA-8529-1
 DMSO, 8 sc, 
 14.1.2019
##JCAMPDX= 6.0         $$ Bruker NMR JCAMP-DX V2.0
##DATA TYPE= NMR FID
##DATA CLASS= NTUPLES
##ORIGIN= UXNMR, Bruker Analytische Messtechnik GmbH
##OWNER= root
$$ XWIN-NMR		Version 3.5
$$ Mon Jan 14 15:55:49 2019 Russian Standard Time (UT+4h)  she@DPX200
##.OBSERVE FREQUENCY= 200.1313
##.OBSERVE NUCLEUS= ^1H
##.DELAY= (6, 6)
##.ACQUISITION MODE= SIMULTANEOUS
##.ACQUISITION SCHEME= undefined
##.AVERAGES= 8
##.DIGITISER RES= 18
##SPECTROMETER/DATA SYSTEM= spect
##.PULSE SEQUENCE= zg30
##.SOLVENT NAME= DMSO
##.SHIFT REFERENCE= (INTERNAL, DMSO, 0, 15.7039)
##AUDIT TRAIL= $$ (NUMBER, WHEN, WHO, WHERE, WHAT)
$$ ##TITLE= Audit trail, XWIN-NMR		Version 3.5
$$ ##JCAMPDX= 5.01
$$ ##ORIGIN= Bruker BioSpin GmbH
$$ ##OWNER= she
$$ F:/spectra/data/she/nmr/H-F/1/audita.txt
$$ ##AUDIT TRAIL=  $$ (NUMBER, WHEN, WHO, WHERE, WHAT)
(   1,<2019-01-14 15:54:09.84 +0400>,<she>,<DPX200>,
      <created by zg, POWCHK disabled, PULCHK disabled
       configuration hash MD5:
       00 E9 B6 7A A2 85 ED C7 34 08 36 98 17 FE 4E 26
       data hash MD5: 16K
       EB 3A 3E A6 67 87 ED FD A7 E6 4F CA 1C 8A 50 A5>)
$$ ##END=
$$ 
$$ hash MD5
$$ EC 34 E8 08 87 DB AB 9C 28 5A F2 13 3F B9 96 E1
##$RELAX= 
##$RELAX= 
##$RELAX= 
##$RELAX= 
##$RELAX= 
##$RELAX= 
$$ Bruker specific parameters
$$ --------------------------
##$DU= <F:/spectra>
##$EXPNO= 1
##$NAME= <H-F>
##$PROCNO= 1
##$TYPE= <nmr>
##$USER= <she>
##$AMP= (0..31)
100 100 100 100 100 100 100 100 100 100 100 100 100 100 100 100 100 100 
100 100 100 100 100 100 100 100 100 100 100 100 100 100 
##$AQSEQ= 0
##$AQ_mod= 1
##$AUNM= <au_zg>
##$AUTOPOS= <>
##$BF1= 200.13
##$BF2= 200.13
##$BF3= 200.13
##$BF4= 200.13
##$BF5= 200.13
##$BF6= 200.13
##$BF7= 200.13
##$BF8= 200.13
##$BYTORDA= 1
##$CFDGTYP= 0
##$CFRGTYP= 5
##$CHEMSTR= <none>
##$CNST= (0..31)
1 1 145 1 1 1 1 1 1 1 1 1 1 1 1 1 1 1 1 1 1 1 1 1 1 1 1 1 1 1 1 1 
##$CPDPRG= <>
##$CPDPRG1= <>
##$CPDPRG2= <>
##$CPDPRG3= <>
##$CPDPRG4= <mlev>
##$CPDPRG5= <mlev>
##$CPDPRG6= <mlev>
##$CPDPRG7= <mlev>
##$CPDPRG8= <mlev>
##$CPDPRGB= <>
##$CPDPRGT= <>
##$D= (0..31)
0 1.2 0 0 0 0 0 0 0 0 0 0.03 0 0 0 0 0 0 0 0 0 0 0 0 0 0 0 0 0 0 0 0 
##$DATE= 1547466849
##$DBL= (0..7)
120 120 120 120 120 120 120 120 
##$DBP= (0..7)
150 150 150 150 150 150 150 150 
##$DBP07= 0
##$DBPNAM0= <>
##$DBPNAM1= <>
##$DBPNAM2= <>
##$DBPNAM3= <>
##$DBPNAM4= <>
##$DBPNAM5= <>
##$DBPNAM6= <>
##$DBPNAM7= <>
##$DBPOAL= (0..7)
0.5 0.5 0.5 0.5 0.5 0.5 0.5 0.5 
##$DBPOFFS= (0..7)
0 0 0 0 0 0 0 0 
##$DE= 6
##$DECBNUC= <off>
##$DECIM= 24
##$DECNUC= <off>
##$DECSTAT= 4
##$DIGMOD= 1
##$DIGTYP= 9
##$DL= (0..7)
0 120 120 120 120 120 120 120 
##$DP= (0..7)
150 150 150 150 150 150 150 150 
##$DP07= 0
##$DPNAME0= <>
##$DPNAME1= <>
##$DPNAME2= <>
##$DPNAME3= <>
##$DPNAME4= <>
##$DPNAME5= <>
##$DPNAME6= <>
##$DPNAME7= <>
##$DPOAL= (0..7)
0.5 0.5 0.5 0.5 0.5 0.5 0.5 0.5 
##$DPOFFS= (0..7)
0 0 0 0 0 0 0 0 
##$DQDMODE= 0
##$DR= 18
##$DS= 0
##$DSLIST= <SSSSSSSSSSSSSSS>
##$DSPFIRM= 0
$$ [...]
##$SUBNAM2= <"">
##$SUBNAM3= <"">
##$SUBNAM4= <"">
##$SUBNAM5= <"">
##$SUBNAM6= <"">
##$SUBNAM7= <"">
##$SUBNAM8= <"">
##$SUBNAM9= <"">
##$SW= 24.933730806125
##$SWIBOX= (0..15)
0 0 2 0 0 0 0 0 0 0 0 0 0 0 0 0 
##$SW_h= 4990.01996007984
##$TD= 16384
##$TD0= 1
##$TE= 0
##$TE2= 300
##$TE3= 300
##$TEG= 300
##$TL= (0..7)
0 120 120 120 120 120 120 120 
##$TP= (0..7)
150 150 150 150 150 150 150 150 
##$TP07= 0
##$TPNAME0= <>
##$TPNAME1= <>
##$TPNAME2= <>
##$TPNAME3= <>
##$TPNAME4= <>
##$TPNAME5= <>
##$TPNAME6= <>
##$TPNAME7= <>
##$TPOAL= (0..7)
0.5 0.5 0.5 0.5 0.5 0.5 0.5 0.5 
##$TPOFFS= (0..7)
0 0 0 0 0 0 0 0 
##$TUNHIN= 0
##$TUNHOUT= 0
##$TUNXOUT= 0
##$USERA1= <user>
##$USERA2= <user>
##$USERA3= <user>
##$USERA4= <user>
##$USERA5= <user>
##$V9= 5
##$VALIST= <valist>
##$VCLIST= <CCCCCCCCCCCCCCC>
##$VD= 0
##$VDLIST= <DDDDDDDDDDDDDDD>
##$VPLIST= <PPPPPPPPPPPPPPP>
##$VTLIST= <TTTTTTTTTTTTTTT>
##$WBST= 1024
##$WBSW= 4
##$XGAIN= (0..3)
0 0 0 0 
##$XL= 0
##$YL= 0
##$YMAX_a= 441847
##$YMIN_a= -626660
##$ZGOPTNS= <>
##$ZL1= 120
##$ZL2= 120
##$ZL3= 120
##$ZL4= 120
##$ABSF1= 10
##$ABSF2= 0
##$ABSG= 5
##$ABSL= 3
##$ALPHA= 0
##$AQORDER= 0
##$ASSFAC= 0
##$ASSFACI= 0
##$ASSFACX= 0
##$ASSWID= 0
##$AUNMP= <proc_1d>
##$AZFE= 0.1
##$AZFW= 0.1
##$BCFW= 1
##$BC_mod= 2
##$BYTORDP= 1
##$COROFFS= 0
##$CY= 11.3945322036743
##$DATMOD= 1
##$DC= 2
##$DFILT= <>
##$DTYPP= 0
##$F1P= 18.9103706918063
##$F2P= -1.10871071338519
##$FCOR= 0.5
##$FTSIZE= 0
##$FT_mod= 4
##$GAMMA= 1
##$GB= 0.15
##$INTBC= 1
##$INTSCL= 1
##$ISEN= 128
##$LB= 0.24
##$LEV0= 0
##$LPBIN= 0
##$MAXI= 10000
##$MC2= 0
##$MEAN= 0
##$ME_mod= 0
##$MI= 1.114404
##$NCOEF= 0
##$NC_proc= 0
##$NLEV= 6
##$NOISF1= 3.799351
##$NOISF2= 2.8
##$NSP= 1
##$NTH_PI= 0
##$NZP= 0
##$OFFSET= 15.70392
##$PC= 1
##$PHC0= -8878.677
##$PHC1= 17.20006
##$PH_mod= 1
##$PKNL= yes
##$PPARMOD= 0
##$PSCAL= 0
##$PSIGN= 0
##$REVERSE= no
##$SF= 200.130013532006
##$SI= 16384
##$SIGF1= 3
##$SIGF2= 2
##$SINO= 400
##$SIOLD= 16384
##$SREGLST= <1H.CDCl3>
##$SSB= 0
##$STSI= 0
##$STSR= 0
##$SW_p= 3612.71676300578
##$SYMM= 0
##$S_DEV= 0
##$TDeff= 0
##$TDoff= 0
##$TI= <>
##$TILT= no
##$TM1= 0
##$TM2= 0
##$TOPLEV= 0
##$USERP1= <user>
##$USERP2= <user>
##$USERP3= <user>
##$USERP4= <user>
##$USERP5= <user>
##$WDW= 1
##$XDIM= 8192
##$YMAX_p= 0
##$YMIN_p= 0
$$ End of Bruker specific parameters
$$ ---------------------------------
##NTUPLES= NMR FID
##VAR_NAME=  TIME,          FID/REAL,        FID/IMAG
##SYMBOL=    X,             R,               I
##VAR_TYPE=  INDEPENDENT,   DEPENDENT,       DEPENDENT
##VAR_FORM=  AFFN,          ASDF,            ASDF
##VAR_DIM=   8192,          8192,            8192
##UNITS=     SECONDS,       ARBITRARY UNITS, ARBITRARY UNITS
##FACTOR=    0.0002004,     1,               1
##FIRST=     0,             0,               0
##LAST=      1.6414764,     0,               0
##MIN=       0,             -626660,         0
##MAX=       1.6414764,     441847,          0
$$ Real data points
##PAGE= N=1
##DATA TABLE= (X++(R..R)), XYDATA
0 0 0 0 0 0 8 -8 8 -8 16 -16 24 -29 32 -40 51 -56 72 -88 102 -120 142 -165 189 -221 253 -288 331 -377
28 -377 425 -481 544 -610 684 -768 855 -953 1062 -1179 1309 -1452 1607 -1779 1971 -2182
44 -2182 2419 -2681 2979 -3316 3701 -4150 4679 -5309 6078 -7047 8301 -10000 12449 -16304
58 -16304 23296 -40035 162382 -25359 -485235 -213292 261628 434225 43221 -344340 -299547
69 -299547 127108 339372 91686 -331769 -385400 -34112 310311 247437 -69860 -229315
79 -229315 -39083 221249 230629 -8945 -175155 -87628 103785 113177 -80532 -233645 -147184
90 -147184 65518 156963 52463 -70567 -50333 64518 102690 22232 -51475 -7236 87930
101 87930 85056 -40786 -143527 -101711 19077 54488 -30903 -99471 -30157 107218 141393
112 141393 23891 -101937 -76093 76415 172395 88697 -91372 -179758 -104280 25247 65648
123 65648 6337 -49126 -28117 38116 72930 45077 -12702 -49676 -39135 10216 65994 83421
135 83421 33365 -58194 -112018 -67651 33958 76532 4613 -93079 -83262 38929 130786 77117
147 77117 -56383 -96222 19256 146620 105556 -83939 -204265 -102416 105216 165120 5042
158 5042 -169699 -131302 78963 198345 74302 -140621 -172205 31888 226804 167306 -87224
169 -87224 -240158 -121135 110590 173747 9439 -160572 -123646 64980 166668 61697
179 61697 -105873 -120405 31907 151371 84982 -79257 -134429 -25266 91715 63058 -61567
190 -61567 -104784 -2550 112261 82348 -61556 -137802 -42635 110957 134890 5055 -110792
201 -110792 -72149 59789 108897 11657 -107321 -99699 19477 98861 40388 -75140 -93629
212 -93629 13569 114214 85078 -31893 -88190 -21183 69850 58778 -44574 -107406 -43759
223 -43759 76421 107356 7623 -104984 -95977 22475 110863 72518 -36355 -84173 -24397
234 -24397 62386 70124 -9593 -82272 -64788 21245 77351 44760 -32314 -66621 -28224 31976
246 31976 49849 15944 -23931 -25555 6650 28896 11974 -22269 -30768 -1954 29282 25048 -11240
259 -11240 -40095 -28534 12794 38497 19046 -22095 -30799 9050 50046 37515 -21394 -60422
271 -60422 -32994 30728 55804 9285 -56300 -61150 3749 65113 51928 -14233 -49157 -13968
283 -13968 37457 34373 -19353 -52607 -19436 39426 47619 -7149 -54144 -29175 36102 53825
295 53825 -3781 -62063 -38725 41987 77383 16137 -71999 -77130 14044 94230 64295 -43638
307 -43638 -99498 -35695 66751 80362 -9937 -87134 -53058 49636 93458 23471 -73248 -76577
319 -76577 16081 86920 46777 -51485 -81523 -8073 70466 51897 -38930 -83153 -21450 73423
331 73423 83703 -4094 -84547 -60761 36495 86458 29608 -62954 -78118 -3103 68303 52709
343 52709 -23743 -66169 -25404 45002 60611 5768 -49923 -42249 11104 40335 14778 -24191
355 -24191 -24863 9871 30699 10188 -24430 -28877 3515 31623 18005 -21469 -36081 -6151 33456
368 33456 33989 -2985 -32135 -20393 16445 32990 7631 -32097 -38427 -1990 36022 32233 -6083
381 -6083 -32278 -17300 17330 29436 5510 -23705 -22240 7929 28094 9782 -26205 -32614 2588
394 2588 37358 28807 -14825 -39961 -15692 30543 41601 173 -46590 -39661 17211 56845 29377
407 29377 -35450 -60053 -14208 48893 55790 -762 -53774 -43088 16412 52245 22048 -34730
419 -34730 -46995 -301 47109 37929 -13683 -44332 -20780 24631 35058 -927 -36477 -26560
431 -26560 16605 39196 13245 -26636 -29528 7552 37249 21814 -21283 -42153 -16540 25566
443 25566 35869 3565 -30919 -25860 11506 35483 17606 -18929 -31481 -8476 20904 23479
455 23479 -2002 -23869 -15880 11390 23046 6631 -15404 -14907 5008 16217 3756 -16395 -16916
468 -16916 5410 24255 14290 -15457 -28287 -5664 26468 27899 -5291 -32792 -20969 16581
480 16581 33911 8536 -30074 -35416 2430 39846 31327 -12840 -38880 -14900 26650 32429 -3816
493 -3816 -36749 -24443 17619 36741 8950 -30741 -30237 12316 43029 20671 -28266 -42447 -4512
506 -4512 37442 30074 -17360 -45423 -17191 35081 48020 4288 -44062 -38451 12826 45216 19916
519 19916 -29620 -42417 -4497 37002 32798 -8525 -35187 -15953 22371 30377 -1330 -31412
531 -31412 -21479 14337 29272 7287 -22472 -21597 7293 27661 13976 -16988 -26974 -3043 24310
544 24310 21068 -9125 -28274 -14324 14735 24777 6884 -16441 -18580 2061 19294 13245 -8715
557 -8715 -19192 -7068 10982 13446 -384 -11664 -8109 5082 12031 5119 -6345 -8679 248
570 248 8001 3142 -9060 -11517 -255 12812 12687 95 -11450 -9080 4747 13662 4862 -13019
584 -13019 -17868 -2824 15417 15530 -1944 -15219 -9323 8644 17737 5712 -13444 -16856 -887
597 -887 14344 9927 -7313 -13597 -1497 13809 12417 -3605 -15087 -7523 9767 14184 -132
610 -132 -17076 -12892 7770 19757 7521 -13921 -17650 635 19088 15215 -7131 -21538 -10591
623 -10591 13287 20377 1827 -18664 -15907 6180 20008 9640 -10540 -15630 -1008 13818 10018
636 10018 -7868 -16721 -5129 13032 14392 -1507 -13008 -5953 10200 13781 350 -14919 -13894
649 -13894 2295 15023 8434 -9090 -15432 -2193 14554 14100 -1854 -14034 -9261 5371 11833
662 11833 2785 -9991 -10298 2464 13132 8114 -5225 -9759 -1580 6973 5069 -4198 -8940 -3381
676 -3381 5848 7903 474 -7556 -5374 5175 10339 3111 -7766 -9114 -406 7937 5864 -3555 -9764
691 -9764 -5161 5695 9807 2354 -7117 -6825 1967 7508 3402 -4566 -6823 -2173 4333 5084 -294
706 -294 -4776 -2015 4846 6118 415 -6200 -4850 1640 5278 1382 -5016 -6969 -481 7825 7553 -1148
722 -1148 -7984 -3743 5334 7189 -927 -8473 -6853 1857 8475 5762 -2613 -7322 -1697 5767 5979
737 5979 -2265 -7604 -4250 3291 5614 951 -4430 -4522 2120 6848 3682 -4243 -6761 -260 6430 4343
753 4343 -4102 -7978 -2936 5258 7614 909 -6834 -5990 2583 8133 3566 -5166 -7172 -648 5862
768 5862 4642 -1837 -5433 -2413 3839 5799 903 -4734 -3832 1666 4542 978 -4856 -4498 877 4861
784 4861 3796 -1387 -3930 -383 4430 4682 -1688 -6749 -3828 2906 5159 863 -3418 -3203 1311 4797
800 4797 3494 -1828 -4658 -2198 2092 3031 -988 -3530 -1901 1742 3271 1462 -1386 -2374 146 2830
816 2830 1994 -2235 -4169 -555 3989 3336 -1128 -3970 -1189 2514 3331 234 -3163 -2916 621 3447
832 3447 1447 -2497 -2978 -108 2553 2388 224 -1448 -1288 451 1928 1014 -2096 -3393 -787 2483
848 2483 1911 -864 -2099 -269 2200 2306 -329 -2390 -1940 1070 2404 42 -2782 -2169 1448 2879
864 2879 1375 -1079 -1520 -477 730 1323 265 -1975 -2140 393 2094 1486 -185 -1031 -418 687 994
881 994 -101 -1777 -1820 515 1980 868 -1387 -1305 1018 1768 559 -770 -1134 -387 687 954 -158
898 -158 -1390 -1091 655 1292 352 -208 -45 503 700 533 14 -883 -1039 24 1251 328 -1142 -1114 308
917 308 976 355 -77 -511 -77 307 497 82 -1279 -820 723 874 601 -145 132 192 52 214 -209 -928
937 -928 -1221 -22 1515 1062 -549 -825 231 1128 717 -259 -947 -606 366 951 18 -1216 -734 440
955 440 1136 -40 -654 -236 -62 180 974 599 -635 -1403 -255 1257 869 -792 -1178 -47 942 947 -169
974 -169 -1265 -964 516 1420 240 -1508 -1495 901 1680 582 -405 -360 -100 628 1012 219 -1312 -1724 -328
993 -328 1626 1141 -819 -933 187 1091 1008 -337 -1717 -1516 607 1783 327 -1674 -1049 1058 2051
1010 2051 632 -814 -1212 -283 788 985 -403 -1768 -1219 691 1699 238 -1335 -1614 650 1793
1026 1793 1183 -793 -1715 -835 1349 1720 -406 -2449 -1157 1493 1960 419 -1477 -1205 654 1490 682
1043 682 -1148 -2112 -511 1448 1671 -588 -1642 -209 1662 1757 182 -1467 -1681 -311 1486 1128 -1216
1060 -1216 -1971 -16 2353 2142 -686 -1926 -579 1267 1777 -242 -2264 -1798 626 2438 1139 -1654
1076 -1654 -1636 786 2075 844 -1212 -1965 -664 1175 1787 225 -1662 -1443 938 2145 963 -1605
1092 -1605 -1988 -207 1618 1622 -601 -2222 -1697 1158 2807 993 -1960 -1586 1450 2262 636 -1518 -2020
1109 -2020 -320 1391 1395 -733 -1913 -721 1797 2073 156 -1853 -1295 382 1606 549 -1253 -2132
1125 -2132 -1008 1660 2327 294 -2035 -1089 1343 2198 -344 -2796 -1992 111 1947 1343 -894 -1863
1141 -1863 -74 2244 2053 -881 -2803 -1122 1367 1837 -236 -2017 -1463 573 2982 1608 -1334 -2504
1157 -2504 114 3074 1481 -1610 -3089 -976 2041 2536 -46 -2306 -1595 1435 2818 1196 -2553
1172 -2553 -2825 635 2713 832 -1825 -2352 -180 2145 2138 -208 -2642 -1436 1886 2977 -161 -3361
1188 -3361 -1983 1070 2502 1243 -1552 -1987 507 2726 2121 -915 -3230 -1544 1944 2539 -459 -2751
1204 -2751 -1346 1261 2848 934 -1325 -2141 -67 1928 984 -1319 -2447 -532 1595 1344 -423 -1450
1220 -1450 -972 955 1869 765 -1453 -2106 -612 1836 1564 -638 -1938 -796 1128 2201 727 -1161
1236 -1161 -1566 -163 1902 1116 -1018 -2062 -672 1392 1735 197 -1493 -883 1141 2009 848 -1645
1252 -1645 -2428 -564 2419 1710 -1054 -2473 -514 2026 2541 207 -2498 -2191 1149 2958 852 -2590
1268 -2590 -2901 717 3229 2201 -1296 -2762 -942 2577 2871 -120 -3372 -2152 1754 3183 632
1283 632 -2861 -2153 1278 3413 1155 -2434 -2995 32 2702 2073 -1571 -3742 -878 2854 3021 -414
1299 -414 -3268 -1615 1512 2995 1015 -2701 -2896 527 3287 1962 -1727 -3021 -10 2818 2325 -1043
1315 -1043 -2552 -1005 1402 2219 -225 -2701 -1980 966 2920 1218 -1708 -1959 326 2400 1443 -1049
1331 -1049 -2745 -1299 1255 2650 615 -2111 -1667 1060 2640 1225 -1763 -2210 -336 1317 1662 -388
1347 -388 -1485 -972 1122 2140 757 -1353 -1629 614 1707 571 -1087 -1868 -617 1206 2113 362
1363 362 -1984 -1478 1225 2550 614 -1736 -2055 -184 1838 1562 -616 -2175 -1204 1615 2302 153
1379 153 -1906 -1538 641 2119 569 -1397 -2127 -234 1770 1674 -589 -2193 -681 2064 2012 13 -1967
1396 -1967 -1399 732 1899 438 -1694 -1790 177 2471 1938 -1389 -2846 -482 1993 1980 -867 -2481
1412 -2481 -1291 1088 2438 686 -1972 -1966 480 2190 928 -1748 -2519 -85 1898 1403 -488 -1994
1428 -1994 -847 1428 1970 333 -2206 -2017 849 2581 1014 -1521 -2221 143 2440 1717 -747 -2400
1444 -2400 -1285 1610 2389 158 -2295 -1478 907 1820 725 -1292 -1779 10 1764 1249 -113 -1879
1460 -1879 -958 1270 1512 -267 -1790 -1304 853 1398 727 -1117 -1884 77 1974 1492 -854 -1848 -533
1477 -533 1422 1359 228 -1253 -671 765 1120 697 -877 -1474 -173 1168 852 -354 -1094 -88 861
1494 861 949 156 -963 -1067 209 1216 426 -993 -1316 455 1219 1045 -863 -1305 -337 1081 1204 217
1512 217 -1500 -1157 634 1817 906 -1338 -1231 -139 1153 1039 -344 -864 -570 875 1661 435 -1636
1529 -1636 -1348 732 1268 425 -1323 -1357 94 1470 1459 -482 -1848 -1001 1169 1579 -54 -2111 -943
1546 -943 1186 1883 409 -1467 -1440 -96 1854 1035 -590 -1762 -523 1521 1329 -404 -1559 -1060 658
1563 658 1359 395 -901 -1002 231 1578 835 -1032 -1523 -83 1508 984 -1020 -1504 -354 1250 1280
1580 1280 112 -1249 -702 321 1144 434 -1094 -1403 106 1007 832 -148 -774 -158 764 911 144 -1467
1598 -1467 -1081 439 1155 398 -1194 -737 419 1134 537 -604 -1274 -75 891 1170 -62 -1195 -530
1615 -530 845 961 140 -937 -617 -9 859 635 -421 -1138 -699 669 1083 51 -850 -390 675 1005
1633 1005 318 -478 -1224 143 944 810 -685 -1140 -27 1153 710 -192 -939 149 447 649 237 -756
1651 -756 -1066 -243 752 512 -411 -592 -83 869 658 -267 -831 -565 -47 812 319 -406 -728 132 1280 602
1671 602 -730 -886 -191 571 432 -211 -629 -382 322 810 27 -631 -545 268 979 265 -448 -774 -210 502
1691 502 810 0 -484 -807 566 779 456 -782 -723 167 748 735 -558 -957 -383 948 1015 -145 -859
1710 -859 -335 542 798 -5 -1219 -1043 -155 610 601 -99 -911 -178 1005 1150 271 -857 -557 559 817
1729 817 85 -993 -1110 105 1068 687 -620 -784 67 982 564 -771 -1120 -417 524 566 110 -317 -270
1748 -270 634 908 498 -722 -865 -59 626 485 -571 -688 -189 413 769 -15 -830 -714 399 811 387
1767 387 -631 -447 143 361 118 -431 -361 -63 898 493 -257 -507 -261 517 445 -156 -696 -400 -35 560
1787 560 268 -25 -474 -369 305 680 207 -755 -720 213 913 273 -200 -379 3 834 509 -261 -760 -332
1807 -332 299 344 -203 -537 -290 237 570 110 -187 -313 -151 521 543 -43 -732 -307 368 520 320 -477 -193
1828 -193 252 605 493 -619 -814 -120 724 456 -387 -304 89 364 410 -93 -329 -255 -22 95 283 -487 -494
1849 -494 -69 476 438 -198 -129 -47 544 478 -33 -829 -769 106 339 -118 -482 -232 662 869 207 -154 -450 -77
1871 -77 293 212 -226 -634 -321 234 178 322 -171 -31 75 265 236 95 -537 -307 59 439 93 -404 215
1892 215 467 477 66 -362 -471 125 233 156 -418 -170 33 447 304 -111 -318 173 222 538 187 56 -570
1913 -570 -262 90 163 -467 -152 160 260 303 -162 -249 -364 105 466 0 -362 -309 221 658 36 43 -111 272
1935 272 403 267 -284 -376 -95 122 404 88 -53 -90 365 549 186 -305 -223 -210 -12 -101 109 -182 -124 545
1957 545 485 127 -430 22 16 23 -202 -345 -275 -138 108 111 202 -287 -158 499 295 87 -402 -239 259 -7 67
1980 67 -71 -236 -131 146 327 26 -263 -77 154 563 -37 -385 -181 -12 -14 -189 -115 -202 58 415 16 -245
2002 -245 -328 -159 -64 6 -232 -111 -7 299 211 217 6 -460 -42 -25 -92 -165 -58 54 361 310 41 -89 -145 219
2026 219 210 -156 -56 -273 121 230 -125 -316 -84 103 233 540 -104 -228 -402 307 132 50 -213 -190 128
2047 128 -163 -58 101 191 -87 -5 34 -257 -290 -221 7 -136 -74 -181 -60 11 234 186 5 -237 -307 -11 149
2070 149 -94 -268 -55 140 234 91 155 -142 -37 396 43 -109 -256 -224 241 -34 146 39 91 -27 -11 -6
2092 -6 241 11 284 -22 -82 -75 -357 97 -273 -169 -197 -276 83 -122 50 56 16 -33 -229 141 160 208 -43 221
2116 221 120 165 365 -285 -242 -80 47 87 -62 116 132 -75 146 26 106 -67 35 -75 -208 29 -249 298
2138 298 190 86 -106 90 133 56 -200 -132 -48 15 128 68 -93 -15 -76 12 399 -13 222 -36 -176 -15 -124
2161 -124 127 76 189 182 207 -26 53 478 220 -49 -19 -24 151 0 75 45 -275 -220 -72 29 203 -287 90 -112
2185 -112 -30 85 -2 -68 -28 -273 10 329 -132 -70 -68 -79 -289 -8 139 96 167 -172 72 -208 -169 352 -28 49
2209 49 -298 -35 -244 -3 -115 36 -196 -237 -41 250 446 97 -192 41 -115 -123 175 55 102 -223 -81 -173
2231 -173 -89 -8 233 -24 -97 100 184 184 -8 -265 51 80 -157 363 103 -195 -44 -156 206 232 111 21 -304
2254 -304 -150 -219 240 241 -235 -276 115 50 -127 147 -40 -155 -284 -231 15 169 -46 1 -274 106 5 115
2276 115 126 -124 -433 111 -65 326 -224 93 -14 -209 -249 12 196 3 -66 14 -147 -65 120 -179 -26 -160
2298 -160 -165 -125 -93 61 -172 -8 -53 54 408 333 -73 -77 -120 54 271 -98 310 30 -70 107 -84 224 41
2321 41 -92 -432 -189 227 -121 353 -211 -315 -39 167 -89 116 210 -41 -166 -73 -70 140 182 137 29 73 34
2344 34 350 35 -313 -90 66 -66 280 -286 36 -131 -266 -128 164 494 29 -132 -194 -43 -7 260 -211
2365 -211 150 -113 -76 195 74 64 -278 -232 -184 163 308 362 -210 84 -129 257 207 211 -7 -146 51 -322 15
2388 15 252 174 -123 -207 -202 -241 366 227 2 -151 -306 -54 18 367 53 -324 -418 -67 396 326 -99 56 -12
2411 -12 -14 201 222 148 -141 81 86 19 124 149 87 -208 -222 -162 26 60 -203 -180 246 42 131 247 167 -235 -318 269
2437 269 66 116 379 -116 -254 -205 -294 486 -196 17 -191 -85 -142 -39 -56 212 -275 -100 -172 106 139 337
2459 337 -277 -279 183 89 194 15 -150 65 67 51 303 185 209 -59 -165 -235 335 346 -330 -289 -172 194 299
2482 299 -37 143 -21 -290 298 -44 119 123 -114 -243 -372 105 139 150 -134 58 -11 -17 295 119 -3 -111
2504 -111 -215 -401 -120 275 234 25 -176 -234 -59 119 -1 -250 44 50 110 -141 178 61 -181 -112 130 287
2526 287 165 111 -328 62 -100 -120 56 -22 142 -380 -152 -77 207 199 224 1 -181 34 171 -1 -55 -102 -254
2549 -254 44 213 363 56 68 -98 -2 261 -161 120 154 -110 36 40 372 214 -120 39 -178 -51 -92 341
2571 341 -36 -97 -113 -9 73 129 313 -42 -236 42 -151 190 387 44 -468 -131 12 167 383 13 -357
2592 -357 -120 139 246 140 -43 -284 -273 -47 240 -58 -35 62 -249 98 -17 256 199 -30 -163 -221 -372 145
2614 145 -53 -141 -367 5 45 49 41 33 -325 -173 -178 393 308 61 72 -295 -160 -73 70 81 86 -180 -195 12 -1 273
2640 273 24 231 -35 2 -118 -92 -89 -197 -138 -83 -2 480 -69 -279 124 -62 228 139 75 -46 39 -76 -120 204
2664 204 194 401 -172 18 -79 -132 409 191 11 -261 -213 -231 225 180 -293 -55 31 -107 76 191 193 -88 -104
2687 -104 -107 186 -247 382 31 -227 -169 26 85 102 191 -50 -25 20 -25 -92 -179 -114 -257 -318 48 42 313 -447 -13
2712 -13 34 63 209 -59 -72 -65 176 -10 82 119 -120 187 -48 156 251 -207 -179 -84 -10 -111 -17 202 -98 -68 54
2737 54 -171 175 86 163 -392 -152 -146 231 100 -29 -82 220 -400 -99 81 98 137 28 -275 92 264 179 92
2760 92 -2 -266 -87 208 -164 -147 -139 -124 -88 316 406 75 138 -363 -24 281 -120 198 -29 96 -155 -14 122
2783 122 292 -17 151 66 -1 -104 437 129 -130 -35 -125 96 -99 -194 -1 -86 -103 8 61 120 89 -48 -99 -100
2807 -100 95 -93 32 -61 -202 -206 -57 335 209 89 93 -332 105 152 112 95 -154 -268 -157 -161 81 21 -204 87
2831 87 -339 243 172 27 87 -246 103 127 163 80 -150 -37 59 -108 103 148 146 91 20 273 -110 215 270 -205
2855 -205 -81 -150 58 197 -196 61 -223 -69 181 143 -11 75 -161 -38 -195 91 300 -133 187 -93 -29
2876 -29 230 188 326 -120 134 -378 -4 298 -60 -87 18 -61 74 172 74 -329 -265 60 159 183 35 16 -250
2899 -250 -27 -72 266 25 168 38 -172 -101 -307 56 125 127 -266 -25 122 -49 -120 66 -130 -73 -211 36
2921 36 -56 -278 18 5 63 -163 46 -292 105 125 -105 -72 168 -25 -82 -203 -75 3 -59 25 2 -180 20 81
2945 81 -30 220 -51 -157 16 -113 -289 105 42 36 -104 66 246 -126 -19 -234 -81 -84 36 169 129 232
2967 232 -69 122 -80 60 289 -89 71 -285 -207 278 22 95 132 94 -63 51 70 120 -228 -181 8 31 165
2990 165 204 -54 9 -99 10 8 -76 134 27 -89 -3 255 11 -15 -206 103 63 -20 12 92 -154 -90 250 21
3014 21 215 -25 -116 197 -315 -16 143 84 170 46 154 -53 -107 30 4 -254 -279 45 -66 49 59 -22 -4
3037 -4 -99 6 -143 85 25 -149 -17 76 55 98 -41 147 163 4 -50 -27 159 188 207 -10 20 220 -71 -60 -349
3062 -349 -20 -134 4 183 3 3 -283 76 219 65 -225 -40 74 -277 72 -50 70 106 11 -17 164 19
3084 19 171 -86 -131 53 -21 195 8 143 234 -15 -61 318 -214 -276 15 74 -98 20 -88 328 8 102 -150
3107 -150 -66 139 11 107 92 -22 -127 121 193 -177 123 75 -26 -130 -348 -319 166 216 76 17 -173 55 -121
3130 -121 -78 -55 -38 -172 63 20 -117 41 253 -49 0 88 -75 26 -105 -118 240 -36 92 -26 -184 -193 -123
3153 -123 -8 124 24 -104 -67 209 56 -214 -213 -150 104 -311 -222 90 28 -386 -73 164 338 -165 220 -209
3175 -209 13 7 265 24 -16 38 -61 -26 20 -6 -159 18 -14 -50 -165 -195 -14 67 -355 -31 241 175 12 32 -236
3200 -236 -344 42 97 -138 8 83 -204 11 138 67 50 129 283 211 223 385 -347 96 180 211 86 -121 -79
3223 -79 14 131 -4 -225 -10 102 -32 -215 -306 -138 -81 184 8 -146 129 8 31 -149 -191 50 -348 -101
3245 -101 289 108 -163 18 -113 207 -52 82 107 -74 -155 -257 -43 -26 111 144 34 -117 -218 37 113 73
3267 73 -139 3 -34 -91 129 4 -226 213 80 173 -67 97 99 104 -176 -89 88 10 -93 -10 -152 -48 236 -18
3291 -18 -34 119 0 -102 -97 29 101 78 -61 158 67 99 101 108 11 -95 -107 -59 -147 -285 41 362 190 -139 185
3316 185 -46 36 4 213 -397 -81 13 -234 172 120 -126 127 -178 -331 -181 252 25 83 187 -113 94 -286
3338 -286 96 260 38 -188 252 34 -306 171 -283 26 154 -24 -66 12 39 156 -291 -39 -21 62 139 -299
3360 -299 7 104 -152 -270 115 18 -86 103 143 -12 -139 58 20 18 257 -117 -223 53 -43 -110 87 -63 187
3383 187 320 -172 190 149 28 -5 -72 38 -194 152 -258 162 136 -48 5 -66 -149 90 36 -263 -24 58 -41
3406 -41 155 53 0 -17 73 -473 -25 10 -266 213 -174 -10 -188 77 -51 -2 -109 -144 -201 -156 -297 -183 -62
3429 -62 -57 -54 256 104 -41 178 -134 -26 -170 -109 -151 -33 76 -65 45 -213 4 228 -20 216 225 92 66
3452 66 72 209 62 -132 26 -54 71 55 19 40 -10 175 48 -38 168 -33 161 -8 2 -10 70 177 -227 284
3476 284 62 148 -35 -254 -182 -253 76 48 -259 -27 -197 47 -52 -150 -202 120 -142 -80 -255 2 -87 -5 66 -267
3500 -267 300 34 32 323 -177 -44 39 126 20 -167 -98 151 -201 5 73 -314 87 -51 170 126 -74 67
3522 67 -241 -128 -248 266 170 48 -247 153 -10 -213 -355 -57 33 80 72 -11 220 -42 113 -110 70 99 23
3545 23 39 -96 -278 -216 -363 -239 -33 -52 -71 62 -55 246 68 137 -65 19 -99 108 221 -14 -69 66 -48
3568 -48 -273 -34 303 -120 -194 7 415 -260 13 -122 -29 100 -35 -8 -102 -28 -265 268 -204 -43 78 24
3590 24 181 -156 -87 102 17 -63 -97 61 -28 -61 135 -88 -214 147 77 -240 -5 -63 -254 -57 151 57 276
3613 276 82 94 -54 -74 119 104 -74 245 31 21 14 51 22 -18 392 122 -64 3 139 73 169 -49 -92 84
3637 84 -245 -103 -213 53 91 248 70 161 -262 1 -80 -165 244 -107 194 -199 15 -48 97 -38 407 170
3659 170 166 -18 57 130 94 -1 77 -120 -36 46 -28 105 -159 92 235 -91 163 -166 85 57 -8 -155 108 -11
3683 -11 -146 -140 -110 39 -34 -172 342 -70 99 2 -267 -140 52 -15 -139 53 41 -88 65 -257 -118 -4 -142
3706 -142 -195 -97 38 -23 233 -323 -25 -27 -36 -84 -129 -67 31 44 -3 -95 61 -18 111 341 41 -154 152 -211 128
3731 128 312 191 -80 -99 -185 -73 405 -133 165 -21 58 132 -155 -42 25 -49 -69 45 192 -4 33 78 -15
3754 -15 194 109 74 -195 52 211 286 15 122 -186 259 -21 -273 21 -38 -62 -143 179 -173 -298 168 -14
3776 -14 -45 72 112 10 -166 -98 145 -222 -61 -2 26 -30 13 28 -190 238 59 -77 -163 -10 -186 -62 32 -49
3800 -49 153 -345 -283 -14 107 255 -51 -300 -14 -202 104 -41 -106 -141 7 79 -135 132 4 111 -16 -109
3822 -109 -125 -39 -86 69 -33 -111 130 -153 128 96 -1 153 -99 -215 300 93 -108 -53 -14 8 8 -213 -158 -32
3846 -32 23 -62 -106 -137 108 60 18 269 -126 111 -48 153 -129 122 42 41 -96 -61 59 23 -64 -208 76 -10 18
3871 18 -285 -92 -14 69 -14 15 -101 124 138 139 45 49 134 -44 -67 -194 -168 -13 -75 -69 251 -181 -160 -52 44 160
3897 160 -55 -30 244 50 -97 42 114 42 -318 -160 28 -137 -113 -254 198 2 -135 -41 -244 79 135 -36
3919 -36 72 -261 151 -125 39 -97 -161 242 -1 -76 197 -255 -264 -147 195 112 75 -140 -54 111 -127 -92 -148
3942 -148 -61 -76 97 -134 -47 108 -241 6 207 -15 -39 -294 -26 -33 63 21 -350 59 -36 293 -81 50 -141
3965 -141 106 60 -104 -116 134 28 -114 25 33 -20 -16 26 -126 158 -60 82 -82 180 183 53 -155 225 -156
3988 -156 252 70 81 -166 262 -211 186 381 51 -34 153 8 11 77 384 -189 -85 111 238 -125 83 -21
4010 -21 64 -100 -151 152 -157 66 -52 -107 126 33 21 92 98 1 137 73 81 -92 -22 49 211 177 99 21 130 11
4036 11 -144 54 -117 10 149 4 206 -181 56 197 20 -12 -15 -26 111 332 32 -161 -83 159 -171 17
4058 17 -123 83 89 129 -239 49 -91 -11 -49 209 -43 19 2 130 129 171 242 -66 -71 -41 -330 107 95 137 307 -212
4084 -212 138 53 148 222 55 -68 17 199 220 -87 16 180 -35 160 64 92 150 155 -195 9 157 -25 192
4107 192 147 -136 -250 47 10 66 -32 98 75 126 -32 148 119 -25 172 100 103 145 -81 -31 226 85 -59 237
4131 237 -58 -31 103 -23 -5 -86 -16 -201 -87 66 -160 -141 -46 -170 155 82 -75 287 -16 -56 229 46 -292
4154 -292 21 265 -62 155 301 -43 145 -12 165 -89 86 -52 0 337 -61 -17 11 196 166 -106 -236
4175 -236 -350 162 77 179 128 -10 147 -168 28 -224 30 -5 127 64 -39 -84 25 65 111 261 142 -194
4197 -194 42 -21 11 211 -19 18 -27 -37 359 168 -135 97 -149 123 -274 -60 -77 -164 207 -138 63 20 -277
4220 -277 -211 14 -155 -8 28 265 -21 10 92 -66 288 -82 275 -212 43 -188 64 182 -126 -109 185 -68
4242 -68 58 -45 -33 74 -39 153 3 -137 -45 114 -165 -106 -155 -88 -100 -51 -144 -106 0 -163 88 219 223 28
4266 28 -31 -103 26 -16 -121 13 154 -66 331 104 66 101 165 -111 -56 -185 -105 -71 87 94 -464 3 11 21 -283
4291 -283 -96 -111 -305 -46 -55 56 -106 182 36 -73 -198 -351 222 41 43 43 -146 30 -46 5 -33 -24 -51 8 167
4316 167 -31 -77 -35 167 191 -125 62 -2 147 69 15 -157 5 -73 240 29 32 165 -84 -140 -24 59 37 29 -25
4341 -25 -250 -411 -42 96 -69 190 104 121 148 255 -324 359 176 98 63 -192 23 -112 157 -53 -53 118 -19
4364 -19 -100 151 292 -234 64 -233 -198 32 -33 133 29 -151 75 -115 225 53 148 29 -174 252 -230 -314
4386 -314 72 74 -16 54 -148 140 -134 -53 90 -16 -113 -175 -25 -103 -4 -14 42 82 53 353 -153 123 -58 23 47
4411 47 105 -145 163 -172 -21 -20 58 -203 -128 -39 -75 -120 85 123 -33 -43 -13 -94 85 -161 92 -2 -21 60 70 -126
4437 -126 -274 -77 -28 -6 -8 -37 214 141 -226 -110 266 -178 27 -44 -251 253 -243 -171 231 87 83 -42 -53 -45
4461 -45 77 -62 -51 222 260 82 -10 82 -380 -81 138 60 100 40 159 142 -39 -16 -21 286 208 86 3 60 188
4486 188 116 -126 -100 -217 -30 -10 134 -234 -106 9 -59 -170 12 -80 -245 146 29 147 224 -72 171 -46
4508 -46 -96 42 105 40 46 59 -31 -116 -135 146 -56 169 -153 144 114 -78 -76 -57 59 13 54 19 -128 12 8 -35 118
4535 118 -40 -96 2 -24 -79 -61 144 -54 -269 -242 -49 -68 43 48 -197 -54 -98 187 -101 -152 -450 -111 178 125
4559 125 -12 -1 176 -12 -112 29 -191 -123 58 144 94 -66 -235 66 13 -30 -55 -150 -347 84 77 213 -16
4582 -16 110 -15 171 44 -33 218 62 232 141 -233 202 183 36 -144 -76 92 -103 -75 -147 164 154 -53 -154
4605 -154 -82 -244 -39 -174 -6 27 64 -14 60 -54 62 -281 -155 179 216 -97 -132 80 110 -286 63 -10 136
4628 136 117 115 90 96 108 260 -65 45 -32 71 34 -142 20 49 115 -49 -263 138 196 -108 -20 15 -184 -59 89
4653 89 -192 -55 -91 10 2 125 21 92 -141 116 120 -110 -122 223 -90 48 73 -17 -86 -293 77 118 -62 95
4677 95 -148 216 211 -103 174 -63 -23 -41 170 -51 -47 103 -62 62 37 -5 -130 -10 -32 331 219 -36 -42 -40 -120
4702 -120 -53 -55 -69 50 -19 -186 -359 -195 50 -64 154 271 28 -48 67 -206 42 6 -24 -140 -33 -88 82
4725 82 -72 66 -19 20 47 76 51 -98 -59 75 -16 26 -283 -369 -54 -205 170 134 2 -136 -242 18 -230 -243
4749 -243 219 14 -201 -15 -35 228 -22 107 60 162 173 -145 155 -115 210 110 -170 6 -121 175 273
4770 273 48 243 10 59 180 -273 -128 37 -96 135 -132 53 38 -20 195 186 -27 -132 23 -210 -310 220
4792 220 141 -47 -8 10 7 -91 12 -25 -40 -210 -33 178 125 290 140 -267 56 182 3 -53 88 134 65 -127
4816 -127 60 46 104 -178 23 -112 -188 -169 -63 158 -294 -339 -265 -189 -96 -21 208 -130 147 -11 -251 -335 49
4839 49 134 -83 -115 -24 -114 -332 -44 69 0 -229 -56 64 -146 -71 -79 105 -7 -15 63 -146 -1 44 -188 -240 -390
4864 -390 147 250 84 15 -60 64 -21 -143 -12 -223 199 -35 -88 63 212 29 18 -132 -19 31 147 24
4886 24 98 -59 85 180 -133 -34 162 226 21 87 45 -207 -173 -78 195 35 1 -27 354 66 74 179 -23 90
4910 90 96 118 5 47 -147 292 -14 -114 130 -85 -144 -248 98 145 -68 319 144 -91 54 -28 110 -45 -37
4933 -37 120 -48 229 203 -3 -44 -26 55 161 -32 -66 517 150 -44 39 30 111 171 -91 -103 33 -3 -45 -283 204
4958 204 121 270 -47 -153 115 -186 -117 -61 -365 154 -62 47 5 -100 93 -124 -119 -265 81 7 -4 69 -50
4981 -50 98 303 -410 -305 -28 144 -232 -90 22 211 180 -137 -164 -138 124 -174 75 123 169 -29 -37 119 -179
5004 -179 -24 -39 -13 47 -92 -70 -168 19 58 80 43 73 -177 -82 139 76 64 120 39 -57 161 100 -116 128 103 6
5030 6 91 -191 142 -13 80 18 -70 22 -14 -16 -19 -25 -64 -67 -172 280 -50 -110 304 -153 264 70 -157 -247 -61 -195
5056 -195 -93 -110 -47 0 -305 66 20 15 69 -402 -104 -27 141 69 127 -20 -33 -35 -19 -66 112 115 31 170 243 102
5082 102 -112 82 -116 21 -211 -127 -134 -104 -2 -23 -147 171 -231 77 -35 -115 -11 -219 -131 -8 249 -45
5104 -45 -127 -70 90 31 -213 82 -36 131 191 -75 -68 190 48 -168 0 -46 -129 -18 -79 105 99 18 -83 99
5128 99 -88 -210 -42 -130 -75 3 59 186 -32 148 -131 -154 94 -33 -3 -133 -141 -214 293 -17 -82 93 -143 171
5152 171 -441 105 -24 168 50 109 110 -50 37 -43 82 -150 7 -125 -17 -153 145 -337 87 -62 109 -222
5174 -222 -8 151 182 -29 -73 156 -67 -234 181 -4 49 -156 73 -149 -19 -52 17 -234 -172 155 52 207
5196 207 90 -139 80 98 -14 -106 -300 23 155 -208 -32 52 14 91 33 -157 -121 -50 258 -60 -70 129 234
5219 234 -247 -105 3 73 11 37 -30 153 132 -112 142 45 32 -131 224 143 110 80 -169 174 -83 -169 -10 145
5243 145 -239 -16 -107 -54 171 35 55 -66 -165 -1 -41 -21 267 312 207 175 91 163 258 75 -145 14 -38 40
5267 40 23 -22 50 30 203 102 247 112 102 17 228 10 -76 24 136 -164 75 83 125 -116 -23 158 -26 77
5291 77 -138 -30 -4 99 109 87 0 -62 -154 103 -46 111 -51 -107 -122 -25 -80 -74 74 -56 -148 129 154 82 209
5316 209 71 -100 162 125 -115 253 34 -139 -57 -51 9 -60 127 -96 -93 -172 -67 55 -132 44 9 243 27
5339 27 -85 32 -117 17 110 -328 -23 188 347 59 -14 179 -171 56 7 132 100 119 159 -7 62 -65 181
5362 181 -67 -174 -171 -270 72 8 -81 -99 21 -51 81 414 157 155 -112 244 138 163 -83 100 162 19 -11 121
5386 121 -29 -220 86 -104 -157 -136 -73 71 173 -177 28 8 43 191 -11 -264 106 -41 105 123 -247 -163
5408 -163 -67 301 302 -167 -121 6 95 112 -21 22 -15 -266 66 -17 24 -42 165 -100 69 -20 -17 120 85 145 165 -78
5434 -78 165 -182 -182 35 43 -60 158 -72 -173 55 -46 -164 261 36 -280 -130 75 -63 -235 322 -30 83
5456 83 -75 111 79 122 -17 204 -48 -337 -34 -27 61 -123 -109 139 108 -31 117 174 317 111 184 -69 54
5479 54 -201 -117 -196 -15 5 -125 343 55 -151 14 -81 -228 -91 87 178 146 -71 132 -265 -129 -21 -113 66
5502 66 116 -33 244 159 -13 111 -62 86 -61 127 -4 -22 154 -112 26 196 -45 -94 360 180 119 42
5524 42 -32 6 -77 -130 -100 -47 -61 -129 -37 45 5 -54 71 20 107 74 89 137 -211 49 -161 48 51 -33 193 164 -243
5551 -243 78 -83 -295 -121 -90 133 184 -212 14 85 227 29 125 199 -102 -73 9 -33 68 -103 153 267 -55
5574 -55 -19 6 59 -23 -120 -462 -353 58 96 -97 -196 -130 -113 167 45 155 -151 8 88 -27 -113 -99 -281 22
5598 22 -76 15 36 95 -112 7 -69 -49 -57 -90 61 25 33 144 -152 -131 352 124 -245 226 0 -85 -297 15 79
5623 79 146 132 29 -89 99 -113 151 -131 133 -148 126 92 -179 -32 -64 -102 55 30 -143 50 151 185 38
5646 38 -219 -36 222 97 11 191 -72 15 177 -123 -25 108 182 -73 -20 -227 126 145 138 211 86 -52 57
5669 57 48 54 -142 -95 -2 16 54 88 11 271 -36 180 205 -187 -97 -40 32 -66 3 -50 -42 -136 -83 -294 22 158 -84
5696 -84 285 61 -82 162 -5 -81 -122 -49 -105 -274 16 -26 61 -133 121 121 225 -206 -93 225 311 -164 127
5719 127 -152 60 152 103 -224 161 102 -52 120 188 123 -155 79 -178 61 -86 -108 11 133 -34 138 48
5741 48 -76 159 -86 128 -240 -57 214 -220 89 -77 -12 -37 -169 -242 -44 10 37 26 -83 -12 -110 116 -70
5764 -70 93 126 102 170 300 123 20 93 82 190 79 -79 12 6 122 -80 -219 -137 32 26 242 140 218 -84
5788 -84 -281 -231 -103 -195 -52 -194 163 -51 187 -305 -39 -150 93 -81 -94 185 212 -97 33 -19 -249 -102
5810 -102 -71 51 210 -280 148 74 -140 -84 54 374 -103 349 49 226 93 -283 92 182 198 -172 58 143
5832 143 130 -204 3 -79 47 308 -270 16 -210 130 -37 -9 -139 241 -94 -1 55 204 253 -58 67 -66
5854 -66 -149 -52 136 -112 -56 -236 179 50 -127 102 92 -191 -26 72 75 188 48 475 -162 178 -9 192 -2
5877 -2 -219 -96 -81 139 321 -127 354 -73 56 37 1 199 -286 -152 241 -102 -101 30 63 28 179 -86 114
5900 114 -211 55 64 -20 113 155 210 -68 -46 -40 30 -63 130 176 119 -32 -54 114 -30 -164 -329 -125 105 -227
5924 -227 -75 -32 -15 68 39 298 183 347 56 12 -124 -81 -40 126 289 21 -130 95 50 74 87 -124 -122 118
5948 118 -65 89 68 -35 7 82 28 -48 52 -88 205 -267 -4 143 181 4 15 64 -49 186 -161 -316 -58
5971 -58 13 -37 77 -164 -17 -119 -10 229 83 216 -110 64 117 74 51 257 260 65 -65 57 134 14 19 -314
5995 -314 165 -43 50 114 -21 -114 -86 133 -129 -144 233 17 145 246 259 2 102 76 131 222 -35 183 68
6018 68 -93 209 249 88 -116 173 22 -40 13 22 -133 -132 29 -271 95 -180 -96 -109 -233 -102 -42 345 132 -1
6042 -1 9 -44 -59 -66 21 -188 -81 78 -128 -49 262 -162 -171 -214 16 266 -64 -64 -66 -25 -46 62 1 -189 -164 -48 -147
6069 -147 146 55 -143 3 232 63 -16 -85 -104 154 33 384 -97 155 137 -6 -277 33 -31 -168 35 73
6091 73 209 260 291 226 125 292 281 -94 210 -46 61 298 31 -236 35 45 -74 -191 39 48 40 88 -93 178
6115 178 -89 44 111 104 -71 79 -97 51 -122 -124 -120 -190 220 -329 -47 -133 83 -31 -95 14 -243 -226 34 -100
6139 -100 -204 -18 71 51 -41 132 96 -89 19 -86 148 22 -111 41 -144 -285 -77 -172 135 173 -181 -85
6161 -85 -47 -172 -19 -8 -152 97 97 -63 365 -105 51 -112 263 123 13 181 157 -132 -138 15 -133 -131 73
6184 73 -168 90 79 -45 -54 177 14 -23 4 -99 74 -154 157 -41 -184 34 -136 96 -2 -263 -102 10
6206 10 125 -118 -211 1 194 123 36 -32 -121 -52 146 -107 46 -232 -219 -120 101 29 -39 -71 57 136 -188 92
6230 92 92 21 -371 -49 -279 -145 -46 132 -87 -31 221 -130 214 134 -37 -9 -18 105 79 -46 -147 -166 -58 -44
6254 -44 -102 46 89 99 9 -71 162 216 52 97 35 -33 -142 -155 -241 -134 121 246 347 -22 -12 133 -125 21
6278 21 -5 -179 -133 151 100 -518 282 3 173 71 91 101 10 5 36 79 99 -103 23 -38 124 -141 -217 -98 10
6303 10 65 -134 39 49 -39 181 -123 -4 15 86 42 -132 151 212 -32 258 125 121 53 -2 -207 -180 -57 253
6327 253 -245 -89 246 113 -42 -97 15 148 29 120 203 86 137 -88 -165 -18 -32 -120 -67 -126 81 -156 -261
6350 -261 34 -114 -104 236 -121 -56 17 -135 -13 -11 29 113 34 -43 -308 -37 6 -90 -150 131 -9 17 -138 172
6374 172 -89 160 -140 204 56 60 254 -44 80 -19 175 -134 57 93 -164 85 299 33 -335 33 172
6395 172 -189 -98 90 -52 -194 -62 175 17 221 -21 -122 -187 -66 -10 -29 -258 181 154 -26 155 -145 245
6417 245 -7 -242 -10 122 -70 127 -10 151 -24 -234 -342 135 -150 250 -70 -137 52 -227 -124 81
6437 81 -87 -17 19 -107 237 44 129 -129 140 17 57 -137 -58 -186 85 110 -37 65 -46 -22 -181 103 -61
6460 -61 185 246 -142 158 -100 79 73 -144 80 -92 34 6 -106 -84 -61 30 -83 -50 85 58 -77 -99 -15 108
6484 108 426 110 -229 70 190 -44 -197 -11 99 211 -6 -36 -227 -168 16 75 237 -219 -101 319 56
6505 56 -59 9 93 -146 -44 -135 -74 -173 -119 -167 -22 49 47 270 -173 -161 92 130 89 53 -252 108 -180 -135 183
6530 183 -11 -127 27 -82 144 -186 17 79 -146 -191 163 40 88 -99 -76 -38 69 115 -234 -8 -86 15
6552 15 132 36 -50 -25 -208 62 -88 127 -156 94 -67 193 143 -139 -176 34 147 218 130 167 -69 136 121
6575 121 -43 -94 176 228 -66 382 50 -163 -64 116 75 150 109 81 -236 -21 -32 -16 -60 -39 -101 -20 -103 210 131
6600 131 -109 105 -261 99 -78 -53 222 150 -128 335 141 -50 -124 -20 90 -192 98 29 23 -2 -125 -186 -46
6623 -46 -23 91 24 161 222 140 -59 169 -65 39 12 -79 188 -119 -112 71 58 -129 -150 235 286 46 -336 72
6647 72 100 -310 131 -11 8 60 -73 51 94 -14 224 58 226 212 22 172 -115 -98 -3 -53 103 -106 -18
6670 -18 109 115 -117 163 -20 174 -87 -110 98 50 218 84 -228 -156 -80 -12 89 103 -26 86 -127 -24 70
6693 70 -202 52 24 220 -49 47 86 -23 207 185 -55 -58 5 91 -148 -40 191 -81 9 -307 -315 -33 192 119
6717 119 -114 7 -2 80 24 89 106 183 -4 -109 238 354 30 -88 -271 -140 -9 -20 229 383 114 71 -359
6740 -359 43 -88 225 -30 -35 -186 14 -131 340 164 213 23 55 -49 -308 -100 98 -102 109 105 -30 -264
6762 -264 -170 -249 0 138 115 62 37 -61 253 193 -248 -151 -72 239 83 42 160 29 135 -90 -216 -95 -31 -66
6786 -66 68 194 -195 165 81 80 -130 -3 124 194 4 137 -50 90 17 -114 -14 27 -183 -31 24 -26 221
6809 221 -29 134 166 162 122 178 -89 48 100 166 63 161 -208 57 -49 -113 67 -103 -214 -94 -132 -54 -8 -19
6833 -19 256 167 -71 -198 -319 -1 -108 20 -37 14 -67 -173 -25 -71 31 104 -128 -125 -196 -53 -28 64 240 -21
6857 -21 150 170 296 279 -19 -72 32 152 -123 -50 -45 -23 -113 88 5 -212 82 69 147 -49 -2 3 279 2 -435
6882 -435 -229 -27 -98 -170 -22 209 -50 115 142 -10 99 26 162 -372 -30 -84 178 -38 -189 96 -41 -110
6904 -110 -269 -171 -20 -138 -37 11 224 154 -100 -204 -105 78 -179 -23 -104 4 -67 288 66 218 -195 -60
6926 -60 78 -35 -62 -11 240 -155 -52 -9 4 -136 -16 -166 39 30 175 149 -24 -94 223 46 -226 200 104
6949 104 -109 50 66 -160 -400 -162 276 -87 -27 -231 -64 51 239 -308 30 2 -82 -60 -230 -55 28 23 -214
6972 -214 -164 -157 -34 73 96 60 -134 -225 -230 151 -73 -137 -17 -118 243 -66 -89 -35 59 10 -206 55 35 90 148
6997 148 50 -46 -160 85 111 142 -121 -234 -141 47 -109 -285 -187 -32 -102 164 -48 -65 -119 -127 392 87 119 -18
7021 -18 9 159 222 -162 74 17 33 142 -126 157 -154 -203 209 19 123 -35 160 -51 -3 120 0 183
7043 183 -54 375 -84 160 -249 -155 -185 -150 16 -134 245 -208 54 -28 24 -97 109 220 -172 -91 -159 133
7065 133 -6 74 -4 81 205 -186 -86 -146 -25 -66 -59 -81 66 121 -40 24 2 -18 -84 18 223 16 -22 133 -188
7090 -188 -249 110 -193 131 -10 105 -103 15 210 94 -145 -95 113 -109 -34 -206 93 -2 -83 262 -68 -277
7112 -277 -36 -30 -170 102 48 23 114 6 -20 50 -13 160 88 -33 11 -43 -158 -152 157 -20 229 76 -117 79
7136 79 82 138 -247 -23 13 -92 221 52 116 223 433 9 138 269 -53 33 -295 -10 -14 75 72 -75 187 -123
7160 -123 -48 210 138 232 -175 18 62 -124 -97 -50 148 92 233 -46 60 -162 -103 -183 -59 235 34 -112 -94
7183 -94 159 -277 24 -322 -177 46 -244 16 42 74 67 135 214 36 345 -47 -16 222 496 41 81 -41 -82
7206 -82 -50 -27 125 205 204 223 -95 83 70 10 55 49 17 91 63 -138 45 324 92 -71 -28 -115 239 -24 -28 -182
7232 -182 -59 25 -187 -189 138 -90 -3 10 -98 -265 172 -23 46 -342 100 -62 27 8 -84 -30 172 -66 -107 -99
7256 -99 33 305 43 -136 119 -78 -265 67 -2 -220 123 111 -61 -11 68 -134 238 -121 42 140 190 229 -96
7279 -96 -81 76 130 -33 219 -128 36 130 -104 -17 54 162 60 1 120 -36 -165 -134 -57 148 -134 3 243
7302 243 -122 54 -196 -151 264 -163 35 195 268 28 21 56 -42 189 101 2 -148 -121 -110 -76 7 30 71 3 30
7327 30 -107 31 305 232 57 -107 166 242 23 247 -240 -60 19 -674 -27 17 123 -357 -138 142 76 -208
7349 -208 55 75 -67 -207 65 -210 -76 19 -226 2 171 40 -98 -22 56 8 -258 -9 182 96 -18 167
7371 167 98 -133 122 -103 -171 149 -193 -155 27 138 186 -25 -12 30 30 -110 -57 -76 121 -173 158 389 61
7394 61 45 -25 305 8 -53 -68 -119 -108 -68 -92 88 -50 -90 197 -135 -96 -24 -1 22 92 84 19 89 16 -43 192 -88
7421 -88 -210 -25 94 128 -68 180 151 45 46 -102 90 -125 12 54 -180 -142 -12 -90 14 -99 -84 111 -133
7444 -133 35 5 -69 -299 31 16 -196 199 -94 32 159 -163 -289 69 -371 -12 -70 151 49 122 -87 -204
7466 -204 -221 154 -1 -57 -108 -137 43 -239 -60 82 333 18 -22 187 -59 54 2 -183 -48 95 -157 169
7488 169 -51 3 116 -13 254 -67 122 115 226 -213 416 -120 -18 113 -16 9 9 -19 -195 -167 -154 -212 -59
7511 -59 -41 -105 12 188 -295 -96 -118 89 78 -120 -69 122 -5 -98 20 -139 -32 -110 -25 75 -66 115 126
7534 126 38 -228 -48 -133 -75 260 -169 -110 55 116 -85 -276 127 157 75 -279 289 18 116 19 -169 111 -64
7557 -64 17 -130 -1 -25 -227 101 -77 126 -166 128 135 97 187 138 30 274 -31 160 26 -192 127 -48 -140
7580 -140 -64 -111 152 242 11 47 19 -76 116 31 -39 172 41 -39 -341 -223 -151 32 -31 -259 222 -455 131 -125
7604 -125 -106 130 58 -133 118 95 99 417 -35 8 109 -179 -52 -216 -65 5 134 321 -105 -30 -104 13 -125
7627 -125 3 -166 71 85 -117 235 -378 219 -37 26 20 -154 22 -53 159 12 -160 -37 -4 -243 110 24
7649 24 254 -23 -38 32 -76 -71 -229 83 -158 -50 -117 -158 -5 0 -107 -126 46 -40 47 -119 12 51 266 -35
7673 -35 -239 232 -19 -81 -39 0 141 -9 254 -248 -139 25 84 -165 109 17 299 97 73 45 45 205 90
7696 90 72 -255 -175 -253 97 147 36 100 -226 -60 -49 20 -66 -178 180 96 -115 45 20 119 89 24 106 36 37 67
7722 67 -229 -131 118 190 -44 35 60 76 -127 -70 -10 -278 14 232 7 -12 -5 -179 -179 33 -263 138 -16 -16 86
7747 86 -101 23 30 -35 -185 31 -205 -71 -59 48 -42 -94 97 -80 -185 -161 227 -124 -167 -91 29 -137 144
7770 144 -86 97 -168 352 152 -44 198 149 76 -152 206 -69 124 31 -279 -187 261 -158 25 68 -129 41
7792 41 -6 -90 -116 -123 11 3 217 -83 -155 -59 -65 222 -41 268 26 -134 155 -239 -216 131 -413 59 -83 80
7816 80 -170 89 -88 86 -68 -17 -96 -77 -208 -88 293 19 207 -114 75 174 287 79 -10 -65 -7 -54 40
7839 40 -34 -266 -48 29 35 175 -186 -120 -189 -99 -37 -119 56 -227 100 203 205 23 -24 -28 -50 -190 -223 307 224 59
7865 59 -135 -123 -54 64 -122 63 -163 336 -6 241 67 18 136 89 -47 -1 36 131 125 -65 -69 -132 -11 -265
7889 -265 -144 321 -225 60 91 11 -255 -107 -29 -118 20 -57 62 74 -80 -46 153 89 35 289 -8 218 -205
7912 -205 32 -102 -82 192 -145 -88 -47 39 -251 3 145 4 -309 58 -7 67 335 123 -319 -19 -275 -11
7934 -11 14 -136 478 -340 -63 -166 11 -142 -88 280 65 -191 127 -177 -17 196 13 94 32 -175 -167 52
7956 52 154 253 -31 -56 -32 -56 -130 140 -56 -61 173 149 25 -22 167 258 40 21 -51 241 85 43 221 4 221
7981 221 -82 26 -67 89 -281 30 -89 -81 -47 -88 259 -165 141 65 251 150 -30 -226 -154 77 -26 178
8003 178 156 7 122 59 -66 107 9 -241 -153 91 -346 254 -217 37 -24 94 -110 -185 -233 -392 -149 16
8025 16 63 23 36 -79 67 21 51 128 -282 -140 -174 -92 -61 12 10 41 -147 -388 -65 56 -89 -41 -127 -32 204 -70
8051 -70 149 -162 82 -99 53 -62 82 -81 -309 -48 89 57 -53 54 72 -254 170 8 -62 -350 -44
8072 -44 59 16 94 -205 -67 7 160 -342 -91 136 -43 182 247 -253 171 -117 -181 157 227 10 104 -352 -68
8095 -68 135 -36 -122 -13 6 151 -36 116 118 -257 -45 81 -208 94 -88 63 -165 69 -40 139 177 69
8117 69 191 214 -96 -185 -180 -180 -90 -81 -62 -56 114 95 -239 -179 41 -138 -1 -87 123 -63 149 -136 -11 -40 -193 -179
8143 -179 -233 10 144 -130 -40 -48 -18 -68 82 127 -131 -12 170 -95 -42 134 -128 44 61 177 142 -207 -39
8166 -39 -92 -68 180 -29 -99 -7 161 -156 151 103 -20 -127 71 337 -31 -130 2 69 -108 -101 -117 -199 -1 -150
8190 -150 192
8191A92
$$ Imaginary data points
##PAGE= N=2
##DATA TABLE= (X++(I..I)), XYDATA
0 0 0 0 0 8 -8 0 -8 12 -8 16 -24 24 -32 46 -48 61 -77 88 -104 124 -144 166 -195 223 -254 293 -336 378 -429
29 -429 487 -548 613 -690 770 -858 957 -1064 1180 -1310 1453 -1606 1779 -1969 2182 -2417
45 -2417 2682 -2983 3325 -3718 4177 -4720 5377 -6187 7214 -8568 10444 -13228 17793 -26617
59 -26617 50042 -245401 -626660 -87931 409771 441847 -27512 -305437 -101375 331227 382825
70 382825 -1600 -389763 -306486 88083 309006 85811 -261603 -314522 -21254 233286
80 233286 179427 -60755 -139109 29339 209610 147446 -76510 -187065 -54916 126546 122661
91 122661 -55516 -176335 -112862 25867 58590 -15879 -51551 30885 126839 103293 -19421
102 -19421 -83179 -12105 86333 64357 -59042 -123012 -45104 64631 51662 -71850 -139011
113 -139011 -41197 124617 170894 43757 -109690 -117080 18601 134409 108108 -10449 -85054
124 -85054 -61472 -4225 4647 -37866 -74958 -60677 1005 70482 107023 85638 14215 -58404
136 -58404 -68548 -616 76164 64618 -39123 -120713 -77866 42778 92240 7373 -99565
147 -99565 -77728 64467 155378 67564 -105706 -149518 5123 175855 144039 -63564 -197480
158 -197480 -95218 108795 152907 -22471 -193876 -132841 103354 231547 91022 -151204
168 -151204 -202897 -2663 203174 169437 -52893 -189691 -91435 97734 134733 -18058 -157794
179 -157794 -104026 73786 153140 42694 -106332 -100533 44572 135840 60804 -73065 -90056
190 -90056 19423 93454 18025 -117909 -134417 4845 137899 106654 -42366 -117959 -29400
201 -29400 101625 106024 -18763 -112847 -62066 61841 98329 1741 -103125 -81365 40046
212 40046 107494 37657 -76401 -89688 10036 90553 50766 -51676 -79025 9262 103402 79225
224 79225 -45103 -125618 -67090 59649 105557 23219 -82306 -86150 8313 85706 60514 -28563
236 -28563 -73176 -22094 62372 79660 9553 -69506 -73988 -10389 45707 40071 -8008 -39203
248 -39203 -21009 19775 35261 11434 -18489 -14980 16140 33114 10208 -30274 -44732 -17272
260 -17272 23121 33279 2756 -31321 -23165 21263 47550 17451 -37711 -51770 -3976 52273
272 52273 49223 -11876 -62171 -39904 30849 66866 23755 -45588 -58367 -4575 43368 26495
284 26495 -27059 -41108 6417 54709 40180 -22267 -53433 -13393 44015 38330 -27089 -65781
296 -65781 -20702 53925 60142 -15020 -77753 -43357 55022 99221 30154 -75299 -91983 343
308 343 86014 59579 -43941 -92247 -25007 73215 79676 -12568 -87236 -51819 50273 90472
320 90472 19029 -73105 -70014 20406 78382 29533 -59849 -72424 10445 85595 57128 -42421
332 -42421 -92501 -31648 65365 80759 -2157 -79442 -57408 33194 80806 32307 -48517 -65155
344 -65155 -3177 57595 44210 -23714 -62998 -28969 32097 47580 7406 -29212 -18139 19017
356 19017 30104 -21 -30608 -23291 11908 28759 4478 -30324 -28883 10262 40571 24675
368 24675 -17087 -34113 -8890 26552 28652 -6358 -37567 -26831 15789 40990 19747 -22219
380 -22219 -35663 -6799 26870 25967 -5222 -27804 -14602 16768 26031 -286 -29036 -21686 16993
393 16993 39123 14365 -28728 -37664 -1252 36907 28872 -17753 -48088 -20230 35861 53321
405 53321 7039 -49876 -47258 13479 60512 38218 -28831 -62832 -26465 36158 50959 3461
417 3461 -46336 -36126 21080 53830 23185 -31559 -45566 -5939 35337 28585 -14521 -39081
429 -39081 -14371 28345 35926 -633 -34116 -21661 19451 36088 6895 -33104 -36212 2046
441 2046 37345 29712 -10673 -35652 -16373 22795 33122 2904 -29960 -27863 4020 28010 17475
454 17475 -11873 -24930 -6917 19669 21978 -1329 -20329 -12044 9544 15211 -2057 -17969 -11159
467 -11159 11712 21492 4354 -21251 -21433 7057 31473 19166 -17179 -33061 -8927 25844 27932
480 27932 -6474 -36572 -24028 18940 42756 17309 -27757 -37875 -1561 34749 25514 -16543
492 -16543 -37576 -11607 28496 32468 -4653 -35277 -19991 24208 39449 3876 -39162 -34926
504 -34926 12052 42738 18544 -29469 -40126 1404 44967 36090 -16537 -50134 -23691 29796
516 29796 44388 3479 -40551 -33879 13588 43025 21094 -23586 -36482 -4458 31008 25222
528 25222 -12636 -33402 -11479 23668 26920 -3371 -27311 -15463 15861 26450 4046 -23688
540 -23688 -21328 8455 27842 12404 -18940 -27514 -3470 23215 22178 -3628 -22490 -14416 9572
553 9572 20560 6425 -15236 -18008 22 15812 11374 -5492 -13248 -3690 9725 11626 609
566 609 -9815 -8187 2946 7967 317 -9734 -8127 5190 13994 8084 -6275 -12808 -4661 8774
580 8774 11876 -732 -14445 -12011 5625 17993 9680 -9392 -17059 -3997 13271 15052 -1874
593 -1874 -17053 -12878 6521 17079 6318 -11167 -12925 2944 14316 7346 -9106 -14341 -1700
606 -1700 13484 12098 -5774 -16779 -6414 13512 17468 -657 -18682 -13669 8248 20383 8568
619 8568 -14510 -20235 -2067 18600 16611 -6546 -21273 -9864 13342 19648 2272 -15717 -13513
632 -13513 4944 15477 5425 -12450 -15349 726 15804 10581 -7129 -14494 -2164 12684 10858
645 10858 -4846 -15307 -7175 9561 15506 2956 -13266 -12840 3818 16374 8490 -9461 -16271
658 -16271 -4767 10042 11761 -924 -11718 -7250 6732 12992 3522 -9370 -9449 1256 8821 3835
672 3835 -5670 -7332 221 7563 5725 -3821 -9107 -3365 6797 8690 -641 -9107 -6227 4307 9428
687 9428 4112 -5878 -8751 -1243 8013 7434 -2098 -9308 -5155 4873 7828 841 -6588 -6134 1068
702 1068 5800 3893 -2367 -5497 -1043 5069 4593 -1931 -6096 -2295 4282 5352 -11 -5703 -4358
717 -4358 2612 7962 3795 -5291 -8652 -1470 7019 5734 -3124 -8442 -3157 5581 8799 2686 -5779
732 -5779 -7300 22 6667 3825 -3747 -6414 -619 5759 5362 -1407 -6071 -3527 3147 5584 774
747 774 -6182 -5519 2461 7664 3155 -5235 -6377 472 7162 5430 -2767 -8095 -3817 4720 7216 311
763 311 -6998 -5853 2854 7269 2925 -4695 -5776 -299 4603 4481 -1211 -5343 -2366 3538 4984 -85
779 -85 -4919 -2995 2538 4843 1201 -3845 -4147 695 4802 3006 -3046 -5982 -1149 5285 5553 -572
795 -572 -4979 -2615 2097 3796 583 -3720 -3959 -14 4122 3177 -1255 -2955 -527 2594 2432 -998
811 -998 -3173 -2560 430 2847 1165 -2124 -2846 1341 4589 2213 -3007 -3938 -262 3364 2239 -1527
827 -1527 -3563 -1124 2528 3911 154 -3466 -2938 1046 2871 950 -1283 -2307 -689 1394 2168 939
843 939 -1686 -2106 833 2612 1095 -2467 -2625 263 2231 1283 -1228 -2346 -569 2559 2543 -339 -2844
860 -2844 -1342 1672 2405 -72 -2636 -1556 188 1246 886 -390 -1272 -993 1223 1971 477 -1794
876 -1794 -1818 -307 541 1004 -388 -1098 -519 1578 1970 332 -1969 -1362 388 844 -472 -1393 -256 1054
894 1054 1224 906 -352 -1423 -695 1073 890 -783 -1104 -894 100 527 524 269 12 -85 801 1404 197
913 197 -1583 -1125 -78 650 -205 -856 -113 424 1135 683 -180 -695 -404 803 1076 -300 -611 -237 328
932 328 90 315 -15 -128 -455 614 1350 111 -1496 -1330 300 671 -124 -512 -358 256 1311 1057 53
951 53 -1156 -853 610 616 -426 -916 -175 519 611 583 726 -612 -783 369 1277 121 -1460 -1382 -9 1110
971 1110 820 -381 -791 -72 1494 1334 -228 -1775 -1394 387 1018 -203 -912 -366 274 1174 874 -100
989 -100 -731 -783 972 1553 97 -1491 -1349 486 1516 680 -510 -1191 -393 1374 1800 193 -1731 -983
1007 -983 811 1424 -257 -1411 -833 1009 1689 1394 -487 -1456 -547 1015 1298 -645 -2348 -1183 630
1024 630 1772 552 -839 -1180 -9 1726 1114 -1044 -2149 -621 1889 1598 -761 -1814 -375 1408
1040 1408 1799 435 -1482 -1610 -49 1835 876 -1519 -1959 -172 1918 1522 -386 -1348 -714 920 1710
1057 1710 544 -1819 -2171 391 2320 1105 -1684 -2066 -273 2084 1597 -787 -2246 -1023 1605 2099
1073 2099 -61 -2054 -1436 1128 2081 218 -1576 -1261 530 1874 1238 -736 -2208 -1448 1163 2052
1089 2052 151 -1780 -1452 1001 2319 1002 -1179 -2212 -937 1525 1668 -648 -2580 -883 2081
1104 2081 2548 63 -2165 -1112 766 1907 355 -1562 -1986 -583 1910 1640 -688 -2128 -700 1716
1120 1716 1439 21 -1562 -1574 248 2122 1510 -1282 -2704 -679 2504 2234 -739 -2619 -1276 1566
1136 1566 2110 604 -1857 -1967 217 2293 1167 -1565 -2176 468 2400 1644 -836 -2690 -955 1323
1152 1323 1897 143 -2272 -2100 972 3226 1096 -2038 -2058 361 2616 1684 -1433 -2657 -1064 1717
1168 1717 2399 -22 -2790 -1656 1725 2943 327 -2521 -2123 531 2374 1445 -1108 -2615 -458 2524
1184 2524 2272 -991 -3051 -1050 2021 2231 -200 -2672 -1868 915 2680 1364 -1623 -2923 224 3080
1200 3080 2024 -1111 -2723 -405 2003 1781 -516 -2033 -1703 782 2425 992 -1678 -1785 534 2096
1216 2096 886 -1212 -1954 -742 990 1290 -29 -1547 -1363 773 2377 1167 -1194 -1994 -125 1716
1232 1716 1316 -540 -1960 -1313 822 2146 731 -1514 -1967 -33 1914 1031 -972 -1701 -610 1408
1248 1408 1936 410 -1815 -1869 738 2513 1038 -2089 -2091 283 2246 1671 -1185 -2629 -878 2216 3025
1265 3025 248 -2935 -2278 1287 3222 805 -2837 -2840 449 2532 1789 -1367 -3276 -464 2865 3141
1281 3141 -694 -3404 -1805 2333 2787 -14 -3027 -2084 1366 3452 1607 -1959 -3298 426 3139
1296 3139 1811 -2352 -3753 -735 2878 2738 -484 -2810 -2003 1608 3376 1061 -2768 -2892 668 3133
1312 3133 1208 -1869 -2500 -47 2305 2045 -720 -2505 -1188 1747 2634 -204 -3141 -1779 1296 2510
1328 2510 690 -1589 -1994 150 2208 2013 -614 -2356 -1201 1535 2163 -89 -2491 -1585 416 2252
1344 2252 1291 -728 -1456 -677 1185 1638 -697 -2046 -1021 656 2046 578 -919 -1099 345 1586
1360 1586 1299 -932 -2122 -1009 1387 1801 -195 -2215 -1271 943 2373 1286 -1050 -1898 -681 1729
1376 1729 1673 -819 -2712 -1085 1851 2078 293 -1549 -1207 925 1824 848 -1544 -2312 -9 2141 1077
1393 1077 -1203 -2372 -419 1868 1834 97 -2027 -1397 987 2061 423 -2521 -2272 410 2788 1544
1409 1544 -1349 -2350 -286 1997 1998 -598 -2486 -1543 1058 2407 602 -2086 -1231 1315 2435 872
1425 872 -1416 -1875 -226 1354 1259 -878 -2654 -1113 2072 2784 446 -2017 -1633 975 2110 893
1441 893 -1814 -2722 -439 2218 1892 -416 -2138 -827 1897 2107 -85 -1967 -1437 453 1461 820
1457 820 -1395 -1830 -246 1607 1486 -509 -1983 -397 1442 1299 -166 -1665 -1340 390 1873 910
1473 910 -1195 -1557 399 2057 1129 -1089 -1999 -540 720 958 169 -1376 -1220 275 1655 973 -696
1490 -696 -848 165 869 596 -1209 -1389 -704 663 1339 444 -762 -796 1167 1689 406 -1407 -1572 27
1508 27 1196 850 -273 -1159 -289 1349 1805 338 -1373 -1212 454 1347 90 -1259 -1312 -276 1581
1525 1581 1343 127 -1292 -753 942 1406 95 -1484 -1046 476 1497 604 -1264 -1368 -80 2042
1541 2042 1406 -781 -1907 -504 1448 1382 -642 -1885 -1442 723 1819 1037 -627 -1151 -56 1508
1557 1508 1052 -901 -1835 -541 1212 1110 -45 -1015 -684 898 1986 347 -1270 -1579 229 1724
1573 1724 304 -1216 -1406 100 1288 1215 -247 -797 -364 646 1043 -8 -1221 -915 829 1136 449
1590 449 -618 -668 80 978 966 -431 -1426 -583 957 911 -571 -1345 -420 641 1087 4 -513 -761 311
1609 311 1023 568 -699 -1327 -462 981 874 -157 -1017 -255 951 930 479 -593 -1051 -310 695 710 -486
1628 -486 -1241 -164 1183 1020 115 -850 -533 197 679 367 -996 -1342 -27 1057 516 -554 -768 443
1646 443 882 538 -443 -1002 -565 212 630 495 -514 -709 -7 981 652 -286 -779 -467 296 553 81 -955
1666 -955 -632 419 1047 61 -980 -788 581 782 25 -640 -1119 -329 544 961 -198 -804 -209 613 813
1685 813 -6 -533 -817 -45 760 680 -413 -1199 -375 560 761 256 -924 -553 501 1010 97 -1025 -1320
1704 -1320 -293 886 753 -396 -865 66 1210 998 -326 -831 -689 70 774 296 -567 -786 17 773
1722 773 805 -269 -693 -285 765 671 73 -924 -665 522 1084 401 -798 -876 500 1281 250 -660 -814
1741 -814 46 702 557 -230 -520 -320 610 719 -5 -594 -550 349 579 334 -689 -967 13 328 305 -145
1761 -145 -677 -291 691 757 -266 -818 -460 596 635 -384 -696 -347 182 415 312 -137 -736 -156 627 427
1781 427 -571 -403 -126 465 510 262 -500 -534 171 683 398 -354 -1040 -282 324 569 272 -432 -257 208 362
1802 362 117 -314 -819 38 337 665 -280 -348 -101 626 419 -14 -344 -423 147 722 369 -525 -419 7 495
1823 495 406 -303 -372 -198 292 590 97 -359 -732 -68 757 277 -490 -533 33 573 189 -260 -334 46 544
1844 544 473 -117 -322 -559 182 424 14 -189 -407 344 510 508 -17 -543 -369 376 393 -11 -333 -331 366 686
1866 686 105 -473 -109 -51 369 358 -365 -406 -163 377 25 -158 -629 159 386 176 -31 -248 -353 -1 549
1887 549 507 -143 -79 2 329 230 -71 -660 -112 262 248 9 -291 -203 183 451 -117 -114 -238 -86 384 451 159
1910 159 23 -358 -212 343 49 -359 -423 308 494 188 -366 -541 -141 127 348 -127 -324 94 56 247 52
1931 52 -186 -144 167 207 -182 -153 -250 -340 366 148 -110 -379 82 298 85 -263 -31 -290 -95 215 524 206
1953 206 -158 133 351 644 -21 -472 -231 396 265 -1 -193 106 316 168 -97 -321 -473 65 416 8
1973 8 -146 -227 -85 149 158 -23 -19 -2 -52 136 418 -234 -196 187 302 368 -165 -180 -90 209 208 -133 -132 210 123 323
1999 323 1 -121 -419 -167 432 90 11 -183 -324 177 195 201 -177 -445 -28 114 -9 86 111 174 185 -35 -157
2022 -157 -224 16 422 272 -165 -188 159 352 61 -25 135 44 -243 111 67 -126 -167 -78 305 286 31 -225 115
2045 115 214 47 -130 -105 -303 -192 256 54 115 -257 -18 -75 -69 -114 8 221 -43 255 -164 -63 -69 240 328
2068 328 28 -318 -201 96 277 -296 -62 -51 -483 -128 393 97 49 -71 77 248 -56 -27 -7 -50 -155 204
2090 204 -89 -346 23 97 -26 185 -122 -10 136 24 -164 -181 -271 -139 -9 310 249 3 29 202 325 -78
2112 -78 -142 -99 -18 -92 -18 -13 198 -208 -79 -310 40 136 -10 51 73 84 -109 322 106 48 186 -1 -157 -189 492
2137 492 209 1 -163 -230 -96 171 272 -112 -249 -115 -7 -43 152 52 -83 180 -107 -234 -223 -121 39
2158 39 5 -48 121 111 24 249 -203 -269 -234 50 -194 58 -99 131 -230 74 258 -115 -305 -298 -138 273 5
2181 5 -45 -194 -222 198 -24 85 1 -226 4 31 82 -46 -171 -100 -257 -245 101 97 83 93 8 -81 -363 -344 193
2206 193 -38 -64 -226 122 84 86 63 -187 -78 -22 108 130 -66 -118 -302 -94 170 242 71 -147 -63 -234 268
2229 268 -12 -230 -204 -36 -284 -497 196 -152 -83 156 -141 -68 -204 228 322 -77 -325 -303 -121 -18 -109 204
2251 204 466 188 143 77 96 162 -155 -167 85 180 105 -132 -113 -68 -233 101 282 69 96 -13 -61 125 69 -146
2275 -146 99 -77 193 14 199 186 119 -13 -509 -64 -116 57 123 74 -291 47 -89 -13 315 74 -188 -364
2297 -364 -3 -157 -139 -314 -312 -124 95 243 259 207 -258 -186 -61 -59 51 69 -2 -57 -185 120 122 -35 -156 128
2321 128 -365 115 91 276 196 20 -44 -12 409 204 -243 -131 -134 57 68 110 83 31 -112 58 115 378 464 144
2345 144 -356 -34 85 16 376 -229 214 -13 -119 -68 293 19 -165 11 -219 -27 25 -122 -147 -434 -143
2366 -143 -23 128 -122 104 132 86 -46 -21 124 227 -419 -380 -206 192 -96 196 -83 17 5 11 110 377 11
2389 11 -114 -273 -277 260 -35 -198 -263 -28 -78 247 348 98 -129 -80 -188 -181 357 267 -138 -49 -217 49 167
2412 167 116 -17 24 -135 188 163 220 -148 42 -258 -205 174 263 27 -207 -64 -206 106 188 24 -25 -229 -235
2435 -235 179 485 -30 30 -31 -322 -309 227 81 210 -92 81 33 190 302 234 -53 -132 -33 -135 152 -50
2457 -50 -46 51 -80 -41 60 617 147 -340 -71 -268 -2 -83 135 77 -304 -90 -255 385 86 -389 -411 -129 259
2480 259 117 -171 49 -29 -15 20 178 254 204 197 -56 -146 129 111 53 -72 -239 8 279 8 248 -51 -121 1
2504 1 -52 74 31 173 -106 -322 -37 -18 57 69 -225 -222 -178 79 10 -122 -97 -162 -4 -13 49 157 4 198 62
2529 62 -341 155 239 0 -112 -319 83 55 145 185 142 -69 -71 295 269 331 -475 113 -84 147 161 -10 -120 -153
2553 -153 70 56 291 95 153 -201 -190 20 215 53 115 -40 76 -62 25 -105 339 -142 -192 -85 151 141
2575 141 113 136 21 -50 -41 113 99 -134 -51 -253 -126 121 69 17 68 -152 -304 92 107 135 441 -169 64 30
2599 30 312 304 300 6 -274 1 0 380 36 9 -156 -212 531 158 -134 105 -114 65 186 234 79 -125 -120 -101
2623 -101 -125 54 126 -158 3 -32 134 -39 119 77 -79 -84 -230 130 264 64 -212 -131 -72 -38 96 279 -165
2646 -165 -171 -82 -225 316 297 35 -359 -159 0 36 62 -182 -261 -47 -340 147 132 136 -297 -209 116 6 -84 -84 197
2671 197 -54 -60 68 286 -2 79 -44 -173 -88 105 -48 -131 -38 -139 224 79 201 68 72 -172 -219 -261 -5
2694 -5 160 -229 -81 22 24 2 -23 45 -21 -67 -159 279 -51 -79 181 -296 -212 121 -132 70 -38 -64 30 -332 75
2719 75 375 118 -324 -358 -70 163 336 148 -142 -73 -112 274 298 86 -197 -44 -54 103 40 82 200 -175 27
2742 27 41 -11 266 -11 -133 -48 -76 75 168 108 -89 -309 -92 -97 76 -47 -247 154 -74 -24 217 93 108 -211
2766 -211 31 265 -66 119 183 -48 -279 -196 -114 229 164 -159 192 25 -32 97 57 35 -275 -128 16 70 49
2789 49 -6 -280 -38 114 -30 178 83 -173 5 -139 258 -7 125 6 -173 -33 -100 201 110 -130 -78 -223
2811 -223 3 38 50 83 -66 69 -109 -202 365 156 -13 31 -217 126 222 154 -261 -148 -233 475 43 306 239
2834 239 208 171 147 109 188 19 -113 -276 -181 181 188 210 -304 44 -45 -59 55 122 -42 -259 67 262 -55 82
2858 82 -148 66 85 -30 92 -105 59 258 -62 22 59 33 174 272 -44 -31 57 104 69 54 59 -150 85 -109
2882 -109 -29 62 75 72 -262 98 -79 -66 145 -417 152 -222 -21 560 41 -107 -100 78 214 264 -147 -310 135
2905 135 -111 27 -46 -86 -236 -329 107 -24 -288 -150 372 -152 -66 54 69 151 129 18 -37 -31 154 91 74 -13
2929 -13 -192 -17 187 206 -64 80 323 -68 35 78 39 223 159 -113 -14 226 53 -65 179 -237 179 85
2951 85 203 4 383 47 -111 -159 25 440 -245 -8 164 81 314 99 -46 238 -65 57 0 94 -151 -87
2973 -87 -235 109 -60 279 -42 53 -125 -195 115 17 240 215 38 37 73 158 -12 48 177 -40 -166 -76 151 143
2997 143 -89 -236 298 209 259 -51 82 -32 -123 -134 -170 -76 79 -109 -80 -236 -109 -45 140 -129 143 -4 110
3020 110 -120 60 234 14 73 -381 10 95 -35 -105 -60 98 233 -236 78 -16 -24 16 223 45 104 -335 -396
3043 -396 -161 212 137 -331 -134 24 39 92 104 70 -9 -100 -4 -302 27 6 3 -226 -17 -22 -100 30 21 -169 -277
3068 -277 -163 -83 -113 181 33 -1 -33 11 225 -80 -171 -176 -120 133 164 -6 172 146 452 -24 246 -102 164 -65
3092 -65 -44 -66 -20 165 109 -9 23 -85 -150 65 269 -83 -40 -96 -217 -78 223 -1 209 216 -115 150 -25 78
3116 78 133 -75 -72 -35 86 23 -164 62 138 140 138 157 170 -199 -185 -136 -26 -62 -81 -57 47 -142 270 243 -104 95
3142 95 -107 72 113 -66 25 -85 303 -50 121 -33 -31 -188 109 45 -94 165 29 99 -119 10 411 49
3164 49 -11 -19 -25 -62 34 176 72 -47 33 87 -6 -272 -278 34 -64 -123 -275 -140 -119 267 77 -110 -136 -206 224 -45
3190 -45 -242 -35 -49 -200 -58 147 116 64 -59 -156 37 -110 51 -41 -223 -99 9 -87 24 130 -57 -166
3212 -166 36 193 383 12 -31 -154 147 -66 -154 -82 -76 -278 -65 -100 -166 132 -15 39 -88 -140 -118 -73 -10 69
3236 69 194 -246 -178 -12 -46 -40 -207 -30 -118 287 -230 111 57 108 52 121 -180 -215 -175 42 87 115 7 37 -28
3261 -28 166 -175 -283 156 -118 192 -104 0 254 151 45 -71 70 -284 190 61 139 70 -87 -50 -143 39
3283 39 -186 -237 54 -223 -130 -16 123 36 -161 58 -47 141 71 -44 19 -8 -45 -209 -268 -87 -195 112 -192
3306 -192 108 172 -149 230 -39 -57 126 -104 147 82 -177 -48 -102 -52 -124 122 -24 206 130 -37 139 -22
3328 -22 47 -126 91 -92 126 -224 -27 98 -88 -15 -49 -75 215 -38 22 157 -363 -93 -168 -148 -27 -33 -88 62
3352 62 -32 38 274 -86 -88 30 182 -111 -124 -188 54 107 7 -84 -216 -119 -25 117 113 -50 270 202 -33 -57 38
3377 38 -30 -246 169 217 -98 -292 219 63 68 36 237 152 234 -47 -180 61 213 -59 127 96 -44 0 -20 -188
3401 -188 -165 -67 98 122 -170 78 161 -64 -103 42 237 96 -6 -7 -132 -192 -35 -77 -122 -70 99 4 -61 148
3425 148 -115 -59 9 -94 2 -58 46 109 -118 133 -78 -156 -42 113 72 -70 65 -7 -193 22 37 -27 271
3448 271 249 85 -104 283 220 -56 34 -187 119 34 407 351 -119 -61 -30 78 145 86 102 -206 -60 109 -89
3471 -89 -171 -253 81 -47 -88 56 206 223 -107 -64 86 129 -95 -136 -30 -282 -325 -69 115 -184 -235 -20 -73 -9
3495 -9 88 -126 -139 178 18 79 -241 128 -211 19 336 -112 -53 -1 128 283 -24 -79 252 97 -27 -161 287
3518 287 36 -119 338 -153 -326 153 -147 -164 253 -115 -54 -107 121 -29 -232 182 67 75 -122 -151 -60 -104 80
3541 80 -18 3 -47 -52 -94 -213 -70 -159 65 -3 -109 21 261 -105 -129 67 14 -126 65 -97 -286 -96 -9 404
3565 404 37 -19 -67 -5 48 -138 80 -222 217 -211 166 -103 -46 195 132 -133 -99 -60 72 117 123 -4 -350 -273
3589 -273 82 -47 28 -188 -137 241 -67 31 264 141 272 56 -41 41 21 -78 26 -316 -123 -252 -159 248 59
3612 59 -98 -52 91 -84 200 -84 -66 84 140 209 97 76 89 10 -185 213 44 -284 62 95 -136 27 -92
3635 -92 -11 -48 -79 2 -70 149 243 150 -148 -113 197 115 32 36 -23 -45 -219 -25 314 73 60 -126 -25 -56 94 38
3661 38 -16 173 -56 -11 -32 -111 -149 115 -102 7 138 -132 137 -363 -66 -10 -107 212 -236 -57 -37 77 -168
3684 -168 58 25 67 55 9 127 113 14 88 -22 127 -11 79 21 -37 -41 69 62 76 -193 -221 19 -119 -54 -77 -222
3710 -222 32 -61 115 -51 59 -121 -144 -131 -34 94 -88 -323 100 106 -92 -139 170 151 50 -19 5 40 -158 -20
3734 -20 -154 -3 -47 -124 195 -22 -65 163 -113 -71 44 -65 126 204 61 147 -135 -53 -47 100 32 -244 -300 141
3758 141 -36 -202 265 -25 -106 -228 44 -7 -14 94 63 53 60 33 196 203 -35 -125 -67 -184 276 114 43 24 152
3783 152 19 351 111 -15 141 287 154 -61 123 -133 109 189 64 239 93 -79 -99 213 115 -112 67
3804 67 -279 -51 -10 176 60 61 -12 -188 181 -42 -97 -13 3 80 154 166 -9 -255 -104 -226 44 -238 -36 -39
3828 -39 -135 77 -91 -81 -165 38 -99 -203 1 71 108 42 -167 258 -69 19 -140 145 -77 12 -8 -184 -224 236
3852 236 -88 -39 -11 114 172 -135 83 11 -102 71 -385 120 206 209 189 38 -58 -79 13 79 268 -90 9 130
3876 130 16 67 15 42 3 126 -81 -71 262 52 177 -108 40 -153 49 -123 -73 66 84 -36 22 144 165
3899 165 -123 -89 179 97 -245 -181 67 -6 -104 -10 15 -146 -81 -215 -156 -100 59 116 -51 -40 -67 51 -105 -72 94
3924 94 13 -274 -44 -10 224 -4 -143 124 58 65 -146 306 -39 -136 -160 9 152 127 11 -28 -207 -84 41
3947 41 -32 -21 -144 -248 119 23 -6 -15 -30 107 -66 -168 -13 -401 -224 -30 40 229 -86 30 -446 -72 109
3970 109 -39 -202 31 85 -276 -191 161 -92 137 10 169 -32 -76 -234 85 109 -119 1 14 -86 54 202
3992 202 -147 -229 -85 312 184 -30 -20 62 204 -176 -165 87 35 9 8 11 154 -81 -232 15 -9 172 -18 -167
4016 -167 195 -4 -61 -41 206 -32 79 38 29 -66 -102 -160 -48 237 33 87 -66 2 100 59 -122 270 -219 -162
4040 -162 -7 -153 233 43 156 79 151 -28 -21 -18 39 49 -35 -32 52 158 239 -37 -227 -64 225 -318 100 185 -7
4065 -7 -188 34 -168 -162 -459 192 -7 -88 164 179 -152 -53 -80 130 30 226 237 84 41 56 203 235 167 108 13
4090 13 91 47 24 179 240 51 -221 -140 -205 67 -48 24 -52 8 6 -64 258 -25 281 -246 -218 -265 -180 90 -106
4115 -106 -21 39 5 -108 101 55 10 55 287 65 -63 -56 -75 -107 102 45 186 -68 263 -142 55 -104 -181 229
4139 229 234 56 -134 89 -55 112 -172 95 -88 -160 173 -171 -35 403 -67 -21 -178 -44 -242 22 -264
4160 -264 -1 108 221 298 118 -252 -4 -104 -99 119 -158 53 -204 8 119 49 -22 -215 250 70 -105 201
4182 201 -16 -25 -60 63 156 53 71 -67 295 -139 -406 34 12 -2 13 -235 -153 187 -127 -64 -57 -47 -127 24 -47
4207 -47 -91 -139 -7 53 277 -63 222 -147 169 75 -28 91 114 170 -147 -4 337 50 -81 35 -35 -226 -376
4230 -376 38 -235 26 -352 183 25 121 151 -54 62 194 44 -115 72 20 7 215 -74 64 -270 -13
4251 -13 5 121 5 248 -229 71 159 178 7 -16 113 13 70 -107 141 66 -72 -214 -171 63 15 43 59 52
4275 52 -3 -6 75 -22 128 70 -145 -123 -171 156 -173 92 6 -83 -176 -5 -50 -105 46 -140 26 137 214 -57 -167
4300 -167 269 263 57 127 55 -162 -83 -100 -107 219 20 -149 77 65 -104 283 -115 25 -74 -86 111 182 76 -103
4324 -103 47 -75 20 63 -85 189 18 -162 31 -50 -140 34 -40 -5 99 159 -224 -28 -80 287 -177 -151 99
4347 99 -17 67 132 62 -3 -38 32 145 -39 271 40 -325 -70 -73 106 28 197 39 151 205 -349 117 -101 -17
4371 -17 335 -3 122 -102 107 -170 31 87 -50 -61 -103 157 221 121 -135 -3 -88 71 -20 -269 189 134 60
4394 60 11 82 -25 157 -4 103 132 -301 -178 -2 100 -115 -127 203 42 -94 182 132 22 134 205 -52
4416 -52 101 -235 -142 70 39 -109 -194 211 79 -286 47 -335 -20 161 -141 -37 13 -184 -213 173 -211 -180
4438 -180 -185 64 199 111 -213 31 231 -50 -33 -26 254 -148 -238 -66 -164 -78 313 -71 -20 -34 -11 11 -27 72 137
4463 137 57 139 112 -43 -13 3 191 181 161 166 -11 -214 62 222 98 -17 167 -40 -35 16 -18 53 -52 206 -238
4488 -238 -10 157 -4 -48 -147 326 148 -126 -124 207 344 -186 -40 15 97 127 66 -37 -264 92 99 -24 99
4511 99 155 291 -7 265 86 69 16 -165 -113 -119 50 -179 -9 -308 243 324 -188 -49 -103 90 113 -12 -31 9
4535 9 36 -105 23 229 134 -71 -217 -49 -231 30 -30 152 176 -34 -53 101 -208 -55 -89 -47 169 -417 -31
4558 -31 -111 47 169 24 -134 120 172 87 113 -243 -131 4 -58 -65 -119 -30 -125 5 -36 -199 -235 -275 57 -92 -290
4583 -290 -59 38 121 258 48 -349 -54 -86 205 -20 47 357 -83 -176 118 110 186 -248 140 37 -104 -69 120
4606 120 454 -154 92 -14 74 292 207 107 43 211 305 309 -8 -13 -71 -9 -237 170 102 -59 -53 -124 99 62 -40
4631 -40 65 33 39 -30 316 -256 -246 -7 85 45 115 179 64 60 103 -43 53 85 137 -41 169 38 43 -225 -98 196
4657 196 -13 114 -35 152 -34 115 -110 181 19 -117 12 -87 73 -76 122 81 145 -129 5 -204 77
4678 77 -53 136 98 -17 -122 10 72 -78 238 31 -128 3 142 97 291 102 -245 -65 -75 207 -208 -13
4700 -13 -181 -121 129 -57 130 -36 267 -75 -257 64 -137 157 297 -45 104 167 220 -131 12 339 190
4721 190 145 168 -20 -86 109 -31 94 83 -120 -12 -42 -139 -53 61 95 146 337 -25 28 255 64 263 -235
4744 -235 -94 184 6 240 -22 -78 -75 -31 98 170 285 -54 -154 -232 -29 2 223 -200 107 12 -183 15 -323
4767 -323 -89 18 16 -12 -159 233 36 29 132 134 156 51 70 -47 80 152 -46 77 122 23 0 142 144 -31 -155
4792 -155 -171 184 62 208 35 -150 -98 60 105 -45 -33 153 -103 93 -17 -317 -41 185 165 -68 63 25
4814 25 44 0 -83 74 51 -6 -172 104 -39 132 119 -45 73 -14 -251 -65 -7 -251 28 218 -37 -242 -39
4837 -39 50 3 -12 -37 154 -113 -145 -92 -189 69 -17 125 -35 -142 -172 15 -23 -43 62 56 154 46 113 214 16
4862 16 45 -92 155 146 169 95 66 -164 -260 -98 182 -142 -27 258 36 -126 -207 -38 -88 -92 112 -122 -7 140
4886 140 -155 28 144 -120 237 286 -13 57 239 19 72 2 -376 -98 -26 117 119 133 -154 242 -95 -250 2
4909 2 236 157 -282 -142 -146 186 178 126 -20 52 -18 156 -166 -83 107 182 -46 -112 -151 -241 210 -84 -30 -69 -95 -175
4935 -175 106 -39 30 -9 38 -1 -107 88 -349 10 -56 21 -255 34 -177 -74 -136 -121 41 -6 244 -386 98
4958 98 -26 139 105 -20 -223 -3 -113 24 -72 -153 193 211 -252 40 -137 97 120 -41 170 -229 -149 -132 94
4981 94 -110 -226 101 -184 -27 189 126 -4 -104 183 34 -184 -28 -111 -96 48 -104 66 -86 1 -44 -102
5003 -102 -1 -23 39 -2 33 -15 -49 -197 -457 -39 132 65 49 69 -231 9 -14 64 -221 77 57 270 -248 -44
5027 -44 6 -65 -117 -19 23 -30 129 1 227 371 88 77 -62 -1 117 -60 -269 -129 -340 156 85 -77 -36 22
5051 22 -227 94 -262 -81 126 27 76 -186 48 -39 -100 95 392 -53 44 -37 -145 -205 -125 161 -201 208 -105
5074 -105 212 221 -12 -24 -56 9 206 -238 -3 -192 4 -99 -140 192 77 -139 -171 -184 28 -37 -152 -45 136
5097 136 132 -278 123 13 -82 -128 -3 89 198 129 5 -100 164 -58 86 20 -138 90 101 -70 -121 -50 274
5120 274 -166 -301 173 143 246 126 105 71 178 -9 120 161 -85 -102 7 160 114 -12 -209 -238 -114 6
5142 6 -90 35 -7 -314 29 81 20 17 -81 -33 171 -39 -33 -80 279 -19 108 -59 104 18 34 262 -27 19 -74 -9
5168 -9 -167 44 20 240 -210 -188 -97 -149 -71 16 -62 114 -60 23 140 -29 112 -133 -119 -175 -80 95 151 3 -11
5193 -11 -122 -97 -222 87 -56 5 -56 -41 -47 31 171 49 -60 30 -166 -214 -341 -134 -82 30 -114 148 -227 -155
5217 -155 -116 -95 55 -309 -162 -170 -134 62 66 151 -233 -175 -112 -139 -286 -93 45 -18 69 -226 238 -222 113 281
5241 281 -104 -22 -162 -17 -179 -22 -161 -42 -256 121 97 101 -112 97 -235 211 38 -169 -42 195 85
5262 85 -62 144 108 -44 149 -91 -160 4 -8 -32 77 47 17 -118 -209 -169 -211 47 253 45 108 10 -43 91
5286 91 -100 213 26 95 277 121 224 -262 72 -95 143 24 87 -70 49 -453 62 325 144 25 -230
5307 -230 185 88 -185 -187 220 94 -40 318 326 -65 -142 -96 -151 -50 315 75 21 -52 -105 -20 51 6 -136 -166 34
5332 34 -16 277 89 60 -209 -77 62 -175 129 94 30 88 102 26 15 -116 208 69 10 -14 12 253 -344 59
5356 59 26 -13 -16 148 -71 25 8 58 -65 30 -44 -52 195 -6 87 -107 146 -168 92 23 -15 -167 7 1 60 108
5382 108 55 28 -246 -188 -157 -32 -3 -216 8 -99 237 37 54 -62 -132 227 -1 215 -130 -77 -115 91 -64
5405 -64 217 147 107 -210 54 -37 -85 21 189 -60 -79 -82 242 -47 -84 9 -239 -213 -172 -210 183 4 -119 -89 -212
5430 -212 158 -32 74 -20 359 -47 -33 -184 -17 -4 -148 123 -302 202 115 28 -164 -285 -140 80 -27 -93
5452 -93 44 -85 -114 -16 -63 131 -85 225 62 49 -36 -144 -6 -82 -9 -265 88 267 110 63 -52 -140 -305
5475 -305 207 -18 -61 243 35 -177 -193 -232 -14 157 352 -54 -68 187 153 52 148 -2 124 132 83 -45 132
5498 132 -438 13 83 -12 79 -105 -367 79 -46 41 142 -298 -97 -58 -235 204 60 -1 -164 -3 -65 -140 -175
5521 -175 -63 156 -167 218 187 -320 -172 -48 -51 -41 -38 -280 68 -1 -32 -57 -173 24 162 218 -21 -21 155 142
5545 142 40 -198 -2 4 -204 430 -37 103 -49 136 107 23 21 -3 11 150 -166 21 -96 -66 131 95 131 95
5569 95 -220 -51 70 205 214 -109 -108 -204 17 -133 -43 140 220 -290 -136 -71 -253 121 252 156 118 -53 -31 47
5593 47 263 90 41 231 -217 73 -179 90 -277 11 -144 -116 -77 191 31 -244 245 134 56 -165 -46 -71
5615 -71 157 234 -52 -20 10 127 100 -12 -257 -172 128 -167 382 -8 -105 -57 147 147 153 -55 -133 -72 96 152 29
5640 29 122 85 -84 -115 82 -94 76 -201 -157 -236 159 -110 -259 -62 -91 164 -43 -4 -40 44 -8 306 -129 -366
5664 -366 178 234 -23 58 -265 -99 151 -102 -159 -80 16 23 -337 63 -96 35 86 198 119 57 -135 -170 233 155
5688 155 -232 -154 249 56 -296 -207 13 303 -259 75 266 -67 -82 -96 239 34 -109 -20 -76 77 -148 -238
5710 -238 -50 -94 -76 -265 -411 93 176 2 -70 219 266 17 29 325 89 -137 75 61 31 180 34 82 -86
5733 -86 8 58 26 -147 126 84 -70 -98 -325 103 -426 -167 -303 -46 -150 -181 -2 -162 -159 164 118 147 10 -96
5757 -96 -33 -24 -129 -205 -87 111 16 -242 173 -61 9 -62 236 46 43 150 -226 260 -168 -190 89 118 38 97 126
5782 126 -34 -261 79 -31 43 -51 68 321 -103 -194 -36 72 -53 81 63 64 59 -84 201 -72 -84 -101 21
5805 21 -225 3 48 44 -48 -168 30 145 55 -45 65 -221 17 -105 -137 -4 -121 -9 69 -148 -125 49 -64
5828 -64 137 161 -15 46 -50 -292 -186 -165 1 -39 -102 -117 -359 38 -19 -281 -226 164 75 141 -86 87 -41 -145
5852 -145 -47 84 46 -313 -170 -78 210 -64 -93 -162 -75 134 185 -123 76 73 168 -114 246 -22 114 43 -47 165
5876 165 -185 -79 -329 203 121 -362 84 -66 182 287 -81 204 -35 115 -85 11 -65 35 -63 -202 25
5897 25 -53 -98 -7 102 -326 -97 -53 -38 203 -94 -113 -133 -36 -101 188 -154 49 32 241 178 48 106 90 -59 361
5922 361 111 -88 215 -19 50 193 -71 155 40 130 63 3 166 159 427 -24 -58 70 -66 -39 -32 -205 -273 1
5946 1 -125 40 -32 -173 -143 283 -177 112 61 -15 -150 -29 -37 194 -87 60 107 -144 58 -205 -39 -43 -146 -261
5970 -261 9 40 -2 100 48 -92 -139 326 -77 149 119 -88 -1 -48 84 58 -106 -388 -73 89 40 43 5 -193
5994 -193 55 184 97 209 -179 -60 5 -63 34 -56 1 -178 109 154 203 59 262 44 68 23 127 64 40 -7
6018 -7 -263 165 79 -11 -125 -132 -71 54 -53 71 -308 73 -17 104 -14 121 -263 125 -235 -75 -40 7 -17 -177
6042 -177 -18 168 12 -33 201 -66 222 177 -206 64 114 303 -7 189 -6 -126 -75 269 146 199 53 35
6064 35 104 -139 -124 -201 285 -82 199 280 166 69 65 -1 285 1 -19 82 95 101 -41 28 -14 -131 -217 181 201 32
6090 32 -277 -184 84 37 102 -1 200 73 10 103 -326 12 -73 208 7 -100 -3 -208 -168 -50 65 -106 -4
6113 -4 -56 -59 10 -116 -104 -61 207 -149 -39 -46 -73 42 -161 75 43 -160 54 -200 -26 -203 7 263 -1 264
6137 264 9 -31 -77 133 -28 102 76 141 -210 39 -7 204 -65 81 217 198 -40 -152 94 -219 -149 46
6159 46 -213 160 -59 10 176 -67 175 -290 -70 26 64 -75 -53 -56 -233 217 -157 -68 270 -162 11 -204 -39
6182 -39 5 294 -103 -87 236 58 -35 -3 40 174 -43 324 -225 265 -14 -43 -24 -38 263 123 98 175 -113 -43
6206 -43 -148 114 -270 33 82 6 214 -2 -124 49 -285 170 135 -63 -200 -57 -69 -17 317 -158 -108 -7
6228 -7 -89 -49 -142 -204 -247 208 -136 -283 100 102 69 10 31 -120 61 164 90 -226 174 -3 -330 114 64 35 -157
6253 -157 -101 256 61 -54 220 -123 -66 -91 34 27 101 345 -28 250 -167 -136 -309 -363 61 -134 -95 -40 65
6276 65 -226 126 215 174 -93 259 210 97 104 -6 -77 135 -68 283 -107 -3 164 -86 13 15 175 -175 -79 -229
6300 -229 -29 173 16 162 193 -94 66 -223 265 -208 63 70 -269 -1 99 -270 -44 85 -35 -50 -171
6321 -171 -29 -232 45 135 -16 130 -99 190 108 111 -104 154 163 76 66 34 148 108 73 -121 -119 -56 -40 -164 -69
6346 -69 264 121 236 -31 -25 74 -264 -45 -173 -86 -103 283 -81 64 -112 -42 -15 47 -186 25 244 13 -255
6369 -255 153 -139 -107 -69 -132 81 -364 371 -132 28 16 -69 295 -124 -216 240 42 -94 104 -209 -35 69
6391 69 46 16 167 -101 12 -86 -187 -10 278 86 -254 -312 -363 84 62 -264 -209 53 -198 -20 165 185 5
6414 5 119 -35 -130 171 -86 -18 -104 249 -203 -142 -228 -109 114 -75 -113 -193 -64 21 -35 60 383 -109 206 162
6438 162 105 5 -109 201 27 -57 13 -133 -46 -298 130 245 53 219 117 -82 -112 -248 -11 -214 -156 -9
6460 -9 12 1 25 14 -175 -96 -48 -66 47 -57 -321 -52 168 147 -114 206 4 230 60 126 241 64 121 -30
6484 -30 38 198 160 -8 -4 52 22 -234 -57 63 238 184 168 105 238 171 51 -74 98 19 178 -137 147 190
6508 190 12 42 18 3 -119 125 -228 -317 179 -143 -207 -180 -124 223 -71 -86 260 -105 11 222 96 -154 36
6531 36 -12 -238 182 285 -71 183 187 48 136 171 -108 42 206 -5 112 -314 -108 93 39 -98 151 -28
6553 -28 -157 166 -102 -101 92 24 -250 38 -189 61 -79 -121 -76 -40 41 120 -81 -82 339 -17 -6 58 88 116 -231
6578 -231 -143 209 -268 136 143 -13 -125 -68 58 18 -170 1 2 187 234 -60 145 3 20 6 0 49 -102 -51 -93
6603 -93 -226 158 -88 -53 -60 -74 93 77 125 -222 102 12 9 -89 -191 -247 -114 177 -17 -91 -31 69 -105 167 -106
6628 -106 129 37 -121 178 222 -15 89 -50 -268 43 -278 136 -48 145 -92 8 106 165 -82 32 153
6649 153 -196 99 -47 62 -152 40 -26 59 -177 33 115 79 35 -208 -88 -28 -120 -134 -30 5 232 10 322
6672 322 30 -40 37 76 110 -142 89 8 71 233 -12 -2 138 -165 -171 105 49 237 -144 87 138 -170 -125 -160
6696 -160 -83 147 -219 -38 -17 -47 83 -134 47 -157 -82 190 9 121 121 34 210 37 -98 61 209 -49
6718 -49 -302 13 -188 -151 -72 16 102 88 57 -136 171 92 -156 -198 -87 -277 13 172 78 71 -63 -62 121 -90 258
6743 258 205 -17 14 -37 -263 86 -60 86 -284 -45 -44 -51 -259 -289 158 -174 101 73 292 68 -59 387 22
6766 22 267 -224 -9 245 -96 7 -31 -121 93 46 -117 -106 61 -127 351 4 88 43 -107 -86 -50 75 250
6789 250 97 135 -73 139 -265 -186 54 -28 29 -103 8 -76 193 231 -10 63 267 62 -107 -113 -134 80 -97
6812 -97 -44 -85 7 1 131 160 211 153 177 75 220 -94 13 -39 -88 -38 -70 -15 -231 45 -79 -136 187 -57 -116 11
6838 11 80 -142 89 -12 17 -425 -101 46 -259 -122 -145 99 -41 -93 -48 -109 203 32 -164 -299 139 118 -181
6861 -181 325 37 -35 -201 -129 216 -61 0 42 5 -157 136 -109 161 -97 -249 97 49 63 -6 -101 -202 -225
6884 -225 223 103 -81 -9 117 129 -44 -54 -191 10 327 32 244 134 86 -176 200 137 82 110 -66 -105 29
6907 29 228 50 208 83 -159 68 -182 128 234 94 -25 -106 61 45 -39 -126 -53 127 118 2 323 -473 80
6930 80 42 101 -57 111 -98 -77 16 64 -61 30 158 -58 -136 -63 160 -79 73 166 236 -44 285 -2 14 -178
6954 -178 -109 223 63 -173 -151 -213 -25 138 -66 -50 8 -64 -108 138 15 -119 58 215 75 -19 -14 7 36 11
6978 11 -130 -5 -64 -40 178 61 124 79 -12 177 124 -163 -115 -209 23 -50 48 -5 89 94 -64 -82 199 144 -81 196
7004 196 -15 88 -28 54 -139 21 24 -176 209 -171 -234 64 -10 250 -15 128 -292 -63 191 -263 147 39
7026 39 -50 -240 -188 -133 -18 98 -133 225 240 157 140 251 154 171 235 98 -96 242 47 -143 -157 -60 -50 -107 -89
7051 -89 9 -43 29 -12 35 -20 69 95 -177 -110 -88 186 58 -255 39 -48 249 34 89 102 65 245 -129 -93 19
7076 19 -81 113 203 -165 -60 -129 -114 222 -105 92 71 364 104 -149 161 -195 57 26 -167 -28 -110 121
7098 121 67 -38 113 -116 -27 14 -55 -277 -193 55 96 -192 76 -154 -236 -39 92 180 212 86 -204 -101 -94 82
7122 82 83 216 133 79 -26 -55 33 287 -319 -38 -173 9 -125 40 -133 -218 -3 7 27 -71 -171 230 -45 52
7146 52 61 -75 8 -15 -41 -76 114 -133 43 79 77 -302 -68 35 -108 209 -90 64 65 48 8 -154 -12 245 93
7171 93 25 -116 -141 164 -82 139 -134 0 332 -10 122 -94 159 -47 -7 -133 31 -96 164 -92 -261
7192 -261 216 -27 -41 -23 -108 -63 37 -132 -171 -104 -100 -102 51 -86 -27 -4 -54 -32 136 187 169 -125 -227 -165 -93 284
7218 284 81 -278 -157 152 298 17 10 66 -191 -11 156 312 27 73 -201 -109 35 273 -15 -188 -133 208
7240 208 266 -79 107 -171 -66 68 19 -150 -102 -58 -169 -88 -335 -147 -148 93 -24 93 65 -202 137 17 -177
7263 -177 -145 97 -223 98 147 21 101 169 -6 7 -7 21 183 296 -22 -115 115 -209 40 273 23 -161 -107
7286 -107 184 -32 -81 14 -132 -107 -104 104 139 141 152 272 -98 -9 -102 -354 -62 157 229 -103 -242 143 -77 48
7310 48 103 -55 100 63 -1 -106 -23 -80 189 84 -156 -101 392 158 -34 62 -43 113 122 -29 171 -172 36
7333 36 243 -39 -110 -138 -150 42 -193 75 -69 313 137 133 116 -278 103 124 144 -79 83 144 183 48 118 110 58
7358 58 7 -35 -157 227 229 33 -161 23 59 -29 175 -105 9 -51 206 -70 4 69 -73 -48 -51 22 -37 -26 -65 189
7384 189 -240 -75 -82 -141 3 -52 -105 -233 -53 382 -154 76 73 -245 36 74 196 122 83 186 -236 -105 -313
7407 -313 -238 -35 -29 -5 117 39 96 271 36 -92 1 8 154 126 123 -88 125 -9 317 137 -114 35 14 -181
7431 -181 201 33 -69 61 173 81 -26 84 152 54 23 -116 -71 145 -51 157 -233 -135 -105 -57 177 202 33
7454 33 193 -153 69 -287 -242 -135 150 -108 -54 -328 67 -176 14 81 134 178 -26 -171 -195 131 -188 79
7476 79 -73 221 -71 78 -86 177 82 204 -9 26 -34 0 25 21 -52 165 -65 -121 145 133 221 61 149 -354
7500 -354 45 9 -181 210 187 -13 -240 -114 42 -92 50 33 -47 -137 -97 94 51 -161 -4 123 -218 309
7522 309 117 3 -136 -136 -89 215 140 -29 25 0 290 -29 70 -78 -66 -38 -97 -97 -9 -265 -216 -1 -395 -38 58
7547 58 -197 190 -252 -97 -85 379 41 86 69 -7 -53 -30 265 58 195 -62 37 168 -73 192 160 -96 160
7570 160 253 401 -200 26 -181 -198 45 -148 -9 -28 12 -232 -111 -149 12 -69 -325 78 68 277 -19 -66 153
7593 153 247 202 142 153 68 89 200 103 108 234 88 -116 -119 -27 -70 90 -302 362 -98 -103 -41 -173 -257 32 286 -8
7619 -8 -55 -81 -243 148 19 135 223 -104 -245 -20 -5 33 -174 59 69 9 115 152 48 112 201 189 -3 139
7643 139 -140 119 -37 -58 38 -77 74 126 318 -88 93 -59 41 74 129 -103 -99 -81 -85 11 -180 183 -59 132
7667 132 84 -177 -37 -56 103 259 46 93 -14 166 -51 95 163 23 128 65 -101 -81 192 260 -96 -17 85
7690 85 123 204 -48 -227 -84 37 -132 128 252 302 -118 118 235 -147 58 -80 -6 69 -141 150 -144 -129
7712 -129 37 -40 15 1 65 35 -28 -77 141 -141 63 238 -294 -101 -161 109 225 -301 130 -95 -46 72 -66
7735 -66 73 94 -243 108 366 -72 -209 -135 175 -80 -193 235 12 163 3 -83 191 92 -75 -191 -35 -61
7757 -61 44 -28 11 -46 165 -154 79 -12 -92 358 -2 -363 4 85 253 -36 69 10 160 -83 55 -28 -154
7780 -154 333 -50 197 42 -198 114 48 -21 -125 -34 -72 20 221 52 193 -14 319 -97 -62 1 170 132 25
7803 25 15 144 -86 9 26 -121 118 30 -18 70 -264 43 -67 71 93 -250 -207 -138 -117 134 149 -87 -39 -5 194
7828 194 34 111 46 -27 353 -92 312 44 226 -159 149 84 -40 128 -67 147 -56 -27 -156 -24 -93 -119
7850 -119 -38 71 228 141 155 227 -220 47 -137 -238 220 30 24 176 -47 -29 78 57 199 -103 154 10 -124
7873 -124 27 -34 102 121 -132 -111 -20 308 9 -51 -38 -33 82 188 -256 -107 93 16 21 -53 -395 6 181 -66
7897 -66 -124 -32 57 -17 -4 85 -134 -52 79 -125 121 -111 -4 -229 122 137 96 -220 150 -85 94 -34 8 -225
7921 -225 -244 87 240 233 -63 -51 -67 -7 -76 -190 95 111 -2 345 46 -168 -288 -13 85 95 71 -97 -142 24
7945 24 115 61 -309 -105 -195 136 -116 -226 200 52 -9 195 -76 -88 -209 -126 -147 240 22 298 -51 128 56
7968 56 -288 -5 49 81 -17 -111 -126 -3 -56 -68 131 -7 191 -55 11 -2 13 122 -13 20 73 -219 -158 -80 -191
7993 -191 -73 -222 -115 -30 -293 -234 -343 -192 -224 168 62 -97 49 -132 -173 -52 39 -92 -202 36 134 -274
8015 -274 1 -122 -113 -10 64 -237 201 63 61 -154 91 42 21 304 60 -331 48 207 8 81 -48 -93 -26
8038 -26 -16 -110 -176 -219 -108 121 148 -8 135 7 4 -162 -266 -47 -93 -95 126 -86 157 -113 -65 39 214 84
8062 84 -86 -437 6 36 -46 -29 -296 47 211 115 -180 12 -176 76 -10 -42 45 -158 -75 218 -76 -61 59
8085 59 -86 196 -64 -120 136 -113 -145 -184 135 50 -191 -61 69 76 226 -138 -184 21 -316 -3 -227 3 -218
8108 -218 -11 -224 10 246 -46 110 -151 -195 114 -170 -61 93 119 208 9 45 -147 -124 172 -81 27 -126
8130 -126 114 72 -58 -114 149 -72 -30 56 -84 93 -265 56 -5 -216 -158 -63 42 -8 131 -116 -78 71 149
8153 149 -7 -63 129 86 52 -297 -197 15 -122 90 196 -64 57 176 -161 -114 -301 -91 -59 -150 -311 -350
8175 -350 328 -209 227 -44 8 19 -366 -35 221 -77 -98 82 -107 90 34 163
8191A63
##END NTUPLES=NMR FID
##END=
