##TITLE=1H_CA-8528
 CDCl3, 8 sc, 
 9.1.2019
##JCAMPDX= 6.0         $$ Bruker NMR JCAMP-DX V2.0
##DATA TYPE= NMR FID
##DATA CLASS= NTUPLES
##ORIGIN= UXNMR, Bruker Analytische Messtechnik GmbH
##OWNER= root
$$ XWIN-NMR		Version 3.5
$$ Wed Jan  9 15:50:09 2019 Russian Standard Time (UT+4h)  she@DPX200
##.OBSERVE FREQUENCY= 200.1313
##.OBSERVE NUCLEUS= ^1H
##.DELAY= (6, 6)
##.ACQUISITION MODE= SIMULTANEOUS
##.ACQUISITION SCHEME= undefined
##.AVERAGES= 8
##.DIGITISER RES= 18
##SPECTROMETER/DATA SYSTEM= spect
##.PULSE SEQUENCE= zg30
##.SOLVENT NAME= DMSO
##.SHIFT REFERENCE= (INTERNAL, DMSO, 0, 15.7039)
##AUDIT TRAIL= $$ (NUMBER, WHEN, WHO, WHERE, WHAT)
$$ ##TITLE= Audit trail, XWIN-NMR		Version 3.5
$$ ##JCAMPDX= 5.01
$$ ##ORIGIN= Bruker BioSpin GmbH
$$ ##OWNER= she
$$ F:/spectra/data/she/nmr/H-F/1/audita.txt
$$ ##AUDIT TRAIL=  $$ (NUMBER, WHEN, WHO, WHERE, WHAT)
(   1,<2019-01-09 15:48:49.15 +0400>,<she>,<DPX200>,
      <created by zg, POWCHK disabled, PULCHK disabled
       configuration hash MD5:
       00 E9 B6 7A A2 85 ED C7 34 08 36 98 17 FE 4E 26
       data hash MD5: 16K
       7F AE A8 AE EC 97 DF 53 C1 AC 19 74 77 24 45 78>)
$$ ##END=
$$ 
$$ hash MD5
$$ 1C FE 60 DA 03 93 96 62 DA 9E 7D 57 A5 11 79 FB
##$RELAX= 
##$RELAX= 
##$RELAX= 
##$RELAX= 
##$RELAX= 
##$RELAX= 
$$ Bruker specific parameters
$$ --------------------------
##$DU= <F:/spectra>
##$EXPNO= 1
##$NAME= <H-F>
##$PROCNO= 1
##$TYPE= <nmr>
##$USER= <she>
##$AMP= (0..31)
100 100 100 100 100 100 100 100 100 100 100 100 100 100 100 100 100 100 
100 100 100 100 100 100 100 100 100 100 100 100 100 100 
##$AQSEQ= 0
##$AQ_mod= 1
##$AUNM= <au_zg>
##$AUTOPOS= <>
##$BF1= 200.13
##$BF2= 200.13
##$BF3= 200.13
##$BF4= 200.13
##$BF5= 200.13
##$BF6= 200.13
##$BF7= 200.13
##$BF8= 200.13
##$BYTORDA= 1
##$CFDGTYP= 0
##$CFRGTYP= 5
##$CHEMSTR= <none>
##$CNST= (0..31)
1 1 145 1 1 1 1 1 1 1 1 1 1 1 1 1 1 1 1 1 1 1 1 1 1 1 1 1 1 1 1 1 
##$CPDPRG= <>
##$CPDPRG1= <>
##$CPDPRG2= <>
##$CPDPRG3= <>
##$CPDPRG4= <mlev>
##$CPDPRG5= <mlev>
##$CPDPRG6= <mlev>
##$CPDPRG7= <mlev>
##$CPDPRG8= <mlev>
##$CPDPRGB= <>
##$CPDPRGT= <>
##$D= (0..31)
0 1.2 0 0 0 0 0 0 0 0 0 0.03 0 0 0 0 0 0 0 0 0 0 0 0 0 0 0 0 0 0 0 0 
##$DATE= 1547034528
##$DBL= (0..7)
120 120 120 120 120 120 120 120 
##$DBP= (0..7)
150 150 150 150 150 150 150 150 
##$DBP07= 0
##$DBPNAM0= <>
##$DBPNAM1= <>
##$DBPNAM2= <>
##$DBPNAM3= <>
##$DBPNAM4= <>
##$DBPNAM5= <>
##$DBPNAM6= <>
##$DBPNAM7= <>
##$DBPOAL= (0..7)
0.5 0.5 0.5 0.5 0.5 0.5 0.5 0.5 
##$DBPOFFS= (0..7)
0 0 0 0 0 0 0 0 
##$DE= 6
##$DECBNUC= <off>
##$DECIM= 24
##$DECNUC= <off>
##$DECSTAT= 4
##$DIGMOD= 1
##$DIGTYP= 9
##$DL= (0..7)
0 120 120 120 120 120 120 120 
##$DP= (0..7)
150 150 150 150 150 150 150 150 
##$DP07= 0
##$DPNAME0= <>
##$DPNAME1= <>
##$DPNAME2= <>
##$DPNAME3= <>
##$DPNAME4= <>
##$DPNAME5= <>
##$DPNAME6= <>
##$DPNAME7= <>
##$DPOAL= (0..7)
0.5 0.5 0.5 0.5 0.5 0.5 0.5 0.5 
##$DPOFFS= (0..7)
0 0 0 0 0 0 0 0 
##$DQDMODE= 0
##$DR= 18
##$DS= 0
##$DSLIST= <SSSSSSSSSSSSSSS>
##$DSPFIRM= 0
$$ [...]
##$SUBNAM2= <"">
##$SUBNAM3= <"">
##$SUBNAM4= <"">
##$SUBNAM5= <"">
##$SUBNAM6= <"">
##$SUBNAM7= <"">
##$SUBNAM8= <"">
##$SUBNAM9= <"">
##$SW= 24.933730806125
##$SWIBOX= (0..15)
0 0 2 0 0 0 0 0 0 0 0 0 0 0 0 0 
##$SW_h= 4990.01996007984
##$TD= 16384
##$TD0= 1
##$TE= 0
##$TE2= 300
##$TE3= 300
##$TEG= 300
##$TL= (0..7)
0 120 120 120 120 120 120 120 
##$TP= (0..7)
150 150 150 150 150 150 150 150 
##$TP07= 0
##$TPNAME0= <>
##$TPNAME1= <>
##$TPNAME2= <>
##$TPNAME3= <>
##$TPNAME4= <>
##$TPNAME5= <>
##$TPNAME6= <>
##$TPNAME7= <>
##$TPOAL= (0..7)
0.5 0.5 0.5 0.5 0.5 0.5 0.5 0.5 
##$TPOFFS= (0..7)
0 0 0 0 0 0 0 0 
##$TUNHIN= 0
##$TUNHOUT= 0
##$TUNXOUT= 0
##$USERA1= <user>
##$USERA2= <user>
##$USERA3= <user>
##$USERA4= <user>
##$USERA5= <user>
##$V9= 5
##$VALIST= <valist>
##$VCLIST= <CCCCCCCCCCCCCCC>
##$VD= 0
##$VDLIST= <DDDDDDDDDDDDDDD>
##$VPLIST= <PPPPPPPPPPPPPPP>
##$VTLIST= <TTTTTTTTTTTTTTT>
##$WBST= 1024
##$WBSW= 4
##$XGAIN= (0..3)
0 0 0 0 
##$XL= 0
##$YL= 0
##$YMAX_a= 431698
##$YMIN_a= -412950
##$ZGOPTNS= <>
##$ZL1= 120
##$ZL2= 120
##$ZL3= 120
##$ZL4= 120
##$ABSF1= 10
##$ABSF2= 0
##$ABSG= 5
##$ABSL= 3
##$ALPHA= 0
##$AQORDER= 0
##$ASSFAC= 0
##$ASSFACI= 0
##$ASSFACX= 0
##$ASSWID= 0
##$AUNMP= <proc_1d>
##$AZFE= 0.1
##$AZFW= 0.1
##$BCFW= 1
##$BC_mod= 2
##$BYTORDP= 1
##$COROFFS= 0
##$CY= 11.3945322036743
##$DATMOD= 1
##$DC= 2
##$DFILT= <>
##$DTYPP= 0
##$F1P= 18.9103706918063
##$F2P= -1.10871071338519
##$FCOR= 0.5
##$FTSIZE= 0
##$FT_mod= 4
##$GAMMA= 1
##$GB= 0.15
##$INTBC= 1
##$INTSCL= 1
##$ISEN= 128
##$LB= 0.24
##$LEV0= 0
##$LPBIN= 0
##$MAXI= 10000
##$MC2= 0
##$MEAN= 0
##$ME_mod= 0
##$MI= 1.114404
##$NCOEF= 0
##$NC_proc= 0
##$NLEV= 6
##$NOISF1= 3.799351
##$NOISF2= 2.8
##$NSP= 1
##$NTH_PI= 0
##$NZP= 0
##$OFFSET= 15.70392
##$PC= 1
##$PHC0= -8858.455
##$PHC1= 15.40006
##$PH_mod= 1
##$PKNL= yes
##$PPARMOD= 0
##$PSCAL= 0
##$PSIGN= 0
##$REVERSE= no
##$SF= 200.130013532006
##$SI= 16384
##$SIGF1= 3
##$SIGF2= 2
##$SINO= 400
##$SIOLD= 16384
##$SREGLST= <1H.CDCl3>
##$SSB= 0
##$STSI= 0
##$STSR= 0
##$SW_p= 3612.71676300578
##$SYMM= 0
##$S_DEV= 0
##$TDeff= 0
##$TDoff= 0
##$TI= <>
##$TILT= no
##$TM1= 0
##$TM2= 0
##$TOPLEV= 0
##$USERP1= <user>
##$USERP2= <user>
##$USERP3= <user>
##$USERP4= <user>
##$USERP5= <user>
##$WDW= 1
##$XDIM= 8192
##$YMAX_p= 0
##$YMIN_p= 0
$$ End of Bruker specific parameters
$$ ---------------------------------
##NTUPLES= NMR FID
##VAR_NAME=  TIME,          FID/REAL,        FID/IMAG
##SYMBOL=    X,             R,               I
##VAR_TYPE=  INDEPENDENT,   DEPENDENT,       DEPENDENT
##VAR_FORM=  AFFN,          ASDF,            ASDF
##VAR_DIM=   8192,          8192,            8192
##UNITS=     SECONDS,       ARBITRARY UNITS, ARBITRARY UNITS
##FACTOR=    0.0002004,     1,               1
##FIRST=     0,             0,               0
##LAST=      1.6414764,     0,               0
##MIN=       0,             -412950,         0
##MAX=       1.6414764,     431698,          0
$$ Real data points
##PAGE= N=1
##DATA TABLE= (X++(R..R)), XYDATA
0@%%%qJ6j6J6j6K4l2M0n4O7p8R7j20J43j73K03k38K80l28L80m39N07n82O65p56
28d02Q57r70J096j233J382j547J730j929K149k389K652k941L257l607L993m422
44b324M899n431O029o705P480q381R434j0685J2206j4103J6545j9822K4490l1730
58a8098M4613p4609K73434K06358k84891q9149j15052j1358M0137J46579O2885
69A80849j2520q2300q3579j36296j02627l2365K4849j5329k794M4559O2233J1425
81a43895L2774R4001R2945N004k4362M624J1559j1368K8601Q2043O4237j218k2082
94B12863l4044p6647q5477p772M7081Q579m2048l8165n5106j17572j17445j1942
106c17695P7754Q6106Q0238Q8261L8165n2992p7637k9437L420J9951P6200J23764
$$ plain form
0 0 0 0 0 -8 8 -8 8 -8 16 -16 24 -30 37 -41 56 -64 79 -94 109 -129 151 -177 203 -236 271 -311 354 -402
28 -402 455 -515 581 -652 730 -817 913 -1016 1133 -1256 1396 -1545 1712 -1895 2098 -2324
44 -2324 2575 -2856 3173 -3532 3948 -4433 5001 -5684 6522 -7581 8964 -10858 13632 -18098
58 -18098 26515 -48094 225340 431698 146807 57658 -57394 -68752 -28615 117964 180849
69 180849 168329 86029 2450 -133846 -236473 -268838 -243989 -259318 -262112 -217553 -155320 -143895
81 -143895 -111121 -17120 75825 80829 56467 61091 72650 61282 89883 171926 236163 234945 212863
94 212863 178819 102172 16695 8923 56004 64583 22535 -15630 -70736 -188308 -305753 -317695
106 -317695 -239941 -153835 -73597 14664 52829 -163 -77800 -107237 -103817 -83866 -7666 116098
118A16098P9732M826j130J7752j9452o0312l1490l291m7983q7713m7247O109O676
131f7425J1615M8698L6895m0788q4881o2481m7748m6331J3343J01323J08629M7990
143A8839K6866L6808K486l9324o880N0704L7651r065p496M455k8304m3808N939
156D8871M3010J0222k5030k0855l9314r4210r0567j6888K7969J4612K1645N4004
168f6531L1439k7470k7099K3510L4763J3679K8773M9467J2129l1832r355L3278
180F4751K8418J8497M5046M1978k7655q1968o3197m0727n3707l6455K6756M4858
192c3405p77k3876j689m522l2762j6943K6433K0080j7138o589K9896K4969J4907
205b1416N4991Q8691M6724j3166k1484k1200n7192o4714m097M3550K6069M660
$$ plain form
118 116098 195830 200656 199526 217278 197826 137514 106024 102733 54750 -32963 -80210 -74101 -67425
131 -67425 -55810 -7112 29783 -11005 -95886 -158367 -206115 -252446 -239103 -137780 -29151 18839
143 18839 45705 82513 84999 45675 38795 89499 127150 118085 110589 115044 86740 42932 48871
156 48871 91881 102103 77073 56218 16904 -77306 -167873 -184761 -156792 -142180 -120535 -66531
168 -66531 -35092 -62562 -89661 -66151 -31388 -17709 11064 60531 72660 40828 31473 64751
180 64751 93169 111666 156712 198690 171035 89067 25870 -14857 -68564 -105019 -78263 -33405
192 -33405 -34182 -58058 -59747 -64269 -97031 -113974 -87541 -67461 -84599 -91188 -61292 -36323 -21416
205 -21416 33575 122266 168990 155824 134340 113140 55948 -8766 -12863 30687 56756 61416
217F1416J4251m237n7662o7201k3441o090k4537j1010K4492J0440k5148m559M6169
230f7117M6119J7482K9276M3785J964m1824k1141J5840J0515P066L8063M6310
242A26338k273l6008j6783j1674m0870l8823J344M51m0770m2907r10J0362n011
255i7534J6787N4398L4932j5467k2226n975j8166k4719K2056O5734M9946K1997
267H1763L1280K6306k1739m7362j6068J131k6845l4331j474N776k1423j6107K1920
280a7173K2690j3784k0877o077k4971n2221k2658K8859L6047K3428M4815N7708
292E5786J5842k5556j0302J0217p627j5429J6727K8423o392k3766K534R452j7051
305C2858j5763J3481M408l9331m3140j3476j4923l0950k678M1038L2813L275J2571
$$ plain form
217 61416 75667 71430 13768 -53433 -76874 -82964 -107501 -118511 -94019 -83579 -108727 -113286 -67117
230 -67117 -20998 -3516 25760 69545 71509 29685 8544 24384 34899 41965 80028 126338
242 126338 124065 88057 71274 59600 18730 -20093 -18749 -18298 -59068 -101975 -102885 -92523 -97534
255 -97534 -80747 -26349 8583 -6884 -29110 -35085 -53251 -77970 -55914 9820 59766 81763
267 81763 113043 139349 117610 70248 54180 55311 28466 -5865 -7339 -1563 -22986 -39093 -17173
280 -17173 5517 -8267 -29144 -35221 -60192 -112413 -135071 -106212 -70165 -46737 -1922 55786
292 55786 71628 46072 35770 45987 38360 22931 39658 68081 61689 37923 40457 49909 32858
305 32858 17095 30576 34984 -4347 -47487 -60963 -75886 -106836 -109514 -68476 -35663 -32388 -19817
318a9817K9373L227k1546N54K0743j373j7152J1560K9557Q035L752L4331L4794
331A16038j0834l5367k3154l2220n9901m1920J0040K7184J1387K0224L6264N420
343B3161l7391l3108q230j6194k2482J3897M5074K9093J1194L1236L9082M068
355G9400j7333P34K903k8272l2798J711J2425q125k970K3494J2931k4687k6417
368g004n585j4507l6305j5475J6827P649j2055Q487L0147J2415l585J9589L5612
381C6210O160j3528M084Q507j9879k3437J2548K5250K998L140K4690J1423l0085
394D8081l5645j5036k1874m1625j9195J8364J5289n97J6909L5522R892j8138n306
407a3359O750j6154k5282P208L0039J5468J2929L8864L8239k309k0299p492j6069
$$ plain form
318 -19817 9556 12783 -8763 -8209 12534 11161 -5991 5569 35126 43161 46913 81244 116038
331 116038 105204 69837 46683 14463 -45438 -87358 -77318 -50134 -38747 -18523 17741 23161
343 23161 -14230 -47338 -55568 -71762 -94244 -80347 -35273 -6180 5014 36250 75332 79400
355 79400 62067 62801 65704 37432 4634 6345 18770 10645 7675 31169 44100 19413 -7004
368 -7004 -12589 -27096 -63401 -78876 -62049 -54400 -66455 -57968 -27821 -15406 -18991 598 36210
381 36210 42370 28842 32926 41433 21554 -1883 10665 35915 38913 42053 66743 78166 48081
394 48081 12436 -2600 -24474 -66099 -85294 -66930 -51641 -52238 -35329 193 10085 -8053 -13359
407 -13359 -6609 -22763 -48045 -40837 -10798 4670 17599 56463 94702 92393 72094 64602 48533
420D8533m3881l4336L472J0205n899O978K7640Q476k4298j8573j873j6771l0415
433g0742l900K2197R262o68K3606L7400J1566j990J6118J6043j5744k4520Q39
446A9467N844j3458n926K3202J7848j1985j3093L910j0532l4124j8972O977l760
459c4602k1218k605J6732J858q883J7107L3540J0714m895R156R835j9002k3289
472a5552Q615K1078M973Q771L0677J9480j6483k1625m180j3991l5921k1384N398
485c0144k315j7563L379K6588J2580n536O464J1740j8003l4669r461J0632L759
498d2549J2722M3833M6781J0475q438l43j1160l5145k3692R094J2223o062M56
511H195J6332K5k2908j0657P984p377k5260r733M300j0936j5887J3759L2551J4505
$$ plain form
420 48533 4652 -29684 -26212 -16007 -21906 -14928 12712 21188 -3110 -21683 -23556 -40327 -70742
433 -70742 -74642 -52445 -43183 -43851 -20245 17155 28721 26731 42849 58892 43148 18628 19467
446 19467 25311 11853 5927 29129 46977 34992 21899 25809 15277 -18847 -37819 -30842 -34602
459 -34602 -55820 -58425 -41693 -39835 -48718 -31611 1929 12643 7748 16904 26739 7737 -15552
472 -15552 -6937 14141 19114 27885 58562 78042 61559 39934 35754 21763 -14158 -35542 -30144
485 -30144 -32459 -50022 -46643 -20055 -7475 -13011 -6547 5193 -12810 -47479 -56940 -46308 -42549
498 -42549 -29827 14006 60787 71262 62824 62481 51321 16176 -7516 1578 13801 7739 8195
511 8195 24527 24552 1644 -9013 -1029 -8406 -33666 -43399 -39099 -50035 -65922 -52163 -19612 -5107
525e107K695J6645J3982j4469j7566R559J7482m12J288J6822N315k1513j4719
538A0002J0291O920q868N68J0467j4384m0401k6297k602m678m009K4317L7518
551a156R791j0839j630P17j8327j4541J5786K3471L068K569K1897J6878n838j006
565D0840J7441K507k8196k6634r462j4934k1142N343L1291J6866n356l263n377
578g6k9999l5385k368J9025R608Q559K7400K2018p498j1493J3179J7294j656m88
592B8120J3610P09k3744j5448Q150N867m135Q470J6566r304l1967j8247k780j2840
606c6973j5637R557J9914l240j4598N901J6533L802N872K5251J7796j2067j8457
619C654k779k580q804J3951L9800K7320m385r202o856k8260m2469j7250J0979
$$ plain form
525 -5107 -2412 14233 28215 13746 -3820 5739 23221 22809 24097 40919 46234 24721 10002
538 10002 20293 27213 18345 18913 29380 14996 -25405 -51702 -54304 -58982 -62991 -38674 -1156
551 -1156 8635 -2204 -3834 -3117 -21444 -35985 -20199 3272 6340 8909 30806 47684 41846 40840
565 40840 58281 60788 32592 5958 -3504 -18438 -39580 -34237 -2946 13920 8564 5301 -76
578 -76 -30075 -65460 -67828 -48803 -39195 -30636 -3236 18782 11284 -209 12970 30264 28608 28120
592 28120 41730 42439 18695 3247 11397 17264 13129 21599 38165 28861 -3106 -21353 -24133 -36973
606 -36973 -52610 -43053 -23139 -26379 -40977 -35076 -18543 -14741 -8869 16382 34178 22111 3654
619 3654 875 -1705 -10509 3442 43242 70562 66177 56975 50119 21859 -20610 -37860 -26881
632b6881N811m397P900J2597r079j7059L805J1258o693j0244O984M688j2991k867
646c7168K9453L2534J1475R113J6759l931l1320k1965L768M822k820R698J5641
659C6059q592k8491j2830M33q662r088J2557J4155j5909k6794n808O006k006R376
673c9594L5939L3219K969p319O12o944j9050j919K1046J3759m518L401J0931o658
687C5874j9596p61J1320j0029k8374j6001p647j9853j3265J8696L2355J4765M757
700B241P524o890k9676k0881J0389J9351J1209K0317L2506J1112j5578r975P224
713C8873j678j3909k168O114j3518k6749q119Q825L34j445J3912R029k0634k9242
727d0375q773n50o139Q326L3697K6494j991o446O326Q64r907Q129K7283J3815
$$ plain form
632 -26881 -21070 -25467 -17567 -4970 -14049 -31108 -27303 -16045 -22738 -32982 -25998 -21310 -34301 -37168
646 -37168 -7715 24819 36294 45407 62166 58235 26915 4950 8718 13540 10720 20418 36059
659 36059 27467 -1024 -13854 -13421 -22083 -31171 -18614 -4459 -20368 -47162 -52970 -46964 -48970 -39594
673 -39594 -3655 29564 32533 25214 25826 18882 -168 -2087 18959 32718 28200 31601 42532 35874
687 35874 16278 15517 26837 16808 -11566 -27567 -35214 -55067 -68332 -49636 -17281 -2516 2241
700 2241 9765 2875 -26801 -47682 -37293 -17942 -6733 13584 46090 57202 41624 31649 38873
713 38873 37195 23286 21118 27232 13714 -13035 -21154 -12329 -11995 -13440 472 9501 -11133 -40375
727 -40375 -49148 -49698 -55837 -47511 -13814 12680 10689 4243 10569 11433 1526 9655 36938 50753
741E0753r423q280l174j7057k0230N054K1092M956q149q31n543k8479k8870j055
755d9236J0251k781j65J6572J2965n963J46K0174J5654l279k735M223r351j8915
769a2440K476K7602K2117J1803J5481P477k8133m7127k6590o509o488L142K7395
782i794K6033l774j9665j1773j1766j8582m185K1590J8283J144M859J5878L609
795A1857r101O829K2762O984j2280m429N770o648j3286N312J4195l817j5717p378
809A053o841k0083j1311J5610J6941m209q291J870r140k6202q824K4338K9233
822e856J6047J7861J8175o108k7420j7212J266J635M458K3346K4169k775j9345
835B8241o889m750k0802j7866M829P742j1722j4176N162Q920j674L558J6847N438
$$ plain form
741 50753 41330 33050 29876 12819 -7411 -2357 18735 23691 15542 14711 9168 -19311 -48181 -49236
755 -49236 -38985 -41766 -41931 -25359 -12394 -18357 -18211 1963 17617 14338 11603 15826 6475 -12440
769 -12440 -9964 17638 39755 51558 67039 74516 46383 -744 -27334 -33843 -40331 -37189 -9794
782 -9794 16239 12465 -7200 -18973 -30739 -49321 -53506 -31916 -13633 -12489 -7630 8248 11857
795 11857 2756 9585 32347 39331 27051 22622 28392 21744 8458 13770 27965 24148 8431 1053
809 1053 -5788 -25871 -37182 -21572 -4631 -8840 -17131 -15261 -24401 -50603 -59427 -35089 -5856
822 -5856 10191 28052 46227 40119 12699 -4513 -3247 -1612 2846 26192 50361 47586 28241
835 28241 21352 16602 -4200 -22066 -17237 -9495 -21217 -35393 -30231 -21311 -22985 -19427 -2580 2858
849B858j3893r766L454j010l589J9061L1983J2188q268k047K577j3790j8209M775
863F324J6232J97j0426l224m913j9248j3489R470J1702l574j705O972p061k3928
877c6671r153J6634J4960M049J2690K0536J318j6209m427R325K507j882J1156
890B4833J0339j0354j7730o56L510r037m240J3234O712j8404k0277k826k105j0823
904c7824J384K0466J2705m310j328Q110j934q395Q128J7664J930r776L360R023
918A9203n297o634J4123J7502m589j5646o542r588k2775j4045J1233J4493J624
931f938K854R156o445k2844j0199Q937N063j303J2575K0464J957j1235J815J2404
945A6261M85m606R004J0051r237j5132K58L032q162m193J1132M431j5342j2850
$$ plain form
849 2858 -11035 -20801 -17347 -18357 -21946 -2885 29098 41286 33018 30971 33548 19758 1549 6324
863 6324 22556 22753 12327 9103 4190 -15058 -28547 -19077 -7375 -10949 -12654 -5682 -12743 -36671
877 -36671 -45824 -29190 -14230 -10181 2509 23045 24363 8154 3727 13052 15559 13677 24833
890 24833 35172 24818 7088 6432 9942 905 -3335 9899 16611 -1793 -22070 -24896 -27001 -37824
904 -37824 -36440 -15974 -3269 -7579 -8907 -797 -2731 -11126 -2998 14666 16596 6820 10180 19203
918 19203 13906 7272 21395 38897 34308 18662 12120 2532 -20243 -34288 -23055 -8562 -6938
931 -6938 -4084 5072 -1373 -24217 -34416 -25479 -20416 -21719 -9144 11320 13277 2042 3857 16261
945 16261 16746 12140 21144 31195 21958 6826 7084 10116 1954 -2239 8893 13324 -2018 -14868
959a4868K945j511j2408m99J4880M026j1633k526R858K197l449J3229K0516K908
973B3665r506p99J389j1785q991J2642J7064R18m547M701l310k2206j6445L688
987a3522L134q050j095J1433N53j2476j939J2442L108n787N794J1512m486j2269
1001a1648N192J3978K196l10J3945J1563r544j4220P00R40j1463o160R411L742
1015H322j2610q362N139j159j0228J258J3080O5j3122k685P240k849n966J2732
1029i145K1485M521m105N395M635j1195j1173P283J0068m617m314P165R28j5636
1043A295q514Q070J825j1203l750O420n293j6484k262J2633M165j592J0380J4824
1057A0514l255j1328K527Q242m456l273J3100J2106o068p327P255L201j1297p023
$$ plain form
959 -14868 -11923 -13434 -25842 -26341 -11461 -7435 -19068 -21594 -11736 -9539 -12988 241 20757 23665
973 23665 14159 13360 14749 2964 -6027 6615 23679 24597 20050 24751 21441 -765 -17210 -13522
987 -13522 -10388 -18438 -19533 -8100 -7547 -20023 -21962 -9520 -6412 -12199 -6405 5107 621 -11648
1001 -11648 -6456 7522 9718 9408 23353 34916 25372 11152 11852 12792 1329 -4831 4580 8322
1015 8322 -4288 -12650 -7511 -8670 -18898 -17640 -4560 -4495 -17617 -20302 -13062 -15911 -21877 -9145
1029 -9145 12340 16861 12756 18151 22786 11591 418 7701 17769 13152 8838 16003 16931 1295
1043 1295 -7219 851 2676 -8527 -12277 -5857 -11150 -27634 -29896 -17263 -13098 -14690 -4310 10514
1057 10514 7259 -4069 -1542 6700 2244 -1029 12071 24177 18109 10782 18037 21238 9941 2918
1071B918Q145lj6122r459M433j950j0026L806J5054J439j0417q18N502p010r151
1086b3659R930J6870L048j767R487P697r423q784Q463Q773n961l759P128j372
1100A6671j6524q647O752J241r094R08R391l654j5427l479P910k427n922R066
1114a3235J4026j007o610O595J0271l689l273J1628Q345q646q379N687K123r373
1128D463j726J2790K917j3156p612J275q055j5089J65J3162K600n803M713P874
1142a482o764j0431O182J1790l19k182J1238Q686p566o063R846P123o815k877
1156A0366Q533j064j5398p165O876l47q917J260R211n462j5284k456O565l001
1170a6283n036J0559J3623l436q190M646O450n804j433J4736J1181m873m145N772
$$ plain form
1071 2918 11063 11060 -5062 -14521 -10088 -12038 -22064 -18258 -3204 -1765 -12182 -13000 -7498 -14508 -23659
1086 -23659 -13729 3141 6189 4422 13909 21606 12183 3399 11862 20635 14674 10915 18043 16671
1100 16671 147 -8500 -1748 -507 -9601 -8693 698 -2956 -18383 -21862 -13952 -16379 -22301 -13235
1114 -13235 791 -216 -6826 -231 10040 6351 3078 14706 23051 14405 6026 11713 13836 4463
1128 4463 2737 15527 18444 5288 -2324 -1049 -9104 -24193 -24028 -10866 -8266 -14069 -9356 -1482
1142 -1482 -8246 -18677 -12495 -705 -1024 -3206 8032 16718 9152 3089 12935 20058 13243 10366
1156 10366 18899 17835 2437 -4728 2148 1801 -7116 -5856 3355 -2107 -17391 -19847 -13282 -16283
1170 -16283 -21319 -10760 2863 -573 -8763 -4117 2333 -3471 -4904 9832 21013 16140 11995 17767
1184A7767r84j3001l740J0116K186r710j825N604o537j4171o98R507k504q313
1198a6303L230O947o327q036Q929J2329o26j830R705N164j1120o120R883P678
1212A3503m066J948J1513m81j5327q191M183k859r061L962J0923l601j2430j638
1226a1622L271p324o532R410J1956l237o149O898N549o872k313J3538R479n809
1240A0243l361O968l31j1102j201J1574K047q621j638M541q879j4443J079R801
1254c323j503o630N178N725r237j0899O751J0189k202K94J1551N423r743n449
1268c875Q044M861m689L074J2214R9j3607m832N039l163q622M665J0413m464j2833
1283g676j737K492o963n759R999J1517m041n504M919J817r618k076J3857R133
$$ plain form
1184 17767 16783 3782 42 10158 12344 2634 809 6413 -124 -14295 -14993 -5486 -7990 -16303
1198 -16303 -13073 -6126 -12453 -20489 -11560 769 143 -1687 8018 13182 2062 -4058 5825 13503
1212 13503 9437 11385 22898 22417 7090 -1101 3082 223 -8838 -4876 6047 2446 -9984 -11622
1226 -11622 -8351 -15675 -22207 -12797 -841 -4078 -10227 -3329 2220 -4652 -6965 6573 16052 10243
1240 10243 6882 13850 13519 2417 1216 12790 14837 6216 4578 9119 240 -14203 -13124 -3323
1254 -3323 -4826 -11456 -6278 -553 -9790 -20689 -13938 -3749 -5951 -5657 5894 11317 1574 -3875
1268 -3875 4169 9030 4341 7415 19629 19728 6121 1289 6328 3165 -5457 -792 9621 5157 -7676
1283 -7676 -9413 -6921 -13884 -19643 -9644 1873 -2168 -7672 -2753 -936 -10554 -12630 1227 10360
1297A0360m254o3Q599j203j1976j805J0541J045p805R46N947o988j1591K410Q022
1312B185l529o336M401L051j1436r085P872J0006k485N85J1635L428j2124p364
1326i196P005M138k937N926J3562L87j1619l804L235o700q191P379J1785l745
1340G225j0160J307K712r794q331Q061Q933m512m185N983K758p733j114J0902
1354B052M494o828K18P417j733r219L482J3462J456q624k84L778r147j2209L561
1369h124J0325L43k263N683J030j3507j0728M835M645l635L703J4377M532j1613
1383c97n705O130J143o948L760J2472J150q431j069N090l738o349O941Q120o909
1398E260r906K382L152q966m814J1256R037o871o998M138M58q848j012J1724N845
$$ plain form
1297 10360 6106 6043 14642 13439 1463 -342 10199 11244 3439 4385 10332 3344 -8247 -5837 2185
1312 2185 -1344 -7680 -3279 -228 -11664 -20749 -12877 -2871 -5356 -4771 6864 10292 -1832 -9196
1326 -9196 -2191 1947 -990 4936 18498 18885 7266 3462 6697 -3 -8194 -815 10970 7225
1340 7225 -2935 -1628 1084 -8710 -17041 -8980 -47 -4559 -8744 -2761 -3 -7736 -8850 2052
1354 2052 6546 -282 -64 7353 5620 -3599 -117 13345 14801 6177 5893 9671 524 -11685 -8124
1369 -8124 2201 2544 281 5964 6994 -6513 -17241 -12406 -7761 -11396 -7693 6684 11216 -397
1383 -397 -6102 28 1171 -5777 -2017 10455 11605 3174 2105 7195 3457 -2892 4049 12169 5260
1398 5260 -4646 -2264 888 -8078 -12892 -1636 7401 530 -6468 -2330 -1872 -10720 -11732 -8 5837
1413E837m868n9M844m618r871M564J2824J278n867M289M618j0863j3630L497R923
1428A898q30j754P391L651j0728r312L326J696m905K782J1511J260j1010k557
1442g581P968O91o391M771J1949j334j1284j652M064l065l886Q012R776m092o821
1457A125K452M0j0392l500J0086O033p691m053O231K06r158n34J2300M938o465
1472A618k066L160o035r580M336J1993K278j742O555M155j2038j2270L757O795
1486I16l178j283R541M485r846p436M635L017n002J605Q966p06j1045l111N756
1501b686j679m395P836J2200k044r740l09L754o605n712P845R134l709n802L898
1516A986K333p130k014J0300L826p774l792L131l268r781J430J3262M990m637
$$ plain form
1413 5837 969 910 5754 1136 -8735 -4171 8653 9931 4064 8353 12971 2108 -11522 -8025 1898
1428 1898 1068 -686 6705 10356 -372 -9684 -6358 -4662 -9567 -6785 4726 5986 -5024 -7581
1442 -7581 387 1078 -5313 -542 11407 10073 -1211 -2863 1201 -1864 -5750 2262 12038 7946 1125
1457 1125 3577 3617 -6775 -10275 -189 5844 -1847 -5900 331 537 -8621 -9155 3145 8083 1618
1472 1618 -448 2712 -3323 -12903 -8567 3426 5704 3962 10517 14672 2634 -9636 -5879 916
1486 916 -2262 -3545 5996 10481 635 -6801 -2166 851 -4151 -2546 6420 5714 -5331 -8442 -2686
1501 -2686 -4365 -8760 -924 11276 9232 -508 -817 2937 -3668 -9380 -1535 7599 3890 -1912 1986
1516 1986 4319 -2811 -4825 5475 9301 1527 -2265 866 -2402 -12183 -10753 2509 7499 2862
1530B862J391M586p593j2268J88Q720M28j448P506N176p675q031M371N119m019
1545f87o48Q266J782j0788o332N486K578m222M320J1273P07j0465m338K416m275
1560d927o385N663J0037r86o306L905L732o888m746P611O185o704o234M644K148
1575G49o853p73J1644O478n082k607K941m882j1281O95R610J946l097M524N716
1590I728p571j0727K560P590k563l810O637M492q745p943M189M890j812J893J0437
1605I245K117r569m623L478k562o617L931J2395J165p537L26N142m244p805K634
1620b524P001l671p380K467L319m860j867R211O120o132m307M438j628r557j707
1635a1077J0961O095l847J020N948k704r652q7P116L33l960L827L581p505r009
$$ plain form
1530 2862 4253 8839 1246 -11022 -10834 -2114 -1686 -3134 4372 9548 1873 -6158 -1787 3332 -687
1545 -687 -1335 6931 8713 -2075 -8407 -2921 -343 -4565 -245 11028 11735 1270 -3068 -652 -4927
1560 -4927 -11312 -5649 4388 3402 -2904 1001 4733 -2155 -6901 710 6895 191 -6043 -1399 749
1575 749 -6104 -6877 4767 11245 6163 3556 6497 1615 -9666 -8971 639 2585 -512 4012 9728
1590 9728 2157 -8570 -6010 1580 -983 -4793 1844 6336 -2409 -10352 -6163 -1273 -3085 -1192 9245
1605 9245 11362 1793 -2830 648 -1914 -8531 -4600 7795 8960 1423 1749 6891 2647 -5158 -2524
1620 -2524 4477 806 -6574 -4107 -788 -5648 -7515 1696 7816 1684 -2623 1815 187 -9370 -11077
1635 -11077 -116 5979 2132 3152 9100 6396 -3256 -3343 3773 4106 146 3973 7554 49 -8960
1650h960L497O397k064j339P974L907r905r091K096K107n086K116J1512N324n318
1665C167j647M197k967q093K327Q176j036o683K842O498l220n424N491O765n730
1680D663q466J017O29o828k299Q682O999m009j793M535k280r536j391R282L588
1695B793l778K534O632l862r459J194Q641N96k553N466L785p576j0284R29K396
1710b546l576m40R692N314o784n571L685q39q336o08Q228K512n799O12P310M58
1726C312m617M290P786k850q279J08K514n327l706Q178Q457l065m592K958q17
1741D350r901m883O413M127m640j090N788o31p311J321Q882K523m055J806M130
1756F829n984r840K126P553R66l1Q823N650p093r436M3j87o770j834Q868M072
$$ plain form
1650 -8960 -5463 934 -1130 -2469 5505 9412 -493 -9584 -7488 -5381 -10467 -8351 3161 8485 3167
1665 3167 1520 5717 2750 -5343 -3016 5160 4124 -2559 283 6781 3561 -1863 3628 10393 4663
1680 4663 -3803 -2786 -2157 -8985 -11284 -2602 4397 388 -1405 3130 850 -8686 -10077 -795 2793
1695 2793 -985 1549 8181 4319 -5140 -3946 4695 5291 2738 8204 11989 4413 -5871 -4942 -2546
1710 -2546 -6122 -6562 3130 8444 1660 -3911 -226 -1065 -9401 -10009 -1781 731 -5068 -4456 2854 3312
1726 3312 -1305 2985 10771 7921 -358 -250 2264 -3063 -6769 1409 9866 6801 2209 5167 4350
1741 4350 -5551 -10434 -4021 106 -4534 -5624 164 -467 -7778 -6457 2425 4948 893 2699 6829
1756 6829 845 -8995 -6869 684 1650 1619 10442 16092 8999 -437 -394 -581 -7351 -9185 -317 3755
1772C755m920k059N065K39o898k35O175n64p676k1O203j039k781O246Q675j508
1788H657o405M89J766n749m095O834O663m093m226K386n07p833j914Q444N141
1803E558m202j317L255n176j0723j784P961L811L53P423Q159l832r411j269J694
1818E00m925l294P116O789k591k258O274K503o426m033L185j882r808l852O064
1833f638L165j841N105R643n23r037l960R61m908m941P661J0588J038k479L243
1848G077J678p361n736M978N014l470k363M205j99q354k498O014K934m069J337
1863h13N584l197q530o96N111k07l741M002O697l245m911M360O070k119k302M612
1879F675J120q233o381L304K959j552K738R479J915q380n527j01m319p280K525
$$ plain form
1772 3755 -1165 -3224 1841 2080 -4818 -5053 1122 558 -7118 -7139 -936 -1975 -4756 1490 10165 8657
1788 8657 2252 2741 4507 -1242 -5337 1497 8160 4067 -159 2227 1720 -6113 -8027 417 5558
1803 5558 1356 39 3294 -1882 -12605 -14389 -6428 -2617 -2264 5159 13318 9486 75 -1194 500
1818 500 -4425 -7719 -603 6186 3595 1337 7611 10114 3688 -345 2840 958 -8850 -12702 -6638
1833 -6638 -3473 -5314 -209 9434 8911 -126 -4086 -3125 -8033 -12974 -5313 5275 6313 3834 7077
1848 7077 8755 1394 -4342 636 5650 2180 -183 4022 3823 -4531 -7029 -1015 1919 -2150 -813
1863 -813 4771 1574 -6956 -7652 -2541 -2748 -6489 -2487 4210 965 -3946 414 6484 4365 2063 6675
1879 6675 7795 -438 -6819 -3515 -556 -2108 630 10109 12024 3644 -1883 -1984 -6303 -13583 -11058
1894a1058R467K427k542K615M456m004n430L122N061l629m621L259K984l622j346
1909b861Q183N976l718k831J995l427j0307l244O360K782k261L259N770k915p853
1924e092n02M688j768l398M247M978l829n501L827N522j570j22O523L177o898
1939D282n529J869j06n317J137P944J761n622j535L615k668o393J695O074j681
1954d74o214R31L309k634k093P002P661j501l214K331o19p849l271N880M457j483
1970B219Q92N960o65q246k488L543p63n378N77L981k829n961K434O808j85j858
1986a959M793L403o604o670K142L622k129Q97R034M741m608l379K390j201o228
2001a756m91N093l83n780q7M231k033m709M051N832k034o330N08J821m802l659
$$ plain form
1894 -11058 -1591 836 -1706 909 5365 1361 -4069 -947 4114 485 -4136 -877 2107 -1515 -2861
1909 -2861 5322 11298 7580 4749 6744 3317 -6990 -10234 -3874 -1092 -3353 -94 5676 2761 -5092
1924 -5092 -5594 -906 -2674 -6072 -1825 3153 -676 -6177 -2350 3172 1602 1480 8003 11180 4282
1939 4282 -1247 622 516 -4801 -3664 4280 6041 419 -1116 2499 -169 -6562 -4867 1207 -474
1954 -474 -6688 -5757 -2448 -5082 -7175 -173 7488 5987 2773 5104 4485 -3364 -6635 -755 3702 2219
1970 2219 3111 9071 8406 160 -2328 1215 452 -4926 -4349 -368 -3197 -9158 -6724 84 -101 -1959
1986 -1959 2834 6237 -367 -7037 -4895 -1273 -3402 -2505 6529 11270 6662 3283 5673 4472 -1756
2001 -1756 -2247 2846 2463 -3317 -3404 827 -1206 -5915 -1864 3968 1934 -4396 -3888 -2067 -6869 -10528
2017a0528O118O811m62m69M921J348o298k537M541J500m606q51M946q90o453O25
2033b284O056Q96m162M43K302n610q034N66L999k90K64P228N373m038m064K122
2049G67O46n069r20O678L509l751j113N169N39m934M98M543j410o452j413K126
2065e87l580m213L797N661j646l298L177K703m494m036M311L626l548j975M181
2080G9K322l654Q27P436L094l411j483J929n116q533r51N111R44p40M814O110
2096H778l892p431j612Q25m810l576N529N542j009M40N028K603m199j251L454
2111D419o36o125o40N451L66l000K299O621j243o491j417J560l608m757J974M919
2127c08j887k494K639J911m335j684N978M132l216j304M230l13o778j915N649
$$ plain form
2017 -10528 -4410 2401 1939 1470 6391 7739 1441 -1096 3445 4945 339 -512 4434 3544 -2909 -2284
2033 -2284 3772 4668 506 949 3251 -2359 -10393 -9827 -5828 -6118 -5854 1374 6747 2709 -1355 767
2049 767 1413 -3656 -4576 2102 5611 1860 747 5916 6455 1521 2019 6562 5152 -1300 -2713 -587
2065 -587 -4167 -8380 -4583 1078 -568 -3866 -689 2014 -2480 -6516 -2205 1421 -2127 -4102 79
2080 79 2401 -1253 -426 7010 10104 6693 5210 7139 2023 -6510 -7461 -2350 -1406 -2146 2668 8778
2096 8778 4886 -2545 -4157 -3332 -8142 -11718 -6189 -647 -1656 -1216 3812 6415 2216 965 4419
2111 4419 3783 -2342 -2982 2469 2835 -165 2134 8755 7512 1021 -396 1164 -2444 -7201 -5227 -308
2127 -308 -2195 -4689 -2050 -139 -4474 -6158 -180 3952 736 -568 3662 3349 -3429 -5344 305
2142C05L308j386K340N606j164o313k615Q09m297l976L203M646k184k516M338
2157A04L412l952m087L268J678m957l884M043L247j169K212O869K405l952j315
2172C922J835m235o196J329N744n24l198L072M145l242n438J729K589l680m280
2187f428J481J749l640p14N758L706j258J803M289j396p323k250M547L61k807
2202b122L153O852O6n009r15J755k843l919K026K012l412l350K426J793l765m22
2218e674O812K803m211k406K538j4m914o39O033L477j964J285L541j536l907J145
2234B369K998k420m658J587J915m797l526M088N491j532k464K302L75o766m039
2249i077K099K236P6K541O521Q41m005j19K853j369m068K474M518j570n580J032
$$ plain form
2142 305 3613 2227 4567 10173 9009 2696 81 890 -3407 -7383 -4180 466 -1718 -4234 104
2157 104 3516 -436 -4523 -1255 423 -4534 -8418 -4375 -1128 -2297 -85 6784 9189 5237 3922
2172 3922 5757 1522 -4674 -3345 2399 1875 -1323 1749 5894 2652 -2786 -1057 1532 -2148 -6428
2187 -6428 -4947 -3198 -6838 -7552 -1794 1912 654 2457 6746 5350 -1973 -4223 324 685 -2122
2202 -2122 1031 7883 7949 2940 2025 3780 937 -2982 -956 1056 -2356 -5706 -3280 -1487 -5252 -5674
2218 -5674 1138 3941 -270 -2676 -138 -152 -5066 -5705 328 3805 1841 3126 6667 5131 1224 2369
2234 2369 5367 2947 -1711 -124 1791 -3006 -6532 -2444 3047 1515 -949 1353 1728 -5038 -9077
2249 -9077 -6978 -4742 -4666 -2125 4396 5237 1232 1113 3966 2597 -1471 1003 5521 3951 -1629 -597
2265e97L278j390j707L706L436l632m915j530o45n122m08O362L908j806Q31L807
2281C576q67n908r66M447Q55k770R26M543p39k669K378M847r38l743O66n07n917
2298b786m348L379L784j509JM349P65p226l723K639J593j865J515N706M26m495
2314a795n08L402k81j004L775N382k198n059J98N19m203k947M867M236j811k404
2330A69J897k34n272k691L224J148l528m30L492m7k327K986O567M36l231p3J338
2347C424m064m933K577O519R65J00L031J535n877n818N02N64l006j1M392J056
2363I56m666j157L369J012k689J207M433j455n278n84L465k6l65N022N419j450
2379G213m014P7N9m563k022L885L303k778k310K712n94m619p32M476J355l821
$$ plain form
2265 -597 2681 1291 -416 3290 6726 3094 -1821 -3351 -3996 -9118 -9526 -3164 744 -1062 -231 3576
2281 3576 2709 -3199 -4165 282 1137 -1633 -707 3836 3097 428 2806 7653 6715 2972 3638 3131 -2786
2298 -2786 -7134 -3755 29 -1480 -1479 2870 3635 -3591 -7314 -4675 -3082 -4947 -3432 2274 2700 -1795
2314 -1795 -2303 1099 818 -186 3589 8971 6773 1714 1912 2431 -1772 -4719 148 4384 2573 169
2330 169 2066 1832 -3440 -6131 -2907 -1759 -5287 -5717 -2225 -2272 -4599 -1613 4954 5390 2159 2086 3424
2347 3424 -640 -5573 -2996 3523 4488 4588 7619 9154 3277 -2541 -2039 -1475 -4481 -4492 -100 956
2363 956 -3710 -4867 -1498 -486 -3175 -1968 2465 1010 -4268 -4852 -1387 -1413 -1778 3244 8663 7213
2379 7213 3199 3276 3335 -1228 -3250 635 3938 1160 -1150 1562 968 -3651 -4383 93 1448 -2373
2395b373j110J814j938l843J785N413J823q05K618K862l510m592J932K967j613
2410A430j607L107J886m156k693L495K385k657p67K357k087o707k245K627J119
2425d513l50M301O035r13m826q69J040l099k563M271N160j87j986K251J863l271
2441B344j735L074J380m456k604J530r14l918N01N649J931k760j94J399k700n061
2457f534Q71M519J33j463L019K840k133k663L552L321j767k060K184k07n577l127
2473e092L583L209j055J538L996j099o988k838P58q59k481L644N486O8l105P50
2489d85K343k378k683L479L507k348k576K324J385k880q27M802K008l323k157
2504A91K073j239m591L13L894j2l495J99K379j843k854L277N051o99k964J081
$$ plain form
2395 -2373 -3483 -1669 -3607 -7450 -5665 -252 1571 766 3384 6246 2736 -1856 76 3043 1430
2410 1430 -177 2930 4816 660 -2033 1462 3847 1190 423 2780 693 -6014 -8259 -5632 -4513
2425 -4513 -4863 -562 5473 4560 -266 -1135 -95 -3194 -5757 -1486 3674 3487 1501 3752 5615 2344
2441 2344 609 3683 5063 607 -1997 -467 -1381 -5299 -4798 851 2782 22 -172 1227 -1473 -6534
2457 -6534 -5663 -1144 -1011 -2474 545 3385 1252 -1411 2141 5462 3695 1635 3819 3612 -1965 -5092
2473 -5092 -1509 1700 645 2183 6179 5080 -1908 -4746 -3988 -4847 -7328 -3684 1802 1870 -1235 -485
2489 -485 1858 -520 -3203 276 3783 1435 -1141 1183 2568 -312 -1139 3663 5671 2348 191
2504 191 2264 1025 -3566 -3253 641 629 -2866 -2667 -288 -2131 -4985 -1708 3343 2644 -320 761
2520G61p9m805k936M195N051J001J273L919J53o293m669Q64n86k626J764N657
2536B644J058k829l03K306k294m778L98K433k195k826K813M224k8j88L740J994
2552F169m304m474J157R93k368J073N981K378k973j772P69k504m757Q29M836P92
2568A825k345N71J859m018m403J792L963l73n88L314K647l682k787J964J729l157
2584a689m90L827J593k431J25L970L70l924o93J129l086m591O05M148R00n50L274
2601B487K789l871n040m09Q01k488Q2N374M366j390q03K078j85m285j315L067
2617A258J013k832rL470m77l253P56L571j531l535J10J445k393l171K607L591
2633F20j098j810K401J286l066j576L529K428k468n24L116M04m087p36L658P73
$$ plain form
2520 761 682 -4123 -7059 -2864 2187 3188 4461 8380 8533 2240 -2429 -1565 -2151 -4777 -3013 2644
2536 2644 3702 873 570 2876 582 -4196 -3798 -1365 -3560 -6386 -3573 651 623 435 4175 6169
2552 6169 1865 -2609 -1452 -459 -2827 -1754 4227 6605 3632 1860 2629 125 -4632 -3803 1033 1825
2568 1825 -520 51 1910 -2108 -6511 -4719 -756 -1129 -1717 1597 4244 562 -2225 -261 1468 -1689
2584 -1689 -2179 1648 3241 810 935 4905 5275 1351 658 1787 -1299 -5890 -5285 -1137 -237 -787 2487
2601 2487 5276 1405 -3635 -4044 -3243 -5731 -5649 -275 4091 2701 1898 3976 3791 -494 -1809 1258
2617 1258 2271 -561 -570 2900 2423 -830 -74 3497 1966 -1569 -1459 -14 -2407 -5578 -2971 620
2633 620 -478 -2288 113 1399 -1667 -3243 286 2714 246 -278 2838 3242 -845 -1581 2077 2850
2649B850k198R85K912j542n076k73J786j989k350K849L379j889k042J999J770
2664A171k712j787L008J514k697q88L486J429k129K49M571l41l722n84J842j692
2680G18l862J280L539q45k733J801K429k545l570J910J571k528j481K806J745
2695B35k398j74L901J412k166J99K867k99m239l32K825l24k409J381L610j042
2711C047l309M58J605k734l506J734J808k370j214L290K255k387p87L275J461
2726B626l310j207L048K46k670O60L783J059k468N93K698k613l737L88K028j976
2742h52k822K532K479k582k321K104J639k059j743L370P65k211j125K906O37j754
2758a037P64M329J08k986L98K809j827l807P03K870j444k934K006K187k208k416
$$ plain form
2649 2850 652 1637 4549 3007 -2069 -2342 -556 -2545 -4895 -2046 1333 -556 -2598 -599 1171
2664 1171 -1541 -3328 -320 1194 -1503 -2391 1095 2524 395 644 5215 4874 1152 568 2410 718
2680 718 -3144 -1864 1675 830 -1903 -102 2327 -218 -3788 -1878 -307 -2835 -4316 -1510 235
2695 235 -2163 -2337 1564 2976 810 1009 3876 3577 -662 -994 1831 1507 -902 479 4089 3047
2711 3047 -262 196 1801 -933 -4439 -2705 -897 -3267 -4481 -1191 1064 -1323 -2110 1165 2626
2726 2626 -684 -1891 1157 1403 -1267 -607 3176 4235 1767 2360 5058 2445 -1292 -904 1124 -852
2742 -852 -3674 -1142 1337 -1245 -3566 -1462 177 -1882 -3625 -255 510 -1701 -2826 80 717 -1037
2758 -1037 -273 4056 4164 1178 1576 4385 2558 -1249 -546 2324 880 -2054 -48 2139 -69 -2485
2774b485J828J380k658k002J957P70k636p85M072K142j980J207L214l1l911j100
2790a018K895o2l157K125L213p47k696J027J708k617k751J268R04l247k181K540
2806b796K026j433n28L964J260l262j648J672L15k523J207M393J297j824J228
2821C348K171k487l821Q82K218j631k901K691J576k576k853K265J487k811j428
2836c870K273J083k561m13L152R57k300O18L303n14k770J271L637L5k389J222
2852B734J909k704l836K93K171j215m22K729K045l685k977P98j055k593m91M644
2868a655K291j466P56K783n39l739J79L106n47k165J733L068o05k070J617K058
2884D805k793k633O11L62l183j611L284J828j995j306K576r9m031o25L203J526
$$ plain form
2774 -2485 -657 723 -1935 -3937 -1980 -1210 -3846 -4631 -559 1583 -397 810 4024 3993 82 -1018
2790 -1018 1877 1815 -1342 783 3996 3249 553 1580 3288 671 -2080 -812 92 -3155 -5336 -2796
2806 -2796 -770 -2203 -2731 1233 2493 -769 -2417 -745 -430 -2953 -1746 2647 3944 2120 3348
2821 3348 5519 3032 -789 93 2311 680 -2221 470 2046 -530 -3383 -1118 369 -2442 -3870
2836 -3870 -1597 -514 -3075 -3488 -336 621 -1679 -1061 2242 1728 -1042 229 3866 3901 1512 2734
2852 2734 4643 1939 -1897 -1604 567 -648 -1070 1659 3704 19 -2958 -2160 -3215 -5808 -6299 -1655
2868 -1655 636 -830 -74 2709 2170 -1569 -1390 1716 1169 -996 737 3805 3200 1130 2747 4805
2884 4805 2012 -621 -10 352 -2831 -4442 -1158 670 -1325 -2631 -55 -154 -4185 -4810 -1607 -81
2900h1j270J195L045p08l359P29K595m49r50K953J994k475l504R18N98k243j837
2917b849L315J813k848j981J535M53l090m85L300L1k166J21K986k39j911K481
2933D66L503k31l146M51J938k339k428K374L316r16j761J062K67m007k008K179
2949a280J005k178n63L164q71l438j35L488P29j564J384K747j144l169K76L058
2965A509m39p07K771K039k472k550J043R41k853p72K842R47l549k156J863M05
2981a138k098K08L808M42k657p26J086j178j788K623M140m0j288J717R53l078
2997I86k704K070K696j730j326J960M52l381j397K502Q08k287o59J913j356l619
3013e072O19L886M35j432J773K777k294l572J142K887k26p22K960J684k349k928
$$ plain form
2900 -81 -1351 -156 2889 2181 -1178 -449 2146 1697 747 3700 5694 3219 -285 633 1231 -1012 -2849
2917 -2849 466 2279 -569 -2550 -1015 -562 -3652 -4137 -837 -806 -2972 -2851 135 -104 -2015 466
2933 466 3969 3738 592 1043 2981 642 -1786 588 3904 2988 1227 2289 2556 -1451 -3459 -1280
2949 -1280 -275 -2453 -3016 148 -723 -4161 -4296 -808 -79 -1643 -259 2488 1344 -1825 -1549 1509
2965 1509 1070 363 3134 5173 2701 151 1194 2135 -718 -1490 1352 2299 -1250 -3406 -1543 -1138
2981 -1138 -3236 -3028 780 1222 -1435 -2161 -1075 -2253 -4041 -1418 2722 2682 1394 3111 4064 986
2997 986 -1718 352 3048 1318 -8 1952 2404 -977 -2374 128 936 -1351 -2010 -97 -1453 -5072
3013 -5072 -4453 -567 -132 -1564 209 2986 692 -2880 -1738 1149 923 201 3161 4845 2496 -432
3029d32N11J199k104L25L549N98l499j870R80j165k832R65L490R86j920J67J887
3046H35j418k294J345K921r26j658J711J736j361j114L116K012k266k222R44o67
3062F94l572m30L477J844j383q9J487k362l917l80K308M05o93K846K849k074l120
3079b110J241K108j220q43K944K141k984j981J844N20k062k08K789K73k963j065
3095a576J591n44k307J223K783p32k999R2K004j445j259K971L076j167j976J291
3111A026J54k571o94L221K198j171o18J736r12l759j273K730P05k098O66J861
3127A201j199k889N38K564o04j286J395J820k294k427J921J948m62p6K872J060
3143D082l173j695J224P89j928J93L084J24k884o83J335j278j710J196K577o28
$$ plain form
3029 -432 79 1278 -826 -501 3048 3646 147 -1723 -743 -1908 -4740 -3775 -285 701 -1219 -1052 835
3046 835 -583 -2877 -1532 1389 463 -1195 516 2252 891 -223 2893 4905 2639 417 1361 694
3062 694 -2878 -3308 169 2013 630 541 2028 -334 -4251 -4631 -2323 -1918 -2611 235 3084 1010 -2110
3079 -2110 -869 1239 19 -824 2120 4261 1277 -704 1140 1660 -402 -610 2179 2452 -511 -1576
3095 -1576 15 -529 -2836 -1613 1170 438 -2561 -2469 -465 -1910 -3169 -198 2878 1711 -265 1026
3111 1026 1180 -1391 -2085 1136 3334 2163 1545 3281 2369 -1390 -2663 67 772 -1326 -660 1201
3127 1201 2 -2887 -2349 215 -389 -1675 -280 1540 -754 -3181 -1260 688 226 150 3022 4082
3143 4082 909 -786 438 1227 -701 -508 2576 2700 -184 -867 468 -810 -2520 -1324 1253 625
3159F25k667L4J387j193j220K381K995j094j818J382N00k288p71K722J790j379
3175A386o98J795n38k961k21K319K35k004L70J750k001k652P42K510l01j254J706
3192A83J316k104k282J762J642r05j81L175N20k766j026J676L55j824O14K680
3208B835m21k658p07J360j055j725R77K545m39k270Q03Q51j952j229K178K251
3224A344j699q70J980O92j666k64K109J035k004o93J529p79k250K43K910K94j791
3241A20P01O95k015k871J068J301j48m65K170J560k416j607J371Q19j479j45K474
3258A133J307j995n10K021k94j976M06J909p87k096L0J760q31j566J169J700j385
3275ek061R97P74j432q31K587J790j746j109J406K49k092l96L284P37j005K37
$$ plain form
3159 625 -2042 -2008 -621 -1814 -3034 -653 2342 1248 -570 812 1312 -976 -1747 975 2765 1386
3175 1386 688 2483 1945 -1016 -1237 1082 1317 -687 -317 1433 -568 -3220 -2478 32 -269 -1523 183
3192 183 1499 -605 -2887 -1125 517 -388 -569 2606 3126 360 -666 1010 1365 -459 155 2835
3208 2835 2414 -244 -951 409 -646 -2371 -1394 1151 712 -1558 -755 96 -1856 -3085 -907 1344
3224 1344 -355 -1225 755 1447 -219 -483 1626 2661 657 -36 1493 714 -1536 -1293 1617 1911 120
3241 120 821 1516 -499 -3370 -2302 -1001 -1149 -1614 556 2116 -300 -1907 -536 283 -1196 -1341 1133
3258 1133 2440 445 -65 1956 1662 -314 92 2001 1214 -882 -852 908 77 -1489 -320 1380 -5
3275 -5 -2066 -1069 -295 -1727 -2558 29 1819 73 -1036 370 619 -1473 -1869 1415 2152 1147 1384
3292A384J219q90l049L55J617o46j295J312J610j337j921J043R55j460j098J283
3308i18J242j715m97J965J204j296k24K087j12k076p79K237j94j285J054J811
3324B504m88k228N8J338k111j215J084J931j066j255R01R42k018j155K275J169
3340F66j230j78K051L69k411p5K025L47j625L68K167r07j850J49J718q84j904
3357a204Q76J700k050j446R43J696j087j078J655O07k085p03J929N56j283L54
3373f20K307O52k450J89J428l90j739J019J684q24j583M11J292j598j641J267
3389e96J281j404r24J189J119k186n39J500N42r29K25J557L78j810L47J904m50
3406A204j489N05J914q63j715P65J757j210j684J016J168k002j565R82J172j249
$$ plain form
3292 1384 2603 1713 -1336 -981 636 -10 -1305 7 1617 280 -1641 -598 357 -1103 -2201 -918
3308 -918 324 -1391 -1888 77 1281 -15 -239 1848 1736 -340 -1119 1118 924 -361 693 2504
3324 2504 2016 -212 -154 1184 -927 -2142 -1058 873 -193 -1448 -547 395 -1623 -2778 -503 666
3340 666 -564 -742 1309 1678 -733 -808 1217 1564 -61 307 2474 1567 -283 -134 1584 700 -1204
3357 -1204 -328 1372 -678 -2124 -1181 515 -572 -1650 5 612 -1473 -2176 -247 309 -974 -620
3373 -620 1687 2339 -111 78 1506 1116 -623 396 2080 1256 -327 84 1376 -222 -1863 -596
3389 -596 685 -719 -1643 -454 665 -1521 -2060 -560 -18 -947 -722 835 1213 -597 -250 1654 1204
3406 1204 -285 220 2134 1271 -444 321 2078 868 -816 200 1368 -634 -2199 -1217 -45 -1294
3422a294r70J945J124j485j239J902J55j750K65K616M13j740N31J913q72j861
3438c47O42J905j013j275N86J276j685j680J275J058j548q45J449K59j535o50
3454b128J516N58j424J21K004K12j864P40J422J33j265P25J621n64j607L57J202
3471A759j552j210J214J493j698j214J189K99j782r59J527J152j575k74J404M68
3487B41j418K13J967lj370M38J508q55r20O13J991j079j502J111R90j592j712
3504a379P98J147j491j86J524J83j914m70Q53J61j097O52J806j63j211K45J764
3521A222l41j400J012J748m65j756P24J242j426j274J476P47j607q64J111j47
3537Bj746l94J816K19j491O9J573k12j854K88K106J4q95J109R93m63j376Q68J088
$$ plain form
3422 -1294 -2264 -319 805 -680 -1919 -17 138 -1612 -1347 1269 1682 -58 473 2386 1514 -347
3438 -347 295 2200 1187 -88 498 1774 89 -1591 -316 742 -806 -1651 -202 57 -1478 -2128
3454 -2128 -612 -54 -1478 -1357 647 859 -1005 -265 1157 1290 25 750 2371 1807 200 557 1759
3471 1759 207 -1003 211 1704 6 -1208 -19 280 -1502 -2461 -934 218 -1357 -1631 -227 241
3487 241 -1177 -964 1003 1000 -370 68 1576 721 -199 414 2405 1326 -176 935 1925 333 -1379
3504 -1379 -581 566 -925 -1111 413 596 -1318 -1788 -935 -774 -1871 -1219 587 424 -787 -542 1222
3521 1222 881 -519 493 2241 1776 20 744 1986 560 -714 762 1509 -98 -962 149 2
3537 2 -1744 -2138 -322 -103 -1594 -1525 48 -164 -2018 -1730 376 390 -505 604 1597 1134 -242 626 1714
3556A714n47j348J516Q58j705j322J082N15j379j089J800k90j484n57J727j84
3572f93j007O74J539r6j727N48J235l56j270J857J916p29j575O36O64j388j078
3589h50J323R45j097o82P39q5j989q9J621j0j472K75J230N0k077Q54J740J06r52
3608d20L85R69l85j192J099J438p02n98R88L82j887j143J507k50o45j69J386O8
3626H31k293m62Q93K03r08M10K013l45j175L57J074o79j022J611J264q13p18R31
3644A172N82j292j062J593N81j593p11P92Q9j278l53J768K79j588n3Q46q24j290
3662b342Q37K002p2q32R87Q52j225j328J290J070o12l94J324P11k340n69Q83M62
3680G04j382J97J554k46k104j34J155o38q30J003J361p48r64L79R43r67j30J550
$$ plain form
3556 1714 1167 -181 1335 2193 488 -834 248 763 -616 -1705 95 -195 -1679 -2236 -509 -693
3572 -693 -1700 -1026 513 417 -1310 -762 473 117 -1153 704 2620 1891 316 952 1616 228 -850
3589 -850 473 1418 321 -361 378 293 -1696 -1785 -164 -174 -1646 -1371 -141 -91 -2168 -1314 426 532 -420
3608 -420 -35 934 549 -643 456 1894 1192 594 1582 1964 77 -1066 441 191 -454 -623 763 831
3626 831 -1462 -1924 -1031 -828 -1736 -1326 687 342 -833 -476 598 -81 -1103 508 1772 959 241 1172
3644 1172 1754 462 -600 993 1574 -19 -730 62 151 -1127 -1480 288 567 -1021 -1074 -228 -1052 -2342
3662 -2342 -1505 497 425 -407 580 1432 207 -1121 169 1239 627 233 1557 2268 -72 -641 242 704
3680 704 -678 -481 1073 827 -1277 -1411 -256 -894 -1724 -721 640 -108 -1072 -693 250 -717 -847 703
3698G03J119r88j116R10L75j226l20J970O31j746o10J170r20j708J73K173M9j299
3716f60J26Q42p47j372L85J661n53j78J049O60j382j013J324J474j160j41R09
3733A224L04j889l53O42P31p94l47J867p36j845j89P94j48o76J115J643q79j533
3751a069R84M94j083l64J241J383r00o27M26M97j285k10J638J06j270j17P74l63
3769B55j369L38J527k57j354K61P58p96j209J035J216j92n75R78K79j564o44J253
3787f0Q16m60k41J722R8k294m03R24K67j304Q03J237j01j598k00J103j052k86
3805a029N25J157q84q36P74P26q93q93J782Q64j185o88J046k3j169J80J731N00
3823A685j569m89Q85m80j042K36J854o16j002N65O38j258j140Q15J192l15m28
$$ plain form
3698 703 1822 834 -282 628 1003 -223 -543 1427 2058 312 -298 872 -48 -1756 -1583 590 639 -660
3716 -660 -534 308 -439 -1811 -1426 235 -318 -496 553 1213 -169 -1182 142 1616 456 315 1224
3733 1224 1528 -361 -714 -72 659 -135 -482 1385 649 -1196 -1385 -591 -739 -1415 -300 1343 464 -1069
3751 -1069 -85 409 -674 -1038 203 1586 686 59 485 982 -303 -513 1125 1231 -39 -156 618 255
3769 255 -1114 -776 751 494 -860 -599 159 -637 -1846 -811 405 213 -362 616 895 -669 -1313 -60
3787 -60 756 296 55 1777 1875 -419 -822 102 369 -935 -132 1105 1004 -594 -794 309 -743 -1029
3805 -1029 -504 653 -231 -1067 -293 433 -460 -1353 429 1293 108 -580 466 443 -726 -546 1185 1685
3823 1685 116 -373 512 32 -1010 -774 1080 464 -538 27 665 -593 -1733 -918 274 -41 -469
3840d69J185L61j558o61J156M22p08K42J329l12j517K20J145l47r87L41J280p58
3858C64j264J53R68o65m83R21R64r89q10K36R59j198K9J404O96j116p05J103j99
3877C68j248J12J661M25j145k35J223p68j721Q08J222j31o82J63M29p02j346P86
3895g81J496j012l55R95L12j009n40J045L50p47L06P88J82j515m8R85L9r65P37
3914B63J057p36j267j8Q39n81n28R00P60q66p20N22O49j187M46Q89N00r67o46
3933f91J167l30r84O68J336K4j325M51O41q34q28J50J582q51r21J191r6r20o82
3952a252R90O45j072N3O62L82j000l5O11M05l50K78L14N5j104j82J309k61p36
3971b88K25J142p34p56K37M47p05o69J247L31p88o11P26J96q73m9J243N16j248
$$ plain form
3840 -469 716 1077 -481 -1142 14 436 -272 -30 1299 987 -530 -310 835 488 -499 -158 1122 364
3858 364 -900 -747 221 -444 -927 -6 958 -31 -841 -605 354 -844 -815 589 1285 169 -536 567 368
3877 368 -880 -768 893 1318 173 -62 1161 393 -1328 -520 702 571 -111 52 481 -221 -1567 -781
3895 -781 715 -297 -652 343 655 -354 -894 151 501 -246 60 848 1030 -485 -533 452 491 -474 263
3914 263 1320 584 -683 -701 138 -443 -971 -71 689 -177 -897 -375 274 -913 -467 422 922 -45 -691
3933 -691 476 146 -838 -170 1166 1190 -135 316 957 123 -705 -555 1027 176 -745 446 350 -570 -1252
3952 -1252 -262 383 -689 -636 26 408 -592 -627 -16 389 39 317 631 686 -418 -600 709 448 -288
3971 -288 -63 1079 345 -411 -174 273 -432 -1101 146 477 -311 -922 -196 0 -873 -922 321 837 -411
3990d11j48J037l42q30L62J293l82n15M67O88r32j058J016P86q75r03Q38M38j298
4009g69l69J104M69r25P7Q00j32j007k48R44K33o90L49J454l53q70J59M88m36
4028B78q06P47R03r38r94J265K13j073n36J014J56j117j12R81J11p48n92J644
4046C96K97j273J18P81m33n05O36O89l2p17N88Q02j177o50N25M10o08m08J016
4065D55K47j327n88J149jr05j5J119L02q96k83Q28K4o11K94P67k54j036J027O72
4085I68o65j91N08L39n68q62N39P02j004n67R31M00j228j65R10k47r65J25J007
4104c3rm89K85R32m86q48M11O70N8o24N16O57o42p69M62O04n04k50L49L85q45
4125a70k55N20k57p54N4J080Qj337M88N11r7n29M79J117q30q66J034N17l62o06
$$ plain form
3990 -411 -559 478 136 -694 -332 961 579 64 531 1219 287 -771 245 1031 156 -747 91 529 -769
4009 -769 -1138 -34 435 -490 -413 387 255 -752 -1000 -56 177 -513 -164 1290 937 67 226 714 278
4028 278 -528 219 1122 184 -810 455 668 -405 -941 73 229 -888 -1000 -19 92 -656 -1248 396
4046 396 693 -580 -462 319 -114 -619 17 706 674 -43 545 1347 170 -480 45 455 -153 -561 455
4065 455 702 -625 -1213 -64 -65 -970 -985 134 436 -460 -743 85 109 -502 -208 559 305 -731 296 968
4085 968 303 112 620 959 391 -471 68 770 -234 -801 130 530 -698 -863 47 -200 -1165 -1040 -33
4104 -33 -42 -531 -246 686 200 -648 -237 433 491 -133 383 1040 398 -371 91 695 191 -59 290 675 -170
4125 -170 -425 95 -162 -916 -862 218 226 -1111 -623 -112 -209 -738 -259 858 28 -838 196 713 351 -255
4145b55R59M32n49q35P64L34j147k77R38L74j239l1P12k39r75J03Q69N4r74N86
4165c96Q42n49q17L14J158n25j70O90O08m02p44L61M69o22m48J000J12r09p5M04
4185C01j27q42L65N07k97j040L73N42L4r86Q39J153l91j105N51O10n43l95J113
4204F62N42n66l36O63j53j071j63R64J14j000l9Q72j91j329O5J075l36o14L27
4223e14O15k09j101Q31O02n49J5R04M64r09j36P95J86r32pR91j02p94l00L39m18
4244b29n72M03O09k36r69L73O61p46n23P26J004o81n15Q43O77r21l37J003L73
4263I43n28m68J035n01o91J13J060m04q06J34N98q98r90N36J179n63o45L51R15
4282C70m86r33O41M07o41pJ182O49j000l79J071l31m42j22J124m21j248J38J138
$$ plain form
4145 -255 704 1136 587 -248 516 850 -297 -574 364 738 -501 -532 180 -59 -1034 -931 -62 -8 -982 -396
4165 -396 446 -103 -920 -606 552 27 -143 547 1155 753 9 370 839 217 -231 769 881 -28 -103 301
4185 301 174 -668 -303 204 -93 -1133 -760 -218 -184 -1170 -331 822 431 -674 -123 487 -56 -451 662
4204 662 1204 638 302 965 812 -259 -422 542 656 -344 -383 489 298 -1031 -966 109 -227 -841 -514
4223 -514 101 -108 -1209 -378 224 -325 -310 594 1058 149 13 808 994 62 55 1046 944 150 -150 189 -229
4244 -229 -801 -398 211 -25 -994 -621 40 -706 -1229 -503 501 -180 -695 148 825 -96 -433 570 943
4263 943 415 -53 982 481 -210 -97 963 559 -247 -113 485 -413 -1403 -867 312 -251 -896 -545 370
4282 370 -116 -1049 -408 -1 -642 -649 533 1182 182 -197 874 543 101 -21 1103 682 -566 -428 710
4301G10p25m17L85L43l13n74o2L60o03l7O21R55o82n48Q64R8j074k09J021P22
4321H35n78k88O52J60r36j90J121j82r81P05M61p87n97J80J061r00m37N72L93
4340B64p08o30O73O24l84M0O58k8j139J22R18m2l69K42P86j4j134J4R55o75j123
4361i50N30R36m83m81QQ46p22m81L97M51n33o6P30pj034K40J138K53r37J19L69
4382C23K08j168K90J079k55m25L38L61p66q33M74O69l80n51N26L67n54l91N78
4401a10K62p25p2R37Q2n35l7O87j00m54J85N59l37p33P76M19m47p84N65N19o56
4422Am42L18Kl35m61J127L82n60p44R59M0q19p1J106j06q27O55N73m2j261O32
4443A27L67k95l52P16K35p45n84K48Q14m81n24P04Q4p12k03M02K87o90K87Q37
$$ plain form
4301 710 -15 -432 -47 296 -17 -591 -653 -293 -896 -933 -312 643 -39 -587 277 375 -699 -908 113 835
4321 835 257 -31 621 781 -155 -345 776 594 -387 318 779 -8 -605 -425 636 -264 -701 -129 264
4340 264 -444 -1074 -401 223 -161 -121 537 509 -630 -508 410 368 -1 241 1027 1013 -121 -107 848 173 -950
4361 -950 -420 516 33 -448 -440 406 -316 -797 -400 51 -482 -548 182 175 -859 -619 519 772 -165 -46 323
4382 323 531 -637 -347 732 477 52 390 751 -15 -848 -374 295 -85 -636 -110 257 -297 -688 -110
4401 -110 152 -573 -645 292 374 -161 -198 489 389 -65 120 679 342 -391 385 804 357 -427 138 657 1
4422 1 -441 -123 -121 -456 -917 210 592 32 -712 247 287 -532 -603 503 397 -430 225 798 756 -505 127
4443 127 494 199 -153 563 798 53 -531 -283 531 50 -474 230 314 -398 -601 -199 88 -602 -315 522
4463E22n6r81L82N62j81o17N50N64P4j177L01M87k50n18O07N94r17k99N75m6n82
4484d06l96J011K54p28j42N79j69o63M02O47J25p58M03Q18n04j343P95R06n36
4503B95k73M84L19n12q62M66L36p98P6P02N4q04j62N74J04o88K78O51j23p30M58
4524a55O49k98o94O37P22o3j223O70K62n30l82P65N76r70n42M65J72p18K03M61
4544GL82p59j53Q07j23q71L35Q52n15j92N22L66l79l72j46Q16o93l18O09O46q28
4565gn24L59N12q91J83N00N3n47k95O99o6l73J58N08J08p62l5R94l37m60L44O56
4587G77k10q58M60N18j084J05O07M99j003k39N28l3j020K45Q06J34m78J86O40
4606E80m20j079P59M24k34n65P77M85n46l69O08N36q80m12L91K17m40k88P54m01
$$ plain form
4463 522 466 -515 -133 429 248 -369 181 745 819 -358 -57 430 180 -338 269 863 -54 -353 222 176 -406
4484 -406 -802 209 463 -265 -407 172 3 -660 -258 389 514 -244 159 977 473 -870 -75 831 295
4503 295 22 506 825 313 -549 -83 253 -545 -469 233 287 -517 -679 -105 -1 -689 -411 240 117 -613 -155
4524 -155 494 196 -498 139 861 798 -425 245 507 -23 -405 360 936 -34 -576 -111 61 -657 -454 7
4544 7 389 -370 -523 284 161 -710 -375 477 -38 -230 292 658 279 -93 -239 577 -116 -434 175 821 -7
4565 -7 -531 -172 340 -551 -368 132 185 -362 -657 42 -24 -397 -239 269 377 -385 -420 574 237 -223 121 777
4587 777 567 -291 169 687 -397 -292 315 814 -189 -428 100 67 -953 -708 98 232 -246 -60 580
4606 580 160 -919 -160 264 30 -535 242 727 181 -188 420 956 76 -336 55 272 -168 -456 298 -103
4626a03m0j03L46K39q82n00O38P51q30M22L72Q0p07J83K07j20n06M65P62j60p16
4647b02N05L39p84j34L17M97q14J98M40m72n70K78M02k08k12N3P47n81n80N14
4667b67P86l54l34M50K57p17m46R43L91n54L4M78j1q47n2K40n0m39j05P13J09
4688B25l95l28O62o5o03q7Q47n59m4K60M94n71j05O84J68p20O5K73K83o59K6M34
4710B85J33j97k94M64k31r51R7P83k31l62j71R56j88q62L28O80m63j9N35K52n66
4731b2l87O84J56m97j31O78K03o44l76O44N4k89k87M57j30q40K72N81k78l63L78
4752a37M87m14k16K09L07k84m00Q47L28l84l98P52m22o12K92M49k23j76j83N27
4772C49j40p77J36Q04k79n71N32L50m80m46N24L48o76q1O26M42n04k84K62K86
$$ plain form
4626 -103 -143 -246 100 339 -543 -1043 -405 346 -484 -62 310 390 -317 -134 73 -47 -553 -88 674 514 -202
4647 -202 303 642 -142 -276 41 538 -276 -78 362 -110 -680 -402 0 -208 -420 -367 380 -201 -781 -267
4667 -267 519 165 -169 281 538 -179 -625 318 709 155 189 667 656 -191 -243 -3 -53 -492 -597 116 225
4688 225 -170 -498 164 99 -504 -591 256 -303 -347 -87 407 -164 -269 415 583 -137 -72 201 484 -175 -149 285
4710 285 418 221 -73 391 160 -791 -694 89 -142 -504 -675 281 93 -769 -441 239 -224 -243 292 544 -22
4731 -22 -409 275 431 -66 -197 481 684 40 -336 308 362 73 -214 243 113 -727 -455 126 -152 -515 -137
4752 -137 350 -64 -280 -71 236 -48 -448 399 727 343 -55 697 275 -337 -45 404 181 5 -178 349
4772 349 209 -568 -432 372 93 -478 54 404 -76 -522 2 350 -326 -407 219 661 157 -127 135 421
4792D21l58l15P12k4o46Q7L44K44r90L17O36l11l76k9K18l65l02O69J91Rl54N05
4814B83q7n33J55K59K91n20N9O33k63k70j40N28J3n23j52P60m30o17L25O24m62
4835f7j90L28K0l22m34M06K85q2k31N75J0m88R7J95j07j50j93R32K3p32K59K90
4857D24k19n05L31J28l3k86M4M48m24l33L40M4N2n23M33J67n92J14O49n2k46m4
4879h3K76K85r23L80M54J22p61L73L74n46l38K65J83q8J44k54M47l53j55K30q6
4900e4j43K04j39M21l78k50O08K11o70k1K66L35o80Q2O57l79m23L32N04l48n49
4921d14K21L78p17K97J8P40m56m06L94O7l47K5K06Q9l51K03M35k13p65M85L27
4942B16Q8n54K17L07k91l71K65L97n37K54K02J93l95j10J4L06m65M4M13j1o44
$$ plain form
4792 421 63 -252 460 436 -210 -123 221 465 -525 -208 428 117 -259 -288 -70 -435 -737 -68 123 132 -222 283
4814 283 196 -337 -182 77 368 -152 -93 540 277 7 -133 395 408 -115 -267 493 63 -554 -229 395 -67
4835 -67 -257 71 91 -231 -665 -259 26 -56 -287 288 298 -190 -93 102 -5 -155 -348 584 607 -125 134 424
4857 424 205 -300 31 159 126 -160 -116 332 -92 -425 -85 -41 11 -512 -79 88 -504 -390 259 207 -39 -83
4879 -83 193 478 -445 -65 389 511 -250 123 497 -49 -387 -122 61 -27 117 -137 310 -43 -198 32 -54
4900 -54 -197 7 -132 289 -89 -339 269 480 -190 -211 55 390 -290 -208 449 70 -353 -21 483 135 -414
4921 -414 -193 185 -532 -235 -217 523 67 -339 55 122 -225 -200 6 95 -256 -53 382 169 -596 -111 216
4942 216 304 -250 -33 274 -17 -388 -123 274 -263 -9 193 386 -9 -119 -105 201 -264 -220 193 182 -462
4963d62K04N44k42k74j74J018k54k12j28L34p2l62J61N04n59m08N18J44m22j52
4983b94M09Q7j99k98J60K70l79J22L58k71k86K73L12l06k78k34N27J5j01J77M74
5004E38n77K9J89K86l63o10N75O8n1m77N78o3k51p5M77j84k71k73Q35l8q04M70
5026HM62l27k16l3n9Kk67J49Q54l20o60M26K99m33m06O23R3l05j26M61n5l44k9
5049b03L99L8l48n4O25k91j63k21N22R6n07P5L80j00o54N98K30m27O6lM0j47j64
5072b13L7K44l87J70P14j84o17j21M47k13j97M2M62l61j0O59k64m33J81Q8K52
5093B96k79l39N90k9m74p2L32J77j25m8J55l1m84J95K60K5k22J27J92J15q67L13
5115a93M29m79j00M78J59n40j25M72J58n75N5O58k12j51k73N35J26n45N7M33k1
$$ plain form
4963 -462 -258 286 44 -230 -404 614 360 148 20 354 282 -80 81 585 26 -382 136 280 -142 -294
4983 -294 115 202 3 -295 -135 135 -244 -122 236 -35 -321 -48 264 -42 -320 -554 -27 -12 -113 64 538
5004 538 -39 -10 179 465 102 -508 67 135 84 -393 185 122 -129 -204 273 89 -182 -455 380 342 -462 8
5026 8 470 143 -73 -106 -165 -163 -430 -281 573 253 -407 19 318 -115 -521 102 195 -110 -236 225 170 -174 -203
5049 -203 196 234 -114 -168 457 166 3 -218 304 400 -107 -32 348 248 -406 192 422 -5 61 58 98 -49 -213
5072 -213 -176 68 -319 -149 565 381 -236 -357 90 -123 -320 -278 184 -177 -187 472 208 -225 -44 44 296
5093 296 17 -322 268 239 -235 -307 25 202 77 29 184 153 -331 -136 124 149 -73 54 246 361 -506 -193
5115 -193 236 -243 -343 135 294 -246 -371 101 259 -316 -261 397 185 34 -239 296 422 -123 -66 367 346
5136C46o14Q4L15o3o30P75j72J46o32O78K89j005J33K15K42p7j21L90j13m42k31
5157d87O05J47l19n4L39p3m69K2M69k88j64J58K36K4k73N3N30p18L5J76K53o9
5179A33n76M02K99r1n51O78R3m81j36M27k83J2L08j12O3l02l7M47n21j59L61Q6
5201F0J11j81j48N19o24j02M43Ll25L4M23j05k29j03M6J80j99J65K54J08n75K89
5223D4J91j45j37J44J27l22o4L68k21k56j09L17M83o10j02L21J13J43n43M61J05
5244C08m94K82m9J97n10K16J61K32m88j63N13q4r3J38M17m53j78L9N4j35P4L62
5266C46k39j51j48L02J6l97K66k8O59n74K0K70l14j77k3L65l49j24J57L88p2n40
5288c47K97J79o41L54p1K70j05L9M6J81k01J9K9n2n8J72P8m66J61o7L65j35k71
$$ plain form
5136 346 -268 -184 131 68 -562 213 41 187 -445 233 522 -483 -350 -135 107 30 -91 299 186 -256 -487
5157 -487 118 265 -54 -108 231 158 -311 -289 180 -108 -272 -114 122 146 -127 -74 456 -262 -227 -51 202 133
5179 133 -443 -41 258 167 -384 294 387 -94 -230 197 -86 -74 234 122 185 -117 -154 293 -228 -387 -26 60
5201 60 171 -10 -158 361 -263 -365 78 81 -244 -210 213 108 -121 -224 -178 2 -197 -32 222 330 -245 44
5223 44 235 90 -47 97 224 -98 -162 206 -15 -271 -380 -63 420 -190 -292 29 142 285 -258 203 308
5244 308 -186 96 47 244 -266 -50 111 343 -145 -308 205 121 28 166 583 130 -48 -9 45 -90 -16 346
5266 346 107 -44 -192 110 126 -271 -5 -33 626 52 72 342 28 -149 -172 193 -156 -280 -123 265 193 -347
5288 -347 -50 129 -512 -158 -229 41 -64 -25 21 202 1 20 49 -3 -61 111 189 -277 -116 -183 182 47 -224
5311b24J58m2r5j45J90P08m27j6l27L63n4j80J58J35k64o2M01k12j98L65Q9l01
5333B0l39L58J32k72j10L10k86K11k50K22Q5j83l64M91Q1n00J39O0K48k44O9J95
5355G3K64n63J87O33p94P2M32j09l36m41K92K71q5n7K46J26l8n76L75K01n33J71
5377a89M22k64O3J07P7j62r5Q0K07k89m57N38M35o27K57Q4k59r3j38R7N51l09
5399C6k01J22K02k3l78J49J66k99J00J77J52l78K94p5M11o17K22J96k14j67J17
5420hmk8l9J48M37n63k88L58J45q5O2k59M72m42Q0k89L68l03R4L07P8m3k76M44
5444C66m27N5k64M12n1Q7Q8k24l60l4P12k31j75k14J13J48p7l10O41R3p39M53
5466F2L4l77J19m3M15l93K07K49J14k77j69K31r5J24l18K65j19M3n7K27k70O8
$$ plain form
5311 -224 -66 -108 -203 -348 -158 550 123 107 -220 143 89 -91 67 202 -62 -124 277 65 -133 232 321 20
5333 20 -319 39 171 -101 -211 99 -187 24 -226 -4 81 -102 -466 25 106 -394 -255 -195 53 -191 -122 73
5355 73 337 -226 -39 594 -200 -128 304 195 -141 -582 -290 -19 -104 -161 85 211 173 -403 -28 173 -360 -189
5377 -189 233 -31 32 139 216 54 -41 39 246 -43 -500 38 473 -154 103 187 -72 -165 -303 -206 345 36
5399 36 -165 -43 159 136 -242 -93 73 -226 -126 51 203 -175 119 44 455 -162 60 256 42 -125 -8
5420 -8 -12 -40 -79 69 506 -57 -345 13 158 73 135 -124 348 -94 -14 -303 65 -238 -144 163 241 198 -78 366
5444 366 -61 -6 -270 142 91 178 266 42 -318 -352 360 129 -46 -260 -147 1 -76 -386 255 348 -391 62
5466 62 96 -281 -162 -205 210 -183 24 273 387 110 -59 172 77 201 -117 148 29 72 15 242 -28 40
5488D0k8Q1j04k2j20M85m94N3j46M53n7l03J95j63L24l43J83P3j30l66M65Q6k22
5511f0K8J56J87l39j16n2L45m17j7L98L4m47K91K27j80m41L79M31l73m03N23R6
5533B50k01j63K06J09j07J4M8j19j16MK41nn16M6M04l21j2l3M99m57J09R0K62
5556B32k06j59R7P3j54j28M49k5j68N6L41O3m03l24J54J40j31j62L01J57l44J66
5578B5P0r4k11J59L53m75J66K6N2j46m1M09l84R4P8N8J40n81p5K82K98k24m9J79
5602A09K0l70N8K11K10n37M33r9K12k34K72k19j68j14L74ok0k17J21K78p4k26
5624A4J54j77r1R1P3j10J01P3m79M35r6j05L67k76l43K99J26K28k97j60L35O5
5646B27m84M90j62J37n79J33O33m02k23L71R5j68m12M61j3j67mJ36K8j87M9L47
$$ plain form
5488 40 12 93 -11 -33 -153 332 -162 -109 -255 198 141 -162 33 -130 194 -149 34 107 -23 -389 76 162 -60
5511 -60 -32 124 311 -28 -144 -196 149 -268 -285 113 147 -300 -9 218 38 -403 -24 407 34 -369 154 250
5533 250 49 -114 92 201 94 108 156 37 -79 -75 166 161 -355 -309 95 -226 -238 -271 228 -229 -120 -30 232
5556 232 26 -133 -36 37 -117 -245 204 179 11 67 408 471 68 -256 -102 38 -93 -255 46 203 -141 25
5578 25 95 1 -210 -51 302 -173 -7 19 71 -75 -116 293 -91 3 81 139 279 -302 -377 -95 203 -21 -70 109
5602 109 129 -241 -183 28 238 -299 134 35 247 13 285 66 -102 -216 158 152 132 -85 36 314 240 14
5624 14 168 -9 -100 -9 64 -46 55 128 -351 84 -12 -117 250 -26 -369 -70 56 284 -13 -173 162 227
5646 227 -257 233 71 208 -371 -238 395 -7 -230 141 236 68 -344 117 104 -63 -67 69 97 -90 -41 306
5668C06l20j55R2J30o8m6J90M6m36J4Q1j39J3M27p2M7r9l5J22j5k31o7L61m9k30
5693a33K57q1j28m28L37O10m37m1j67M47j88j17K86k01OJ0J82j14r9l04N82l88
5715a09K7K02Jj65k21K92K53l7J3l41Q3J27j05k22K89k77k71L33j59m2M03kn3
5738A9pk14J65K14j65k7P6j56P6j75N87m47Q5l8J15j74k58P2K30P7k42K10K06
5761B29k61k33N36m67J6K59j1O2k72k54J34J08j90J21K31j66o9K47L07n06L18
5782A39k46N1J11r8l5K92l17j58J42L48k78l96P62l03K83o34O81l82j57K24MJ46
5804A79j15k72L01j66k18J97L33m3m81L05J73k13q9K98k50k97K40K99r5k29M36
5825B93k04M0l82O2L98k06Kl68O56l67q5L81m13K42l70N16k96J6K56m35L05n09
$$ plain form
5668 306 -14 -169 -77 53 -15 -61 129 175 -261 -247 -166 -305 -292 135 63 110 11 -24 98 83 -148 -215 146 97 -133
5693 -133 124 43 -85 -513 -176 434 -3 -44 -211 236 48 -69 217 16 22 32 214 100 1 -303 279 -109
5715 -109 -82 120 121 -44 -265 27 280 243 256 -85 -2 125 20 -202 87 -190 -461 -128 -287 -329 74 72 19
5738 19 12 -202 -37 177 12 -15 61 -95 -19 -194 393 -54 31 -7 108 -66 -324 -252 -22 55 -187 23 229
5761 229 -32 -265 271 -196 -180 79 68 130 -142 -396 -262 -154 -344 -223 8 -158 -227 20 327 -179 139
5782 139 -107 -56 55 -43 -78 214 -103 -261 -119 229 -49 -445 317 14 297 -337 344 -38 -195 29 33 179
5804 179 64 -208 93 -73 -291 -94 239 196 -285 20 193 -20 -109 189 -61 -358 -118 181 86 -143 293
5825 293 89 129 -253 -191 207 1 3 -365 291 -76 -161 220 -193 49 -321 195 -101 -85 171 -264 41 -468
5847d68L84L69l30r5K33K0R5k18o6K12J84n53K41k0Q0k9n7R0J32k13l4m8J99l22
5871b14K56K52k94j4%k49q4L32O4Pk54K17K80k70j8r6J68Ro59M54J68n6q5n7J25
5896a8j62Q6p3M65p72m9R62m70j22N6Q1O7Jk94L7O9J01l66K76J58k05O4J23j03
5920h8n2K03k56K29P5l13K99j06j02M01j25k76j89L93l0m7n19O40l52N2O5K55
5942A57K81q12N9K92K49j66q2p3k02J30J29j36LN51j64l45L38l62P0K09j09j91
5964a74J95K91n24M67n13J61K7j82M92j67n8l03M50j16j83oM10l33m3k20L25K24
5986B20k32J94o0k23P0L32j95j33j01N09n69J25L32l84j21J63P1J34l26J93N0
6007D9j95n0Jj08O02l90rJ44K22l34R1k33%L18k34J34K63l90K7L05j17j69K85
$$ plain form
5847 -468 -84 285 -45 -140 93 113 208 -10 -76 136 320 -233 8 -12 68 39 -18 72 204 -9 -43 -91 108 -214
5871 -214 42 294 0 -14 -14 -263 -347 -15 49 56 -198 19 299 29 11 -85 83 92 -567 -113 55 -1 -86 -143 -18
5896 -18 -180 -94 -167 298 -474 -523 439 -31 -153 -97 -16 51 52 -242 -205 -136 -35 -401 -125 33 -172 -108 15 -88
5920 -88 -140 63 -193 36 111 -202 97 -9 -111 290 165 -111 -300 93 63 16 -503 137 -215 -163 -98 157
5942 157 438 -374 -315 -23 226 60 -22 -95 -297 -167 -38 -174 -171 380 216 -129 209 -153 -83 126 17 -174
5964 -174 21 312 -212 255 -258 -97 -70 -252 240 73 15 -288 162 46 -137 -143 267 -66 -109 -329 -4 220
5986 220 -12 182 122 -101 -31 301 106 -27 -128 381 -188 -63 269 -115 -236 -73 -2 132 -194 -1 49
6007 49 -146 -196 -195 -303 299 -91 -100 44 266 -68 23 -210 -210 108 -126 8 271 -119 -92 213 96 -73 212
6030B12qk52K2lr8K65j98K48j82nK42j24J88o21P5N79j57q2j01J13j86p7n1M7
6054a54J27k40M05N0n8lj84J55o8j15M3J24m3n71P95r0l8K3j44j84j72J02M12
6077A72j87k62K10L2J4j13n9M2J46l75N20J56q1j64K7O1k16J39j83R9J37O4j19
6100F0k37R7J75j02K11j81J94j47Mj90M42k21k68K15P9k84J60k10J51l0L29k69
6122b2L71n4n74L46J23k67J23l48L34N0j39j97M59R5k74N2j42R0j52k9L40k90
6144a05j35K33J56k17J16m12N8L15L7k50L89k11k70J73L59m22K02R6j99M1j55
6165b01K32O3m88L11K71o1m48M35P3m26K40M4K93p58J45K36K79l53k61O26m00
6186a48L5J71K39j22k37J12K34k13j64M0J50j94Q8P0m4n6l62N20J4j32J65k96
$$ plain form
6030 212 204 -48 -26 -29 -127 138 -60 188 6 1 243 119 307 -314 -239 340 183 101 0 113 -73 -150 -201 -154
6054 -154 -27 -267 138 188 130 127 -57 98 30 -85 -42 82 39 -532 263 173 135 158 14 -170 -342 -240 172
6077 172 -15 -277 -67 -35 -21 -134 -193 -151 -5 -380 140 296 215 51 78 139 -77 62 -121 -22 115 179 60
6100 60 -177 -80 95 -7 204 23 217 70 74 -116 326 105 -163 52 131 -153 7 -203 -52 -82 247 -22
6122 -22 349 295 -279 67 190 -77 46 -302 32 82 -57 -254 205 300 26 78 -64 26 -126 -155 185 -105
6144 -105 -240 -7 149 -68 48 -364 -306 9 46 -204 185 -26 -296 -123 236 -186 16 112 -87 -46 -201
6165 -201 31 94 -394 -83 188 127 -321 114 187 -239 1 45 338 -420 -275 -39 240 -113 -374 252 -148
6186 -148 -113 58 297 175 -62 50 284 71 -93 -53 97 -97 -9 61 17 -39 -401 119 133 1 166 -130
6208a30K11l51Q2J75R2o2k3K06j7q8l01J69j3L9n3K43l90J91J71k47Q0R6J47k36
6232iJ32k47k70L03n0kK33j37j86J18J44J1k80M55j0J33o88O13k93l3m0K59K07
6255C63j0m00p7K24l76J24K51j79j36N48k78N3m69J85L59k51j06Pj46L16l51L42
6277gJ56k20J3K92P5m20j96J62L76l41O7J58k76J93j74J91R0l77K74J58j96M5
6299D3p7J09L37n24J74O5j80lL6M15q1k54r9J1K61o78M11Q8r7k16K46j48J37O6
6323D2J3K93l19O6K59l16k02M16j41r9j46K67j62n7J05J69J42m49j68K86k5P6
6345E0j17K84k22K54k26o4m0K15j5Nq1k04M33Q4n44K31P0J94m18M1N3J54j55p3
6369i1r1J72K25l59L34j55J31k30K94j74p2OJ49m3J01l31J69K35o07M64p6k37
$$ plain form
6208 -130 81 -270 -188 -13 79 17 -6 200 183 95 -206 -37 -50 -11 -64 179 -211 -20 151 -96 -16 80 227 -9
6232 -9 123 -124 -394 -91 -141 -143 90 -47 -233 -115 29 40 -240 215 205 338 -350 263 -30 -63 -103 156 363
6255 363 353 -47 -124 100 -276 -152 99 -80 -216 332 54 107 -362 -177 182 -69 -175 -168 -314 2 -349 -7
6277 -7 149 -71 -58 234 309 -111 -307 -145 231 -110 -43 115 -161 32 -142 49 139 -238 36 194 -2 43
6299 43 -34 75 412 -112 62 127 -53 -56 -20 395 314 60 -39 -28 233 -445 -34 54 -43 -259 -13 -161 -24 42
6323 42 55 348 29 95 354 38 -164 252 111 12 -134 133 -29 -86 19 188 330 -119 -287 -1 -26 50
6345 50 -67 217 -5 249 23 -41 -81 134 119 124 43 -161 272 356 -188 43 113 307 -111 -70 -17 137 -18 -91
6369 -91 -182 -10 215 -144 190 35 166 -64 230 56 -16 -10 139 96 197 -134 35 270 -337 127 51 -186
6391a86L5J09K39m35p8J40O13k72l38K30j33J10n2pK41k41J77k28J65k09L81k67
6413fl08K58J78J68k88q0K5K30l07J62o4P1k92N30J5l29j78K63M1P3N2l31LP4
6437d0r3R1L7L49k29L8k47J66j54L96j74J59j62j3k24K07o1j04L02l32j96L02
6459A8J35k43K77P6j95j36L1L8J03l22r4L33j1K4J70l7l88n2K16L17m35J18J40
6482H3J61q0j62k78n2K15R8j00K01j33JN0J1k79K10J8J9j33J15J85l90j1M26q3
6506I2r6m3J18K61l14RL01l15j07J8J04j26j83K40J08j36J34j3ol88K69J81k68
6529a60Q7J83K72m16nj67J03K50q2j67K15j85J67j60j16M10l92L21r7J52k70n0
6551a07K28k61k55M03J94k61Q2q5J67k64J92Q3j31q5j21L98j66M5k43L83l83j7
$$ plain form
6391 -186 -151 -42 197 -238 -316 -176 437 165 -173 57 -76 34 -18 -25 216 -25 152 -76 89 -120 261 -6
6413 -6 -314 -56 122 290 2 -78 -53 177 -130 32 -32 39 -253 277 292 -37 -215 48 89 162 214 -117 -114 -40
6437 -40 -133 -42 -5 344 115 153 -94 72 -82 314 140 299 137 124 -100 107 46 -58 244 -88 -284 18
6459 18 153 -90 187 263 68 -68 -37 1 104 -218 -312 21 10 34 204 167 -221 -273 -57 260 -175 -57 83
6482 83 244 164 2 -276 -328 -113 -15 -115 86 -47 -46 4 15 -264 -54 -36 -17 -150 -35 150 -240 -251 175 92
6506 92 -4 -47 71 332 18 27 328 13 -94 -76 28 -98 -281 -41 67 -69 65 52 46 -342 -73 108 -160
6529 -160 -73 110 382 -34 -39 -206 -103 147 65 -102 113 -72 95 -65 -181 229 -163 158 61 213 -57 -107
6551 -107 121 -140 -395 8 202 -59 23 -62 105 -159 33 116 -15 -100 -221 177 11 56 -187 196 -187 -204
6573b04L13j9k13P0k66O41j23l98L83j76j18j40J4O62l19j45j11M04p3pk53J92
6595A14n8j5L74k36m91K96K75l43l9J30l39K26j64J45o8J28J56m6K31k66L3r2
6617d9L23l90M2K29l13j5J32L66l71k07K55K77l00P8j40K26J7m66M22j93LJ89
6639A15J07J66m20k87L44j38J7q3J56l45L21J56l7p2n9L78k95J23l20J5K58J10
6661B10j75J97k39r9j97K72J95m43K55j44j1P1J01K42l70L09k89K21J63k57K5
6682C7k35L05J80m01J25M46j004N05p8J44o9l6K6p0J73J23o5l86J87K24k13R8
6704A6j28j3M29o60N26j48j32j07K13kn6K08L4j60K3O4o0K22n33Q2j08M75j1k92
6728a18L78k36j83K00J00r3N7k23k5J13R1l43M83q3k65K03J89m38K8j77L53J55
$$ plain form
6573 -204 109 90 -123 -53 -319 322 199 -199 184 8 -110 -250 -236 426 107 -38 -149 255 182 175 -78 114
6595 114 56 41 415 179 -312 -16 259 -84 -123 7 -332 -106 -270 -125 -193 -65 91 45 276 10 43 -49
6617 -49 274 -116 -74 155 -158 -173 -41 325 -46 -253 2 279 -21 57 -83 143 160 -306 116 -77 -74 115
6639 115 222 388 -32 -319 25 -113 -96 -179 -23 -368 -47 109 72 0 -59 319 24 147 -173 -158 100 210
6661 210 35 232 -7 -106 -303 -31 164 -279 -24 -168 -179 -108 -7 235 -135 174 -115 106 269 12 37
6682 37 -198 107 287 -114 11 457 -547 -42 -120 24 -45 -81 -55 -125 48 171 106 -280 -93 131 -82 16
6704 16 -112 -125 304 -356 170 22 -110 -217 -4 -6 -62 146 180 20 43 107 47 269 -264 -182 -290 185 174 -118
6728 -118 260 24 -159 41 141 48 105 -118 -143 -30 61 -282 201 118 -147 56 245 -193 -165 -342 11 166
6750A66m56K95L60m80Q5R2j07m2n2J8J25p9l4L48k48j08l0J34Q0k07J16K12m1
6773A47l10KP1M96k60jjk89K71o1l9k60N43J03l56p9p0R1p6K92p6J64l68j73J01
6798a38K26J69n66M57J36m38J20J49P8R2j10Pm8k32K96j80K53k27p8R3L9j13O6
6821E1mj3k74K79M43n30N1J49j29j77K06J03n4L19p6m89JQJ92k5j47J42j4k8p0
6846h6k7K03N7l96K77P6m1K61l65J47J6k03L8J7p9q9L1J40Q9j1j22L16j25j21
6870Cj45J08J72M1K17m68j1M0Q2j16K86n21K45L89k81k64J93M4J84j99ko2J60
6893I5l80K40o0nJ69K73k98k21M06k30L7l47J98J13Jk6O9L15l60o0P2J67l77l2
6917b41N72k39j13K00o4q7j97J08J12J63j08q7J11l76L36k18j83M45k47P6L7N2
$$ plain form
6750 166 -290 5 365 -115 -30 62 -45 -87 -139 -121 4 -75 -109 239 -9 -117 -147 -13 67 -140 -24 188 147
6773 147 -163 -161 -90 406 146 145 144 -145 126 65 26 -234 309 412 56 -23 -93 -2 -78 214 138 302 -66 -239 -138
6798 -138 88 257 -309 148 284 -154 -34 115 193 285 175 182 134 -98 198 18 271 44 -34 59 98 -15 51
6821 51 47 34 -240 39 482 -48 3 152 23 -154 52 155 101 420 344 -145 -144 -136 56 31 -116 26 12 -16 -86
6846 -86 -113 90 147 -249 28 104 63 324 -41 106 122 -81 -43 -26 -105 -194 -163 -23 66 55 -67 249 124 3
6870 3 -142 -34 138 179 396 -72 -83 -43 39 -77 209 -312 -67 322 41 -223 -30 14 198 -1 -3 -65 95
6893 95 -285 -45 -105 -110 59 332 34 -187 219 -11 26 -321 -123 -10 -9 -35 34 349 -11 -71 1 168 -209 -241
6917 -241 331 92 -21 179 115 28 -169 -61 51 214 106 19 130 -246 90 -128 -311 134 -113 -37 0 52
6939E2j06l27N90m9n91L70J27m8l8J08Q6j20l06N56l51j70K46M0r3k05L34j91
6961h6j27k24K39J56P6j59J27L0j14R5K19l48j15M30j03j39l84O60l02J56j88
6982a01J15K17j15j92k84J18p2K52j15J72K56j76j46K81Pm31L21k4p7k19M11l13
7004a15L18l23J7K93j28k7o2J97l89L86Jo4l17J21Q8n5k63L52r5N7k49K81J06
7027A30J22l45J27j18K7j41J98J46j21j16L27k45p2J58j16j55L46k73l4L78k56
7048c3o3J85k2K37l7k20l6k71M55k14p3L8P2J9k99j72M87k3J33k09K60k02j52
7071a40O2p7J56N3Mk87K18k65L94p6j3J70j25K4j08j37K05j70J94j21J01N3l71
7094b56L92q5k07l35K41L67k03N7N1ML13m13K37J02k09r3j47M34l54m6K48p5R6
$$ plain form
6939 52 -54 -381 209 160 -431 -61 66 18 -20 88 174 54 -252 304 -47 -217 29 69 -24 -229 105 -86
6961 -86 -213 -437 -198 -42 34 -125 2 32 -82 13 232 -116 -231 199 96 -43 -427 233 -69 87 -101
6982 -101 14 231 116 -76 -360 -242 -314 -62 -177 -5 251 75 -71 210 217 -214 107 83 6 -213 198 -115
7004 -115 203 -120 -103 190 62 35 -27 170 -219 167 168 104 -213 -92 -4 -59 -322 30 -65 -8 -257 24 130
7027 130 252 -93 34 -84 -57 -198 0 146 25 -91 236 -9 -81 77 -39 -194 152 -121 -155 223 -33
7048 -33 -96 89 67 304 267 47 11 -260 195 -19 -92 -54 18 37 -262 -434 53 30 163 -46 214 12 -140
7071 -140 -78 -155 1 54 58 -229 -11 -276 118 42 29 199 74 98 -10 -147 58 -112 82 -39 62 115 -256
7094 -256 136 51 -156 -491 -250 117 -86 -29 22 26 339 -74 163 265 56 -37 -184 250 -104 -150 98 23 119
7117A19j39N5j44J39J40j71n9N2L69l42J60l57j7j4M27l05J54r4n8j48J52L14
7139B33j35k50k69Q91m96J63O3j94k94M2J44M3n0K57j18Qk54j22K52J56L5N4k8
7162A31n8J5K94m27o6l8K48j16K0r1m9J95oJ80m6j73Or6J93KQ7j63L9j23k9J90
7188A19k9k9l19L92r2J76m7l03M1J39l72J9J66J38N3k05K05j19K35J8n32J05n0
7211b91M49J07l84O2J40j52K58Kq6J93j61k19qj58K46m8m2Mm3j10K15L41j42j93
7235b0P8o9qK7R3k91J78M4J10m91L11L3O7k3P2M5k36l2J46r5l0J75j83K05k29
7260a23l5M6J35l07N07j90K94o39L07R9l25k02M40K50l17K5J33L5j69j42R8J68
7282H8L6P3k91N3r5j35L51J01j48j1o7K41m58K76l3J40j34k01N88k47J02m04L17
$$ plain form
7117 119 -20 35 -109 30 170 -1 -60 -8 361 19 179 -178 -195 -209 218 -87 67 -27 -85 -233 -81 233
7139 233 98 -152 -421 470 -26 137 200 6 -288 -246 -102 -59 -109 148 30 38 -216 -338 -86 70 105 159 131
7162 131 73 88 382 -45 -111 -149 99 -17 3 -88 -137 58 52 232 186 13 19 -77 116 118 205 42 81 -42 -71 119
7188 119 90 61 -258 134 42 218 171 -132 -91 48 -324 -305 -139 -1 52 -153 52 -67 168 186 -346 -241 -291
7211 -291 158 265 -119 -57 83 -69 189 191 105 298 137 -82 -90 -248 -2 -50 -92 -88 -131 -241 -26 315 173 -20
7235 -20 58 -11 -19 8 101 -190 -12 32 142 -349 -38 -5 62 39 111 156 -80 -112 34 -61 -91 84 -99 106 -123
7260 -123 -158 -112 23 -284 223 33 327 -312 -5 94 -231 -433 7 257 -60 -35 98 133 -36 -178 -80 88
7282 88 124 197 -94 -41 -136 -271 80 181 33 22 -45 196 -262 14 -19 121 -13 -214 374 127 229 -175 142
7305A42j00k25L59p9j38O7J20k70N0j09N07k52Pr8J69o6L0n29M46k81L30k71Q3
7328a08K1J1J26Q4k6q7j20l4K04k01J29r5K6o2L89j74l05L39k81l6j53J80K76
7351A03k19P5K88k77j7L1m0K74k11J80j34J21j29j92K43k19J21J53l46M49k43
7372A1K2J84j69L33n64j03O78l37J94k93o2J81k43K87p8MJ15j08J71k65J08J22
7394A88j71k02M77j10j21j16R0J1j15R5kl23K34J17J95j61k2l09J14o1j12L19
7416A5J23j22m42L99O0k63J83j33P4J58k17M2pn4J04J76j72k33O73k54k7k02K68
7439A49P8l38k86M70J46l94L55j9kj71k15J11K64j70J46k6K06j73j16j5r2k70
7461c62L94J9l5j41J68j26J25p7J92k02j9l3K6K11l99K46n1J04p4pJ6K11k21J36
$$ plain form
7305 142 42 -183 176 97 -41 26 146 -124 -74 -183 324 72 79 -19 150 84 114 -415 31 -250 80 -191 -108
7328 -108 -87 -76 50 134 108 21 -99 -133 71 -130 -1 -96 -70 -132 257 83 -222 117 -164 -200 -353 -173 103
7351 103 -116 -41 247 -30 -47 -16 -56 218 7 187 53 174 45 -147 96 -123 -2 151 -195 254 11
7372 11 33 217 48 381 -183 -286 392 55 249 -44 -106 75 -168 119 41 45 160 52 223 -42 66 188
7394 188 17 -185 292 182 61 -55 35 46 -69 26 24 -299 -65 52 247 86 64 -245 -131 -192 -304 15
7416 15 138 16 -426 -27 33 -230 -47 -180 -106 52 -165 -123 -130 -184 -80 96 -76 -309 364 110 83 -119 149
7439 149 227 -111 -397 73 219 -175 180 161 159 -12 -227 -116 148 -22 124 98 304 131 15 0 -92 -362
7461 -362 32 51 16 -125 43 -83 42 -35 157 -45 -64 -97 -71 140 -259 -13 -64 40 -34 -41 -25 186 -35 101
7485A01K6J27l71o3j2J65j11K35l01K11j69q4j83L06L75k70J23p3j13j65J98L4
7507a4l03K38J19K7jO2K67j48m54L66j06j3J93m11N76l97K16k85k75K66P1K57
7529B51k84L4K75j65k18o2J83q7o4N2L14k39k27R6O1R9L06n65N36k76J46Pl6j42
7553em29M85l2q2J97k03j9N7j34L90j28k28K7K77l88P4L59p5l08L31M4l3j36j06
7577f5K12p6K43o99N54KN7j68k57M68k95MK89l62Q9J43l2J59m04q1J49K09o5m43
7601c69L81j01M8J25r3J6M3k52L33j7k49j8L08j69j59N51k52l73K92m0R9l42R8
7624a40L24O7o24K51N00l77j06K03n9J06p0p4j7J76n4j69K06j15m1j51J84j33
7646a13L05q2K00m01J1J78J28l00j7J93P6l27K35j85l0m19M24M72m37k19L35M0
$$ plain form
7485 101 127 254 -117 -180 -192 -27 -138 97 -204 7 -162 -246 -429 -123 252 -18 105 32 -81 -246 -48 -14
7507 -14 -317 -79 40 67 66 128 395 247 -207 159 53 40 233 -178 398 1 217 -68 -343 -77 -6 251
7529 251 -33 1 276 111 -107 -169 14 -73 -137 -85 229 -10 -237 -141 -80 19 325 -240 296 20 166 173 137 -5
7553 -5 -434 51 19 -63 134 -69 -88 -31 -165 225 97 -131 -104 173 -215 -141 218 143 -165 166 210 177 41 -65
7577 -65 147 71 314 -385 169 171 228 60 -197 271 -24 -20 269 -93 -4 139 107 266 -138 -219 -70 139 74 -369
7601 -369 12 -89 -41 84 -9 7 50 -202 131 114 -135 -153 155 -14 -173 378 126 -247 45 5 104 -238 -140
7624 -140 184 251 -373 -122 378 1 -105 98 39 145 75 1 -16 160 106 -63 143 28 -13 -164 20 -113
7646 -113 192 110 310 -91 -80 98 226 -74 -91 102 178 -149 86 -99 -129 -548 -124 348 -89 -308 27 67
7668F7j89J92L3N9o95M99J50j52k43K21K91l6k78k6N65n99K09K01k08j79K5L4
7690e9J61j60l7k69L41K2j28K1M9L1o3qJ56j0m08M06J22n32L96J75k99m13N23
7713A7j14j08J80j81P9K68j09k23J51M20m98L10j14J2j6J6K35m86K21j94J64Q0
7735A10Q0J27k21k91K23J51j41j84L74j6j52o1l2K5M9M4m6o2j52K14j84J68j68
7758a45k0L70r7m3P9k9k30j45M90j82j34JK33j35j18J20P3K0k46n8K53j36K18
7781A39Q2j25j49J58l57N19k32j32R5R6l09j35J95j78M30k86J15L25j20o47P88
7802B72k64r2K95m4j11k36L17kj91j14K2R6p9K09K9%k01k18J10O15j28l47k09
7825b71K06p8K5J26j40L66k36M0J21kk38n6n5J01J21l8J1j35O6K31m6j48O6m4
$$ plain form
7668 67 -122 70 103 162 -533 -34 116 -36 -279 -58 233 197 -81 -107 458 -141 68 269 61 -118 -93 -59
7690 -59 102 -58 -95 -364 -23 -1 -129 -108 -59 -28 -91 -99 57 47 -361 45 167 -365 31 206 -93 -506 17
7713 17 -97 -205 -25 -206 -127 141 32 -191 -40 380 -118 192 78 90 74 90 325 -161 60 -134 30 110
7735 110 190 317 96 -195 28 179 38 -146 228 212 60 -1 -33 -8 41 85 39 -23 -175 39 -145 23 -145
7758 -145 -165 205 108 65 144 115 -115 -260 230 48 -86 -85 148 13 -105 15 88 108 -138 -196 57 -79 139
7781 139 221 96 -53 105 -252 267 35 -97 -2 94 -215 -350 -155 -333 97 -189 -74 251 131 -516 272
7802 272 8 -84 211 167 56 -180 137 135 -56 -170 -148 -52 -131 78 107 107 -94 -312 -202 413 285 -62 -271
7825 -271 -65 -143 -118 8 -132 234 -2 38 159 157 -81 -137 -192 -91 30 -8 3 -132 -66 165 119 -29 37 -7
7849gMJ4m46P81m62L51n3k42J5j50K24J30k10k40K11L37j48J2J73k07J47m80M34
7872A88k63K2J92j8j84J08l67K70ml8jj02L66k16J05p4K57k27j06J58n4j56K03
7895E9J43j72j36K38n6l12J33K72M1m61M98j41Q6j52j2J64l64J52n4p2J86L1j11
7918d0K6P1r0M7oK09k35P7k18k65L80j7K60Qn4k17N8l84L2L32k18J69J80M1j96
7943e0m6L06l62Q6J11K02l24k0K13j15J22m25K1N01l27K34l8K06j77k20o1q4N94
7966C47n88L63j9m70M76j30K18k18r9j24L37m11P19m04j20o2K95m65K70O2o7J83
7988I3m50N8L40J26j94k87L65Kk01j18O6J62J27l69J02J90o0K3p3L86j49k5r3
8011B1J31n5j27K03M6m10K40M09n28L3J90l0j21k82L27q8j9j03K50o2j57l1L66
$$ plain form
7849 -7 -3 11 -435 346 -116 235 182 -60 -45 -195 29 159 -51 -291 -80 257 109 121 294 87 234 -246 188
7872 188 -75 -53 139 121 -63 45 -322 -52 -56 -94 -95 -197 169 -47 58 -16 241 14 -92 66 12 -144 59
7895 59 202 30 -106 132 76 -236 -103 169 210 -251 247 106 192 40 28 192 -172 -20 -74 -146 40 71 -40
7918 -40 -14 57 -33 14 8 217 -18 59 -159 -424 -44 -61 199 207 153 -64 -6 -390 -358 -26 -244 -75 105 146 -50
7943 -50 -96 210 -152 -66 45 247 -77 -97 116 1 123 -302 -281 220 -107 127 89 295 118 -102 -163 -247 347
7966 347 -241 122 103 -367 109 -21 197 -21 -120 -244 93 -318 401 -3 -123 -185 110 -355 -85 -23 -90 93
7988 93 -357 -299 41 167 -27 -314 51 53 -148 -266 -200 -38 89 -280 -178 12 -48 -25 -98 288 139 114 21
8011 21 152 97 -30 173 219 -191 49 458 -70 -37 153 123 2 -280 47 -41 -60 -163 87 25 -132 -163 203
8034B03j27j40k74K66J77j1m2O3J40l06j74K99J01l48K49N0k54K6L08j99r6k18
8056c07M42j93j87K92J40k8l40N3k7K57k26j18L29k25K10j05rNO1l41L39M2k25
8079a61R7Q9Lm07L16K24m2j26l49L90p0L0O5rl78L53Ro8K95k80L6q5K07j41K04
8104B02l64M01l14L92m81j12M45Q2k66n9K05j57L1o1K59j22j35j7j82L41l1p8
8126b1Q9k82J55N7J03k49P5L0k7p4q6o0M28m11L39O4l9m15K69K90k35J00k93L38
8150A45k43J15j08l2M24m00L19N5k52N3j11J10j12r0J62J41j09o2k04L02j33j05
8172a35M36q7n0P1j32P5l19J75k6K87j98k89N97r36M43RJ5j78M62
$$ plain form
8034 203 76 -64 -338 -72 105 94 52 115 255 -51 -225 74 175 -173 76 126 -128 -102 206 7 -89 -307
8056 -307 135 -58 -245 47 187 159 -181 -128 -155 102 -124 -242 87 -138 72 -33 -42 -37 24 -317 22 64 -161
8079 -161 -64 25 28 -379 -63 161 119 -7 -356 34 -36 -6 59 50 -328 25 34 -34 261 -19 17 -68 139 -2 202
8104 202 -162 239 -75 317 -164 -276 169 251 -15 -74 131 -26 5 -56 203 81 -54 -71 -253 88 57 -21
8126 -21 68 -214 -59 -2 101 -148 -73 -43 -70 -144 -230 -290 138 -273 66 130 91 -324 -55 235 0 100 -193 145
8150 145 -98 17 -91 -123 301 -99 220 275 23 76 -35 75 -37 -127 35 176 67 5 -199 103 -30 -135
8172 -135 301 214 164 235 103 178 -141 34 8 295 97 -192 405 -531 -88 -79 -64 -242 220
8191B20
$$ Imaginary data points
##PAGE= N=2
##DATA TABLE= (X++(I..I)), XYDATA
0@%%%%%%qJ4j4J6j6K4l2M0n1N9p2Q8j04J23j45J69j96K26k58K98l42L86m40M99
30B64n62O31p08P92q83R86j098J221j356J502j664J843k039K260k504K776l083
47a622L431l832M295m838N489o281P274q564J0309j2824J6788k4023M1552j62715
61a35561k77389Q3890J19559J75598J74196J84462N1950o1095j02379o6543o9132
72G7556l0411L0578N1909j5571l9834j0623o984o3646n8218n084j2978q8601q9532
85b61439j5856K6220K1210N5897R9567O9687J213o730J7603J1931K0002Q3221
97A22526J07301L2004m5244m4009l8825p1792n3502M2157R1214L3974l5222n8026
109H2556r7926j48934j22349k4359L7014M7302P3105R0503L3899l5669j9960K9322
$$ plain form
0 0 0 0 0 0 0 0 -8 6 -8 8 -8 16 -16 24 -27 32 -40 48 -56 67 -78 91 -105 121 -137 161 -181 205 -235 264
30 264 -298 333 -375 417 -466 520 -578 643 -713 789 -875 968 -1071 1189 -1315 1461 -1622
47 -1622 1809 -2023 2272 -2566 2923 -3358 3916 -4648 5661 -7163 9625 -14398 27154 -135561
61 -135561 -412950 -329060 -209501 -33903 140293 324755 376705 315610 213231 146688 77556
72 77556 47145 77723 129632 114061 74227 63604 56620 -7026 -65244 -70328 -83306 -171907 -261439
85 -261439 -277295 -251075 -229865 -173968 -74401 -4714 -3501 -10231 7372 19303 39305 122526
97 122526 229827 261831 216587 172578 133753 61961 8459 50616 141830 175804 140582 82556
109 82556 -15370 -164304 -286653 -311012 -273998 -226696 -153591 -63088 -29189 -64858 -84818 -55496
121e5496J8178n519L1197O6746K9322n738L5946P8842N0750J0069N274k7213j03575
134A28783j27957p2485k7150j8881J8813O8571L7442m5582o8517l2997l0700m2131
146b12791R365P2730N7776P924J5223M4208L0281J8969N9172P8060K2825l0354
158A73388k7866k9366o0236m3967K6924N1251L381k4121j3513l6876q4953o8301
170a34255k281J4311j2165l958K0425o65k5071J5294O9460O1420L3198M1904L2833
183A10450k7120n8857j2400L1233K2126K1744N4715M2887k6464o1177l6172k9383
195C1582n2930l9875M87n580m1195k6141J9385K1680O034L1286N0810L724m8631
208d9364l2504L482L11R884O8320R7601N0607J655j719j4177n3443n1116L97J6456
$$ plain form
121 -55496 -37318 -42837 -11640 55106 84428 78690 114636 193478 244228 254297 259571 232358 128783
134 128783 826 -71659 -98809 -117690 -98877 -30306 7136 -38446 -106963 -139960 -170660 -212791
146 -212791 -203426 -130696 -72920 -64996 -49773 -5565 24716 43685 102857 180917 203742 173388
158 173388 145522 116156 55920 11953 38877 90128 93509 69388 55875 18999 -65954 -134255
170 -134255 -136536 -122225 -134390 -138348 -117923 -118588 -143659 -128365 -58905 2515 35713 77617 110450
183 110450 83330 24473 12073 43306 65432 87176 141891 184778 158314 97137 60965 31582
195 31582 -21348 -61223 -60736 -66316 -107511 -133652 -114267 -92587 -86553 -55267 -4457 -733 -49364
208 -49364 -81868 -78386 -78075 -68191 129 97730 148337 149992 148273 134096 80653 29537 29934 46390
222D6390j3209j7440O423q883m4834k4722K2122J3618k4949k1043j322k4119m5770
235a37738m260M8607M6492K9553M6130M4733l690l0606l20J7915n914p791K3694
248F6805J8511k6305k9612J1159J8161j2019j0704R650j8053o6616n9479j8472
260a16974q794n721L4996O5355L4294o913l43O264k3824l0359J4199M0403J4865
273A7448K229L1015L5472J673n427K0699R731l6093m6570k3982k8444m3040r876
286g5165L7311L0555k473Q43P613k7387n4388k0664J9994J2035M032L3311M4090
299I707Q368p865K1314L0984K150m359J7869N731l5230l5360J600N913j3800J732
313H754L0851Q898l2732k8813p370k3865m0873j1253J8566K972q912K1766M2581
$$ plain form
222 46390 33181 15741 22164 13281 -31553 -56275 -34153 -20535 -45484 -66527 -67849 -91968 -137738
235 -137738 -141998 -93391 -46899 -17346 28784 73517 69827 39221 38901 56816 50902 43111 66805
248 66805 85316 59011 29399 40558 58719 46700 35996 45646 27593 -39023 -98502 -116974
260 -116974 -125768 -131489 -96493 -31138 3156 -3757 -4100 2164 -21660 -52019 -37820 2583 17448
273 17448 19677 50692 86164 87837 82410 103109 112840 76747 30177 6195 -22249 -65289 -75165
286 -75165 -37854 -7299 -9772 -8929 -1316 -28703 -83091 -103755 -83761 -71726 -67694 -34383 9707
299 9707 18075 10210 31524 62508 64658 60299 78168 83899 48669 13309 14909 20822 7022 8754
313 8754 39605 48503 15771 -13042 -20412 -44277 -85150 -96403 -77837 -74865 -83777 -62011 -19430
326a9430J9235O986K9847K5868j8496l6172q361K594j1858P325N1246M9059P810
339A05653p104l633l2648o7224m8442p796n208j2302J6393L9349J2404j3270K223
352b1605J2574j5379k9174N9J6113l831j757L4471M4257J6106P801K5154J0455
365I5244k9624l0076k224o188k5874r180J9289L712k2982q608J2307o452k5447
378c6103l443J3041j2054k8440j899J4942k076m38L6186M5515J6119M276J9750
391F5376O653l0119k9783J721L776j3868L445L3005J8827j3342q145L171k2654
404A8063m8118k7750l174j5000j7746J8103L9602J8972O313K3223J9238j7907
416A3819k9333k717M483j0917L657L9556L9084R202N397J6223q116m0842l1770
$$ plain form
326 -19430 -195 6791 36638 62506 44010 7838 -523 2071 -9787 -2462 48784 97843 105653
339 105653 98549 94916 62268 -4956 -53398 -61194 -66402 -78704 -62311 -22962 -10558 -23828 -21605
352 -21605 -9031 -24410 -53584 -53525 -37412 -41243 -43000 -8529 35728 51834 59635 84789 95244
365 95244 65620 35544 33320 27132 1258 -7922 11367 15079 -7903 -16511 -4204 -10656 -36103
378 -36103 -39546 -26505 -38559 -66999 -68898 -53956 -56032 -56470 -20284 25231 41350 45626 65376
391 65376 72029 41910 12127 13848 17624 3756 7201 40206 59033 45691 37546 40717 18063
404 18063 -30055 -57805 -60979 -75979 -93725 -75622 -36020 -17048 -10735 12488 31726 13819
416 13819 -15514 -18231 -13748 -24665 -21008 18548 57632 66834 72231 88454 80338 39496 7726
429G726o362j4570k5681n99K1964M370j2746N953J5983r458k3416j559O826j5203
443d6772j5316J7814K9419R722J1628L3935K3649j0740j4092O212l274k3619q988
456I578J5851K859k0058n907J1703m428k0144L6J3462j2361k8898j0742P06j6608
470f4951j2208K4285L7066J5184R648K4549J2483k0640k0385O388M634j2878O20
483C795K5586J3908q205L199J8593l650k9380j9382j0329k9930l6289k109K3787
496e0406J3875J1057K9127K2048j7404l1294j0250k604j2217M158L7443L5454
508B8987P455N240J7230J007k1506j0046R099o084k5731j0461O489o985j4448
521a9754R411K0773m553k2224p379k919k1435j7025J5582K4754M926J311J8431
$$ plain form
429 7726 1364 -13206 -38887 -39486 -17522 -13152 -25898 -19945 -3962 -13420 -36836 -38395 -31569 -46772
443 -46772 -62088 -44274 -14855 -5133 6495 40430 64079 53339 39247 45459 42185 18566 9578
456 9578 25429 28288 8230 2323 14026 9598 -10546 -10510 2952 -9409 -38307 -49049 -48343 -64951
470 -64951 -77159 -52874 -15808 -624 9024 33573 46056 25416 5031 11419 16053 3175 3795
483 3795 29381 43289 35084 38283 56876 53226 23846 4464 -5865 -35795 -72084 -74193 -50406
496 -50406 -36531 -25474 3653 25701 8297 -22997 -33247 -35851 -48068 -43910 -6467 28987
508 28987 36442 41682 58912 59919 38413 28367 37466 31382 5651 -4810 1679 -5306 -19754
521 -19754 -10343 10430 5877 -16347 -23726 -26645 -48080 -65105 -49523 -24769 -19843 -18532 -101
534a01J0536j1233j179K5459K0158l641p67P258j3199l2183j1013J6749J1471
547A8315J062J3872J4636j8883l9427k2979q035j7365r609J9704K5476R99k897
560b5131J7091J4064p466l196J6047M501k0503j0687J5095J4328N293K1237L3049
573G3722N685k5899k4745j6706k8967k6365Q144K6118N968o176M925R85k3607
586b6918k1807R493J6007l119m444J3029O661j1118K029K8290K3920N204Q671
599D5898J2357j1544k9752j0842J0616n9r086P584J2536j4087k5379l683Q249
612g192o458j0845N310p10k4139k1712O428J6753J1164K5111L9540J7292j8246
625C2296j8937m448j0616j5543J2569L6304J9406l557N65K127j8076k6394n206
$$ plain form
534 -101 10435 -798 -1977 23482 43640 39999 39232 46490 33291 1108 -9905 6844 18315
547 18315 19377 33249 47885 29002 -10425 -33404 -41439 -58804 -68413 -48709 -23233 -22234 -25131
560 -25131 -8040 6024 -1442 -4638 11409 15910 -4593 -15280 -185 14143 19436 40673 73722
573 73722 79407 53508 28763 12057 -16910 -43275 -35131 -9013 -3045 -9221 -4296 -3311 -26918
586 -26918 -48725 -39232 -23225 -26344 -30788 -17759 -11098 -22216 -20187 8103 32023 37227 45898
599 45898 58255 46711 16959 6117 16733 16674 7588 15172 27708 13621 -11758 -15441 -7192
612 -7192 -13650 -24495 -19185 -19895 -44034 -65746 -59318 -42565 -31401 -6290 33250 50542 32296
625 32296 13359 8911 -1705 -17248 -4679 31625 51031 47474 48039 50166 32090 5696 490
638D90K671j6077k0700j588J746j1942j694K6253K3232n526j0809J252q074k2366
652d3132k438K9177K8442J1179J3891J5908p588k2878l789J3321J397p673N678
665C1495K194k5916l2234m745J1016L10J534J8027P591k3462k8324p584j775n738
679e7611J2798L3254K1341p57M685J5139Q95j0609O844J6214n842k2812p267P052
693A3324k291j726J9900K0186r337k7466k1369k2888l1980j3453K1403K6828R314
706a9555Q602J5308k486k2516q107J6426J1382j951P929J6849M35j0301R152K3322
720D4489P513m929J157n669l0861l2125n003Q076j211L343J8337M326k4754k3718
734d1029o57K521m491J0942K6442J0226j3077o725R208L525J953K2893L1298N819
$$ plain form
638 490 3161 -12916 -33616 -35204 -33458 -45400 -47094 -20841 2391 -3135 -13944 -12692 -20766 -43132
652 -43132 -45570 -16393 12049 23228 37119 53027 45439 22561 18772 32093 33490 25817 31495
665 31495 33689 7773 -24461 -29206 -18190 -17880 -16346 1681 9272 -14190 -42514 -50098 -51873 -57611
679 -57611 -44813 -11559 9782 9025 13710 28849 29744 19135 25979 42193 36351 13539 6272 13324
693 13324 11033 9307 29207 49393 40056 12590 -8779 -31667 -63647 -77100 -55697 -28869 -19555
706 -19555 -10953 4355 1869 -20647 -28754 -12328 -946 -2897 5032 21881 22316 12015 21167 44489
720 44489 52002 47073 48230 42561 11700 -20425 -25428 -17352 -18563 -15220 3117 7443 -17311 -41029
734 -41029 -41686 -39165 -43656 -32714 -6272 3954 -9123 -15848 -6640 -3115 -1162 21731 53029 58848
748E8848j4220p893o174k1808j7794R906J6724l403r184L216p89j9604j4109O798
762a9486K236j7049j3265K414m55l756J8741L8855K3721J828J59m050k6889k9195
776b6191L048K7995K1845J5659K2247R295k5022l7548j8866q639j1987r5J8285
789i974R138j3064j0881L846l057j2230L527J9527M882j3892l98J5942P205n24
803D7J5094K1385o21j3293j856L552o794j728J6785J0724j7198k3073r213j1813
817a8002k0923j164K6585K1711l304r258n620j9148k7804m477K2518K2132J6797
830D3K3946J8279r366k1091k562O763n666n247J4820J4258j0126j3052M988P114
844B3101q600r480O94r209k4720j5303N307M909M96J5755K3362j76j9189p309
$$ plain form
748 58848 44628 36735 30561 8753 -9041 865 17589 14186 5002 8218 7429 -12175 -26284 -19486
762 -19486 -17250 -34299 -47564 -45150 -45605 -49361 -30620 8235 31956 33784 33943 29893 3004 -26191
776 -26191 -23143 4852 26697 42356 64603 73898 48876 11328 -7538 -16177 -28164 -28259 -9974
789 -9974 -836 -13900 -24781 -20935 -23992 -36222 -32695 -13168 -8286 -22178 -22576 -6634 571 47
803 47 15141 36526 35905 22612 20756 24308 17514 15786 32571 43295 26097 3024 -6189 -18002
817 -18002 -38925 -40089 -13504 8207 4903 -4355 -9975 -29123 -56927 -61404 -38886 -16754 43
830 43 23989 42268 32902 11811 9249 16012 10346 5099 19919 34177 24051 10999 15987 23101
844 23101 14501 5021 5715 -3494 -28214 -43517 -38210 -33301 -32805 -17050 6312 6136 -13053 -20362
858b0362O945j388l371J7863K6362M590r903o28K286q026l434J5023J1185r951
872B7191j3998l920j2612k3301n665J8595J2031o111k986M752r199k0708k840
885c8771J6419R711J470J1285J1595o228r819R303J6371Q31K54J2261L295k0748
899A7229j9242L109N622n694MJ3527J263j9053j3867n7m977j0179M631J4668j265
914a4281j1408M774J4127K121n14J6712J7144p281j6729j846L094o141J804K1306
928B2882J7416m834j0488m638j4503k4848q729J2610O240n214L159R587p528j7387
942b6275l92J3327K637l986Q147J1062n395q583R510J4438J655K42J2219M376
956C2982j5413j2072N721K351j0763k050R497k784j8175q098P283N21o909M859
$$ plain form
858 -20362 -13417 -14805 -18176 -313 26049 30639 20736 20108 22394 14368 10934 25957 37142 27191
872 27191 13193 9273 -3339 -26640 -32305 -13710 -1679 -7790 -10776 -6024 -15223 -35931 -38771
885 -38771 -22352 -12641 -11171 114 11709 5481 -4338 4965 21336 22167 22421 34682 37977 17229
899 17229 -2013 1096 6718 1024 1028 14555 15818 -3235 -17102 -17159 -22136 -32315 -27684 -13016 -14281
914 -14281 -25689 -20915 -6788 -4667 -5181 11531 28675 21394 4665 2819 5913 -228 1576 22882
928 22882 40298 35464 24976 20338 5835 -19013 -27742 -15132 -8892 -14106 -10947 -1360 -8888 -26275
942 -26275 -26667 -13340 -10703 -14689 -6542 4520 -875 -9458 52 14490 16145 16387 28606 32982
956 32982 17569 5497 11218 13569 2806 756 10253 7469 -10706 -18804 -11521 -11000 -17909 -13050
970a3050J1760o177j6547k132O740q92K498K0402K1264m08q294K815j071j4618
984B290o584J4276J1311m934l276P210l469j7473o330P698j758j2924l038M650
998a2351p419j2427O394J6489K938k607R446Q246r444j1420P348J1956j226J076
1012F999J3875P368j0862p314P095J380j0637j873P182n783j8924p196O210j746
1026a4226o651Q379J4471l873j3696r31M063o844m329J5286J6364L0k077R424
1040A5390M808j0111l195J2694M942j0474n738M721m617j5293j434J2212J844
1053E749r691j44M039j1623j6600R69J0027q72j603J3325J2261n695o097R414
1067C459Q579o016j738J1717M005j1523m569J0169L896p914Q99R559n586j8555
$$ plain form
970 -13050 -1290 -7467 -24014 -26146 -19406 -20298 -17800 2602 23866 23458 15164 17979 16908 2290
984 2290 -4294 9982 21293 16359 13083 20293 16824 -649 -6979 719 -1039 -13963 -17001 -12351
998 -12351 -19770 -32197 -25803 -9314 -6376 -8983 463 8709 -735 -12155 -4807 7149 5923 6999
1012 6999 20874 28242 17380 10066 17161 18541 7904 6031 13213 7430 -11494 -18690 -12480 -14226
1026 -14226 -20877 -12498 1973 -1900 -15596 -16527 -12464 -19308 -23637 -8351 8013 8043 5966 15390
1040 15390 20198 10087 6892 19586 24528 14054 8316 13037 8420 -6873 -8307 3905 5749
1053 5749 -3942 -4086 -47 -11670 -28270 -27301 -17274 -18146 -19749 -6424 5837 142 -5955 3459
1067 3459 12038 6022 4284 16001 20006 8483 3914 14083 17979 10065 10964 20523 14937 -3618
1081c618p704K366o904r190Q133J4106k912r326K795N208q157n463J2979J3747
1095F060k876k222R551L506r707j976J3954P029p144j237O604o448j7063m302
1109f271P345k324q740L003P640p345j3447K275Q054m198m954R144Q457p667n293
1124a4321J1092J0160k211K688J4278L830j2874o970N564j493r186M149J3484
1137A8190j155j2485m313J818j0809j3082M239J0588l396p317O571N931q504n224
1151a8948J1973J0282m387j522J0458L668j0129n41J3857O025o991Q54P294o851
1165A5042j5840k016P943k664q147M380O580j1195j4134J377O191m610j545J2668
1179e970R022q127o266P336L941n865K669J5713O645p387j390P418l107j1048
$$ plain form
1081 -3618 -11322 -8956 -15860 -25050 -16917 -2811 -5723 -15049 -12254 -7046 -15203 -20666 -7687 6060
1095 6060 3184 962 10513 14019 4312 2336 16290 23319 16175 14938 21542 15094 -1969 -6271
1109 -6271 1074 -1250 -9990 -6987 653 -6692 -20139 -17864 -9810 -14008 -18962 -9818 -1361 -9028 -14321
1124 -14321 -3229 6931 4720 7408 21686 25516 12642 5672 11236 9743 557 4706 18190
1137 18190 17035 4550 237 2055 -8754 -21836 -17597 -7009 -10405 -17722 -11151 -5220 -13724 -18948
1151 -18948 -6975 3307 -1080 -2602 7856 11524 1395 854 14711 20736 13745 14599 21893 15042
1165 15042 -798 -2814 5129 2465 -5682 -1302 5278 -5917 -20051 -18674 -12483 -17093 -18638 -5970
1179 -5970 3052 -5075 -11341 -4005 -64 -5929 -3260 12453 19098 11711 10321 17739 14632 3584
1193C584J607J0579l065j1858l10L527q290r955N262Q983o124q558L542K123j0485
1208a9438l644J3376J1187k659Q90J0169J32j2443k484J2142N312m046N489J0025
1222B4008n350j4921k691N068n341p085O430P787r344j2632K795L676p398l314
1236a8312J1454P227q741m946P848L587n690L393J5215M798q211j032O409l738
1250I261r423N091J2365j684j0120K20K449j1188j0819N502R408n178o116N147
1264e085J093j1341n715J0472P973l329K358J0786m80j1542q05J1269L241l732
1278E163N697R828n179j4216q68O493m144m759P683O577r775j2184J007J044q008
1293a5641j381J2466P562q405m191O686l08q833K198J4575M438o799J269P628
$$ plain form
1193 3584 5191 15770 12705 847 537 4064 -4226 -14181 -8919 64 -6060 -14618 -11076 -8953 -19438
1208 -19438 -23082 -9706 1481 -1178 -288 9881 10013 -2430 -4914 7228 12540 8494 13983 24008
1222 24008 18658 3737 1046 6114 773 -6312 118 7905 -1439 -14071 -11276 -7600 -14998 -18312
1236 -18312 -6858 369 -8372 -13318 -5470 -1883 -7573 -4180 11035 15833 7622 6590 12999 9261
1250 9261 -162 4929 17294 15610 5490 5710 8159 -3029 -13848 -8346 1062 -4116 -10232 -5085
1264 -5085 -3992 -15333 -21048 -10576 -2603 -5932 -3574 7212 6732 -4810 -5615 5654 8895 5163
1278 5163 10860 20688 15509 1293 425 6918 2774 -1985 5698 12275 2500 -9684 -8677 -7633 -15641
1293 -15641 -17022 -4556 3006 -5399 -9590 -2904 -3212 -12045 -9847 4728 9166 2367 3636 11264
1307A1264l028q113N347J0193l250q633J469K202j0279p727Q779Q976n776o340
1321d916M710j421j4233o037J0415Q497k204L388J0014k082j2915k158Q597J305
1335I60k881R986J1431m960j1897K46M829o325o134Q670P684p461q917L035J276
1350d58q685k333R392K286r030k225P263K57p100N308J3701M16j0617n35O181
1365C821l836o515Q777J3165K53p134M57j224j2529q253Q623Q732l287n32P894
1380H412j706j6029o995Q061L540m910L062J1248M8j0150p71Q335p24l784O636
1395D273P841o574r422M410O243n012l117J0118O146j0786r891L103K349p658
1409g977j42J0897L227q973l993L914k929o794P198J2990l98q542J124M285p997
$$ plain form
1307 11264 8236 123 5470 15663 12413 3780 5249 7451 -2828 -10555 -1776 7200 1424 -4916
1321 -4916 -206 -1627 -15860 -21897 -11482 -2985 -5189 -1801 8213 6131 -6784 -8942 -345 960
1335 960 -1921 8065 19496 14536 2639 2885 7714 1389 -4745 3925 11609 4148 -4769 -1734 -458
1350 -458 -9143 -11476 -2084 202 -8828 -11053 -3790 -3533 -10633 -5325 8376 8792 -1825 -2360 3821
1365 3821 -15 -6530 2247 15412 15665 8531 8988 7764 -4765 -13018 -4395 4337 1050 518 8412
1380 8412 6706 -9323 -16318 -8257 -4717 -9627 -6565 4683 4731 -5419 -6190 2145 1421 -2363 4273
1395 4273 12114 5540 -3882 528 6771 1759 -1358 8760 14906 4120 -5771 -2668 -319 -7977
1409 -7977 -8119 2778 6005 -2968 -6961 -3047 -5976 -12770 -5572 7418 7020 -1522 -398 3887 -4110
1424d110p746Q611J4122K26n066L661N54j1917p757O402N834l218M01P940k011
1439E926j3101k886R126J834o639K877Q929m234j2379m31R081J189k067P503P845
1454A2573n790r447J676K928n904j110J1034N232q937o384O422J412p895m9J0610
1469F371J996j0846m986L670k961n415P393J3020O69o773J002J138j1088q172
1483a4982Q369J1560r89k802P134K301j0937p054O840N500m388m02O421k377j1655
1498g461j571Q669J463l871N394Q558o188j2646n72N763k449l196Q551Q445n243
1513C646p575L920L559n481j127Q705L127r641n268M661N47o042M470J3658J740
1528A2899r297l567J831o475q885M151J2533J581m088L342K746q763p722O129
$$ plain form
1424 -4110 -11856 -3245 10877 11103 6037 9698 10252 -1665 -9422 -3020 2814 -404 -3 7937 5926
1439 5926 -7175 -10061 -935 899 -5740 -2863 6066 1832 -10547 -10978 -1897 -708 -2775 4728 12573
1454 12573 6783 -2664 -988 1940 -3964 -5074 5960 11192 2255 -4129 2293 3705 -4190 -4239 6371
1469 6371 8367 -2479 -7465 -3795 -6756 -12171 -4778 8242 8911 2138 3140 4278 -6810 -14982
1483 -14982 -6613 4947 3958 1156 8290 10591 -346 -7400 -560 4940 552 150 6571 4194 -7461
1498 -7461 -9032 -363 1100 -2771 2623 11181 4993 -7653 -8225 -2462 -4911 -8107 444 8889 3646
1513 3646 -3929 -9 3550 -1931 -3058 5647 8774 -867 -6135 -1474 -927 -6969 -2499 11159 12899
1528 12899 3602 35 1866 -4609 -13494 -9343 3190 4771 683 4025 6771 -1992 -9714 -3585
1542c585P056l428k505O207K31j0504l965R552O169l672J993P806k765j2995l979
1557h384O133L3l261O639R719l670q642J344L498n771m656O901N501p517o948
1572i081N682M523m845J63J0387L704r290n528K158j826o024M348J1971K907n757
1587C492Q11L334p290r118N075R657j960n564L751K855q959o757O669P594k105
1602A485j120N847j265j1364n388O314K329l196N223J1104o91r691j371N888k632
1617A472o655M284P663l429p007L235N015l249k549P084L358r269o802K988J87
1632c674o829J114J2193M634o802k898M152k605p929J981J0084J418n026K172
1646A985L810o193o106O458Q757j686l782M303O78j1906q165N397N709k199J050
$$ plain form
1542 -3585 3471 43 -2462 3745 3976 -6528 -10493 -941 5228 1556 3549 11355 8590 -4405 -8384
1557 -8384 -2251 -2218 -5479 1160 10879 7209 -1433 -89 3409 -2362 -7018 -117 5384 -2133 -9081
1572 -9081 -3399 1124 -3721 -3558 6829 10533 1243 -4285 -2127 -3953 -9977 -5629 6342 9249 3492
1587 3492 4303 7637 347 -8771 -3696 5961 4001 -1563 2188 5043 -3916 -10673 -4004 3590 1485
1602 1485 365 6212 4947 -6417 -11805 -5491 -3162 -6358 -1135 9969 9278 -413 -1784 4104 1472
1617 1472 -5183 -899 6764 3335 -3672 -437 4578 1329 -1220 5864 9222 -47 -6849 -3861 -3674
1632 -3674 -10503 -9389 2804 7438 636 -2262 1890 -715 -8644 -6663 3421 4839 -187 1985
1646 1985 5795 -398 -6504 -46 8711 7025 3243 7546 8224 -3682 -11847 -6450 -741 -2940 -1890
$$ [...]
8191I9
##END NTUPLES=NMR FID
##END=
