##TITLE=1H_CA-8527-1
 DMSO, 8 sc, 
 10.1.2019
##JCAMPDX= 6.0         $$ Bruker NMR JCAMP-DX V2.0
##DATA TYPE= NMR FID
##DATA CLASS= NTUPLES
##ORIGIN= UXNMR, Bruker Analytische Messtechnik GmbH
##OWNER= root
$$ XWIN-NMR		Version 3.5
$$ Thu Jan 10 13:51:44 2019 Russian Standard Time (UT+4h)  she@DPX200
##.OBSERVE FREQUENCY= 200.1313
##.OBSERVE NUCLEUS= ^1H
##.DELAY= (6, 6)
##.ACQUISITION MODE= SIMULTANEOUS
##.ACQUISITION SCHEME= undefined
##.AVERAGES= 8
##.DIGITISER RES= 18
##SPECTROMETER/DATA SYSTEM= spect
##.PULSE SEQUENCE= zg30
##.SOLVENT NAME= DMSO
##.SHIFT REFERENCE= (INTERNAL, DMSO, 0, 15.7039)
##AUDIT TRAIL= $$ (NUMBER, WHEN, WHO, WHERE, WHAT)
$$ ##TITLE= Audit trail, XWIN-NMR		Version 3.5
$$ ##JCAMPDX= 5.01
$$ ##ORIGIN= Bruker BioSpin GmbH
$$ ##OWNER= she
$$ F:/spectra/data/she/nmr/H-F/1/audita.txt
$$ ##AUDIT TRAIL=  $$ (NUMBER, WHEN, WHO, WHERE, WHAT)
(   1,<2019-01-10 13:49:38.71 +0400>,<she>,<DPX200>,
      <created by zg, POWCHK disabled, PULCHK disabled
       configuration hash MD5:
       00 E9 B6 7A A2 85 ED C7 34 08 36 98 17 FE 4E 26
       data hash MD5: 16K
       A7 93 56 C8 A4 51 48 66 A7 D8 AF 50 3D 9D 68 F4>)
$$ ##END=
$$ 
$$ hash MD5
$$ 21 2D CB FB 2E D0 E9 C7 B8 6D 6B 23 EA 06 04 54
##$RELAX= 
##$RELAX= 
##$RELAX= 
##$RELAX= 
##$RELAX= 
##$RELAX= 
$$ Bruker specific parameters
$$ --------------------------
##$DU= <F:/spectra>
##$EXPNO= 1
##$NAME= <H-F>
##$PROCNO= 1
##$TYPE= <nmr>
##$USER= <she>
##$AMP= (0..31)
100 100 100 100 100 100 100 100 100 100 100 100 100 100 100 100 100 100 
100 100 100 100 100 100 100 100 100 100 100 100 100 100 
##$AQSEQ= 0
##$AQ_mod= 1
##$AUNM= <au_zg>
##$AUTOPOS= <>
##$BF1= 200.13
##$BF2= 200.13
##$BF3= 200.13
##$BF4= 200.13
##$BF5= 200.13
##$BF6= 200.13
##$BF7= 200.13
##$BF8= 200.13
##$BYTORDA= 1
##$CFDGTYP= 0
##$CFRGTYP= 5
##$CHEMSTR= <none>
##$CNST= (0..31)
1 1 145 1 1 1 1 1 1 1 1 1 1 1 1 1 1 1 1 1 1 1 1 1 1 1 1 1 1 1 1 1 
##$CPDPRG= <>
##$CPDPRG1= <>
##$CPDPRG2= <>
##$CPDPRG3= <>
##$CPDPRG4= <mlev>
##$CPDPRG5= <mlev>
##$CPDPRG6= <mlev>
##$CPDPRG7= <mlev>
##$CPDPRG8= <mlev>
##$CPDPRGB= <>
##$CPDPRGT= <>
##$D= (0..31)
0 1.2 0 0 0 0 0 0 0 0 0 0.03 0 0 0 0 0 0 0 0 0 0 0 0 0 0 0 0 0 0 0 0 
##$DATE= 1547113778
##$DBL= (0..7)
120 120 120 120 120 120 120 120 
##$DBP= (0..7)
150 150 150 150 150 150 150 150 
##$DBP07= 0
##$DBPNAM0= <>
##$DBPNAM1= <>
##$DBPNAM2= <>
##$DBPNAM3= <>
##$DBPNAM4= <>
##$DBPNAM5= <>
##$DBPNAM6= <>
##$DBPNAM7= <>
##$DBPOAL= (0..7)
0.5 0.5 0.5 0.5 0.5 0.5 0.5 0.5 
##$DBPOFFS= (0..7)
0 0 0 0 0 0 0 0 
##$DE= 6
##$DECBNUC= <off>
##$DECIM= 24
##$DECNUC= <off>
##$DECSTAT= 4
##$DIGMOD= 1
##$DIGTYP= 9
##$DL= (0..7)
0 120 120 120 120 120 120 120 
##$DP= (0..7)
150 150 150 150 150 150 150 150 
##$DP07= 0
##$DPNAME0= <>
##$DPNAME1= <>
##$DPNAME2= <>
##$DPNAME3= <>
##$DPNAME4= <>
##$DPNAME5= <>
##$DPNAME6= <>
##$DPNAME7= <>
##$DPOAL= (0..7)
0.5 0.5 0.5 0.5 0.5 0.5 0.5 0.5 
##$DPOFFS= (0..7)
0 0 0 0 0 0 0 0 
##$DQDMODE= 0
##$DR= 18
##$DS= 0
##$DSLIST= <SSSSSSSSSSSSSSS>
##$DSPFIRM= 0
$$ [...]
##$SUBNAM2= <"">
##$SUBNAM3= <"">
##$SUBNAM4= <"">
##$SUBNAM5= <"">
##$SUBNAM6= <"">
##$SUBNAM7= <"">
##$SUBNAM8= <"">
##$SUBNAM9= <"">
##$SW= 24.933730806125
##$SWIBOX= (0..15)
0 0 2 0 0 0 0 0 0 0 0 0 0 0 0 0 
##$SW_h= 4990.01996007984
##$TD= 16384
##$TD0= 1
##$TE= 0
##$TE2= 300
##$TE3= 300
##$TEG= 300
##$TL= (0..7)
0 120 120 120 120 120 120 120 
##$TP= (0..7)
150 150 150 150 150 150 150 150 
##$TP07= 0
##$TPNAME0= <>
##$TPNAME1= <>
##$TPNAME2= <>
##$TPNAME3= <>
##$TPNAME4= <>
##$TPNAME5= <>
##$TPNAME6= <>
##$TPNAME7= <>
##$TPOAL= (0..7)
0.5 0.5 0.5 0.5 0.5 0.5 0.5 0.5 
##$TPOFFS= (0..7)
0 0 0 0 0 0 0 0 
##$TUNHIN= 0
##$TUNHOUT= 0
##$TUNXOUT= 0
##$USERA1= <user>
##$USERA2= <user>
##$USERA3= <user>
##$USERA4= <user>
##$USERA5= <user>
##$V9= 5
##$VALIST= <valist>
##$VCLIST= <CCCCCCCCCCCCCCC>
##$VD= 0
##$VDLIST= <DDDDDDDDDDDDDDD>
##$VPLIST= <PPPPPPPPPPPPPPP>
##$VTLIST= <TTTTTTTTTTTTTTT>
##$WBST= 1024
##$WBSW= 4
##$XGAIN= (0..3)
0 0 0 0 
##$XL= 0
##$YL= 0
##$YMAX_a= 414842
##$YMIN_a= -471841
##$ZGOPTNS= <>
##$ZL1= 120
##$ZL2= 120
##$ZL3= 120
##$ZL4= 120
##$ABSF1= 10
##$ABSF2= 0
##$ABSG= 5
##$ABSL= 3
##$ALPHA= 0
##$AQORDER= 0
##$ASSFAC= 0
##$ASSFACI= 0
##$ASSFACX= 0
##$ASSWID= 0
##$AUNMP= <proc_1d>
##$AZFE= 0.1
##$AZFW= 0.1
##$BCFW= 1
##$BC_mod= 2
##$BYTORDP= 1
##$COROFFS= 0
##$CY= 11.3945322036743
##$DATMOD= 1
##$DC= 2
##$DFILT= <>
##$DTYPP= 0
##$F1P= 18.9103706918063
##$F2P= -1.10871071338519
##$FCOR= 0.5
##$FTSIZE= 0
##$FT_mod= 4
##$GAMMA= 1
##$GB= 0.15
##$INTBC= 1
##$INTSCL= 1
##$ISEN= 128
##$LB= 0.24
##$LEV0= 0
##$LPBIN= 0
##$MAXI= 10000
##$MC2= 0
##$MEAN= 0
##$ME_mod= 0
##$MI= 1.114404
##$NCOEF= 0
##$NC_proc= 0
##$NLEV= 6
##$NOISF1= 3.799351
##$NOISF2= 2.8
##$NSP= 1
##$NTH_PI= 0
##$NZP= 0
##$OFFSET= 15.70392
##$PC= 1
##$PHC0= -8875.833
##$PHC1= 17.60006
##$PH_mod= 1
##$PKNL= yes
##$PPARMOD= 0
##$PSCAL= 0
##$PSIGN= 0
##$REVERSE= no
##$SF= 200.130013532006
##$SI= 16384
##$SIGF1= 3
##$SIGF2= 2
##$SINO= 400
##$SIOLD= 16384
##$SREGLST= <1H.CDCl3>
##$SSB= 0
##$STSI= 0
##$STSR= 0
##$SW_p= 3612.71676300578
##$SYMM= 0
##$S_DEV= 0
##$TDeff= 0
##$TDoff= 0
##$TI= <>
##$TILT= no
##$TM1= 0
##$TM2= 0
##$TOPLEV= 0
##$USERP1= <user>
##$USERP2= <user>
##$USERP3= <user>
##$USERP4= <user>
##$USERP5= <user>
##$WDW= 1
##$XDIM= 8192
##$YMAX_p= 0
##$YMIN_p= 0
$$ End of Bruker specific parameters
$$ ---------------------------------
##NTUPLES= NMR FID
##VAR_NAME=  TIME,          FID/REAL,        FID/IMAG
##SYMBOL=    X,             R,               I
##VAR_TYPE=  INDEPENDENT,   DEPENDENT,       DEPENDENT
##VAR_FORM=  AFFN,          ASDF,            ASDF
##VAR_DIM=   8192,          8192,            8192
##UNITS=     SECONDS,       ARBITRARY UNITS, ARBITRARY UNITS
##FACTOR=    0.0002004,     1,               1
##FIRST=     0,             0,               0
##LAST=      1.6414764,     0,               0
##MIN=       0,             -471841,         0
##MAX=       1.6414764,     414842,          0
$$ Real data points
##PAGE= N=1
##DATA TABLE= (X++(R..R)), XYDATA
$$ [...]
$$ plain form
2329 -4097 -4361 -2804 -1859 -1532 -1314 -1137 -692 650 1894 2556 1187 -173 -419 -569 -339 942 1931 1886
2347 1886 667 1404 2216 3384 2946 1211 -999 -3107 -3449 -2787 -2066 -3011 -3779 -3008 -964 698 1689
2364 1689 1987 1564 623 524 1285 1635 492 105 502 874 1481 2319 2984 2833 586 -612 -1354 -1509 -1558
2383 -1558 -2960 -3706 -5030 -3996 -1542 735 1279 702 -11 1029 1848 2817 2596 975 -365 -436 1255
2400 1255 2067 2160 1730 1663 803 29 -33 -90 -1237 -3174 -4494 -4695 -4452 -2319 -430 154 -545 -114 1849
2419 1849 3941 3846 2495 852 40 150 962 1442 584 -309 -66 1222 1624 820 -172 -1122 -2189 -3083
2437 -3083 -2833 -2627 -2755 -2362 -1756 -1128 185 2110 3699 3555 1554 235 764 1758 1748 888 -894 -1331
2455 -1331 -411 1990 3623 1971 -115 -1293 -926 -938 -1142 -2052 -3296 -4532 -4197 -2290 -542 957 1934
$$ packed form
2329d097k64J557R45L27K18J77M45J342J244O62j369j360k46j50K30J281R89m5
2347A886j219P37Q12J168m38j735k210k108l42O62P21r45p68P71K044J662R91
2364A689K98m23r41r9P61L50j143l87L97L72O07Q38O65j51k247j198p42j55m9
2383a558j402p46j324J034K454K277N44n77p13J040Q19R69k21j621j340p1J691
2400A255Q12R3m30o7q60p74o2n7j147j937j320k01K43K133J889N84o99M31J963
2419A849K092r5j351j643q12J10Q12M80q58q93K43J288M02q04r92r50j067q94
2437c083K50K06j28L93O06O28J313J925J589j44k001j319N29R94j0q60j782m37
2455a331R20K401J633j652k086j178L67j2k04r10j244j236L35J907J748J499R77
$$ plain form
2472 1934 2100 1551 1218 2349 3893 3347 1335 -567 -807 -94 1602 2301 1035 -1367 -2264 -958 24
2489 24 -901 -2871 -4197 -4200 -3102 -1494 -1 369 826 1220 3181 3788 3750 3365 2486 688 -838 -1300 -381
2508 -381 148 -767 -1420 -1642 -902 519 1848 849 -1572 -2915 -1986 -524 34 -1250 -1838 -1758 -588 1879
2526 1879 3297 2891 1364 527 536 762 767 422 345 -959 -1228 -438 1210 1923 1503 325 -1328 -2531 -2183
2545 -2183 -811 -1289 -3127 -4212 -2976 -471 1817 2950 2738 1848 2231 3508 4238 2839 405 -1106
2561 -1106 -1185 -1186 -1017 -835 -672 -1541 -2046 -1553 -771 -414 -354 -902 -2069 -2348 -1246 1566 2630 1746 861 1063
2581 1063 2099 3206 3698 1615 -1473 -2997 -2166 -283 -203 -1263 -1827 -1418 -466 1138 2504 2304 688
2598 688 -490 -1286 -1435 -999 -322 -114 -1190 -2044 -1074 1504 3068 2888 1640 -98 -676 143 1742 1331
$$ packed form
2472A934J66n49l33J131J544n46k012j902k40P13J696O99j266k402q97J306R82
2489B4r25j970j326lJ098J608J493L70M57L94J961O07l8l85q79j798j526m62R19
2508c81N29r15o53k22P40J421J329r99k421j343R29J462N58j284n88Q0J170K467
2526A879J418m06j527q37RK26Nl45p7j304k69P90J648P13m20j178j653j203L48
2545b183J372m78j838j085J236K505K288J133k12q90L83J277P30j399k434j511
2561a106p9jJ69J82J63q69n05M93P82L57O0n48j167k79J102K812J064q84q85K02
2581A063J036J107M92k083l088j524Q31J883Q0j060n64M09R52J604J366k00j616
2598F88j178p96j49M36O77K08j076q54R70K578J564j80j248j738n78Q19J599m11
$$ plain form
2616 1331 -882 -2318 -1773 177 1390 1048 50 -1091 -1656 -1228 -762 -772 -2059 -1913 -1266 -517 479 2242
2634 2242 3058 2839 1491 1382 1513 1691 988 -686 -2664 -3674 -2692 -587 463 -547 -1896 -1380 558
2651 558 2071 2383 1095 -894 -1604 -491 829 1317 172 -120 5 147 783 1450 1247 -110 -1641
2668 -1641 -2318 -2206 -654 429 614 -178 -899 144 2212 3635 2343 241 -1540 -1728 -891 66 -200
2685 -200 -1747 -2852 -1680 935 2190 2132 1253 822 367 554 686 803 -418 -1173 -1427 -1232 -162 918
2703 918 1731 764 -1071 -1331 -335 740 591 -572 -2380 -2513 -759 1762 2728 1313 -391 -428 670
2720 670 1218 966 -272 -1831 -2681 -1995 -475 806 930 962 960 699 1074 1942 2309 995 -1160 -2577 -2321
2739 -2321 -1198 -104 -87 -859 -1904 -718 1364 2354 1165 -589 -1091 -796 231 1247 951 104 -164
$$ packed form
2616A331k213j436N45J950J213l42r98j141n65M28M66j0j287J46O47P49R96J763
2634B242Q16k19j348j09J31J78p03j674j978j010R82K105J050j010j349N16J938
2651E58J513L12j288j989p10J113J320M88j145k92J25J42O36O67k03j357j531
2668a641o77J12J552J083J85p92p21J043K068J423j292k102j781j88Q37R57k66
2685b00j547j105J172K615J255n8q79m31m55J87J32J17j221p55k54J95J070J080
2703I18Q13r67j835k60R96J075j49j163j808j33J754K521R66j415j704l7J098
2720F70N48k52j238j559q50O86J520J281J24L2kk61L75Q68L67j314k155j417K56
2739b321J123J094J7p72j045J186K082R90j189j754n02K95J027J016k96q47k68
$$ plain form
2756 -164 511 1751 2087 1332 241 -557 -1410 -2180 -1629 -1107 -1313 -1834 -2050 -1268 338 2003 2588 1371
2774 1371 -13 -750 925 1754 1144 -596 -1607 -1430 250 1958 2502 1173 -570 -622 348 389 -576 -1015
2792 -1015 -2002 -2842 -2490 -1035 307 669 677 112 -154 417 1656 2169 1389 -510 -1755 -542 1268 2234
2810 2234 1709 623 -656 -51 1216 1465 -113 -2080 -3152 -2625 -2392 -1636 -1222 -1112 -985 -481 1127
2827 1127 1807 2063 2098 1271 286 99 557 2024 1481 269 -453 -219 843 1440 1244 -713 -2451 -3053
2845 -3053 -2126 -909 -1448 -2538 -2474 -1679 -249 1562 2463 1896 1369 1334 1896 1957 1232 1372 856 -215 -515
2864 -515 -52 1235 1191 122 -942 -2025 -2090 -1278 -1068 -1845 -3690 -3821 -1586 288 1351 1088 930 1401
2882 1401 2130 3260 3341 2314 430 65 391 190 277 352 303 -772 -1292 -836 -403 -679 -1609 -2646 -3044
$$ packed form
2756a64O75J240L36p55j091p98q53p70N51N22k06n21k16P82J606J665N85j217
2774A371j384p37J675Q29o10j740j011J77J680J708N44j329j743n2R70M1r65m39
2792a015r87q40L52J455J342L62Qn65k66N71J239N13p80j899j245J213J810R66
2810B234n25j086j279O05J267K49j578j967j072N27K33P56M14J10J27N04J608
2827A127O80K56L5q27r85j87M58J467n43j212p22K34J062N97j96j957j738o02
2845c053R27J217n39j090O4P95J430J811R01n67n27l5N62O1p25J40n16j071l00
2864e15M63J287m4j069j064j083o5Q12K10p77j845j31K235J874J063k63j58M71
2882A401P29J130Q1j027j884l65L26k01Q7P5m9j075n20M56M33k76r30j037l98
$$ plain form
2901 -3044 -3386 -1679 51 105 -207 -259 1410 2775 3755 3488 2049 502 430 1364 1911 1162 -259 -991
2919 -991 -965 -384 -353 -157 -880 -2269 -3122 -3111 -2322 -1839 -1279 -1099 -1206 -947 1192 3185 4405 3594 2403
2938 2403 2014 2412 2609 2133 1231 -787 -2151 -1120 -341 -852 -1511 -2344 -2524 -2574 -2063 -1695 -1738 -2040 -1609
2957 -1609 -881 581 1587 2622 3430 3267 2157 2787 3547 2809 1687 14 -1303 -1768 -1206 -84 -876
2974 -876 -2315 -2538 -1872 -624 -758 -1304 -1844 -2177 -2024 -1105 202 676 736 838 1909 3044 3188 3787 3547
2993 3547 1817 642 189 423 69 -445 -1099 -2379 -3106 -2293 -1081 -904 -2071 -3325 -2918 -2081 -1033
3010 -1033 11 -90 123 561 2252 3779 4381 3789 3341 3091 2214 1308 376 -188 -1634 -3058 -3260 -2897
3028 -2897 -2694 -1914 -1939 -2413 -2825 -1817 -405 176 114 -56 62 1061 2310 3488 3720 2681 2154 2457 2876
$$ packed form
2901c044l42J707J730N4l12n2J669J365R80k67j439j547p2R34N47p49j421p32
2919i91K6N81L1J96p23j389q53J1P89M83N60J80j07K59K139J993J220q11j191
2938B403l89L98J97m76r02k018j364J031P79n11o59q33j80n0N11L68m3l02M31
2957a609P28J462J006J035Q08j63j110O30P60p38j122j673j317m65N62J122p92
2974h76j439k23O66J248j34n46n40l33J53R19J307M74O0J02J071J135J44N99k40
2993C547j730j175m53K34l54n14o54j280p27Q13J212J77j167j254M07Q37J048
3010a033J044j01K13M38J691J527O02n92m48k50q77r06r32n64j446j424k02L63
3028b897K03P80k5m74m12J008J412N81o2j70J18R99J249J178K32j039n27L03M19
$$ plain form
3047 2876 1765 672 -672 -1692 -2567 -2774 -2054 -1891 -2214 -2280 -2038 -1606 -1362 -367 282 -437 -1007 -599 586
3066 586 1877 2151 2274 2354 2095 2711 3632 3189 1733 190 -369 -655 -1341 -2318 -2661 -3219 -3287 -3092 -2033
3085 -2033 -1646 -1636 -1332 -952 -510 -118 1059 1862 2168 1958 2124 3362 4012 3750 3091 1551 17 -436 -270
3104 -270 -1190 -3128 -4309 -4142 -3663 -2666 -2108 -1598 -1311 -942 -190 1175 1518 1267 1554 1532 1596 1733 2505 3182
3124 3182 2405 1748 906 873 452 -95 -225 -2143 -3489 -3578 -2799 -1905 -1978 -2125 -1511 -1023 -338 437 1100 635
3144 635 326 976 1350 1773 1585 2257 2149 2210 1874 2120 1816 1089 -230 -1186 -2324 -2991 -2920 -2786 -3237 -3569
3164 -3569 -3207 -1515 -368 135 678 677 1009 1724 2397 2789 2258 1610 2039 2060 2127 1902 1589 538 -456 -1401
3184 -1401 -1983 -2392 -2984 -3237 -2992 -3537 -3155 -1688 -124 377 357 970 1475 2399 2695 2279 1979 1340 1166
$$ packed form
3047B876j111j093j344j020q75k07P20J63l23o6K42M32K44R95O49p19n70M08J185
3066E86J291K74J23Q0k59O16R21m43j456j543n59k86o86r77l43n58o8J95J059
3085b033L87J0L04L80M42L92J177Q03L06k10J66J238O50k62o59j540j534m53J66
3104b70r20j938j181J67M79R97N58N10K87L69P52J365L43k51K87k2O4J37P72O77
3124C182p77o57q42l3m21n47j30j918j346q9P79Q94p3j47O14M88O85P75O63m65
3144F35l09O50L74M23j88O72j08O1l36K46l04p27j319r56j138o67P1J34m51l32
3164c569L62J692J147N03N43jL32P15O73L92n31o48M29K1O7k25l13j051r94r45
3184a401n82m09n92k53K45n45L82J467J564N01k0O13N05R24K96m16l00o39j74
$$ plain form
3203 1166 1645 1671 972 597 564 147 -606 -1094 -1368 -2164 -2808 -3189 -2634 -2412 -1937 -981 -327 -185 186 1393
3223 1393 1888 2074 1902 1662 1167 1689 1835 1830 1313 468 506 963 928 -361 -1326 -1990 -2743 -3170 -2846 -2170 -2570
3244 -2570 -2338 -1736 -503 50 957 2110 2495 2185 1826 2271 2781 2395 1584 1083 350 19 323 280 -558
3263 -558 -1541 -2346 -2092 -2059 -2355 -2571 -2561 -1895 -1562 -427 803 1022 1498 2381 2486 2267 2152 2155 1628 1031 754
3284 754 410 226 139 -102 -509 -933 -1566 -1474 -1140 -1655 -2347 -2855 -1689 -1455 -761 -221 219 680 1141 2118
3304 2118 2752 2684 1902 1782 1528 981 543 548 208 -336 -702 -736 -700 -1152 -1080 -1354 -2413 -2598 -1965 -1507 -1114
3325 -1114 -925 -705 235 1153 1858 2519 2462 2151 1809 1860 1796 769 399 -12 -106 -521 -966 -980 -1264 -1549 -1392
3346 -1392 -1482 -1959 -1842 -1241 -919 -1331 -607 275 855 1234 1881 1961 2020 1990 1778 2115 1186 252 -393 -216 -391
$$ packed form
3203A166M79K6o99l75l3m17p53m88k74p96o44l81N55K22M75R56O54J42L71J207
3223A393M95J86j72k40m95N22J46nn17q45L8M57l5j289r65o64p53m27L24O76m00
3244b570K32O02J233N53R07J153L85l10l59M45N10l86q11n01p33l31L04m3q38
3263e58r83q05K54L3k96k16J0O66L33J135J230K19M76Q83J05k19j15Ln27n97k77
3284G54l44j84q7k41m07m24o33R2L34n15o92n08J166K34O94N40M40M61M61R77
3304B118O34o8p82j20k54n47m38Nl40n44l66l4L6m52P2k74j059j85O33M58L93
3325a114J89K20R40R18P05O61n7l11l42N1o4j027l70m11r4m15m45j4k84k85J57
3346a392r0m77J17O01L22m12P24Q82N80L79O47Q0N9l0k12L37r29r34o45J77j75
$$ plain form
3367 -391 -1026 -1425 -1229 -1399 -1114 -1265 -1170 -1312 -1186 -950 -554 -659 -651 719 1277 1201 1384 1671 1469 2034 2188
3388 2188 1374 695 -451 -611 -42 -527 -1308 -1395 -1185 -1105 -1062 -896 -849 -1220 -1092 -354 -578 -849 -614 257 891
3409 891 1028 1288 1548 1672 1870 1447 1252 581 113 -302 -395 -966 -1619 -1389 -819 -1084 -1175 -1404 -1118 -1173 -417
3430 -417 -233 -459 -428 76 597 1392 1461 1431 2127 2142 1498 1100 991 265 -403 -740 -1431 -1981 -2107 -1578 -1138
3451 -1138 -1061 -948 -607 -255 94 216 143 36 217 297 934 1122 553 1380 1426 1437 733 340 381 -15 -279 -783
3473 -783 -1020 -1114 -1216 -814 -302 -784 -590 -516 148 41 -483 -204 -386 -45 33 310 380 341 828 1357 1440 1290
3495 1290 869 773 624 -12 -306 -583 -1423 -1462 -1107 -1252 -1487 -1088 -316 -55 -173 -304 112 399 530 623 884
3516 884 874 899 1562 1495 1138 636 116 -20 -310 -1323 -1385 -1317 -1663 -1823 -888 -721 -463 -68 822 867 812 695
$$ packed form
3367c91o35l99J96j70K85j51R5j42J26K36L96j05QJ370N58p6J83K87k02N65J54
3388B188q14o79j146j60N69m85p81q7K10Q0M3J66M7l71J28P38k24k71K35Q71O34
3409H91J37K60K60J24J98m23j95o71m68m15r3n71o53K30N70k65r1k29K86n5P56
3430d17J84k26L1N04N21P95O9l0O96J5o44l98j09p26o68l37o91n50j26N29M40
3451a138P7J13L41L52L49J22p3j07J81Q0O37J88n69Q27M6J1p04l93M1l96k64n04
3473g83k37r4j02M02N12m82J94P4O64j07n24K79j82L41P8K77P0l9M87N29Q3j50
3495A290m21r6j49o36k94k77q40l9L55j45k35L99P72K61j18j31M16K87J31R3K61
3516H84j0K5O63o7l57n02n20j36k90j013o2O8l46j60R35J67K58L95Q90M5n5j17
$$ plain form
3538 695 833 1080 465 315 -298 14 -78 332 313 -31 -37 -61 497 36 -627 -380 -86 -179 -314 -470 -211 -44
3560 -44 -83 434 -3 -138 -313 -42 -78 -68 -112 -46 78 241 817 1070 694 889 1227 890 119 -600 -462 -727
3582 -727 -1248 -1498 -1424 -1085 -797 -533 65 273 136 675 1094 938 685 625 895 433 543 367 171 21 -383
3603 -383 -149 -560 -1019 -1377 -991 -540 -940 -721 -109 94 546 856 1011 976 908 856 818 42 -599 -489 -254
3624 -254 -665 -750 -690 -532 -431 -74 668 829 441 199 489 183 78 -32 -166 -251 -201 -567 -119 -151 -299 84
3646 84 55 -81 -312 -69 204 251 189 530 899 1202 542 546 237 -132 -208 -448 -1126 -1274 -1257 -626 -683 -531 -241
3669 -241 868 945 1074 1035 1266 823 338 402 252 -351 -775 -767 -351 -778 -1034 -739 -562 -405 -129 -52 -246 324
3691 324 495 953 906 649 416 569 569 333 105 -167 -621 -708 -1160 -1122 -1342 -886 -535 281 369 -45 740 817
$$ packed form
3538F95J38K47o15j50o13L12r2M10j9l44ok4N58m61o63K47K94r3j35j56K59J67
3560d4l9N17m37j35j75K71l6J0m4O6J24J63N76K53l76J95L38l37p71p19J38k65
3582g27n21k50P4L39K88K64N98K08j37N39M19j56k53o0K70m62J10j76j96j50m04
3603c83K34m11m59l58L86M51m00K19O12K03M52L10J55l5o8n2l8p76o41J10K35
3624b54m11q5O0J58J01L57P42J61l88k42K90l06j05j10j34q5N0l66M48l2j48L83
3646H4k9j36k31K43K73M7o2L41L69L03o60Ml09l69p6k40o78j48J7O31n7J52K90
3669b41J109P7J29l9K31m43m85O4j50o03m24QM16m27k56K95J77J57K76P7j94N70
3691C24J71M58m7k57k33J53%k36k28k72m54q7m52L8k20M56L51Q16Q8m14P85P7
$$ plain form
3713 817 1141 772 534 452 -212 -332 -12 -650 -1159 -786 -376 -279 -331 -227 211 331 110 277 436 87 328
3734 328 492 350 174 -20 -161 189 -225 -612 -487 -523 -561 -320 -23 -180 110 697 960 1045 887 751 958
3755 958 334 -228 -189 -906 -1084 -1120 -1044 -712 -786 -871 160 597 395 746 916 923 836 668 394 401 -116 90 26
3778 26 -152 -812 -629 -672 -646 -970 -720 -620 -662 -190 -181 378 490 685 1252 1041 548 71 668 385 -124 -425
3800 -425 -738 -800 -1105 -237 -414 -247 -372 363 698 554 32 202 442 65 -16 -333 -91 -278 -402 130 -289
3821 -289 -168 -208 254 180 -11 19 253 575 561 183 294 233 149 460 181 -568 -810 -561 -894 -834 -1218 -681
3843 -681 -629 -113 352 773 794 1015 1092 1269 1106 367 375 239 3 -539 -721 -668 -1020 -698 -743 -575 -605 -659 -103
3866 -103 -180 -16 69 253 607 715 621 565 585 254 535 353 -155 -404 -721 -423 -616 -686 -368 -374 -256 57 298
$$ packed form
3713H17L24l69k38q2o64j20L20o38n09L73M10R7n2J04M38J20k21J67J59l49K41
3734C28J64j42j76j94j41L50m14l87J25l6l8K41K97j57K90N87K63Q5j58j36K07
3755I58o24n62L9p17j78l6P6L32p4q5J031M37k02L51J70Pq7j68k74Pn17K06o4
3778B6j78o60J83m3K6l24K50J00m2M72RN59J12J95N67k11m93m77N97k83n09l01
3800d25l13o2l05Q68j77J67j25P35L35j44n22J70K40l77q1l17K42j87j24N32m19
3821b89J21m0M62p4j91L0K34L22j4l78J11o1q4L11k79p49k42K49l33O0l84N37
3843f81N2N16M65M21K1K21P7J77j63p39Qj36k36n42j82N3l52L22m5J68l0n4N56
3866a03p7J64Q5J84L54J08r4n6K0l31K81j82n08k49l17K98j93p0L18oJ18L13K41
$$ plain form
3889 298 353 162 441 185 73 -296 -105 -143 -125 -553 -273 294 288 268 412 527 442 125 63 534 111 -38 -365
3912 -365 -215 -291 -531 -182 -348 -354 -451 -361 -440 -476 -415 -323 176 188 607 948 987 839 1096 507 513 -114 10 -10 -613
3937 -613 -1019 -906 -800 -581 -333 -533 -93 -24 10 230 571 236 181 501 399 25 222 320 250 169 76 336
3959 336 -24 -226 -41 134 -347 -357 -311 -142 -249 -233 203 76 61 246 108 -276 -118 -150 22 120 -541 -101
3981 -101 265 165 262 641 617 684 34 -85 3 -439 -389 -393 -464 -664 -491 -452 -310 -256 -266 -120 -289 84 185 143
4005 143 221 105 755 460 784 69 424 287 291 -188 -334 -390 -1172 -851 -696 -472 -476 -448 126 147 493 193 351
4028 351 385 103 332 485 341 -71 276 189 -72 69 393 304 67 84 -16 -231 -221 -309 -163 -264 -187 -156 -71
4051 -71 225 -129 228 305 251 -156 -269 13 60 -213 293 412 169 617 369 759 179 121 91 -97 -435 -382
$$ packed form
3889B98N5j91K79k56j12l69J91l8J8m28K80N67ok0J44J15q5l17o2M71m23j49l27
3912c65J50p6k40L49j66or7R0p9l6O1R2M99J2M19L41L9j48K57n89Oo27J24k0o03
3937f13m06J13J06K19K48k00M40O9L4K20L41l35n5L20j02l74J97R8p0q1r3K60
3959C36l60k02J85J75m81j0M6J69j07J6M36j27j5J85j38l84J58l2J72R8o61M40
3981a01L66j00R7L79k4O7o50j19Q8m42N0mp1k00J73L9J42N4j0J46j69L73J01m2
4005A43P8j16O50k95L24p15L55j37Mm79j46n6p82L21J55K24mK8N74K1L46l00J58
4028C51L4k82K29J53j44m12L47q7k61J41L24q9k37J7j00k15J0q8J46j01P7L1Q5
4051g1K96l54L57P7n4m07j13K82M7k73N06J19k43M48k48L90n80n8l0j88l38N3
$$ plain form
4073 -382 -193 -661 -589 -167 53 -253 -484 135 377 356 339 124 513 8 -77 150 326 107 -28 2 337 -125
4095 -125 -261 -191 -185 -572 -337 -366 -312 -110 -107 -114 323 -75 427 338 167 460 -206 -22 -172 -223 -56 64 -143 222
4119 222 230 269 -24 0 520 180 -207 -167 -4 -205 -243 -270 63 -198 44 -25 90 -26 -131 93 -34 -263 -303
4142 -303 -185 128 231 97 403 178 -98 270 487 42 -40 -329 116 -98 -494 -266 84 179 -251 311 -48
4163 -48 -57 191 183 211 -95 -22 -4 -36 51 221 289 -140 -89 -86 241 -29 -333 -220 -40 -325 -269 -117 -65 -126 -85 116
4189 116 81 -96 -99 35 -440 -150 -192 -113 65 69 101 257 189 195 605 298 104 96 146 -3 -313 -349 -68 80 -279
4214 -279 -61 -74 -88 -192 -337 -69 282 -249 -180 318 60 218 49 324 351 273 291 297 167 -34 -49 -44 -200 -424
4238 -424 -15 -251 -227 -62 -254 154 -16 -73 -71 75 74 -164 16 115 16 161 303 78 80 246 615 83 -277
$$ packed form
4073c82J89m68P2M22K20l06k31O19K42k1j7k15L89n05q5K27J76k19j35L0L35m62
4095a25j36P0Ol87K35k9N4K02LpM37l98N02q9j71K93o66J84j50n1J67J20k07L65
4119B22QL9k93K4N20l40l87M0J63k01l8k7L33k61K42o9J15j16j05K24j27k29m0
4142c03J18L13J03j34L06k25k76L68K17m45q2k89M45k14l96K28L50R5m30N62l59
4163d8rK48qK8l06P3J8l2Q7J70O8m29N1LL27k70l04J13J80k85N6J52N2o1M1K01
4189A16l5j77lJ34m75K90m2P9J78ML2J56o8OM10l07j94qN0j49l10l6K81J48l59
4214b79K18j3j4j04j45K68L51n31O9M98k58J58j69K75K7p8J8Oj30k01j5Nj56k24
4238d24M09k36K4J65j92M08j70n7KJ46jk38J80R9r9J45J42k25KJ66L69n32l60
$$ plain form
4261 -277 -29 50 10 -243 -142 -112 -603 -504 -274 -118 -144 -127 178 145 -236 229 32 -136 121 245 435 218
4283 218 397 495 437 212 -160 -186 -208 -480 -283 -680 -436 -610 -344 -162 78 -129 -114 378 149 55 -227 328
4305 328 57 13 12 374 367 290 568 440 60 -19 -317 -23 -390 -750 -478 -425 -491 -422 43 -228 -159 185 165 358
4329 358 -197 225 398 83 368 448 621 566 126 482 302 331 -45 -97 -254 -444 -632 -585 -614 -422 -520 -327
4351 -327 35 -335 -3 332 290 256 162 590 518 370 115 576 153 74 367 65 -168 -342 -185 -291 -595 -498
4373 -498 -349 -347 -418 -278 -152 45 -501 44 -3 176 168 110 682 44 103 305 682 94 187 66 137 43 -233 41
4397 41 -186 -464 -635 -511 -324 -300 -527 -363 -36 -119 301 96 389 227 339 177 525 446 352 581 503 271
4419 271 107 201 -109 -481 5 -287 -751 -722 -675 -459 -567 -528 -81 -212 -203 124 626 346 713 785 628 495
$$ packed form
4261b77K48P9m0k53J01L0m91R9K30J56k6J7L05l3l81M65j97j68K57J24J90k17
4283B18J79R8n8k25l72k6k2k72J97l97K44j74K66J82K40k07J5M92k29r4k82N55
4305C28k71m4jL62pp7K78j28l80p9k98K94l67l60K72N3o6O9M65k71O9L44k0J93
4329C58n55M22J73l15K85Q0J73n5m40L56j80K9l76n2j57j90j88M7k9J92r8J93
4351c27L62l70L32L35m2l4r4M28p2j48k55M61m23p9K93l02k33j74J57j06l04R7
4373d98J49Kp1J40J26J97n46N45m7J79qn8N72o38N9K02L77n88R3j21P1r4k76K74
4397D1k27k78j71J24J87K4k27J64L27q3M20k05K93j62J12j62L48p9r4K29p8k32
4419B71j64R4l10l72M86k92m64K9M7K16j08L9M47j31RL27N02k80L67P2j57j33
$$ plain form
4441 495 -35 70 520 110 156 -222 134 -172 -289 -136 -513 -559 -761 -393 -365 -562 -327 -177 159 -235 67
4462 67 599 240 398 380 463 319 174 84 650 153 -51 36 89 -58 -280 -267 -231 -507 -418 -471 -866 -405 -551
4485 -551 58 21 -24 239 575 274 314 718 555 363 329 391 392 -68 56 -122 70 -254 -457 -490 -722 -742 -381
4508 -381 -570 -674 -350 181 210 368 459 566 915 938 457 522 655 588 146 23 115 -405 -145 -5 -65 -278
4530 -278 -543 -284 -324 -616 -545 -449 -264 -149 -297 -142 376 -58 477 459 372 462 467 701 163 225 230 250 85 68
4554 68 117 -247 -292 -411 -294 -649 -757 -605 -351 -602 -614 99 65 140 364 581 848 720 1039 826 756 594
4576 594 274 201 270 -178 -300 -370 -547 -610 -787 -607 -669 -899 -862 -14 -187 -122 -8 274 549 718 653 852 693
4599 693 296 246 483 107 71 -164 -509 -226 -419 -437 -468 -413 -139 -329 -350 -651 -549 -174 -143 -71 -157 70 166
$$ packed form
4441D95n30J05M50m10M6l78L56l06j17J53l77m6k02L68K8j97K35J50L36l94L02
4462F7N32l59J58j8Q3j44j45r0N66m97k04Q7N3j47k22J3L6k76Q9n3l95M61j46
4485e51O09l7m5K63L36l01M0M04j63j92l4O2Jm60J24j78J92l24k03l3k32k0L61
4508c81j89j04L24N31K9J58R1J07L49K3m81O5J33o7m42j23R2n20K60J40o0k13
4530b78k65K59m0k92P1R6J85J15j48J55N18m34N35j8q7R0NK34n38O2NK0j65j7
4554F8M9l64m5j19J17l55j08J52K54k51j2P13l4P5K24K17K67j28L19k13p0j62
4576E94l20p3O9m48j22p0j77o3j77J80o2k30L7Q48j73O5J14K82K75J69o5J99j59
4599F93l97n0K37l76l6k35l45K83j93j8l1N5K74j90k1l01J02L75L1P2q6K27R6
$$ plain form
4622 166 363 600 658 359 510 667 535 502 240 -6 -72 -885 -154 -190 -550 -520 -686 -203 -437 -702 -348 -346
4644 -346 -441 -514 -73 137 327 720 657 992 825 749 693 593 276 46 -24 -383 -664 -782 -847 -932 -822 -640 -478
4667 -478 -462 -247 -26 113 138 -14 363 377 548 542 380 649 536 81 260 96 -343 -118 -275 -455 -201 -294
4689 -294 -387 -301 -361 -417 -418 -353 -184 -96 3 -233 -231 106 217 501 242 629 700 568 453 652 445 -78 275 141
4713 141 -399 -850 -357 -669 -798 -600 -826 -396 -485 -13 -184 -55 40 106 361 591 621 404 985 690 436
4734 436 463 472 160 -142 -120 -505 -723 -580 -623 -586 -392 -508 -379 -221 51 157 84 538 357 270 580 547 364
4757 364 478 326 694 107 325 205 97 -128 -154 -480 -385 -323 -324 -96 -502 -310 -264 -83 -124 -181 -211 -50 -104
4780 -104 106 112 235 365 234 626 475 533 234 335 307 74 -427 -259 -341 -863 -1113 -389 -536 -488 -495 -388 -433
$$ packed form
4622A66J97K37N8k99J51J57j32l3k62k46o6q13P31l6l60L0j66M83k34k65L54K
4644c46r5p3M41K10J90L93o3L35j67p6n6j00l17k30p0l59k81j18o5q5J10J82J62
4667d78J6K15K21J39K5j52L77J4J71oj62K69j13m55J79j64m39K25j57j80K54r3
4689b94r3Q6o0n6jO5J69Q8R9k36KL37J11K84k59L87P1j32j15J99k07n23L53j34
4713A41n40m51M93l12j29J98k26M30q9M72j71J29R5O6K55K30L0k17N81k95k54
4734D36K7Rl12l02K2l85k18J43m3L7J94j16J29J58K72J06p3M54j81q7L10l3j83
4757C64J14j52L68n87K18j20j08k25k6l26R5O2jK28m06J92M6J81m1n7l0J61n4
4780a04K10OJ23J30j31L92j51N8k99J01k8k33n01J68q2n22k50P24j47M8pJ07m5
$$ plain form
4803 -433 -284 282 156 381 162 491 603 803 416 588 635 345 144 -224 20 -499 -495 -565 -532 -706 -508 -454
4825 -454 -412 -517 -197 164 57 59 639 578 -84 189 525 357 35 264 261 216 -405 172 195 -76 -86 51 -194
4848 -194 -69 -445 -341 -391 -311 -200 -192 -258 -191 -4 198 224 111 53 454 487 281 462 652 88 538 436 208
4871 208 239 -172 -243 -394 -570 -757 -562 -454 -332 -433 -131 147 -102 444 393 511 257 474 589 112 130
4892 130 187 214 49 -152 -115 -54 -481 -343 -434 -352 -366 -671 -452 -261 151 -6 -282 334 186 478 361 294 -48
4915 -48 373 430 159 134 59 153 -9 43 133 177 -166 -306 -380 -179 -442 -339 -283 -301 -394 -367 -202 -63 250 248 247 248
4941 248 65 468 431 547 72 103 205 19 22 64 23 -302 -346 -234 -313 -720 -525 -469 -487 -342 -292 -154 368 351
4965 351 486 449 221 333 462 587 57 27 41 -106 40 -257 -231 -353 -243 -153 -1 -518 -707 -102 184 121
$$ packed form
4803d33J49N66j26K25k19L29J12K00l87J72M7k90k01l68K44n19Mp0L3j74J98N4
4825d54M2j05L20L61j07KN80o1o62K73L36j68l22K29lm5o21N77K3k71j0J37k45
4848a94J25l76J04n0Q0J11Qo6O7J87K02K6j13n8M01L3k06J81J90n64M50j02k28
4871B08L1m11p1j51j76j87J95J08J22j01L02K78k49N46n1J18k54K17J15m77J8
4892A30N7K7j65k01L7O1m27J38r1Q2j4l05K19J91M12j57k76O16j48K92j17o7l42
4915d8M21N7k71k5p5R4j62N2R0M4l43j40p4K01k63J03N6j8r3K7J65J39L13kjJ
4941B48j83M03l7J16m75L1J02j86LM2m1l25m4J12p9m07J95N6j8J45N0J38N22j7
4965C51J35l7k28J12J29J25n30l0J4j47J46k97K6j22J10R0J52n17j89O05K86o3
$$ plain form
4987 121 -169 -62 113 251 10 169 401 346 357 233 252 186 -54 176 56 -127 -179 -153 -20 72 -86 137
5009 137 -296 -238 -58 -21 -48 -157 -253 33 55 222 190 598 177 212 294 -21 2 107 98 -65 -249 -102 18 46
5033 46 -517 -337 41 -217 -72 -356 -62 -242 -22 66 325 432 107 281 413 327 375 337 95 -54 -34 34
5055 34 153 -68 -162 -138 -359 -523 -90 16 -9 -268 -7 -452 45 -223 94 295 217 -120 -58 110 307 340
5077 340 -26 395 9 80 75 142 -144 -37 -335 -11 -233 -150 -4 -88 -210 -319 217 55 -155 -151 -37 -94 400
5100 400 177 215 208 -12 9 -99 212 11 -30 -253 -258 193 184 245 -120 -329 -194 -205 -199 9 143 118 -114 286 197
5125 197 188 199 157 34 31 0 13 190 56 -331 -236 -133 -262 50 -220 -99 -71 47 218 229 -47 -49 52 -67
5149 -67 -133 66 -70 -62 37 562 141 226 379 73 55 -149 -205 48 145 -95 -125 -87 -454 -157 -43 143 -339 -194
$$ packed form
4987A21k90J07J75J38k41J59K32n5J1j24J9o6k40K30j20j83n2K6J33R2j58K23
5009A37m33N8J80L7k7j09r6K86K2J67l2M08m21L5Q2l15K3J05rj63j84J47J20K8
5033D6n63J80L78k58J45k84K94j80K20Q8K59J07l25J74J32q6M8l8k42j49K0O8
5055C4J19k21r4K4k21j64M33J06k5k59K61m45M97k68L17K01p8l37O2J68J97L3
5077C40l66M21l86P1nO7k86J07k98L24k22Q3J46q4j22j09N36j62k10MJ14n7M94
5100D00k23L8pk20K1j08L11k01m1k23nM51rO1l65k09J35j1OK08J34k5k32M00q9
5125A97rJ1m2j23ll1J3J77j34l87R5J03j29L12k70J21K8J18J71J1k76kJ01j19
5149f7o6J99j36QR9N25m21Q5J53l06j8k04n6K53R7k40l0L8l67K97J14J86m82J45
$$ plain form
5173 -194 143 -17 1 -154 187 -30 -170 32 160 279 255 -136 -113 134 42 -89 -27 -177 -93 -117 94 6 96
5196 96 141 154 -176 -262 -100 256 -160 -181 -120 -44 -48 191 197 157 -234 -240 64 268 -174 -42 -250 51 -281 -217 123
5221 123 -106 83 17 57 -161 228 254 -80 101 -228 88 310 123 -165 90 215 53 95 5 189 -358 -271
5243 -271 170 15 -129 -154 -253 19 17 35 355 -35 -118 132 122 -92 -138 -78 -77 -136 -155 -38 64 164 -125 13
5267 13 214 -81 -118 109 -111 -78 148 -210 51 73 216 -29 -21 -211 94 159 -43 -122 -17 -128 82 -129 -182
5290 -182 23 -91 295 -216 137 -142 63 112 66 19 34 466 49 -139 195 240 131 37 236 29 -101 -300
5312 -300 -121 79 -41 -101 -111 -142 -98 140 187 254 -107 -165 167 60 213 110 -142 -67 2 -15 92 -24 111
5335 111 -138 -257 29 97 168 -25 -48 -222 -406 73 149 134 169 31 -75 148 234 -138 98 -13 -85 -148 235
$$ packed form
5173a94L37j60J8j55L41k17j40K02J28J19k4l91K3K47r2j31O2j50Q4k4K11q8R0
5196I6M5J3l30q6J62L56m16k1O1P6mK39Om0l91oL04K04m42J32k08L01l32O4L40
5221A23k29J89o6M0k18L89K6l34J81l29L16K22j87k88K55J25j62M2r0J84n47Q7
5243b71M41j55j44k5r9K72kJ8L20l90q3K50j0k14m6O0Jn9j9J17J02J00k89J38
5267A3K01k95l7K27k20L3K26l58K61K2J43k45Qj90L05O5k02p9J05j11K10k11n3
5290a82K05j14L86n11L53k79K05M9m6m7J5M32m17j88L34M5j09r4J99k07j30j99
5312c00J79K00j20o0j0l1M4K38M7O7l61n8L32j07J53j03k52P5O9j7J07j16J35
5335A11k49j19K86O8P1j93k3j74j84M79P6j5L5j38j06K23Q6l72K36j11p2o3L83
$$ plain form
5358 235 384 -173 7 -44 27 195 143 -173 -53 -131 -207 149 90 153 -11 -69 143 8 276 356 -78 -34 -26 -106
5382 -106 -3 122 -29 -48 -351 -240 -45 -21 8 -18 -103 -122 -300 -194 92 327 97 -177 278 63 96 57 -165
5405 -165 111 -87 94 -97 143 -18 -118 -50 229 329 -55 91 -41 24 -157 137 -68 56 -211 -299 231
5426 231 -31 152 211 -1 -225 154 -34 62 192 -137 34 12 94 79 79 -205 -207 -194 22 88 71 15 1 -110 -58
5451 -58 121 211 -7 196 -41 -45 12 462 194 71 -232 -38 132 -114 -83 -16 -176 -100 35 299 78 107 289
5474 289 -7 48 -147 -15 145 33 -244 25 -194 61 -85 -3 161 -109 35 -27 -14 -14 -91 29 22 221 56
5497 56 127 207 -203 -101 68 -115 -13 -114 -329 -106 -2 15 182 -65 33 -1 123 215 258 9 -72 -70 11 -23
5521 -23 49 -157 -240 32 -106 31 -262 107 -106 61 -140 -17 288 -55 38 -228 181 26 -47 25 24 31 -41 -150
$$ packed form
5358B35J49n57J80n1P1J68n2l16J20p8p6L56n9O3j64n8K12j35K68Q0m34M4Qq0
5382a06J03J25j51j9l03J11J95K4K9k6q5j9j78J06K86K35k30k74M55k15L3l9k22
5405a65K76j98J81j91K40j61j00O8K79J00l84J46j32O5j81K94k05J24k67q8N30
5426B31k62J83N9k12k24L79j88R6J30l29J71k2Q2j5%k84kJ3K16O6j7n6j4j11N2
5451e8J79R0k18K03k37mN7M50k68j23l03J94J70k46L1O7j60P6J35K64k21K9J82
5474B89k96N5j95J32J60j12k77K69k19K55j46Q2J64k70J44o2J3%p7J20pJ99j65
5497E6P1Q0m10J02J69j83J02j01k15K23J04J7J67k47R8l4J24R2M3k49q1KQ1l4
5521b3P2k06q3K72j38J37k93L69k13J67k01J23L05l43R3k66M09j55p3P2jPp2j09
$$ plain form
5545 -150 105 -156 6 17 -312 -85 172 106 65 65 -167 -42 114 332 84 -187 -257 50 58 -86 -60 -142 14
5568 14 79 119 122 58 201 -56 135 -209 173 191 123 -298 -18 -52 -35 34 -127 -8 -24 -258 -7 100 131 170 80
5593 80 24 143 249 19 -44 -189 -220 80 140 10 -24 -49 1 -230 -28 -3 28 231 83 -173 23 -17 129 214
5617 214 118 14 -198 144 67 -23 -122 -53 -180 103 -63 84 -2 -145 146 177 -28 125 20 2 63 -269 -165
5640 -165 108 -31 162 -252 153 117 -183 263 47 114 135 166 139 2 43 39 -214 100 -105 -4 -18 -207 -40
5663 -40 -35 -32 -160 163 -102 8 -188 190 -64 25 -73 193 -25 -250 46 50 -65 -158 70 -211 209 232 113 -334
5687 -334 -75 -57 -254 -178 -232 -90 84 202 -169 62 -241 -198 -127 12 12 13 38 87 74 -109 -37 78 -7 -157 56
5712 56 -327 37 -4 153 38 297 -119 78 13 -171 60 -75 -150 -83 -103 68 167 20 -99 -67 105 182 -93
$$ packed form
5545a50K55k61J62J1l29K27K57o6m1%k32J25J56K18k48k71p0L07Qj44K6q2J56
5568A4O5M0Lo4J43k57J91l44L82J8o8m21K80l4J7O9j61J19j6k34K51J07L1L9r0
5593H0n6J19J06k30o3j45l1L00O0j30l4k5N0k31K02K5L1K03j48k56J96m0J46Q5
5617B14r6j04k12L42p7r0r9O9j27K83j66J47q6j43K91L1k05J53j05j8O1l32J04
5640a65K73j39J93m14M05l6l00M46k16O7K1L1k7j37M1mk53L14k05J01j4j89J67
5663d0NLj28L23k65J10j96L78k54Q9r8K66k18k25K96Mj15r3K28k81M20K3j19m47
5687c34K59J8j97P6n4J42J74J18l71K31l03M3P1J39%JK5M9j3j83P2J15q5j50K13
5712E6l83L64m1J57j15K59m16J97o5j84K31j35p5O7k0J71R9j47j19L2J72P7k75
$$ plain form
5735 -93 -81 -20 73 -34 148 -57 -226 133 -94 -144 -382 -117 -37 -110 -362 -301 -43 43 -4 -43 -17 -130 -76 152
5759 152 240 -66 -76 69 -62 207 26 -171 20 87 -9 174 -313 -62 -192 90 -18 -65 -213 372 40 49
5781 49 124 -130 -33 199 -152 -193 83 -113 -52 188 10 30 62 246 163 -159 -132 6 -163 -53 112 -294 5
5804 5 -94 38 -91 -15 161 182 96 64 -13 -53 -82 -85 -27 -245 -191 28 -409 20 -59 -213 -88 -7 -26 222 60 -89
5830 -89 -25 -149 55 -73 -94 151 160 -125 -5 -130 299 284 28 144 21 -106 104 -186 -132 -256 -100 -20 -73
5853 -73 -115 -228 -203 -56 -98 212 -6 58 251 119 180 101 23 -141 167 -220 37 104 -48 -164 52 -6 -343
5876 -343 -216 -347 -236 222 -160 -345 135 -114 -214 98 54 19 75 47 154 -183 -69 32 168 -362 169
5897 169 131 239 -182 -350 -319 107 -185 -28 24 245 278 261 20 27 87 -61 250 237 -89 39 102 -38 110
$$ packed form
5735i3J2O1R3j07J82k05j69L59k27n0k38K65Q0p3k52O1K58Q6m7l9K6j13N4K28
5759A52Q8l06j0J45j31K69j81j97J91O7r6J83m87K51j30K82j08m7j48N85l32R
5781D9P5k54R7K32l51m1K76j96O1K40j78K0L2J84q3l22K7J38j69J10J65m06K99
5804Er9J32j29P6J76K1q6l2p7m0k9lN8k18N4K19m37M29p9j54J25Q1j9K48j62j49
5830h9O4j24K04j28k1K45Rk85J20j25M29j5k56J16j23j27K10k90N4j24J56Q0n3
5853g3m2j13K5J47m2L10k18O4J93j32O1p9p8j64L08l87K57O7j52j16K16n8l37
5876c43J27j31J11M58l82j85M80k49j00L12m4l5N6k8J07l37J14J01J36n30N31
5897A69l8J08m21j68L1M26k92J57N2K21L3j7k41PO0j48L11j3l26J28O3j40J48
$$ plain form
5920 110 -124 227 210 116 113 -75 2 214 70 148 -363 -196 -18 -127 -11 40 -77 33 -189 54 194 258 35
5943 35 34 -82 -8 286 198 -213 95 -124 -79 -32 -49 -19 -168 43 22 -227 -183 -152 0 126 75 -69 -45 -90 -135
5968 -135 -125 165 -132 -20 28 47 -74 -72 134 16 108 30 93 35 45 -229 9 -259 -73 30 -124 122 284
5991 284 96 61 261 111 148 74 140 -196 297 1 -260 211 150 191 -104 176 7 -151 19 -321 -36 150
6013 150 77 -102 103 104 -24 83 128 24 233 -188 -170 162 -29 -136 24 1 -188 -141 107 -33 1 -162 -217
6036 -217 25 -205 -193 -146 288 94 -308 213 93 -15 265 70 181 24 120 2 75 -53 39 -52 47 -128
6058 -128 95 -7 -95 -469 -267 6 -398 -264 -35 -2 143 79 -44 48 93 70 188 197 100 216 128 69 -181 62
6082 62 -191 128 -281 -36 -128 31 -53 74 112 -26 79 -131 -321 186 -6 -15 -11 9 -74 161 -88 109 -81
$$ packed form
5920A10k34L51j7r4lj88P7K12j44P8n11J67J78j09J16N1j17J10k22K43J40O4k23
5943C5jj16P4K94q8m11L08k19M5M7j7L0j49K11k1k49M4L1J52J26n1j44K4m5m5
5968a35J0K90k97J12M8J9j21KK06j18R2p8O3n8J0k74K38k68J86J03j54K46J62
5991B84j88l5K00j50L7p4O6l36M93k96k61M71o1M1k95K80j69j58J70l40K85J86
6013A50p3j79K05Jj28J07M5j04K09m21J8L32j91j07J60k3j89M7K48j40L4j63n5
6036b17K42k30J2M7M34j94m02N21j20j08K80j95J11j57R6j18P3j28R2r1R9j75
6058a28K23j02q8l74K02K73m04J34K29L3J45o4j23R2M5k3J18Rr7J16q8n9k50K43
6082F2k53L19m09K45r2J59q4J27L8j38J05k10j90N07j92rMK0q3K35k49J97j90
$$ plain form
6105 -81 223 -417 32 220 132 393 66 408 -175 -141 -43 -21 1 155 115 124 -97 178 106 -157 244 54 310
6128 310 14 289 142 -180 190 -83 102 -27 75 73 -114 -16 -36 -164 -65 -325 -166 140 -107 199 -4 -187
6150 -187 110 120 110 -57 299 -3 159 73 16 68 -200 -122 132 53 193 201 -153 -106 42 43 -147 -149 22 -144 -115
6175 -115 52 -49 11 359 -156 109 58 359 251 -51 97 49 347 272 196 11 28 3 -92 -112 -86 -61 -116 -225
6199 -225 -60 -171 301 151 1 56 137 137 -43 274 94 -63 4 -121 -200 -100 -61 -68 -291 15 -227 -27 -332
6222 -332 41 -192 247 -121 104 -37 31 5 161 -71 267 309 203 -32 -18 330 -229 131 25 105 15 29
6244 29 -182 99 -213 -140 38 -118 -289 112 172 8 -7 -3 -33 134 96 35 242 162 52 237 20 143 170 52
6268 52 -271 -94 84 -90 -19 -190 -270 92 92 -251 -74 47 -251 54 181 51 180 -149 234 93 200 -27
$$ packed form
6105h1L04o40M49J88q8K61l27L42n83L4R8K2K2J54m0Rk21K75p2k63M01j90K56
6128C10k96K75j47l22L70k73J85j29J02kj87R8k0j28R9k60J59L06k47L06k03j83
6150a87K97J0j0j67L56l02J62q6n7N2k68P8K54p9J40Ql54M7J48Jj90kJ71j66K9
6175a15J67j01O0L48n15K65n1L01j08l02J48m8K98p5p6j85J7k5r5k0K6K5n5j09
6199b25J65j11M72j50j50N5Q1%j80L17j80j57O7j25p9J00L9pk23L06k42K00l05
6222c32L73k33M39l68K25j41O8k6J56k32L38M2j06k35J4L48n59L60j06Q0r0J4
6244B9k11K81l12P3J78j56j71M01O0j64j5Ml0J67l8o1K07q0j10J85k17J23K7j18
6268E2l23J77J78j74P1j71q0L62%l43J77J21k98L05J27j30J29l29L83j41J07k27
$$ plain form
6290 -27 -98 122 104 50 -36 101 -225 -153 -61 -119 -273 -412 -58 293 -322 84 55 44 269 55 102 -24 -45 111
6314 111 222 87 174 -207 -29 -167 116 -161 62 55 -61 -230 -48 21 55 23 102 -30 -48 -103 -380 299 59
6337 59 65 258 207 130 0 -411 46 425 221 -6 -13 4 134 -76 222 -187 -65 -139 -253 -73 -166 -34 175
6360 175 -171 -101 55 68 -138 64 -63 188 117 -7 -32 173 229 -67 -17 -180 -33 -11 136 -200 -119 -165 134
6383 134 -80 130 22 112 -42 -134 -19 72 -104 64 -64 244 -124 -161 -149 47 44 -174 142 5 76 50 -192
6406 -192 -211 55 74 -86 52 -226 214 14 -205 147 -50 -38 -96 -5 207 200 -138 -25 154 76 131 -124 -173
6429 -173 -189 -162 -51 -104 162 33 10 81 -76 -43 -206 20 -156 249 -155 53 -24 40 97 -174 20 -15 23 27
6453 27 49 12 -78 -44 -228 -235 109 34 39 -125 34 -36 -11 82 -97 188 -130 37 -73 65 15 -185 200 168 235
$$ packed form
6290b7p1K20j8n4q6J37l26P2R2n8j54j39L54L51o15M06k9j1K25k14M7j26k1J56
6314A11J11j35Q7l81J78j38K83k77K23pj16j69J82O9L4l2P9j32j8n5k77O79k40
6337E9OJ93n1p7j30m11M57L79k04k27pJ7J30k10K98m09J22p4j14J80r3J32K09
6360A75l46P0J56J3k06K02j27K51p1j24k5K05N6k96N0j63J47K2J47l36Q1m6K99
6383A34k14K10j08R0j54r2J15R1j76J68j28L08l68l7J2J96lk18L16j37P1k6k42
6406a92j9K66J9j60J38k78M40k00k19L52j97J2n8R1K12pl38J13J79p8N5k55m9
6429a73j6K7J11n3K66j29k3P1j57L3j63K26j76M05m04K08p7O4N7k71J94l5L8M
6453B7K2l7r0L4j84pL44p5Nj64J59p0K5R3j79K85l18J67j10J38n0k00L85l2O7
$$ plain form
6478 235 231 107 4 352 204 34 -10 -41 -13 -410 204 -158 -305 161 -148 375 -74 -244 -255 100 193 -142
6500 -142 73 -68 259 -160 -172 334 -40 -119 4 -40 -12 -390 -43 -164 -89 100 -82 12 -72 69 -34 215
6522 215 -63 -215 -196 119 -82 128 260 -137 -61 179 -164 -149 88 -48 170 -51 -345 -155 22 234 -51
6543 -51 65 5 328 5 -10 30 -11 -40 13 141 -78 22 -44 182 253 129 136 132 0 -100 211 98 -135 88
6567 88 -13 176 -86 151 81 -43 -177 218 77 39 -39 79 -65 -267 279 -29 7 -16 23 -74 40 -139 -31
6590 -31 72 -75 -153 -65 89 184 -114 17 271 136 277 126 67 -268 -158 -104 11 34 179 40 -209 391
6612 391 -231 0 49 -51 212 -152 -65 -87 -93 54 -70 -151 10 -12 -36 37 9 -82 -31 216 -184 -184 -64 110 61
6637 61 1 190 233 43 45 55 -169 -245 15 66 -15 -204 75 27 69 -103 194 179 -168 124 112 -128 10 0 -41
$$ packed form
6478B35mj24j03L48j48j70m4l1K8l97O14l62j47M66l09N23m49j70j1L55R3l35
6500a42K15j41L27m19j2N06l74p9J23m4K8l78L47j21P5J89j82R4q4J41j03K49
6522B15k78j52J9L15k01K10J32l97P6K40l43J5K37j36K18k21k94J90J77K12k85
6543e1J16o0L23l23j5M0m1k9N3J28k19J00o6K26P1j24Pmj32j00L11j13k33K23
6567H8j01J89k62K37p0j24j34L95j41l8p8J18j44k02N46l08L6k3L9r7J14j79J08
6590c1J03j47p8Q8J54R5k98J31K54j35J41j51n9l35J10N4J15K3J45j39k49O00
6612C91o22K31M9j00K63l64Q7k2oJ47j24q1J61k2k4P3k8r1N1K47m00%J20J74m9
6637F1o0J89M3j90KJ0k24p6K60N1q1j89K79m8M2j72K97j5l47K92j2k40J38j0m1
$$ plain form
6662 -41 -170 224 -33 -144 118 -13 -214 -61 -237 75 -26 -17 -77 -370 52 165 -120 -67 -31 -27 -103 97 20
6685 20 63 -114 -36 176 -167 51 -91 18 -21 58 174 -36 29 -15 183 108 -176 -40 82 154 16 36 -287
6708 -287 -222 -253 24 38 -6 -97 -91 44 80 -303 258 -249 -75 -76 25 -172 -206 353 -115 258 -52 97 2 126
6732 126 -92 48 -24 71 221 8 188 99 -193 34 47 102 -157 74 -42 -59 146 -64 28 -233 -69 -30 20
6755 20 98 -181 56 -179 146 0 -26 134 23 201 -113 131 16 -184 -321 183 -164 45 -51 -61 -233 -257
6777 -257 175 -70 63 271 -98 -94 -291 31 57 48 104 -55 118 -10 198 -141 -94 110 -92 -65 -82 39 -27
6800 -27 -157 -60 21 238 1 188 279 163 74 -38 235 -24 248 150 -221 -109 119 60 378 -224 -29 -143
6822 -143 -49 -31 -58 60 256 110 -69 55 -216 -67 2 211 33 -168 -100 158 -4 -44 -165 -87 -231 -48
$$ packed form
6662d1j29L94k57j11K62j31k01J53j76L12j01Ro0k93M22J13k85N3L6Mp6K00p7
6685B0M3j77P8K12l43K18j42J09l9P9J16k10O5m4J98p5k84J36J22P2j38K0l23
6708b87O5l1K77J4m4r1OJ35L6l83N61n07J74jJ01j97l4N59m68L73l10J49r5J24
6732A26k18J40p2R5J50k13J80q9k92K27J3N5k59K31j16j7K05k10R2k61J64L9N0
6755B0P8k79K37k35L25j46k6J60j11J78l14K44j15k00j37N04l47K09r6j0j72k4
6777b57M32k45J33K08l69Mj97L22K6rN6j59J73j28K08l39M7K04k02K7j7J21o6
6800b7j30R7Q1K17k37J87R1j16q9j12K73k59K72r8l71J12K28n9L18o02J95j14
6822a43R4J8k7J18J96j46j79J24k71J49O9K09j78k01O8K58j62m0j21P8j44J83
$$ plain form
6844 -48 159 132 -98 10 -61 -77 -10 -46 199 32 20 -99 -22 -215 176 157 -146 -179 -45 -36 -127 170 -168 69
6868 69 -139 -158 -128 -373 255 15 197 -135 -63 132 -11 88 -196 72 -177 -70 144 -42 15 145 -137 -24
6890 -24 -86 209 188 223 120 -300 91 68 -135 -117 -81 -90 -148 262 -340 220 60 -65 131 5 -197 123 -19
6913 -19 -133 -10 52 218 -71 -214 149 77 -62 130 19 74 140 -307 -172 10 41 11 -125 -9 3 48 12
6936 12 306 -23 -247 -80 73 -150 53 -47 110 -201 72 -161 -11 2 12 134 -106 -130 -87 146 27 -212
6958 -212 234 71 29 -41 -159 250 -123 82 209 -127 43 -140 203 82 -95 -38 -374 -154 316 -112 -103 84
6980 84 280 127 20 -216 161 -74 -19 150 108 -138 -159 42 47 83 -98 -319 -119 -158 -248 -144 -165 -133 135 -79
7004 -79 160 21 31 -100 121 -35 163 47 -146 -148 -39 -52 -128 238 75 90 -100 138 -68 -95 46 236 -83
$$ packed form
6844d8K07k7k30J08p1j6O7l6K45j67j2j19P7j93L91j9l03l3J34Rr1K97l38K37
6868F9k08j9L0k45O28k40J82l32P2J95j43R9k84K68k49J07K14j86N7J30k82J13
6890b4o2K95k1L5j03m20L91k3k03J8L6rn8M10o02N60j60j25J96j26k02L20j42
6913a9j14J23O2J66k89j43L63p2j39J92j11N5O6m47J35J82L1l0j36J16J2M5l6
6936A2K94l29k24J67J53k23K03j00J57l11K73k33J50J3J0J22k40k4M3K33j19k39
6958b12M46j63m2p0j18M09l73K05J27l36J70j83L43j21j77N7l36K20M70m28RJ87
6980H4J96j53j07k36L77k35N5J69m2k46k1K01NL6j81k21K00l9r0J04k1L2K68k14
7004g9K39j39J0j31K21j56J98j16j93kJ09j3p6L66j63J5j90K38k06k7J41J90l19
$$ plain form
7027 -83 255 273 -115 -117 -182 -260 -5 -33 96 258 -18 -120 171 -46 -21 -23 27 59 -210 -49 103 -97 36 23
7051 23 216 56 238 150 -82 -109 -121 -157 -114 -130 -23 38 -103 36 20 -65 78 24 -249 296 55 201 -15 266
7075 266 230 -55 126 35 -102 165 -107 226 126 -222 -112 -165 -74 2 201 -73 103 -130 -283 337 68 -128
7097 -128 30 12 139 325 -138 279 -21 147 -122 -96 -303 86 25 -30 181 -101 36 -38 -68 -153 -389 64
7119 64 5 -217 4 -284 -12 303 -34 -149 -97 203 -167 216 7 73 -25 132 -6 148 176 -151 -95 -110 243
7142 243 141 286 170 106 55 141 58 149 -19 52 86 92 -82 46 19 -85 -225 122 -4 89 -124 44 -18 39
7166 39 80 -144 43 54 206 -216 21 -74 133 366 104 -121 158 80 198 234 -258 -6 -59 70 -70 2 24
7189 24 66 159 89 22 -121 89 41 43 -33 -79 48 221 126 56 67 -216 -56 -41 -95 178 -178 -5 -96 -240 -39
$$ packed form
7027h3L38J8l88ko5p8K55k8J29J62k76j02K91k17K5kN0L2k69J61J52k00J33j3
7051B3J93j60J82q8k32k7j2l6M3j6J07O1j41J39j6q5J43n4k73N45k41J46k16K81
7075B66l6k85J81r1j37K67k72L33j00l48J10n3R1P6J99k74J76k33j53O20k69j96
7097a28J58j8J27J86m63M17l00J68k69K6k07L89o1n5K11k82J37p4l0q5k36M53
7119F4n9k22K21k88K72L15l37j15N2L00l70L83k09O6r8J57j38J54K8l27N6j5L53
7142B43j02J45j16o4n1Q6q3R1j68P1L4Oj74J28k7j04j40L47j26R3k13J68o2N7
7166C9M1k24J87J1J52m22K37r5K07K33k62k25K79p8J18L6m92K52n3J29j40P2K2
7189B4M2R3p0o7j43K10m8Kp6m6J27J73r5p0J1k83J60J5n4K73l56J73r1j44K01
$$ plain form
7214 -39 148 -125 -8 -171 79 220 -164 73 81 -151 26 -197 180 112 -1 212 -24 162 -242 -66 -166
7235 -166 -381 73 -108 89 19 -233 36 127 -110 201 -15 48 -193 -295 -105 -61 -92 -300 13 -328 218 99
7257 99 40 -93 265 -63 182 -124 129 59 186 -138 127 -77 -63 -55 -17 28 94 78 -62 152 -300 58 -7 124
7281 124 215 -68 -89 -143 -252 79 167 -118 226 -98 2 -224 -10 60 254 -257 89 34 -103 -91 -63 97 -213
7304 -213 -130 11 100 157 -124 118 59 121 96 152 75 -20 -134 45 69 100 50 182 -4 136 -132 314 225 367
7328 367 99 83 -68 85 -184 -23 63 -181 -213 -80 -30 100 -82 -62 66 161 129 282 -95 -257 199 -64
7350 -64 103 -167 -139 134 -16 -285 287 -193 52 -110 -259 -184 45 59 -23 233 -4 -262 -44 33 -212 149
7372 149 -86 -86 -176 62 106 -225 -117 -263 -31 86 198 137 11 -209 71 237 -148 157 50 -96 -121 -53
$$ packed form
7214c9J87k73J17j63K50J41l84K37Qk32J77k23L77o8j13K13k36J86m04J76j00
7235a66k15M54j81J97p0k52K69R1k37L11k16O3k41j02J90M4l1k08L13l41N46j19
7257I9n9j33L58l28K45l06K53p0J27l24K65k04J4QL8M5O6j6j40K14m52L58o5J31
7281A24R1k83k1n4j09L31Q8k85L44l24J00k26K14P0J94n11L46n5j37J2K8J60l10
7304b13Q3J41Q9N7k81K42n9O2k5N6p7r5j14J79K4L1n0J32j86J40k68M46q9J42
7328C67k68j6j51J53k69J61Q6k44l2J33N0J30j82K0J28R5l2J53l77j62M56k63
7350f4J67k70K8K73j50k69N72m80K45j62j49P5K29J4q2K56k37k58K18P7k45L61
7372A49k35%r0K38M4l31J08j46K32J17J12o1j26k20K80J66l85L05j07j46k5O8
$$ plain form
7394 -53 -26 110 99 226 17 -166 -34 183 313 -285 135 178 -230 77 -87 53 -70 42 80 -21 -105 -165
7416 -165 262 141 26 -150 -174 17 20 136 122 -13 -146 -12 171 65 -45 93 49 4 -43 -35 86 78 84 -91
7440 -91 -226 202 -29 1 -64 -51 1 -159 150 -111 140 231 49 183 -39 -80 298 74 -118 -33 -22 181 -138
7463 -138 -146 31 -80 19 249 -170 -148 181 222 -155 98 -177 6 55 226 13 177 -12 -289 -157 -173 -15
7485 -15 -33 4 -142 -42 92 70 49 -261 67 9 -45 97 -136 -17 -105 54 -294 389 270 -43 -40 -9 -235 -15
7509 -15 -62 22 31 -39 -16 -21 69 -39 -121 10 -4 91 -112 162 2 134 -320 -272 187 29 -35 -276 -186 169 -63
7534 -63 2 254 -175 -238 -121 -49 -70 -49 -177 4 -67 109 287 -158 1 -242 -119 -134 41 -182 51 -86 26
7557 26 103 93 46 -209 -58 -52 302 -176 -33 -205 -128 0 96 -136 -213 -56 -176 -62 -29 274 -31 -63 92 50
$$ packed form
7394e3K7J36j1J27k09j83J32K17J30n98M20M3m08L07j64J40j23J12L8j01q4o0
7416a65M27j21j15j76k4J91LJ16j4j35j33J34J83j06j10J38m4m5m7QJ21qOj75
7440i1j35M28k31L0o5J3N2j60L09k61K51R1j82J34k22m1L78k24j92Q5J1K03l19
7463a38qJ77j11R9K30m19K2L29M1l77K53k75J83M9J71k13J64j89k77J32j6J58
7485a5j8L7j46J00J34k2k1l10L28n8n4J42k33J19q8J59l48O83j19l13LL1k26K20
7509a5m7Q4Rp0K3nR0j08q2J31j4R5k03K74j60J32m54M8M59j58o4k41R0L55k32
7534f3O5K52m29o3J17P2k1K1j28J81p1J76J78m45J59k43J23j5J75k23K33j37J12
7557B6P7j0m7k55J51OL54m78J43j72P7J28R6k32p7J57j20J14L3L03l05l2J55m2
$$ plain form
7581 50 -105 230 -108 -52 99 -95 -5 48 197 -12 121 -34 -260 -86 -159 -92 -74 76 -142 45 -203 -66
7603 -66 88 -66 247 -25 -21 -13 26 15 -62 71 77 -159 148 -17 139 -141 -146 -97 -23 40 36 -43 218 -140 -89 115
7629 115 -149 -70 -50 -145 -160 178 -13 -51 30 -53 -233 42 -20 -88 -176 -40 -180 -51 45 0 -156 179 -113 72
7653 72 -28 85 -128 -509 -320 -68 -67 -128 -165 -223 -114 -113 -186 46 268 -88 117 -192 110 -130 143 229 -152
7676 -152 -113 -34 246 -224 -15 40 -38 20 -318 -264 -83 -215 21 2 85 47 -103 82 204 7 4 -40 2 42 15
7701 15 433 68 -154 -31 140 -18 164 -246 -101 102 -322 54 35 -114 -82 -123 -90 -177 13 63 -47 118
7723 118 157 -13 -225 6 266 127 -156 -358 22 50 -43 6 117 246 105 -197 -12 218 134 -17 -23 -289
7745 -289 204 -74 -21 -84 28 53 131 195 -1 18 -112 -26 -209 66 77 29 64 -115 177 -178 -125 -137 98 1
$$ packed form
7581E0j55L35l38N6J51j94R0N3J49k09J33j55k26J74p3O7J8J50k18J87k48J37
7603f6J54j54L13k72MQL9j1p7J33Ok36L07j65J56k80nM9P4O3mp9K61l58N1K04
7629A15k64P9K0r5j5L38j91l8Q1q3j80K75o2o8q8J36j40J29R6m5j56L35k92J85
7653G2j00J13k13l81J89K52Jo1l7n8J09Jp3K32K22l56K05l09L02k40K73Q6l81
7676a52L9P9K80m70K09N5p8N8l38N4J81j32K36j9Q3l8j50J85J22j97lm4M2M0k7
7701A5M18l65k22J23J71j58J82m10J45K03m24L76j9j49L2m1L3q7J90N0j10J65
7723A18L9j70k12K31K60j39k83k02L80K8r3M9J11J29j41l02J85K30q4j51ok66
7745b89M93k78N3o3J12K5P8O4j96J9j30Q6j83K75J1m8L5j79K92l55N3j2K35r7
$$ plain form
7769 1 35 -48 96 106 7 158 -416 -43 -74 111 -28 87 76 46 2 50 -256 -382 -93 -446 -40 -7 287 28
7793 28 -105 99 349 59 -29 -108 185 157 -14 154 -77 -3 -67 56 222 -159 -209 -1 -101 -201 139 -62
7815 -62 19 -4 -74 -16 -137 183 -54 13 70 25 -128 -83 78 -45 -18 -13 88 -42 37 226 151 163 -16 127 -170
7840 -170 -63 -152 17 178 -275 -147 70 147 -106 -384 -8 -49 83 -24 -40 -210 66 143 -15 -13 148 -414
7862 -414 -32 115 -68 308 27 -127 286 382 -277 249 -55 104 297 236 274 57 -78 -55 -80 34 -134 -6
7884 -6 234 47 -81 -94 -139 57 112 53 32 224 330 -174 208 -135 -155 -189 -32 84 46 10 309 93 73 243
7908 243 -174 -217 63 183 251 74 -15 -211 205 86 -146 -132 -205 -131 14 -48 -91 -377 87 81 39 -73 -91 -3
7932 -3 161 160 3 215 69 -62 152 75 68 -134 120 -17 83 -31 232 -378 -98 74 -49 158 -147 129
$$ packed form
7769AL4q3J44J0r9J51n74L73l1J85j39J15j1l0m4M8l06j26K89l53M06L3K94k59
7793B8j33K04K50k90q8p9K93k8j71J68k31P4o4J23J66l81n0K08j00j00L40k01
7815f2Q1k3p0N8j21L20k37O7N7m5j53M5J61j23K7NJ01j30P9J89p5J2j79J43k97
7840a70J07q9J69J61m53J28K17P7k53k78L76m1J32j07j6j70K76P7j58KJ61n62
7862d14L82J47j83L76k81j54M13R6o59N26l04J59J93o1L8k17j35K3k5J14j68J28
7884fK40j87j28j3m5J96N5n9k1J92J06n04L82l43k0l4J57J16l8l6K99k16k0J70
7908B43m17m3K80J20O8j77q9j96M16j19k32J4p3P4J45o2m3k86M64om2j12j8Q8
7932cJ64jj57K12j46j31K14p7pk02K54j37J00j14K63o10K80J72j23K07l05K76
$$ plain form
7954 129 -392 63 141 -277 31 364 -124 326 -65 -27 151 86 -16 290 263 80 -216 -72 -50 40 -111 -234
7976 -234 170 0 -50 -20 114 -67 303 75 -4 299 134 12 45 21 59 -23 124 92 78 -176 -169 -36 21 -158
8000 -158 -61 -40 101 -2 326 229 -60 -60 184 -212 -152 -14 -126 136 120 151 162 -50 203 -90 -94 -61 42 -69
8024 -69 244 -203 71 -92 -55 285 -127 212 -218 92 51 -80 -112 -1 -183 -239 -49 320 -113 -75 -60 2 -140
8047 -140 -56 60 215 3 -83 224 -92 65 -2 54 -218 185 102 16 -91 31 222 -107 130 124 -134 26 6
8070 6 -61 144 -167 -33 -68 110 16 -53 -117 -130 137 222 92 -37 -5 98 220 175 -128 -43 -227 -143 10 128
8094 128 79 -128 -157 165 117 -152 -123 -202 -116 -135 -74 -69 129 97 -173 -54 -37 -269 119 57 116 -238 -3 34 -60
8119 -60 187 -7 188 -96 -18 57 -48 12 -232 100 -94 4 256 27 -73 174 97 -60 -84 267 40 12 218
$$ packed form
7954A29n21M55P8m18L08L33m88M50l91L8J78o5j02L06k7j83k96J44K2R0j51j23
7976b34M04j70n0L0J34j81L70k28p9L03j65j22L3k4L8q2J47l2j4k54PJ33N7j79
8000a58R7K1J41j03L28r7k89%K44l96O0J38j12K62j6L1J1k12K53k93mL3J03j11
8024f9L13m47K74j63L7L40m12L39m30L10m1j31l2J11j82n6J90L69m33L8J5O2j42
8047a40Q4J16J55k12q6L07l16J57o7N6k72M03q3q6j07J22J91l29K37ok58J60k0
8070Fo7K05l11J34l5J78r4o9o4j3K67Q5j30j29L2J03J22m5l03Q5j84Q4J53J18
8094A28m9k07k9L22m8k69K9p9Q6j9O1NJ98l2k70J19J7k32L88o2N9l54K35L7r4
8119f0K47j94J95k84P8P5j05O0k44L32j94R8K52k29j00K47p7j57k4L51k27k8K06
$$ plain form
8142 218 -151 -218 18 15 115 27 -16 -58 -108 -185 110 -6 -82 -108 -248 -154 -51 -168 189 91 145 -120 3 29 -100
8167 -100 50 -17 49 106 -216 50 -109 -67 67 -40 27 -96 -218 -15 -142 47 -68 -8 76 -302 28 111 -53
$$ packed form
8142B18l69o7K36lJ00q8m3m2n0p7K95j16p6k6j40R4J03j17L57r8N4k65J23K6j29
8167a00J50o7O6N7l22K66j59M2J34j07O7j23j22K03j27J89j15O0Q4l78L30Q3j64
8190e3r
8191f2
$$ Imaginary data points
##PAGE= N=2
##DATA TABLE= (X++(I..I)), XYDATA
$$ plain form
0 0 0 0 0 0 -7 0 -8 8 -8 16 -16 19 -24 32 -40 47 -56 65 -76 92 -108 123 -146 167 -190 218 -250 282 -321
29 -321 363 -408 457 -514 576 -639 713 -794 881 -976 1083 -1198 1327 -1471 1628 -1802 2001
46 2001 -2226 2478 -2774 3118 -3521 4010 -4614 5379 -6388 7789 -9864 13267 -19853 37353
60 37353 -184720 -471841 -79315 304977 360701 25755 -199358 -71390 261843 343957 92052
71 92052 -199747 -161051 120730 279763 87997 -213143 -276984 -46092 159029 94950 -139730
82 -139730 -227763 -69444 119446 83105 -120315 -209495 -34104 204624 222710 7547 -159624
93 -159624 -76728 135298 195938 33165 -139016 -101394 83934 160660 14725 -164788 -130147
104 -130147 95544 231096 99416 -142121 -199453 -18485 148331 68334 -172097 -271153
$$ packed form
0@%%%%pPqJ6j6K4l2L5m3N6p2Q7j03J21j41J68k00K31k69L13l57M08m68N32o03
29c21O84p71Q65r71J090j215J352j507J675j857K059k281K525k798L099l430L803
46B001m227M704n252N892o639P531q624R993j1767J4177j7653K3131l3120N7206
60C7353k22073k87121L92526L84292N5724l34946k25113J27968L33233Q2114k51905
71I2052k91799L8696K81781J59033j91766l01140o3841K30892K05121o4079k34680
82a39730q8033J58319J88890l6341k03420q9180J75391K38728J8086k15163j67171
93a59624Q2896K12026O0640j62773j72181L7622J85328P6726j45935j79513L4641
104a30147K25691J35552j31680k41537n7332J80968J66816p9997k40431r9056
$$ plain form
114 -271153 -91829 153380 161450 -77649 -252649 -116711 197284 331659 140406 -136137
124 -136137 -169299 64140 268428 193714 -66138 -201011 -67707 143961 152913 -59789 -242082
135 -242082 -189517 8181 99276 -15007 -174672 -175070 -16706 114636 87189 -17918 -27660
146 -27660 91240 190632 139831 -1466 -63433 11757 104427 76805 -51034 -134815 -88169
157 -88169 14764 38134 -40946 -107447 -62845 39781 67365 -15214 -98622 -70603 34664
168 34664 87833 27969 -57951 -49647 52181 121666 65089 -51648 -77179 28150 133387
179 133387 96572 -53042 -143668 -68039 87267 142202 34713 -109520 -124108 -151 105410
190 105410 57808 -91149 -170337 -95740 35346 72646 -10982 -97697 -71414 48820 138937
$$ packed form
114b71153J79324K45209Q070k39099j75000J35938L13995J34375j91253k76543
124a36137l3162K33439K04288p4714k59852j34873J33304K11668Q952k12702j82293
135b42082N2565J97698R1095j14283j59665l98J58364J31342k7447j05107r742
146b7660J18900R9392n0801j41297o1967P5190R2670k7622j27839q3781M6646
157h8169J02933K3370p9080o6501M4602J02626K7584q2579q3408K8019J05267
168C4664N3169n9864q5920Q304J01828O9485n6577j16737k5531J05329J05237
179A33387l6815j49614r0626P5629J55306N4935j07489j44233j4588J23957J05561
190A05410m7602j48957p9188P4597J31086L7300q3628q6715K6283J20234R0117
$$ plain form
201 138937 116121 30241 -7079 38591 91352 72132 -3476 -52962 -35228 6470 5454 -45193
213 -45193 -88645 -75252 -22496 6954 -17621 -56233 -54744 -11671 24700 23175 5961 10877 43448
226 43448 73127 71487 45017 23943 24777 29930 12868 -20014 -37987 -30508 -22620 -36556 -57461
239 -57461 -50652 -10252 29031 27523 -12282 -44089 -25368 27751 52355 13961 -46880 -57612
251 -57612 -1776 61988 67716 13103 -36223 -20706 46960 90235 55077 -26761 -69223 -34380
263 -34380 28661 44319 -3719 -59428 -61581 -11779 29532 14650 -37302 -62857 -31981 14621
275 14621 20473 -15503 -40366 -12266 45273 75334 53316 14064 9902 46418 72600 42422
287 42422 -23742 -59835 -36964 2947 1467 -44464 -82159 -65074 -8572 29765 15421 -23928
$$ packed form
201A38937k2816q5880l7320M5670N2761j9220p5608m9486J7734M1698j016n0647
213d5193m3452J3393N2756K9450k4575l8612J489M3073L6371j525j7214M916L2571
226D3448K9679j640k6470k1074Q34N153j7062l2882j7973P479P888j3936k0905
239e7461O809M0400L9283j508l9805l1807J8721N3119K4604l8394o0841j0732
251e7612N5836O3764N728n4613m9326J5517O7666M3275l5158q1838m2462L4843
263c4380O3041J5658m8038n5709k153M9802M1311j4882n1952k5555L0876M6602
275A4621N852l5976k4863K8100N7539L0061k2018l9252m162L6516K6182l0178
287D2422o6164l6093K2871L9911j480m5931l7695J7085N6502L8337j4344l9349
$$ plain form
299 -23928 -33521 1196 37132 33437 3230 -6842 16008 40939 36882 13153 4706 22643 39064
312 39064 18970 -26854 -49017 -22118 15062 4948 -49623 -80749 -41017 33493 61904 14759
324 14759 -49289 -50008 18178 74598 47347 -35430 -75167 -24512 54096 66325 4243 -48396
336 -48396 -21164 54793 86515 32977 -43810 -54944 5117 50894 13459 -65756 -88047 -24629
348 -24629 45496 37514 -34114 -73349 -26121 55166 71557 2007 -67710 -49484 36756 85744
360 85744 41531 -34264 -42333 26655 85367 60253 -18495 -60142 -24646 29295 21489 -45072
372 -45072 -86011 -48618 18544 31023 -18870 -53005 -13052 57859 72463 10053 -53636 -36711
384 -36711 42604 83396 27722 -59596 -68528 15494 90012 63617 -30340 -78787 -27551 52992
$$ packed form
299b3928r593L4717L5936l695l0207j0072K2850K4931m057k3729q447J7937J6421
312C9064k0094m5824k2163K6899L7180j0114n4571l1126L9732P4510K8411m7145
324A4759o4048p19O8186N6420k7251q2777l9737N0655P8608J2229o2082n2639
336d8396K7232P5957L1722n3538p6787j1134O0061M5777l7435p9215k2291O3418
348b4629P0125p982p1628l9235M7228Q1287J6391o9550o9717J8226Q6240M8988
360H5744m4213p5795q069O8988N8712k5114p8748m1647L5496N3941p806o6561
372d5072m0939L7393O7162J2479m9893l4135L9953P0911J4604o2410o3689J6925
384c6711P9315M0792n5674q7318q932Q4022P4518k6395r3957m8447N1236Q0543
$$ plain form
396 52992 57154 -24452 -94158 -67804 20563 60448 8358 -60569 -49672 31517 82459 40207
408 40207 -39549 -57252 6843 68134 45080 -37311 -75663 -17265 68286 76508 -312 -63975
420 -63975 -35975 43710 70599 7114 -73495 -78538 -7388 48221 21279 -48345 -65507 -3035
432 -3035 63623 55552 -9287 -43445 -5759 49501 47260 -12747 -54851 -24018 41478 58008 2787
445 2787 -52283 -33462 37033 66753 12464 -63639 -72529 -7986 47589 25607 -45162 -73369
457 -73369 -17805 59029 68879 5575 -46243 -21997 41999 61752 10232 -49143 -46398 11225
469 11225 49184 21359 -34486 -43378 9344 55785 34365 -30609 -59874 -20677 32637 30189
481 30189 -25381 -63700 -34132 33336 61251 21308 -32349 -29679 24840 60605 30339 -30557
$$ packed form
396E2992M162q1606o9706K6354Q8367L9885n2090o8927J0897Q1189N0942m2252
408D0207p9756j7703O4095O1291k3054q2391l8352N8398Q5551Q222p6820o3663
420f3975K8000P9685K6889o3485q0609n043P1150N5609k6942o9624j7162O2472
432c035O6658q071o4839l4158L7686N5260k241o0007m2104L0833O5496J6530n5221
445B787n5070J8821P0495K9720n4289p6103q890O4543N5575k1982p0769k8207
457g3369N5564P6834R850o3304n1818K4246O3996J9753n1520n9375K745N7623
469A1225L7959k7825n5845q892N2722M6441k1420o4974k9265L9197N3314k448
481C0189n5570l8319K9568O7468K7915l9943n3657K670N4519L5765l0266o0896
$$ plain form
493 -30557 -51109 -13508 30609 26885 -15879 -39689 -12694 32691 38837 -1357 -35133 -19817
505 -19817 19346 26680 -11716 -47994 -34623 14894 43614 19096 -25350 -30628 14574 55086
517 55086 38174 -18672 -49709 -21278 25576 31985 -7452 -41151 -26600 20276 43980 18484
529 18484 -21973 -26891 6474 29349 7670 -33183 -42533 -8882 25642 21562 -11229 -26040 60
542 60 39185 43455 4802 -30844 -23163 13776 28746 312 -35794 -34728 2217 32882 23934
555 23934 -10054 -26582 -5315 24818 23017 -10565 -35552 -22719 8678 20343 2910 -15288
567 -15288 -7156 20139 33714 16647 -11788 -18285 1654 16787 917 -29321 -35903 -8931 21153
580 21153 21564 -2972 -18993 -4683 24751 33585 8421 -23676 -27335 -1698 17755 7975 -15799
$$ packed form
493c0557k0552L7601M4117l724m2764k3810K6995M5385O146m0194l3776J5316
505a9817L9163P334l8396l6278J3371M9517K8720k4518m4446n278M5202M0512
517E5086j6912n6846l1037K8431M6854O409l9437l3699J4551M6876K3704k5496
529A8484m0457m918L3365K2875k1679m0853r350L3651L4524m080l2791j4811K6100
542F0L9125M270l8653l5646P681L6939J4970k8434l6106J066L6945L0665q948
555B3934l3988j6528K1267L0133j801l3582k4987J2833L1397J1665j7433j8198
567a5288Q132K7295J3575j7067k8435o497J9939J5133j5870l0238o582K6972L0084
580B1153M11k4536j6021J4310K9434Q834k5164l2097l659K5637J9453r780k3774
$$ plain form
593 -15799 -20995 -179 22282 21399 544 -14390 -6598 10747 10915 -10353 -27281 -17068 8639
606 8639 19431 5676 -10832 -6736 15254 28728 15232 -12690 -25985 -12068 8891 8734 -12338
619 -12338 -25709 -11845 14990 26725 14266 -3830 -6449 6804 15768 5465 -16068 -24556 -10851
632 -10851 5029 4425 -7788 -10283 4073 19726 19198 2788 -10862 -7034 7533 12116 -2845
645 -2845 -20727 -17439 4780 20902 14211 -4413 -11477 -550 12525 10266 -8577 -24219 -19658
658 -19658 -1745 8213 243 -9316 -2390 16111 25502 16828 858 -5330 1697 8521 947 -16133
672 -16133 -24273 -12275 5728 9869 -1986 -10173 -1356 13791 17309 3722 -13129 -15825 -2417
685 -2417 9067 4211 -10233 -13335 3124 20283 20351 5566 -6395 -4229 4798 5588 -5453 -18008
$$ packed form
593a5799n196K0816K2461q83k0855j4934P792J7345J68k1268j6928J0213K5707
606H639J0792j3755j6508M096K1990J3474j3496k7922j3295J3917K0959j57k1072
619a2338j3371J3864K6835J1735j2459j8096k619J3253Q964j0303k1533q488J3705
632a0851J5880o04j2213k495J4356J5653n28j6410j3650L828J4567M583j4961
645b845j7882L288K2219J6122o691j8624p064J0927J3075k259j8843j5642M561
658a9658J7913R958p970r559O926J8501R391q674j5970o188P027O824p574j7080
672a6133q140J1998J8003M141j1855q187Q817J5147L518j3587j6851k696J3408
685b417J1484m856j4444l102J6459J7159O8j4785j1961K166R027P90j1041j2555
$$ plain form
699 -18008 -17608 -4138 6818 3863 -3785 -936 11431 17447 8559 -6400 -12605 -6446 2574 524
713 524 -11527 -18573 -8475 11273 20774 12012 -359 -338 9121 13888 5456 -8714 -16058 -10358 -404
728 -404 992 -5986 -9227 -204 11188 10955 -584 -8874 -5591 1710 3075 -4752 -12461 -9480 4503
743 4503 16599 14949 4388 1347 8970 14796 8062 -6951 -16902 -14652 -6819 -3102 -7899 -12699
757 -12699 -7450 6284 15644 10987 1003 -1507 3564 6285 751 -8152 -11023 -4718 4369 7635 3176
772 3176 -788 4719 13057 12153 726 -10153 -10793 -4847 -2285 -5744 -11190 -9940 -538 10264 11789
787 11789 4440 -854 1875 5847 2983 -5812 -11344 -8609 -1868 3429 3512 1632 3359 10701 15006
802 15006 9833 -294 -5837 -4800 -3832 -8076 -12791 -13953 -7993 726 5595 4170 982 2925 8928
$$ packed form
699a8008M00J3470J0956k955p648K849J2367O016q888j4959o205O159R020k050
713E24j2051p046J0098J9748R501q762j2371K1R459M767q432j4170p344N700R954
728d04J396o978l241R023J1392k33j1539q290L283P301J365p827p709K981J3983
743D503J2096j650j0561l041P623N826o734j5013r951K250P833L717m797m800
757a2699N249J3734R360m657r984k510N071K721n534q903k871O305R087L266m459
772C176l964N507Q338r04j1427j0879o40N946K562l459n446J250R402J0802J525
787A1789p349n294K729L972k864q795n532K735O741N297Q3j880J727P342M305
802A5006n173j0127n543J037R68m244m715j162N960Q719M869j425l188J943O003
$$ plain form
817 8928 9842 2162 -6572 -8212 -2884 1894 2595 811 365 3990 9890 11404 5677 -1706 -4455 -4362
833 -4362 -6969 -11931 -13687 -9926 -3484 1021 2996 2949 4455 9058 12489 9102 -197 -6239 -5348 -2030
849 -2030 -1348 -2495 -2902 -378 3934 8385 8410 4703 621 -412 -2071 -6649 -11296 -11618 -7036 -3095
865 -3095 -817 870 2974 5770 9160 10659 6716 316 -3415 -3055 -2635 -4225 -4381 -1625 1527 4201
881 4201 6411 6952 5060 2832 1637 -1727 -7560 -11715 -11205 -7834 -4855 -2170 341 3449 6069 9014
897 9014 10228 7344 2344 -1185 -2210 -3283 -4704 -4495 -1843 796 2815 4769 5750 4809 2555 1032
913 1032 -1652 -6932 -11103 -10710 -8186 -5555 -2602 786 3511 6448 9499 11314 8788 3443 208
928 208 -689 -2586 -4464 -5779 -4423 -1827 1355 4104 4778 2626 1070 1603 -21 -4616 -8912 -9598
$$ packed form
817H928R14p680q734j640N328M778P01j784m46L625N900J514n727p383k749R3
833d362k607m962j756L761O442M505J975m7J506M603L431l387r299o042Q91L318
849b030O82j147m07K524M312M451K5l707m082j033j659m578m647l22M582L941
865c095K278J687K104K796L390J499l943o400l731L60M20j590j56K756L152K674
881D201K210N41j892k228j195l364n833m155N10L371K979K685K511L108K620K945
897I014J214k884n000l529j025j073j421K09K652K639K019J954R81r41k254j523
913A032k684n280m171L93K524K631K953L388K725K937L051J815k526n345l235
928B08q97j897j878j315J356K596L182K749O74k152j556N33j624m595m296o86
$$ plain form
944 -9598 -6915 -3973 -1588 1162 4084 7176 10451 11056 7045 1899 -796 -546 -2786 -7113 -8958 -7094
960 -7094 -2395 1896 4814 4685 3241 3472 4412 2811 -2977 -7642 -7513 -5283 -4906 -4565 -2346 1975 6661
977 6661 9913 8751 4526 848 1560 2515 -1147 -6999 -8802 -5615 -347 2705 2981 3169 2960 4401
993 4401 4422 250 -5840 -8415 -6271 -4707 -6300 -7117 -3481 3691 9724 11673 8713 5065 3900 5809
1009 5809 4239 -2697 -9439 -9959 -5671 -2718 -2433 -2394 -22 3682 6211 4476 -344 -4340 -3126 -184
1025 -184 -1304 -6016 -6896 -1358 6165 9322 7667 4301 2310 3382 3974 6 -7382 -11280 -8146 -3364
1041 -3364 -2598 -3487 -1062 4945 9612 9822 5484 65 -1698 356 408 -4980 -11063 -10168 -2648 3821
1057 3821 4586 2443 2658 5463 8076 6142 155 -5432 -6254 -2161 -803 -4210 -6357 -1989 5235 8135
$$ packed form
944i598K683K942K385K750K922L092L275O05m011n146k695K50k240m327j845J864
960g094M699M291K918j29j444K31R40j601n788m665J29K230L77L41K219M321M686
977F661L252j162m225l678P12R55l662n852j803L187N268L052K76J88k09J441
993D401K1m172o090k575K144J564j593q17L636P172O033J949k960l648j165J909
1009E809j570o936o742n20M288K953K85L9K372L704K529j735m820l996J214K942
1025a84j120m712q80N538P523L157j655l366j991J072N92l968p388l898L134M782
1041c364P66q89K425O007M667K10m338n419j763K054N2n388o083Q95P520O469
1057C821P65k143K15K805K613j934n987n587q22M093J358l407k147M368P224K900
$$ plain form
1073 8135 5304 498 -1762 -622 1162 -1515 -7466 -10441 -5749 2540 5611 3117 2239 6095 9947
1088 9947 9439 3516 -3721 -7169 -5735 -3331 -5368 -9716 -9269 -1290 6714 7648 3945 2685 4571 6703
1104 6703 4814 -1008 -7438 -7525 -2170 2243 -7 -3864 -1992 4773 8332 4746 -1175 -5517 -4596 -1432
1120 -1432 -1487 -5531 -8368 -4010 5092 9551 6367 2937 4334 7914 7531 768 -7335 -10649 -7501 -2423
1136 -2423 -1334 -5508 -6677 154 8987 10511 5142 125 305 2363 1446 -3512 -8595 -8317 -1255 4559
1152 4559 3645 -1161 -672 5812 10285 6528 -2312 -7734 -6641 -1241 650 -2492 -7075 -4370 4223
1167 4223 9232 6433 14 -1102 1858 2536 -2350 -8856 -10441 -5331 2188 4865 1001 -1497 4065
1182 4065 12753 13574 5136 -3832 -5724 -2140 -500 -4102 -9781 -10939 -3810 4214 5592 344 -2283
$$ packed form
1073H135k831m806k260J140J784k677n951k975M692Q289L071k494q78L856L852
1088I947n08n923p237l448J434K404k037m348M47P979Q004R34l703j260J886K132
1104F703j889n822o430q7N355M413k250l857J872O765L559l586n921m342R21L164
1120a432n5m044k837M358R102M459l184l430J397L580l83o763q103l314L148N078
1136b423J089m174j169O831Q833J524n369n017J80K058r17m958n083K78P062N814
1152D559r14m806M89O484M473l757q840n422J093N400J891l142m583K705Q593
1167D223N009k799o419j116K960O78m886o506j585N110P519K677l864k498N562
1182D065Q688Q21q438q968j892L584J640l602n679j158P129Q024J378n248k627
$$ plain form
1197 -2283 2357 7515 5187 -2908 -8293 -5984 1060 4780 2539 -2080 -938 7247 12836 8460 -1234
1212 -1234 -6002 -2803 -109 -3666 -10022 -12844 -7336 1477 5636 2498 -2144 1133 9117 11334 3111
1227 3111 -6484 -7283 -1293 3349 1370 -3860 -4997 1741 10031 11069 2940 -3639 -1660 3391 1703
1242 1703 -7099 -13282 -10336 -2195 3201 982 -3570 -2831 5512 12159 8431 -2275 -7401 -2197 4047
1257 4047 2949 -4227 -6988 -1510 7670 11803 6653 -1255 -2308 3954 5744 -2001 -12437 -13967 -6924
1272 -6924 -388 -1175 -5073 -5320 2013 10619 11180 3238 -3630 -1398 6112 6184 -2107 -8946 -5005 4568
1288 4568 10310 6841 -645 -3338 1982 7008 3256 -8429 -14590 -10015 -2495 -1848 -6892 -8024 -1411
1303 -1411 8516 11946 6874 -93 -95 6787 9939 2791 -7687 -9151 -345 7289 5335 -1258 -4315
$$ packed form
1197b283M640N158k328q095n385K309P044L720k241m619J142Q185N589m376r694
1212a234m768L199K694l557o356k822N508Q813M159l138m642L277P984K217q223
1227C111r595p99N990M642j979n230j137O738Q290J038q129o579J979N051j688
1242A703q802o183K946Q141N396k219m552P39Q343O647l728j0706n126N204O244
1257D047j098p176k761N478R180M133n150p908j053O262J790p745j0436j530P043
1272f924O536p87l898k47P333Q606N61p942o868K232P510P2q291o839L941R573
1288D568N742l469p486k693N320N026l752j1685o161M575P520O47n044j132O613
1303a411R927L430n072o967kO882L152p148j0478j464Q806P634j954o593l057
$$ plain form
1318 -4315 92 6446 5730 -3256 -11668 -10423 -3205 -310 -6001 -10573 -5945 5271 11470 8690 2698
1333 2698 674 5104 9752 6503 -3276 -9308 -5178 2586 4063 -1376 -4192 -186 6510 7228 873
1348 873 -6680 -8063 -3039 -73 -4173 -12059 -11382 -2158 7331 7897 2646 267 3992 9674 9891 3588
1364 3588 -3600 -4384 1313 4305 247 -4503 -2548 3675 6771 2185 -5132 -8156 -5490 -1609 -3084
1379 -3084 -10189 -13851 -7627 3012 8336 5247 1960 5435 11605 13855 9133 830 -3049 -1284 1914
1394 1914 -120 -6390 -9102 -3580 3041 3332 -2237 -6233 -4349 -654 -36 -4021 -8559 -7470 -524
1409 -524 5717 5320 1707 2356 8660 12650 9569 1750 -3185 -2762 513 920 -4044 -8674 -6618 1068
1425 1068 5422 2512 -2751 -3009 788 2203 -1285 -7674 -10121 -6634 -239 1847 -1045 -2460 3060
$$ packed form
1318d315M407O354p16q986q412J245P218K895n691m572M628J1216O199k780n992
1333B698k024M430M648l249r779o032M130P764J477n439k816M006O696P18o355
1348H73p553j383N024K966m100p886O77R224R489N66n251k379L725N682K17o303
1364C588p188p84N697K992m058m750J955O223L096m586p317l024K666L881j475
1379c084p105l662O224J0639N324l089l287L475O170K250m722q303l879J765L198
1394A914k034o270k712N522O621K91n569l996J884L695O18l985m538J089O946
1409e24O241l97l613O49O304L990l081p819m935M23L275M07m964m630K056P686
1425A068M354k910n263k58L797J415l488o389k447L487O395K086k892j415N520
$$ plain form
1440 3060 11156 13561 8007 2173 1256 4329 5093 826 -5813 -8492 -4194 1763 1485 -4557 -7509 -3732
1456 -3732 1267 189 -6047 -10426 -8397 -2021 3267 3275 178 1723 9127 15503 13718 6339 2492 3217
1472 3217 4032 -155 -7048 -11457 -9284 -4022 -1438 -4652 -7849 -4575 3343 6576 1633 -4919 -5692
1487 -5692 -946 4000 3723 -860 -2764 1693 9011 11184 5792 616 1435 5167 3467 -3409 -8615
1502 -8615 -8112 -2935 686 -1325 -5836 -6073 691 7092 4702 -3750 -8409 -5147 284 920 -3302 -6001
1518 -6001 -2338 5929 11713 10023 4816 4014 8906 10997 4926 -4708 -9329 -6152 -2373 -3739 -8409
1533 -8409 -11415 -7239 497 3660 -324 -5744 -4212 2343 5181 1477 -2818 -955 5758 11122 10351
1548 10351 5136 2064 5093 9495 6106 -4166 -11696 -10032 -4963 -3978 -8121 -11145 -7671 210 6041
$$ packed form
1440C060Q096K405n554n834r17L073P64m267o639k679M298N957k78o042k952L777
1456c732M999j078o236m379K029O376N288Ql097J545P404O376j785p379l847P25
1472C217Q15m187o893m409K173N262K584l214l197L274P918L233m943o552p73
1487e692M746M946k77m583j904M457P318K173n392n176Q19L732j700o876n206
1502h615N03N177L621k011m511k37O764O401k390q452m659L262N431O36m222k699
1518f001L663Q267N784j690n207q02M892K091o071r634m621L177L779j366m670
1533h409l006M176P736L163l984n420J532O555K838l704m295J863O713N364p71
1548A0351n215l072L029M402l389j0272p530J664N069R85m143l024L474P881N831
$$ plain form
1563 6041 5028 97 -1154 3621 8003 4135 -3626 -5841 -461 5355 5751 1709 -1190 1725 7618
1578 7618 9448 3163 -5465 -6473 -1631 1131 -3639 -9906 -9860 -3034 3448 3554 -1475 -4378 -1778 4712
1594 4712 5119 -1005 -6363 -4102 3497 7061 4574 1485 3369 8899 11528 7698 81 -4847 -3125
1609 -3125 -629 -4182 -12200 -15364 -9658 -1819 955 -1646 -3893 -785 5955 9656 6024 -239 -1724
1624 -1724 3595 7761 4532 -715 -777 4544 8454 5966 -1096 -5513 -4467 -622 -1214 -8069 -13865 -10825
1640 -10825 -1930 3011 798 -2479 -197 5853 9663 7257 722 -2766 -164 4013 3240 -3153 -5624
1655 -5624 -340 6666 8165 2933 -1889 -1496 2154 3530 -1223 -8685 -11038 -6343 -720 -1476 -5049
1670 -5049 -4879 969 6181 6100 1874 -1096 968 4528 5646 1340 -3299 -1645 5248 8763 5233 -580
$$ packed form
1563F041j013m931j251M775M382l868p761k215N380N816L96m042k899K915N893
1578G618J830o285q628j008M842K762m770o267M6O826O482J06n029k903K600O490
1594D712M07o124n358K261P599L564k487l089J884N530K629l830p617m928J722
1609c125K496l553q018l164N706P839K774k601k247L108O740L701l632o263j485
1624a724N319M166l229n247o2N321L910k488p062m417J046L845n92o855n796L040
1640a0825Q895M941k213l277K282O050L810k406o535l488K602M177p73o393k471
1655e624N284P006J499n232m822L93L650J376m753p462k353M695N623p56l573
1670e049J70N848N212q1m226k970K064L560J118m306m639J654O893L515l530n813
$$ plain form
1686 -580 -1528 1081 2597 -1066 -7575 -11263 -9349 -4849 -3051 -5823 -6385 -733 7176 9280 5653 2199
1702 2199 3291 6556 7192 3317 -2917 -4641 -622 4108 3343 -1964 -4049 -478 3384 1467 -3664
1717 -3664 -7572 -7273 -3653 -1531 -3153 -5686 -4095 3031 7808 6436 2332 1533 4174 5872 3503
1732 3503 -1523 -4375 -3052 1256 3163 459 -2451 -810 4188 4940 728 -4338 -5839 -3906 -2688
1747 -2688 -3768 -6527 -7094 -2673 3046 5149 2930 1531 4208 7855 6512 2135 -1488 -1664 686
1762 686 2296 580 -3237 -3369 936 4469 2241 -2815 -5600 -4194 -2184 -2846 -5699 -6660 -4316 749
1778 749 4340 3899 2364 3585 7592 9062 5013 -515 -2590 -581 1062 -95 -3273 -4891 -2953
1793 -2953 1786 3882 478 -3185 -3277 -775 -514 -3313 -5619 -4995 -1774 1439 2686 1565 1590 4790
$$ packed form
1686e80r48K609J516l663o509l688J914M500J798k772n62N652P909K104l627l454
1702B199J092L265O36l875o234j724M019M730p65n307k085L571L862j917n131
1717c664l908K99L620K122j622k533J591P126M777j372m104p99K641J698k369
1732C503n026k852J323M308J907k704k910J641M998P52m212n066j501J933J218
1747b688j080k759n67M421N719K103k219j399K677L647j343m377l623j76K350
1762F86J610j716l817j32M305L533k228n056k785J406K010o62k853r61K344N065
1778G49L591m41j535J221M007J470m049n528k075K009J643j157l178j618J938
1793b953M739K096l404l663r2K502K61k799k306O24L221L213J247j121K5L200
$$ plain form
1809 4790 8272 7423 2018 -1908 -1171 932 603 -2343 -4477 -4170 -573 2372 2184 -874 -2158 12
1825 12 1066 -1107 -5056 -5918 -3149 -97 717 14 -323 2316 6672 8512 5414 349 -901 967
1841 967 1617 -984 -4434 -4714 -2308 692 1472 -473 -1833 -413 2237 1894 -2622 -6075 -4501 -1133
1857 -1133 271 -731 -1848 -41 3840 7026 6913 3396 660 1491 3000 1209 -3276 -5237 -3769
1872 -3769 -754 -129 -1258 -2261 -1326 1284 2959 517 -3771 -4497 -2029 548 -157 -2066 -1021 2188
1888 2188 5250 6291 4455 2235 1617 2970 2000 -1804 -5910 -5709 -2672 -827 -1517 -2844 -1515 1565
1904 1565 3589 3445 410 -2141 -1697 381 582 -2770 -3936 -1223 2518 3941 2971 1165 1460 3177
1920 3177 3759 1905 -2516 -4400 -2943 -414 -435 -2287 -2090 384 2916 2697 808 -1487 -1544 -423 -112
$$ packed form
1809D790L482q49n405l926P37K103l29k946k134L07L597K945j88l058j284K170
1825A2J054k173l949q62K769L052Q14p03l37K639M356J840l098n065j250J868
1841I67O50k601l450k80K406L000P80j945j360J420K650l43m516l453J574L368
1857a133J404j002j117J807L881L186j13l517k736Q31J509j791m485j961J468
1872c769L015O25j129j003R35K610J675k442m288p26K468K577p05j909J045L209
1888B188L062J041j836k220o18J353r70l804m106K01L037J845o90j327J329L080
1904A565K024j44l035k551M44K078K01l352j166K713L741J423r70j806K95J717
1920C177N82j854m421j884J457K529k1j852J97K474K532k19j889k295n7J121L11
$$ plain form
1937 -112 -2615 -5121 -3937 608 3923 3656 2470 2300 4048 5082 4226 990 -2572 -3450 -2453 -2018 -3725
1954 -3725 -5082 -2623 500 1760 480 -544 234 1455 2506 683 -1936 -2947 -1154 2360 3080
1969 3080 1180 569 2091 3572 3093 487 -1876 -3142 -2375 -2155 -3073 -4383 -3013 457 3459 3323
1985 3323 1433 1402 2635 2823 1739 -798 -3546 -3920 -2137 -505 -1165 -1775 2 2856 4071 2589
2001 2589 848 794 1214 774 -416 -2683 -3748 -1921 957 1784 377 -1147 50 1561 1629 -225 -2337
2018 -2337 -2909 -2190 -823 -177 -355 514 2818 4900 4134 1932 872 1093 497 -1276 -3613 -5004 -4881
2035 -4881 -2494 -296 146 -681 655 3512 4466 3345 744 145 -293 -466 -1024 -1840 -2512 -1896 802
2052 802 1953 990 -129 -66 969 307 -1048 -2041 -1921 -875 373 816 550 844 2806 4505 3225
$$ packed form
1937a12k503k506J184M545L315k67j186j70J748J034q56l236l562q78R97M35j707
1954c725j357K459L123J260j280j024P78J221J051j823k619j011J793L514P20
1969C080j900o11J522J481m79k606k363j266P67K20r18j310J370L470L002j36
1985C323j890l1J233J88j084k537k748l74J783J632o60o10J777K854J215j482
2001B589j741n4M20m40j190k267j065J827K878Q27j407j524J197J511O8j854k112
2018b337n72P19J367O46j78Q69K304K082p66k202j060K21n96j773k337j391J23
2035d881K387K198M42q27J336K857R54j121k601n99m38j73n58q16o72O16K698
2052H02J151r63j119O3J035o62j355r93J20J046J248M43k66K94J962J699j280
$$ plain form
2069 3225 196 -1777 -1988 -1887 -2606 -3739 -4167 -3466 -1147 1536 3096 2564 2255 3333 3839 2196 -152
2086 -152 -1174 -1131 -1558 -2017 -2538 -2225 -967 641 1846 814 -534 -232 386 527 -1266 -2114 -1427 -410
2104 -410 699 1703 1588 873 1766 2419 1883 -967 -2835 -2651 -1929 -1665 -1842 -991 -423 1155 3081 3817
2122 3817 3553 2071 1646 850 -1034 -3000 -3326 -2843 -2331 -2521 -2191 -1467 531 2595 3568 3002 760 102
2140 102 997 2023 834 -421 -894 -450 491 1135 1788 755 -242 -976 -1692 -2516 -3670 -2726 -1670 -1820
2158 -1820 -1504 206 2032 3550 4328 4013 2797 1157 890 708 -667 -2734 -3813 -2650 -1391 -561
2174 -561 272 920 843 1293 1805 805 -126 -1542 -1760 -1505 -1457 -1550 -546 307 976 1187 1786 1657 1330 1103
2194 1103 116 -1258 -1983 -860 883 1071 449 475 981 1790 1896 1074 -655 -2904 -3943 -3737 -2855 -2968
$$ packed form
2069C225l029j973k11J01p19j133m28P01K319K683J560n32l09J078N06j643k348
2086a52j022M3m27m59n21L13J258J608J205j032j348L02O18J41j793q48O87J017
2104d10J109J004j15p15Q93O53n36k850j868J84P22K64j77Q51N68J578J926P36
2122C817k64j482m25p96j884j966l26M83N12j90L30P24J998K064R73n66k242o58
2140A02Q95J026j189j255m73M44R41O44O53j033r97p34p16q24j154R44J056j50
2158a820L16J710J826J518P78l15j216j640k67j82j375k067j079J163J259Q30
2174e61Q33O48p7M50N12j000r31j416k18K55M8r3J004Q53O69K11N99j29l27k27
2194A103r87j374p25J123J743J88o22K6N06Q09J06q22j729k249j039K06Q82j13
$$ plain form
2212 -2968 -2549 -1414 284 1676 2648 4026 4589 3570 2456 1586 502 -673 -368 -718 -1826 -2477 -1638
2229 -1638 37 351 -268 -1318 -1800 -1870 -1581 -1122 -1403 -2129 -1382 861 2542 3101 3364 3155 2689 1884 1304
2248 1304 839 -396 -1889 -2924 -2726 -2114 -1063 455 1016 349 -368 130 1020 723 -525 -2362 -3422
2265 -3422 -3340 -1483 636 1224 665 865 2522 3030 3563 2952 2247 436 -1092 -1321 -1109 -617 -739 -600
2283 -600 -917 -1160 -1200 -6 294 -1352 -2890 -3307 -2572 -1309 -653 491 973 1434 2915 4835 4937 3649
2301 3649 2285 1325 410 -973 -1622 -2508 -3202 -3562 -2452 -979 -464 12 -34 -391 -1056 -879 -125 -194 -1064
2320 -1064 -1224 -487 1112 2833 3989 3755 2726 1190 1456 1982 1031 -814 -2824 -3442 -3041 -2422 -838
2337 -838 -280 -885 -982 -468 55 80 -42 -566 -1443 -2562 -1584 393 2308 2766 2687 2299 2293 3180 3479 3001 262
$$ packed form
2212b968M19J135J698J392R72J378N63j019j114q70j084j175L05l50j108o51Q39
2229a638J675L14o19j050m82p0K89M59k81p26P47K243J681N59K63k09m66q05n80
2248A304m65j235j493j035J98O12J051J518N61o67p17M98Q90k97j248j837j060
2265c422Q2J857K119N88n59K00J657N08N33o11p05j811j528k29K12M92j22J39
2283f00l17k43m0J194L00j646j538m17P35J263O56J144M82M61J481J920J02j288
2301C649j364r60r15j383o49q86o94l60J110J473N15M76m6l57o65J77P54o9q70
2320a064j60P37J599J721J156k34j029j536K66N26r51j845k010o18M01O19J584
2337h38N58o05r7N14N23K5j22n24q77j119R78J977J915M58p9l88oQ87K99m78k739
$$ plain form
2358 262 -2357 -3168 -2469 -1716 -2242 -2410 -2434 -1889 -722 625 784 -182 -715 -1045 -757 -883 211 1171 1298
2377 1298 941 1822 3193 4219 4067 2313 732 -1149 -1748 -985 -1134 -2845 -4551 -4105 -2275 -424 476
2394 476 481 -176 -1166 -553 769 1042 206 92 297 962 1963 3061 4184 3708 2499 1182 436 -187 -450
2413 -450 -1709 -3539 -5035 -4873 -2657 -615 -325 -1008 -566 115 1348 2163 1701 579 -831 -370 1260
2430 1260 1772 1680 1833 2210 2145 2008 1911 1137 -3 -1761 -2900 -3451 -3294 -2325 -1718 -1227 -2061 -1127 740
2449 740 2739 2114 785 -725 -1204 -226 1413 2168 507 -602 403 2761 3858 3706 2555 798
2465 798 -1306 -1888 -1728 -1591 -2760 -3767 -3695 -3846 -2614 -65 1712 1854 269 -404 517 1871 2827 2256
2483 2256 629 -545 302 2903 3798 3260 956 -331 -389 -1039 -1275 -2296 -3624 -4719 -4391 -2697 -1130
$$ packed form
2358B62k619q11O99P53n26j68k4N45J167J347J59r66n33l30K88j26J094R60J27
2377A298l57Q81J371J026j52j754j581j881n99P63j49j711j706M46J830J851R00
2394D76No57r90O13J322K73q36j14K05O65J001J098J123m76j209j317p46o23k63
2413d50j259j830j496J62K216K042K90o83M42O81J233Q15m62j122j410M61J630
2430A260N12r2J53L77o5j37r7p74j140j758j139n51J57R69O07M91q34R34J867
2449G40J999o25j329j510m79R78J639P55j661j109J005K358J097j52j151j757
2465G98k104n82J60J37j169j007P2j51J232K549J777J42j585o73R21J354R56n71
2483B256j627j174Q47K601Q95n38k304j287n8o50k36j021j328j095L28J694J567
$$ plain form
2500 -1130 -161 795 1657 1482 1748 2616 3363 2323 415 -648 -1015 -248 817 1677 977 -925 -1045 1061
2518 1061 2216 1226 -1092 -2768 -3153 -2079 -1101 -738 -1335 -2069 -1213 638 1703 1851 1728 559 -201
2535 -201 -719 60 1166 1373 687 504 452 1080 2595 3271 1704 -1143 -2732 -2702 -2004 -1761 -2627 -3980 -4083
2554 -4083 -2029 555 2623 2358 1360 1462 2455 2626 2217 1873 635 -720 -757 -55 547 779 376 -334
2572 -334 -1642 -2041 -1599 -351 -938 -3019 -3757 -2438 -51 1936 2716 1810 335 594 2461 3668 2246
2589 2246 -618 -2236 -2408 -1358 -700 312 128 -699 -654 751 1330 1528 1486 302 -1312 -2847 -2333 -510
2607 -510 261 -523 -1467 -1420 -114 1847 3337 2132 -272 -1457 -327 1241 1314 518 -295 -464 267 1589
2625 1589 1872 853 -477 -1695 -1778 -1894 -2250 -1939 -1645 -2180 -1806 59 1986 3161 3184 2144 1261 507
$$ packed form
2500a130R69R56Q62j75K66Q68P47j040j908j063l67P67J065Q60p00j902j20K106
2518A061J155r90k318j676l85J074R78L63n97p34Q56J851J065J48j23j169p60
2535b01n18P79J106K07o86j83n2O28J515O76j567k847j589L0O98K43q66j353j03
2554d083K054K584K068k65r98J02R93J71m09l44j238j355l7P02O02K32m03p10
2572c34j308l99M42J248n87k081p38J319K387J987P80r06j475K59J867J207j422
2589B246k864j618j72J050O58J012j84q27M5J405N79J98m2j184j614j535N14J823
2607e10P71p84r44M7J306J961J490j205k404j185J130J568P3p96q13j69P31J322
2625A589K83j019j330j218q3j16l56L11K94n35L74J865J927J175K3j040q83p54
$$ plain form
2643 507 1233 1840 860 -1987 -3491 -2540 -251 932 496 -189 -1290 -502 482 1674 848 -902 -1491 -1142
2661 -1142 -645 641 1815 1440 677 -127 177 784 750 476 -966 -2316 -3332 -2070 697 1782 788
2678 788 -21 54 1439 2811 2954 1189 -1662 -2637 -1769 -401 -567 -1223 -1735 -1189 -105 1014 1931 1754
2696 1754 480 -128 -411 -462 -136 391 555 -747 -1616 -480 1444 2438 1540 -430 -1632 -1457 -606 819
2714 819 291 -1686 -2770 -1149 1320 2399 2115 874 -173 -482 -35 538 -221 -1552 -2412 -2030 -1398
2731 -1398 -22 1282 2415 1581 508 201 1137 1811 1670 -49 -1858 -2860 -1781 539 1079 -315
2747 -315 -1670 -1141 349 1281 648 -42 -1424 -1873 -469 667 1056 849 684 1593 1519 1750 2125 1655 245
2766 245 -1488 -2121 -1840 -1295 -824 -949 -1437 -2065 -780 1570 2507 1162 -762 -1268 -831 303 1264 749
$$ packed form
2643E07P26O07r80k847j504R51K289J183m36o85j101P88R84J192q26j750n89L49
2661a142M97J286J174l75p63q04L04O07l4k74j442j350j016J262K767J085r94
2678G88q09P5J385J372J43j765k851r75Q68J368j66o56n12N46J084J119R17j77
2696A754j274o08k83n1L26N27J64j302q69J136J924R94q98j970j202J75Q51J425
2714H19n28j977j084J621K469J079k84j241j047l09M47N73p59j331q60L82O32
2731a398J376J304J133q34j073l07R36O74j41j719j809j002J079K320N40j394
2747c15j355N29J490R32o33o90j382m49J404J136L89k07j65R09p4K31L75m70j410
2766B45j733o33K81N45M71j25m88o28J285K350R37j345j924n06M37J134R61n15
$$ plain form
2784 749 -965 -1363 100 2232 2644 2167 1113 296 -261 -598 -23 101 -1087 -2097 -2467 -1762 -769 723
2802 723 1444 711 -1312 -1363 355 1330 902 -374 -1110 -922 744 2617 3191 2076 556 868 1380 1185
2820 1185 687 -940 -1841 -2873 -2738 -1929 -1202 -739 -855 -696 -684 53 1237 1935 726 -348 -840 149
2838 149 1620 2177 2052 1013 331 901 2488 2653 357 -1743 -2661 -2475 -1908 -1579 -1917 -2132 -2322 -1458
2856 -1458 216 1264 1208 803 762 168 214 1139 2117 1873 1108 411 853 1586 2783 2410 573 -1492 -2251
2875 -2251 -1643 -891 -2110 -3380 -3737 -2928 -1688 98 896 755 106 958 1875 2001 1522 1270 911 681
2893 681 713 1484 2267 1806 1051 -13 -576 -797 -120 -449 -1857 -3805 -4127 -2791 -1199 -378 -741 -1167 -717
2912 -717 719 2498 3084 1937 720 502 1127 1672 1972 2041 1479 777 378 761 1005 40 -1231 -2467
$$ packed form
2784G49j714l98J463K132M12m77j054q17n57l37N75J24j188j010l70P05R93J492
2802G23P21p33k023n1J718R75m28j276p36J88J666J873N74j115j520L12N12j95
2820A185m98j627r01j032J35Q09P27M63j16J59J2P37J184O98j209j074m92R89
2838A49J471N57j25j039o82N70J587J65k296k100r18J86N67L29l38k15j90Q64
2856a458J674J048n6m05m1n94M6R25R78k44p65o97M42P33J197l73j837k065p59
2875b251O08P52j219j270l57Q09J240J786P98j41o49Q52R17J26m79k52l59k30
2893F81L2P71P83m61p55j064n63k21O77l29j408j948l22J336J592Q21l63m26M50
2912g17J436J779N86j147j217k18O25N45L00O9n62p02l99L83K44r65j271j236
$$ plain form
2930 -2467 -3783 -4252 -2941 -1661 -1467 -2308 -2200 -773 1158 2776 3154 2638 1644 1653 2448 2937 2163 1142
2948 1142 393 324 693 535 397 -617 -1943 -2686 -2773 -2805 -2983 -2829 -2524 -2393 -1879 -214 1962 2672 2396
2967 2396 1621 2229 2542 2853 2707 1693 0 -743 493 1320 789 -43 -1393 -1379 -1290 -979 -1033 -2273 -3176
2986 -3176 -3505 -2538 -1758 -963 362 879 674 995 2425 3378 3210 2959 1504 869 660 1113 1875 1181 -573
3005 -573 -1611 -983 -452 -1227 -1793 -2646 -4001 -3574 -2733 -1942 -1326 -1166 -408 1302 2493 3295 3925 4210 3501
3024 3501 2467 2459 1920 1223 593 -173 -1529 -2215 -1501 -819 -1210 -2358 -3404 -3108 -2108 -1606 -1247 -1551 -1645
3043 -1645 -893 911 2795 3111 2818 2689 2980 2335 2247 2234 1385 -64 -778 -1145 -1138 -991 -859 -838 -1705 -2454
3063 -2454 -2347 -1231 -1092 -1859 -2228 -2366 -1773 -406 1508 1987 1687 1854 3056 3812 3822 2808 2134 1294
$$ packed form
2930b467j316m69J311J280J94q41J08J427J931J618L78n16r94RP95M89p74j021
2948A142p49o9L69j58j38j014j326p43q7l2j78J54L05J31N14J665K176P10k76
2967B396p75O08L13L11j46j014j693p43J236Q27n31q32j350J4Q9L11n4j240r03
2986c176l29R67P80P95J325N17k05L21J430R53j68k51j455o35k09M53P62o94j754
3005e73j038O28N31p75n66q53j355M27Q41P91O16J60P58J710J191Q02O30K85p09
3024C501j034qn39o97o30p66j356o86P14O82l91j148j046K96J000N02L59l04r4
3043a645P52J804J884L16k93j29K91o45q8j3q49j449p14l67PJ47J32K1q67p49
3063b454J07J116J39p67l69j38N93J367J914M79l00J67J202P56J0j014o74q40
$$ plain form
3081 1294 277 65 -256 -1046 -1873 -2218 -2092 -2383 -2785 -2073 -2230 -2835 -3136 -2225 -834 73 916 1377 1821
3100 1821 2797 3795 4646 4388 2977 1645 1181 658 155 -1154 -2106 -2964 -3216 -2726 -1855 -1649 -2018 -1888 -1695
3119 -1695 -1405 -1220 42 668 389 485 1073 2199 2995 3403 3136 2545 1194 1251 1560 1047 -487 -1957 -2295
3138 -2295 -2030 -2057 -1721 -1352 -1803 -2172 -1492 -1012 -652 -866 -773 -355 -12 333 1432 2534 2803 2509 2922 3013
3158 3013 2701 2381 1812 191 -1344 -1779 -1901 -1698 -2515 -2976 -2902 -2850 -1886 -1153 -668 -1099 -1156 32 854 1496
3178 1496 1918 2082 2378 2406 2819 3166 2677 2264 1167 257 -1108 -2125 -2168 -1971 -2789 -3677 -3067 -2205 -1408
3197 -1408 -943 -403 -301 -268 597 1188 1330 1178 1242 1504 2181 2069 2204 2515 1823 1108 845 243 -469 -1119
3217 -1119 -1869 -2205 -2913 -2858 -2176 -1635 -1396 -1450 -1042 -202 189 517 1039 884 496 1302 2172 2817 2423 1732
$$ packed form
3081A294j017k12l21p90q27l45J26k91m02P12j57o05l01R11J391R07Q43M61M44
3100A821R76R98Q51k58j411j332m64n23n03j309r52q58k52M90Q71K06l69J30J93
3119a695K90J85J262O26k79R6N88J126P96M08k67n91j351N7L09n13j534j470l38
3138b295K65k7L36L69m51l69O80M80L60k14R3M18L43L45J099J102K69k94M13R1
3158C013l12l20n69j621j535m35j22K03q17m61P4N2R64P33M85m31n7J188Q22O42
3178A496M22J64K96K8M13L47m89m13j097r10j365j017m3J97q18q88O10Q62P97
3197a408M65N40J02L3Q65N91J42j52O4K62O77j12J35L11o92p15k63o02p12o50
3217a119p50l36p08N5O82N41K39n4M08Q40L91L28N22j55l88Q06Q70O45l94o91
$$ plain form
3237 1732 1969 1801 1478 1227 389 -614 -1968 -2640 -2864 -2963 -2832 -2752 -2142 -1979 -1621 -140 772 1264 1102
3256 1102 1109 1249 1347 2262 2611 2283 1803 1474 1812 1792 715 116 -680 -1737 -2316 -2480 -2659 -2592 -2891 -2161 -1399
3277 -1399 -963 -442 568 1320 1229 1438 1718 1704 1336 1582 1540 1149 1040 1491 1439 1080 17 -580 -344 -853
3297 -853 -1839 -2261 -2576 -3003 -2654 -1551 -1150 -1002 -591 345 1119 1150 1628 1884 1877 1222 1099 1537 1528 1325 1162
3318 1162 1021 453 -353 -161 -193 -1005 -1991 -2723 -2714 -2649 -2246 -1558 -1145 -1028 -228 1154 1493 1242 1554 2035 1968
3339 1968 1523 1576 1333 1114 692 750 665 158 -400 -401 -890 -1516 -2302 -2288 -2029 -1921 -2003 -1787 -1230 -220 815
3360 815 1413 1801 1101 1509 2138 2261 1561 1087 706 435 109 313 226 -469 -777 -502 -791 -1418 -1816 -1464
3380 -1464 -1489 -1708 -1875 -1224 -447 38 860 1133 1178 1234 1685 2064 1453 741 676 410 206 279 165 -17 -458
$$ packed form
3237A732K37j68l23k51q38j003j354o72k24r9J31Q0O10J63L58J481R12M92j62
3256A102PJ40R8R15L49l28m80l29L38k0j077n99p96j057n79j64j79O7k99P30P62
3277a399M36N21J010P52r1K09K80j4l68K46m2l91j09M51n2l59j063n97K36n09
3297h53r86m22l15m27L49J103M01J48M11R36P74L1M78K56po55j23M38rk03j63
3318A162j41n68q06J92l2q12r86p32RO5M03O88M13J17Q00J382L39k51L12M81o7
3339A968m45N3k43k19m22N8q5n07n58jm89o26p86J4K59J08q2K16N57J010J035
3360H15N98L88p00M08O29J23p00m74l81k71l26K04q7o95l08K75k89o27l98L52
3380a464k5k19j67O51P77M85Q22K73M5N6M51L79o11p12o5k66k04P3j14j82m41
$$ plain form
3401 -458 -344 -442 -710 -1177 -1503 -1370 -1273 -1456 -1610 -1007 -280 -130 391 1288 1367 1477 1807 2093 1739 983 883
3422 883 910 454 -109 -438 -446 -536 -473 -758 -1253 -1510 -1694 -1208 -997 -1483 -1359 -258 41 285 900 1417 2034
3443 2034 2271 2040 1847 993 587 450 141 -497 -1215 -1318 -1322 -754 -639 -795 -841 -788 -752 -268 -437 -738 -464
3464 -464 47 709 375 256 987 1226 1102 1082 825 376 273 181 146 -471 -649 -535 -224 -239 -264 -343 -201 -203 -638
3487 -638 -615 -847 -1295 -797 -208 -19 -395 396 1091 1510 1132 1200 1384 1154 585 658 419 -304 -344 -703 -463
3508 -463 -1344 -1293 -897 -865 -465 -864 -795 -659 -374 346 429 374 561 1089 1906 1615 1255 1103 962 605 -61 -591
3530 -591 -1016 -1358 -1259 -827 -973 -1170 -602 -370 382 301 228 35 155 201 440 443 -162 136 521 886 386 -43
3552 -43 189 467 431 200 -40 -210 -304 -163 -162 -186 -376 -135 201 385 -245 -150 -433 -556 -504 -521 -494 -344 -174
$$ packed form
3401d58J14r8k68m67l26J33R7j83j54O03P27J50N21Q97P9J10L30K86l54p56j00
3422H83K7m56n63l29qr0O3k85m95k57j84M86K11m86J24J101K99K44O15N17O17
3443B034K37k31j93q54m06j37l09o38p18j03mN68J15j56m6N3L6M84j69l01K74
3464d64N11O62l34j19P31K39j24k0k57m49j03r2l5o17j78J14L11j5k5p9J42km35
3487f38K3k32m48M98N89J89l76P91O95M19l78O8J84k30n69P3k39p23m0l59K40
3508d63q81N1L96L2M00l99O9J36K85P20Q3n5J87N28Q17k91l60j52j41l57o66n30
3530e91m25l42R9M32j46j97N68K32P52q1p3j93J20M6K39Lo05K98L85L65n00m29
3552d3K32K78l6k31k40j70r4J41Jk4j90K41L36J84o30R5k83j23N2j7K7J50J70
$$ plain form
3575 -174 429 851 901 1162 1377 1548 892 442 -32 -582 -564 -1086 -989 -1241 -1476 -1027 -664 -405 -417 -313 525
3596 525 796 559 563 660 746 774 891 756 254 321 110 194 -375 -907 -906 -974 -1034 -954 -989 -405 -253 359 770 642
3620 642 671 919 961 802 -19 -388 -77 -514 -686 -547 -605 -645 -342 322 430 335 331 376 487 106 -180 47 66
3643 66 -250 140 -133 -355 -571 -207 -115 -515 -549 -677 191 137 208 394 500 760 966 872 621 221 93 -136
3665 -136 -180 -983 -1545 -1253 -876 -672 -562 -353 -52 339 988 1141 752 612 942 883 430 -374 -264 -163 -374
3686 -374 -481 -503 -714 -723 -585 -89 -361 -585 -281 117 475 764 782 1073 1039 824 992 121 -226 -689 -449 -756
3708 -756 -1231 -1379 -753 -277 -230 287 602 458 553 808 1241 692 -13 14 40 -194 -723 -356 -316 -143 -70 -85
3730 -85 82 100 50 282 401 210 282 410 857 268 213 284 178 -108 -117 -384 -557 -846 -361 -532 -640 -405 154
$$ packed form
3575a74O03M22N0K61K15J71o56m50m74n50J8n22R7k52k35M49L63K59j2J04Q38
3596E25K71k37MR7Q6K8J17j35n02O7k11Q4n69n32Jo8o0Q0l5N84J52O12M11j28
3620F42K9K48M2j59q21l69L11m37j72J39n8m0L03O64J08r5mM5J11l81k86K27J9
3643F6l16L90k73k22k16L64R2m00l4j28Q68n4P1J86J06K60K06r4k51m00j28k29
3665a36m4q03n62K92L77K04J10K09L01L91O49J53l89j40L30n9m53q04J10J01k11
3686c74j07k2k11rJ38M96k72k24L04L98L58K89J8K91l4k15J68q71l47m63K40l07
3708g56m75j48O26M76M7N17L15j44R5K55M33n49p05K7K6k34n29L67M0J73P3j5
3730h5J67J8n0K32J19j91P2J28M47n89n5P1j06k86rk67j73k89M85j71j08K35N59
$$ plain form
3753 154 693 753 665 1015 817 390 622 173 -292 -894 -1188 -659 -862 -1227 -777 -554 28 -268 -67 561 468
3774 468 547 830 715 308 372 490 702 492 62 233 -516 -546 -642 -851 -1010 -984 -720 -344 -131 -456 224 653
3796 653 986 793 754 596 434 -100 24 -412 -737 -651 -403 -428 -221 -310 81 123 556 328 292 148 -21 11
3818 11 10 -160 -447 -388 -167 -4 -428 -380 -38 -133 -72 113 202 258 218 720 556 750 509 656 848 123 -386
3841 -386 -676 -516 -931 -1128 -1018 -1295 -620 -97 70 215 361 780 1365 1135 953 448 483 158 134 201 -234
3862 -234 -788 -352 -281 -317 -732 -1043 -569 -512 -420 -411 -152 69 109 725 846 658 33 406 711 131 -266 -421
3884 -421 -368 -502 -205 -522 -154 -350 263 174 476 112 357 415 222 -380 -580 -297 -272 -608 -636 -201 -78 -290
3906 -290 631 588 294 24 438 512 246 311 128 94 222 138 157 -225 -431 -564 -508 -694 -989 -1004 -350 -267 -201
$$ packed form
3753A54N39O0q8L50j98m27K32m49m65o02k94N29k03l65M50K23N82k96K01O28r3
3774D68P9K83j15m07O4J18K12k10m30J71p49l0r6k09j59K6K64L76K13l25O80M29
3796F53L33j93l9j58j62n34J24m36l25Q6K48k5K07q9L91M2M33k28l6j44j69L2
3818A1jj70k87N9K21J63m24M8L42r5O1J85Q9N6m0N02j64J94k41J47J92p25n09
3841c86k90J60m15j97J10k77O75N23J67J45J46M19N85k30j82n05L5l25k4O7m35
3862b34n54M36P1l6m15l11M74N7R2RK59K21M0O16J21j88o25L73L05n80l97j55
3884d21N3j34K97l17L68j96O13q9L02l64K45N8j93o02k00K83K5l36k8M35J23k12
3906b90R21m3k94k70M14P4k66O5j83l4J28q4J9l82k06j33N6j86k95j5O54Q3O6
$$ plain form
3929 -201 363 461 269 909 1022 887 818 703 499 305 -176 -256 -539 -376 -663 -579 -549 -449 -344 -277 201 74
3951 74 34 -84 -123 -2 -239 243 518 187 333 335 662 134 191 72 113 -448 -174 -34 119 21 -280 111 165
3974 165 150 57 249 -41 -743 -345 -86 -567 -384 -225 -117 188 372 317 715 636 590 571 291 263 -105 66
3996 66 208 -355 -551 -301 -355 -179 -114 -338 -429 -286 33 -42 -215 -23 381 616 655 346 616 620 362 424 366
4019 366 35 41 -429 -641 -489 -491 -261 -284 -208 43 168 229 226 45 116 172 -164 -207 173 54 88 145 77 118 59 -55
4045 -55 385 58 -28 -204 -255 -467 -488 -311 -33 -237 -186 22 0 137 -135 -578 153 -479 -139 176 305 149
4067 149 213 419 596 307 265 448 74 -102 -252 -126 -508 -355 -393 151 86 -74 -124 66 55 -165 29 34 -127
4090 -127 86 265 477 35 380 502 576 137 127 139 181 35 -194 -179 -796 -407 -389 110 -133 -96 94 168 122
$$ packed form
3929b01N64R8j92O40J13j35o9j15k04j94m81q0k83J63k87Q4L0J00J05O7M78j27
3951G4m0j18l9J21k37M82K75l31J46KL27n28N7j19M1n61K74J40J53r8l01L91N4
3974A65j5r3J92k90p02L98K59m81J83J59J08L05J84n5L98p9m6j9k80k8l68J71
3996F6J42n63j96K50n4J76O5k24r1J43L19p5j73J92M04K35L9l09K70Mk58O2n8
4019C66l31Om70k12J52kK30k3P6K51J25O1lj81P1N6l36m3L80j19L4N7o8M1n9j14
4045e5M40l27q6j76n1k12k1J77K78k04N1K08k2J37k72m43P31o32L40L15J29j56
4067A49O4K06J77k89m2J83l74j76j50J26l82J53l8N44o5j60n0J90j1k20J94Nj61
4090a27K13J79K12m42L45J22P4m39j0J2M2j46k29J5o17L89J8M99k43L7J90P4m6
$$ plain form
4113 122 -127 -19 252 186 -268 -224 61 -148 2 299 354 214 150 291 -24 2 -329 -187 -110 -315 -160 135
4135 135 -112 -98 154 3 -18 -135 -120 -24 -123 -282 -21 -139 -206 249 263 489 272 235 485 65 -97 50 -19
4158 -19 -243 -175 -354 37 -198 -83 -54 84 -244 -205 122 41 -312 -441 40 39 -4 -118 192 105 287 412 363
4181 363 79 -200 -33 48 -334 -264 -230 77 13 200 98 223 -154 -91 110 -39 -540 -448 -65 188 -23 -30 -265
4204 -265 233 232 133 484 248 -82 340 327 187 -171 80 -21 -194 -59 -140 -123 -69 -541 -158 -367 -163 -89 -39
4227 -39 -268 -131 32 422 525 227 187 382 215 190 319 293 -188 -81 -229 -49 -435 -278 -153 -80 -247 -374
4249 -374 47 55 -167 -383 265 -59 -172 -139 211 211 -10 478 148 214 24 218 226 -216 -348 -17 -69 -319 -296
4272 -296 -191 -67 -193 136 -209 -335 -359 -272 -291 -191 -173 246 95 317 115 602 782 488 257 407 381 -58
$$ packed form
4113A22k49J08K71o6m54M4K85k09J50K97N5j40o4J41l15K6l31J42P7k05J55K95
4135A35k47J4K52j51k1j17J5R6r9j59K61j18o7M55J4K26k17l7K50m20j62J47o9
4158a9k24O8j79L91k35J15K9J38l28L9L27q1l53j29M81jm3j14L10q7J82J25m9
4181C63k84k79J67Q1l82P0L4L07o4J87j02J25l77O3K01j49n01R2L83K53k11pk35
4204b65M98jr9L51k36l30M22j3j40l58K51j01j73J35q1J7N4m72L83k09K04P4N0
4227c9k29J37J63L90J03k98m0J95j67k5J29k6m81J07j48J80l86J57J25P3j67j27
4249c74M21Qk22k16O48l24j13L3L50%k21M88l30O6j90J94Qm42j32L31n2k50K3
4272b96J05J24j26L29l45j26k4Q7j9J00J8M19j51K22k02M87J80k94k31J50k6m39
$$ plain form
4294 -58 6 -77 -90 -269 -391 -229 0 -148 -192 6 -76 -247 -298 -193 -182 -69 382 376 154 98 560 356 56 433
4318 433 378 161 -127 -8 0 -172 -198 -409 21 -306 -289 -189 -149 -103 -117 -3 -199 -126 -47 191 134 288 242 383
4342 383 446 441 195 341 206 -16 44 -269 -225 -576 -268 -49 -488 -324 -323 53 -128 -262 46 210 -70 -285
4364 -285 294 372 516 565 379 640 529 102 183 94 48 -344 -208 -333 -556 -374 -530 -394 -323 -332 -74 80 -469
4387 -469 -123 283 157 223 58 388 553 722 611 620 117 255 187 244 -85 -174 -381 -493 -562 -382 -667 -463
4409 -463 -261 -237 -285 -442 -205 66 357 -44 147 384 527 289 682 641 659 275 144 246 75 -178 -333
4430 -333 -246 -666 -777 -544 -553 -509 -259 -162 104 158 68 300 814 262 330 365 534 352 498 688 299 -63 -29
4453 -29 62 280 -291 -416 -335 -458 -477 -717 -74 -434 -392 -7 241 100 -81 126 124 221 249 689 552 425 398
$$ packed form
4294e8O4q3j3j79j22J62K29j48m4J98q2j71n1J05J1J13M51ok22n6M62k04l00L77
4318D33n5k17k88J19Qj72k6k11M30l27J7J00M0M6j4J14j96P3P9K38n7J54m6J41
4342C83O3nk46J46j35k22O0l13M4l51L08K19m39J64JL76j81j34L08J64k80k15
4364b85N79P8J44M9j86K61j11m27Q1q9m6l92J36j25k23J82j56J36P1rK58J54n49
4387d69L46M06j26O6j65L30J65J69j11Rn03J38o8N7l29q9k07j12o9J80k85K04
4409d63K02K4m8j57K37K71K91m01J91K37J43k38L93m1J8l84j31J02j71k53j55
4430c33Q7m20j11K33rM4K50R7K66N4r0K32N14n52O8L5J69j82J46J90l89l62L4
4453b9R1K18n71j25Q1j23j9k40O43l60M2L85K48j41j81K07kR7K8M40j37j27k7
$$ plain form
4476 398 723 739 501 89 -117 -170 -339 -701 -332 -785 -986 -828 -470 -303 -542 -252 162 33 93 394 566
4497 566 328 574 653 653 651 373 486 -14 230 161 -126 -346 -621 -445 -208 -813 -753 -453 -373 -428 -303 -95 274
4520 274 304 233 634 543 286 384 471 366 -78 146 394 128 24 -18 30 -144 -394 -359 -274 -376 -632 -355 -265
4543 -265 -327 -230 -82 39 270 293 271 465 279 562 781 340 364 414 512 169 173 69 -103 -341 -500 -458 -763
4566 -763 -614 -728 -664 -383 -481 -337 106 355 425 429 714 558 528 525 750 746 308 79 468 -355 -379 -290 -219 -678
4590 -678 -884 -565 -757 -642 -559 -290 -433 -253 75 266 682 437 328 554 315 811 153 190 126 104 193 -84
4612 -84 104 -224 -334 63 -378 -471 -582 -428 -534 -546 -429 -439 -317 -184 -48 339 223 280 325 496 633 183
4634 183 403 277 657 240 319 -38 -278 -55 -273 -474 -959 -854 -619 -822 -469 -227 -260 -196 292 532 355
$$ packed form
4476C98L25J6k38m12k06n3j69l62L69m53k01J58L58J67k39K90M14j29O0L01J72
4497E66k38K46P9%kk78J13n00K44o9k87k20k75J76K37o05O0L00Q0n5J25K08L69
4520B74L0p1M01r1k57R8Q7j05m44K24K48k66j04m2M8j74k50L5Q5j02k56K77R0
4543b65o2R7J48J21K31K3k2J94j86K83K19m41K4N0R8l43Mj04j72k38j59M2l05
4566g63J49j14O4K81r8J44M43K49P0MK85j56l0lK25mm38k29L89q23k4Q9P1m59
4590f78k06L19j92J15Q3K69j43J80L28J91M16k45j09K26k39M96o58L7o4k2Q9k77
4612h4J88l28j10L97m41r3j11J54j06j2J17j0J22J33J36L87j16N7M5J71J37m50
4634A83K20j26L80m17P9l57k40K23k18k01m85J05K35k03L53K42l3O4M88K40j77
$$ plain form
4655 355 611 918 770 865 581 426 314 390 278 79 -212 -398 -405 -316 -263 -498 -538 -434 -427 -580 -520 -386 119
4678 119 53 396 431 256 325 346 522 280 299 428 388 244 -253 33 50 -61 -314 -177 -85 -541 -311 -613 -308
4701 -308 -375 -817 -468 128 -130 19 298 111 293 596 549 682 426 514 600 588 340 -136 -225 -186 -83 -342
4723 -342 -427 -685 -767 -454 -723 -800 -272 -81 -131 204 476 589 993 788 867 628 746 401 409 368 -307 -448 -845
4746 -845 -594 -692 -490 -494 -672 -776 -343 -123 -367 15 -79 86 231 255 309 270 532 165 360 313 323 139 462
4769 462 249 -218 -266 -113 110 -97 -582 -197 -315 -506 -456 -207 -339 -445 -475 -150 121 -31 61 430 524 536
4791 536 859 741 733 508 425 210 43 -196 -191 -547 -704 -699 -492 -534 -335 -442 -433 -186 -126 184 83 373 193 628
4815 628 888 863 620 767 518 18 -108 57 -92 -354 -471 -378 -309 -448 -666 -457 -433 -248 -72 -151 281 220
$$ packed form
4655C55K56L07j48R5k84j55j12P6j12j99k91j86pQ9N3k35m0J04Pj53O0J34N05
4678A19o6L43L5j75O9K1J76k42J9J29m0j44m97K86J7j11k53J37R2m56K30l02L05
4701c08o7m42L49N96k58J49K79j87J82L03m7J33k56Q8Q6j2k48m76q9L9J03k59
4723c42q5k58q2L13k69p7N28J91n0L35K72J13M04k05P9k39J18l45Qm1o75j41l97
4746h45K51r8K02mj78j04M33K20k44L82r4J65J45K4N4l9K62l67J95m7J0j84L23
4769D62k13m67m8J53K23k07m85L85j18j91N0K49j32j06l0L25K71j52R2L69R4J2
4791E36L23j18qk25q3k15j67k39Nl56j57NK07m2J99j07RK47O0L10j01K90j80M35
4815F28K60k5k43J47k49n00j26J65j49k62j17R3O9j39k18K09K4J85J76p9M32o1
$$ plain form
4837 220 121 84 271 -118 241 176 446 165 455 616 583 273 -11 -45 -234 -233 -219 -264 -384 -556 -301 -236 -325 -219
4861 -219 -339 106 40 -116 135 129 409 588 642 334 595 366 669 263 68 -1 -80 -409 -145 -291 -550 -626
4883 -626 -472 -607 -291 -397 -73 -32 -76 -49 234 509 88 496 467 336 544 345 635 133 12 -115 20
4904 20 -191 -232 -341 -448 -438 -269 -234 -251 -360 -330 75 200 49 -154 264 129 -61 460 391 306 188 79 125
4927 125 158 247 -62 161 -45 -389 -416 -274 -484 -100 -394 -406 -321 -201 -337 158 -14 -161 105 427 285 442
4949 442 428 598 57 521 337 232 -27 35 -65 -418 -428 -270 -327 -669 -447 -493 -165 -137 -69 -99 117 23 33
4972 33 264 400 369 77 112 210 108 183 273 -2 -155 -214 -247 7 -191 -192 -301 -103 -107 -286 -116 47 -162 122
4996 122 -105 26 -19 395 436 284 45 76 174 84 84 259 98 59 341 -249 -235 -296 -554 -289 -73 -363 -284 -246
$$ packed form
4837B20r9l7J87l89L59o5K70k81K90J61l3l10k84l4j89JJ4m5j20j72K55O5q9J06
4861b19j20M45o6j56K51oK80J79N4l08K61k29L03m06j95o9p9l29K64j46k59p6
4883f26J54j35L16j06L24M1m4K7K83K75m21M08k9j31K08j99K90n02j21j27J35
4904B0k11m1j09j07J0J69L5j7j09L0M05J25j51k03M18j35j90N21o9q5j18j09M6
4927A25L3Q9l09K23k06l44k7J42k10L84k94j2Q5J20j36M95j72j47K66L22j42J57
4949D42j4J70n41M64j84j05k59O2j00l53j0J58n7l42K22m6L28K8O8l0K16r4J0
4972C3K31J36l1k92L5R8j02P5R0k75j53n9l3K54j98jj09J98mj79J70J63k09K84
4996A22k27J31m5M14M1j52k39L1R8r0%J75j61l9K82n90J4o1k58K65K16k90P9L8
$$ plain form
5020 -246 -365 -187 -41 106 359 258 481 255 219 322 249 321 -58 11 20 140 -142 -509 -343 -469 -378 -302 58
$$ packed form
5020b46j19J78J46J47K53j01K23k26l6J03p3P2l79O9RJ20k82l67J66j26R1P6L60
$$ [...]
8191h
##END NTUPLES=NMR FID
##END=
