##TITLE=1H_CA-8525-2-3
 CDCl3, 8 sc, 
 11.1.2019
##JCAMPDX= 6.0         $$ Bruker NMR JCAMP-DX V2.0
##DATA TYPE= NMR FID
##DATA CLASS= NTUPLES
##ORIGIN= UXNMR, Bruker Analytische Messtechnik GmbH
##OWNER= root
$$ XWIN-NMR		Version 3.5
$$ Fri Jan 11 14:11:13 2019 Russian Standard Time (UT+4h)  she@DPX200
##.OBSERVE FREQUENCY= 200.1313
##.OBSERVE NUCLEUS= ^1H
##.DELAY= (6, 6)
##.ACQUISITION MODE= SIMULTANEOUS
##.ACQUISITION SCHEME= undefined
##.AVERAGES= 8
##.DIGITISER RES= 18
##SPECTROMETER/DATA SYSTEM= spect
##.PULSE SEQUENCE= zg30
##.SOLVENT NAME= CDCl3
##.SHIFT REFERENCE= (INTERNAL, CDCl3, 0, 15.7039)
##AUDIT TRAIL= $$ (NUMBER, WHEN, WHO, WHERE, WHAT)
$$ ##TITLE= Audit trail, XWIN-NMR		Version 3.5
$$ ##JCAMPDX= 5.01
$$ ##ORIGIN= Bruker BioSpin GmbH
$$ ##OWNER= she
$$ F:/spectra/data/she/nmr/H-F/1/audita.txt
$$ ##AUDIT TRAIL=  $$ (NUMBER, WHEN, WHO, WHERE, WHAT)
(   1,<2019-01-11 14:09:38.25 +0400>,<she>,<DPX200>,
      <created by zg, POWCHK disabled, PULCHK disabled
       configuration hash MD5:
       00 E9 B6 7A A2 85 ED C7 34 08 36 98 17 FE 4E 26
       data hash MD5: 16K
       43 FA 32 B0 6E 11 22 83 91 F3 0F 48 09 EB 48 A2>)
$$ ##END=
$$ 
$$ hash MD5
$$ 79 3E 5E A5 75 39 32 75 52 BA 39 45 CD 76 07 B0
##$RELAX= 
##$RELAX= 
##$RELAX= 
##$RELAX= 
##$RELAX= 
##$RELAX= 
$$ Bruker specific parameters
$$ --------------------------
##$DU= <F:/spectra>
##$EXPNO= 1
##$NAME= <H-F>
##$PROCNO= 1
##$TYPE= <nmr>
##$USER= <she>
##$AMP= (0..31)
100 100 100 100 100 100 100 100 100 100 100 100 100 100 100 100 100 100 
100 100 100 100 100 100 100 100 100 100 100 100 100 100 
##$AQSEQ= 0
##$AQ_mod= 1
##$AUNM= <au_zg>
##$AUTOPOS= <>
##$BF1= 200.13
##$BF2= 200.13
##$BF3= 200.13
##$BF4= 200.13
##$BF5= 200.13
##$BF6= 200.13
##$BF7= 200.13
##$BF8= 200.13
##$BYTORDA= 1
##$CFDGTYP= 0
##$CFRGTYP= 5
##$CHEMSTR= <none>
##$CNST= (0..31)
1 1 145 1 1 1 1 1 1 1 1 1 1 1 1 1 1 1 1 1 1 1 1 1 1 1 1 1 1 1 1 1 
##$CPDPRG= <>
##$CPDPRG1= <>
##$CPDPRG2= <>
##$CPDPRG3= <>
##$CPDPRG4= <mlev>
##$CPDPRG5= <mlev>
##$CPDPRG6= <mlev>
##$CPDPRG7= <mlev>
##$CPDPRG8= <mlev>
##$CPDPRGB= <>
##$CPDPRGT= <>
##$D= (0..31)
0 1.2 0 0 0 0 0 0 0 0 0 0.03 0 0 0 0 0 0 0 0 0 0 0 0 0 0 0 0 0 0 0 0 
##$DATE= 1547201377
##$DBL= (0..7)
120 120 120 120 120 120 120 120 
##$DBP= (0..7)
150 150 150 150 150 150 150 150 
##$DBP07= 0
##$DBPNAM0= <>
##$DBPNAM1= <>
##$DBPNAM2= <>
##$DBPNAM3= <>
##$DBPNAM4= <>
##$DBPNAM5= <>
##$DBPNAM6= <>
##$DBPNAM7= <>
##$DBPOAL= (0..7)
0.5 0.5 0.5 0.5 0.5 0.5 0.5 0.5 
##$DBPOFFS= (0..7)
0 0 0 0 0 0 0 0 
##$DE= 6
##$DECBNUC= <off>
##$DECIM= 24
##$DECNUC= <off>
##$DECSTAT= 4
##$DIGMOD= 1
##$DIGTYP= 9
##$DL= (0..7)
0 120 120 120 120 120 120 120 
##$DP= (0..7)
150 150 150 150 150 150 150 150 
##$DP07= 0
##$DPNAME0= <>
##$DPNAME1= <>
##$DPNAME2= <>
##$DPNAME3= <>
##$DPNAME4= <>
##$DPNAME5= <>
##$DPNAME6= <>
##$DPNAME7= <>
##$DPOAL= (0..7)
0.5 0.5 0.5 0.5 0.5 0.5 0.5 0.5 
##$DPOFFS= (0..7)
0 0 0 0 0 0 0 0 
##$DQDMODE= 0
##$DR= 18
##$DS= 0
##$DSLIST= <SSSSSSSSSSSSSSS>
##$DSPFIRM= 0
$$ [...]
##$SUBNAM2= <"">
##$SUBNAM3= <"">
##$SUBNAM4= <"">
##$SUBNAM5= <"">
##$SUBNAM6= <"">
##$SUBNAM7= <"">
##$SUBNAM8= <"">
##$SUBNAM9= <"">
##$SW= 24.933730806125
##$SWIBOX= (0..15)
0 0 2 0 0 0 0 0 0 0 0 0 0 0 0 0 
##$SW_h= 4990.01996007984
##$TD= 16384
##$TD0= 1
##$TE= 0
##$TE2= 300
##$TE3= 300
##$TEG= 300
##$TL= (0..7)
0 120 120 120 120 120 120 120 
##$TP= (0..7)
150 150 150 150 150 150 150 150 
##$TP07= 0
##$TPNAME0= <>
##$TPNAME1= <>
##$TPNAME2= <>
##$TPNAME3= <>
##$TPNAME4= <>
##$TPNAME5= <>
##$TPNAME6= <>
##$TPNAME7= <>
##$TPOAL= (0..7)
0.5 0.5 0.5 0.5 0.5 0.5 0.5 0.5 
##$TPOFFS= (0..7)
0 0 0 0 0 0 0 0 
##$TUNHIN= 0
##$TUNHOUT= 0
##$TUNXOUT= 0
##$USERA1= <user>
##$USERA2= <user>
##$USERA3= <user>
##$USERA4= <user>
##$USERA5= <user>
##$V9= 5
##$VALIST= <valist>
##$VCLIST= <CCCCCCCCCCCCCCC>
##$VD= 0
##$VDLIST= <DDDDDDDDDDDDDDD>
##$VPLIST= <PPPPPPPPPPPPPPP>
##$VTLIST= <TTTTTTTTTTTTTTT>
##$WBST= 1024
##$WBSW= 4
##$XGAIN= (0..3)
0 0 0 0 
##$XL= 0
##$YL= 0
##$YMAX_a= 210567
##$YMIN_a= -210004
##$ZGOPTNS= <>
##$ZL1= 120
##$ZL2= 120
##$ZL3= 120
##$ZL4= 120
##$ABSF1= 10
##$ABSF2= 0
##$ABSG= 5
##$ABSL= 3
##$ALPHA= 0
##$AQORDER= 0
##$ASSFAC= 0
##$ASSFACI= 0
##$ASSFACX= 0
##$ASSWID= 0
##$AUNMP= <proc_1d>
##$AZFE= 0.1
##$AZFW= 0.1
##$BCFW= 1
##$BC_mod= 2
##$BYTORDP= 1
##$COROFFS= 0
##$CY= 11.3945322036743
##$DATMOD= 1
##$DC= 2
##$DFILT= <>
##$DTYPP= 0
##$F1P= 18.9103706918063
##$F2P= -1.10871071338519
##$FCOR= 0.5
##$FTSIZE= 0
##$FT_mod= 4
##$GAMMA= 1
##$GB= 0.15
##$INTBC= 1
##$INTSCL= 1
##$ISEN= 128
##$LB= 0.24
##$LEV0= 0
##$LPBIN= 0
##$MAXI= 10000
##$MC2= 0
##$MEAN= 0
##$ME_mod= 0
##$MI= 1.114404
##$NCOEF= 0
##$NC_proc= 0
##$NLEV= 6
##$NOISF1= 3.799351
##$NOISF2= 2.8
##$NSP= 1
##$NTH_PI= 0
##$NZP= 0
##$OFFSET= 15.70392
##$PC= 1
##$PHC0= -8853.563
##$PHC1= 15.80006
##$PH_mod= 1
##$PKNL= yes
##$PPARMOD= 0
##$PSCAL= 0
##$PSIGN= 0
##$REVERSE= no
##$SF= 200.130013532006
##$SI= 16384
##$SIGF1= 3
##$SIGF2= 2
##$SINO= 400
##$SIOLD= 16384
##$SREGLST= <1H.CDCl3>
##$SSB= 0
##$STSI= 0
##$STSR= 0
##$SW_p= 3612.71676300578
##$SYMM= 0
##$S_DEV= 0
##$TDeff= 0
##$TDoff= 0
##$TI= <>
##$TILT= no
##$TM1= 0
##$TM2= 0
##$TOPLEV= 0
##$USERP1= <user>
##$USERP2= <user>
##$USERP3= <user>
##$USERP4= <user>
##$USERP5= <user>
##$WDW= 1
##$XDIM= 8192
##$YMAX_p= 0
##$YMIN_p= 0
$$ End of Bruker specific parameters
$$ ---------------------------------
##NTUPLES= NMR FID
##VAR_NAME=  TIME,          FID/REAL,        FID/IMAG
##SYMBOL=    X,             R,               I
##VAR_TYPE=  INDEPENDENT,   DEPENDENT,       DEPENDENT
##VAR_FORM=  AFFN,          ASDF,            ASDF
##VAR_DIM=   8192,          8192,            8192
##UNITS=     SECONDS,       ARBITRARY UNITS, ARBITRARY UNITS
##FACTOR=    0.0002004,     1,               1
##FIRST=     0,             0,               0
##LAST=      1.6414764,     0,               0
##MIN=       0,             -210004,         0
##MAX=       1.6414764,     210567,          0
$$ Real data points
##PAGE= N=1
##DATA TABLE= (X++(R..R)), XYDATA
0@%%%%%%Qj6J6j6K4l2M0m8N6p2Q8j04J20j38J62j92K23k57K96l40L88m41N00n68
$$ 0 0 0 0 0 0 0 8 -8 8 -8 16 -16 24 -24 32 -40 48 -56 64 -74 88 -104 119 -138 158 -182 206 -235 265 -303
30c03O41p20Q10r06J013j129J255j396J550j719J906k109K334k586K866l177L527
$$ -303 338 -382 428 -478 535 -594 661 -735 815 -904 1002 -1107 1227 -1359 1507 -1670 1857
47A857l924M377m902N517o249P138q243R667j1576J4286j8484K5924m3122J57726
$$ 1857 -2067 2310 -2592 2925 -3324 3814 -4429 5238 -6338 7948 -10536 15388 -27734 129992
61A29992Q0575j80879k17p544j3602m1513R813k1324j1366L7993Q8231O067p1766
$$ 129992 210567 29688 29471 21927 8325 -33188 -23375 -44699 -56065 -18072 70159 76226 4460
74D460p4792k5044k1357K953L4449K2964l0190Q527R7726J06806R036m4737l1628
$$ 4460 -70332 -95376 -116733 -113780 -79331 -56367 -86557 -78030 19696 126502 135538 90801 59173
87E9173l0336m8637j0965K6635j0480n6265j569P9908O9672N305j1736j5831m9285
$$ 59173 28837 -19800 -30765 -4130 -14610 -70875 -72444 7464 77136 82441 70705 54874 5589
100E589m7690J4127L1544l1962n4119J9123P1561M4694J9320K4782j3356p3809
$$ 5589 -42101 -27974 3570 -28392 -82511 -63388 8173 52867 72187 96969 83613 9804
112I804n2403K0004Q479o3865n7763K2723N3591L1116L9888N4683N221n0016k0965
$$ 9804 -42599 -22595 -14116 -77981 -135744 -113021 -59430 -28314 11574 66257 71478 21462 497
125D97K8748N290m1285k8696N427J3479L3095O7873M1051l9391n7449l009P163
$$ 497 29245 34535 -6750 -35446 -30019 -16540 16555 84428 125479 86088 28639 25630 32793
138C2793m5897n8438j6810q713k0005K7376Q9807N9149k0172k5306J9041J2261
$$ 32793 -13104 -71542 -88352 -97065 -117070 -89694 113 59262 39090 13784 32825 45086
150D5086k6418k3571j2709l6439k9204M5327Q4115K8639k4424l316J4391j9480
$$ 45086 18668 -4903 -17612 -54051 -83255 -37928 46187 74826 50402 47086 61477 41997
162D1997l3446o002j6345o2614l9481M8819P7208K5019l630J3237P215j8391n242
$$ 41997 8551 2549 -13796 -76410 -115891 -67072 10136 35155 31525 44762 51977 33586 28344
175B8344R378l4773p6811l0907M2813M7921J7627J8748J9826j1836j6301K2395
$$ 28344 37722 2949 -73862 -104769 -61956 -14035 3592 22340 42166 30330 14029 36424
187C6424J6947n1180p5622j6055L1362K3003K4207M4819K1693k4235n074M4527
$$ 36424 53371 2191 -73431 -89486 -58124 -35121 -10914 33905 55598 31363 26289 70816
199G0816J8131n8855p0387j8795O267M545K8445M2258K633k5629J4668M6982J375
$$ 70816 88947 30092 -40295 -59090 -52823 -48278 -19833 22425 25058 -571 14097 61079 62454
212F2454n2083m3810k0906k3844l015M8619M7085j0584j8949L6428N1862q55l5961
$$ 62454 10371 -33439 -54345 -78189 -81204 -32585 14500 3916 -15033 21395 73257 72402 36441
225C6441k6645l0178l8308N97M6920K4877j8830j497M0591K8157p632q980j3844
$$ 36441 9796 -20382 -58690 -58093 -11173 13704 -5126 -6623 33968 62125 54493 45513 31669
238C1669n1240n4521P483M3614N584k2276J4077M2267K0595N836J5708j0181n8002
$$ 31669 -19571 -74092 -66609 -22995 -17411 -39687 -25610 16657 37252 43088 58796 48615 -9387
251i387m5633J3871K5949q905r577K4171K4848P439K2381L0632j8191o5408l7358
$$ -9387 -55020 -41149 -15200 -24105 -33682 -9511 15337 22776 45157 75789 57598 -7810 -45168
264d5168J0725M191j5243M205K3166P906J0362M5770L8893k3351n3190j8665J882
$$ -45168 -34443 -30252 -45495 -41290 -18124 -10218 144 45914 84807 61456 8266 -10399 -8517
277h517j6616j4470J5047J1627j2192J1925N2803L2325k6719l8782j4622j6057
$$ -8517 -25133 -39603 -24556 -12929 -25121 -13196 39607 71932 45213 6431 -8191 -24248
289b4248k4128J716K0436o599j6833L1036O3574K6386j7646j3645q060l0393k6221
$$ -24248 -48376 -46660 -26224 -32823 -49656 -18620 44954 71340 53694 40049 31989 1596 -24625
302b4625J0491J1603k7834k3159L0387M9074J5023l911m9j9840m0176j1776K2398
$$ -24625 -14134 -2531 -30365 -53524 -23137 25937 40960 37049 37000 17160 -23016 -34792 -12394
315a2394j518l6586j0611L8032L8080J5517J9095J2866k6716l9840L6J8325j8579
$$ -12394 -13912 -50498 -61109 -23077 15003 30520 49615 62481 35765 -4075 -4039 14286 -4293
328d293l9969p837K0650J6051K0602L5551J0034l6078k7585J6042J3664k7760
$$ -4293 -44262 -52099 -31449 -15398 5204 40755 50789 14711 -12874 3168 16832 -10928
340a0928l0589Q7R026P325L2789M5713N575l2524j2706J5373m638l1603k0165
$$ -10928 -41517 -41430 -32404 -25079 7710 53423 58998 26474 13768 29141 24503 -7100 -27265
353b7265p570j6368r88M1801M4386m240k4151N363J5249j1783k1267o582j3098
$$ -27265 -34835 -51203 -52191 -10390 33996 29756 5605 10968 26217 14434 -6833 -13415 -26513
366b6513k6070N730M7274L4576n806o118J3843J505k0082r806l460l1183l7672
$$ -26513 -52583 -46853 421 34997 29191 23073 36916 38421 18339 8533 5073 -26110 -63782
379f3782R080M2844J9696m307R486J5664o317j2375O489l821l7912k8965J7337
$$ -63782 -54702 -11858 7838 3531 13017 28681 22364 9989 16478 12657 -25255 -54220 -36883
392c6883L0089P654P393K3141Q537j6453l013J5080j3098m6082k5294J1515J0612
$$ -36883 -6794 860 8253 31394 39931 23478 20465 35545 22447 -23635 -48929 -37414 -26802
405b6802J538J7210K3933k407j1039J5086J9347j9305l7203j0827N536m313N071
$$ -26802 -25264 -8054 15879 13472 2433 17519 36866 17561 -19642 -30469 -24933 -29246 -24175
418b4175L0750K1023j1386m931K5039J5029k3535k8981j0650j3498j7711R061
$$ -24175 6575 27598 16212 11281 36320 51349 27814 -1167 -11817 -25315 -43026 -33965
430c3965K9032N782j4815Q139L0181Q403j6559r579p099k5467j7657J9837K8166
$$ -33965 -4933 849 -13966 -5827 24354 32757 16198 6619 -480 -25947 -43604 -23767 4399
443D399k830j0240J7951K5414K338o588j104j9782l9842j5924K1905J3828j2926
$$ 4399 1569 -8671 9280 34694 37032 30444 29340 9558 -30284 -46208 -24303 -10475 -23401
456b3401k155K3897J8299L667J0880R715k3099l7483n365J9138J689j1798O249
$$ -23401 -25556 -1659 16640 20307 31187 40902 17803 -19680 -25045 -5907 -4218 -16016 -9767
469i767J5473K985N966K2690M104l6284l5675O37Q377j0817o614J5091J1382J537
$$ -9767 5706 8691 14657 37347 41451 5167 -30508 -29871 -21494 -32311 -38925 -23834 -12452 -10915
483a0915J9885L4675O252k8457j8951M421k224j2551K102Q541p999n699K4958
$$ -10915 8970 43645 49897 21440 2489 6910 4686 -7865 -5763 2778 -5221 -10920 14038
496A4038K8139r302k8475j0049k707j7215j2696R653L920j2543M729L5973K7918
$$ 14038 42177 32875 4400 -5649 -8356 -25571 -38267 -28614 -24694 -37237 -32508 3465 31383
509C1383m061p413L765o815j9807k787J0302r034k0544P069K9167J2248o190J727
$$ 31383 27322 19909 23674 16859 -2948 -5735 4567 -4467 -25011 -17942 11225 23473 17283 19010
523A9010J892j8105j8757M894N797j7864j3960J7138K4614O371O629J6811O85
$$ 19010 20902 2797 -15960 -11066 -5269 -23133 -37093 -19955 4659 11030 17659 34470 35155
536C5155k3268j3959P700m273k6146j3422J1689Q945K108J5846J9166n447j7300
$$ 35155 11887 -2072 5628 1355 -24791 -38213 -26524 -17579 -15471 375 19541 14094 -3206
549c206K432J0879j0790j7889K914J1181j623N009K8184J9726j3077j5852M863
$$ -3206 -774 10105 -685 -18574 -15660 -4479 -6102 -1093 27091 46817 33740 17888 22751
562B2751J850k1601j9975l173o869j3774P474K7596J0978r820M67J2924k176j2757
$$ 22751 24601 3000 -16975 -20148 -27017 -40791 -33317 -5721 5257 -4563 -4096 8828 6652 -6105
576f105M33L262j3634j2045K0045K8618M187p143P515P181j1475j2457J303q104
$$ -6105 -5672 -2410 -16044 -28089 -8044 20574 24761 17618 25133 32314 20839 8382 9685 1581
590A581k7886j2955J8085J7503j66L158J3730L322q651K328Q082j4842k7107m110
$$ 1581 -26305 -39260 -21175 -3672 -3838 -680 13050 16372 7721 10049 18131 3289 -23818 -27928
604b7928J5594N863j648J2071J1356p918p613J2016O246k2582k4315K852J2049
$$ -27928 -12334 -6471 -8119 3952 15308 7390 -223 11793 18039 -4543 -28858 -26006 -13957
617a3957P10M813J9005R572p316L019J6824L94k3050j6248l51m925p353Q956J5010
$$ -13957 -13247 -8434 10571 20143 12827 15846 32670 33064 10014 -6234 -6585 -11510 -18863 -9907 5103
632E103n065j0643J1821J7555p648k0408n004J224j0561m782J6715J4360m976
$$ 5103 38 -10605 1216 18771 11123 -9285 -14289 -13065 -23626 -28408 -11693 2667 -2309
645b309r22J9116J4023p729q988r9r960j8128k76J4287o97j0997O049J9636M074
$$ -2309 -3231 15885 29908 22179 13191 13092 3132 -14996 -15272 -985 -1682 -12679 -6630 13006 17080
660A7080q958K074L476j5640j7993N192J1546o168p564J3218J5396j222k005R081
$$ 17080 8122 10196 13672 -1968 -19961 -14769 -3223 -9391 -16955 -3737 11659 10437 8432 17513
674A7513j595k1152j3223O461J876j0725J285J5879P534j347J0773J5083n908
$$ 17513 15918 -5234 -18457 -11996 -10120 -20845 -19560 -3681 3853 2506 13279 28362 22454
687B2454j9116l945O129q007j2300N749J1395l565l374J4675J2098j1487j5151
$$ 22454 3338 -607 5522 -2485 -14785 -9036 2359 -1206 -4580 10095 22193 10706 -4445
700d445n77p37j1119m856J0259M307n612P407K1534O969j0574l468M318q636j6343
$$ -4445 -5022 -5759 -16878 -21734 -11475 -7168 -12780 -5373 16161 23130 12556 9088 13406 4770 -11573
715a1573J087R585o707j1523R540J9627K185p683K708K641j1630r120P650M383
$$ -11573 -10486 -901 -7608 -19131 -9591 10036 12221 4538 7246 9887 -1743 -10863 -3213 1170
729A170j1652m538J4422J2079k041J315Q250n557j7269l353Q947n787j6798j007
$$ 1170 -10482 -15020 -598 11481 9440 10755 19005 13448 -3821 -7174 1773 -4014 -20812 -21819
743b1819J3969M849j186R831J0513p766j1298O003P506j1073j2435M790Q120j962
$$ -21819 -7850 -3001 -4187 5644 16157 8391 -2907 3096 10602 -471 -12906 -8116 4 -1958
757a958K327J4083M172j3535n866Q471j341j6365p951O214J5n124J0259J7560
$$ -1958 369 14452 18624 5089 -777 7694 6353 -10012 -17963 -11749 -11734 -16858 -6599 10961
771A0961k6j0211M175J0949n037j3485r59L331o765m160J1724J0499n944n071
$$ 10961 10935 724 4899 15848 10811 -2674 -3633 -302 -7067 -11227 497 10996 5052 -19
785a9P645K769j0813p936L851l362j1931K504J7065N628o764M356J3724p11j1245
$$ -19 7626 10395 -418 -8354 -4503 -7865 -19796 -17292 -227 5401 -1363 2993 16717 16006 4761
800D761j70M162r513j2298M268J0036l223n050Q759P636p171n972O385O96j3550
$$ 4761 4591 8753 -760 -13058 -8790 1246 -1977 -7027 1732 9368 2197 -3775 2610 3306 -10244
815a0244o336J0421O094o188K439J4289M156q567M02P910m819j4677k855N720
$$ -10244 -16580 -6159 -65 -6253 -3814 10475 14631 6064 6466 14376 9557 -5120 -7975 -2255
829b255m308p183P512J1662k949n933P693P322q320q996L920K319r092j727J2309
$$ -2255 -6563 -13746 -6234 5428 2479 -3454 4239 11561 3241 -5755 -1835 484 -8608 -10335 1974
844A974N626p720j75J0956J399j1202l242M602n313j1868K766J2345n49p106N690
$$ 1974 7600 -120 -295 10661 12060 858 -2384 2218 -3095 -14963 -12197 148 -401 -7507 -1817
859a817J1739j800o754L604K784j0277p557P909P178o460l498J0209N856o730
$$ -1817 9922 8122 1368 4972 7756 -2521 -10078 -2169 5009 -1451 -4949 5260 11116 4386
873D386k024P393l462j4467l957R248M08q868J532J0287J327m354N888P602p657
$$ 4386 2362 9755 6293 -8174 -12131 -2883 -2475 -11343 -9811 476 1803 -2551 3337 10939 3282
888C282j0465M280P401n693o366P244O875m436j741J0134K712j1930p169O101
$$ 3282 -7183 -2903 4498 -1195 -7561 -317 6558 2122 381 10515 13227 1297 -5872 229
902B29J082r587j833Q045J240n673N326J1552k417j0234J295O884m653r386L225
$$ 229 1311 -8276 -10109 -2064 -824 -6497 -1171 10381 7964 -2270 -975 5909 1256 -8130 -4905
917d905O846m794m184R229Q263o470o524O087K570q810m781P027J090p462M60
$$ -4905 1941 -2853 -7037 2192 10455 3985 -2539 3548 6118 -2692 -7473 -446 644 -6818 -6358
932f358J1771K058q411N04Q259k161j0232L32O568m501o755N574R051l490n940
$$ -6358 5413 7471 -940 -436 7823 5662 -4570 -4238 2330 -2171 -8926 -3352 5699 2209 -3731
947c731O654O016p790o794N425K365q659l236R208M423o479j0J0031K207q375
$$ -3731 2923 8939 1149 -5645 -220 2145 -6514 -9750 -542 3881 -2598 -2608 7423 9630 1255
962A255j626P134k840q954J283P543l264p452M951Q246m769p884L858M986o907
$$ 1255 -371 6763 3923 -5031 -3748 3795 531 -6921 -1970 6276 1507 -6377 -2519 2467 -4440
977d440n842O727M895n902k035R963N995o351j713P430k9r083r87O790k836r647
$$ -4440 -10282 -3555 1340 -4562 -6597 3366 9361 3010 1297 8727 8698 -385 -1372 5418 2582 -7065
993g065J513R471j439p918K716O948m509o931M865N787o337n784P503P139m807
$$ -7065 -5552 3919 2480 -5438 -2722 4226 -283 -7214 -2349 3438 -2899 -8683 -1180 5959 1152
1008A152l446P243K767q055k542P433R4j0392j755Q671J275o910J218P636k286
$$ 1152 -2294 4949 7716 -339 -2881 4552 4646 -5746 -7501 1170 2445 -4465 -3247 4389 2103
1023B103o467L948P284m824q036M620P225m249n202N702M761o718m332O770L133
$$ 2103 -4364 -416 6868 2044 -5992 -1372 5853 1604 -3598 2104 6865 147 -4185 2585 5718
1038E718r604m570O553K415o575n70P641M20o483K863R226j728q454K980P723
$$ 5718 -3886 -8456 -1903 512 -6063 -6633 1008 1428 -5055 -2192 7034 5306 -3148 -168 7555
1053G555k680o650L647N851n904o280N215M685p499o521N358L773o516k666P601
$$ 7555 4875 -1775 1872 7723 1819 -4461 754 5439 -2060 -8581 -3223 550 -5966 -8632 -1031
1068a031K549o862R14R690J650q115M71Q093o86p274J225O348l977q006L404O245
$$ -1031 1518 -5344 -4430 5260 6910 -1205 -734 7359 6673 -601 624 6972 2995 -5011 -1607 4638
1084D638n354p195M520N592n250l915O551M739o155j889Q043L289q004k065P394
$$ 4638 -716 -7911 -3391 2201 -3049 -6964 -413 4326 -1829 -3718 4325 7614 -390 -2455 4939
1099D939R75p645q40O453k003p944J792O972l353p550L035P712k976n231N373
$$ 4939 5914 -1731 -2571 3882 1879 -6065 -4273 2699 -654 -8204 -5169 2543 -433 -5664 -291
1114b91O498m182l915O794M543p037m789N754K623o919l147N664n08p254J56P361
$$ -291 6207 2025 -1890 4904 9447 2410 -2379 3375 5998 -921 -4068 1596 1088 -6166 -6010 1351
1130A351q62q233Q21P964p65o002L172P488k265m834O170O592n071o111M288L084
$$ 1351 489 -7744 -6923 1041 276 -5726 -2554 4934 2669 -2165 4005 10597 5526 -585 3703 6787
1146F787o263m736M582J014p358j466P635J841p603j078P235J139o518J381P348
$$ 6787 524 -4212 370 1384 -5974 -7440 195 2036 -5567 -6645 590 1729 -4789 -3408 3940
1161C940j637n830M483Q382k805o883K850M829m987p007L350K834o945m020P414
$$ 3940 2303 -3527 956 9338 6533 -350 2500 7329 2342 -4665 -1315 1519 -5426 -9446 -2032
1176b032M635n600j897O984K761n844n74O550j038p280J225P851q39p179J456
$$ -2032 2603 -2997 -4894 2090 4851 -993 -1567 4983 3945 -3335 -2110 5741 4902 -2277 -821
1191h21N946l019o846K169L598n402n886M902O624l694k472P064N054m399j116
$$ -821 5125 2106 -4740 -2571 1027 -4375 -10261 -5359 1265 -2429 -4901 2163 7217 2818 1702
1206A702N779M90q083k360O701l1p386k96O957j028o363P56N319l894p532K680
$$ 1702 7481 7971 -112 -2472 4229 4198 -3188 -3484 3473 2445 -3918 -3162 2157 -1737 -9269 -6589
1222f589N794k886l887O336O426k790j996O170L350o818m539M919J053p871k283
$$ -6589 -795 -3681 -7568 -1232 5194 2404 408 6578 9928 3110 -1429 3490 4543 -3328 -5611
1237e611O210J786n708N06O660r38p181J138N120l156o413L425P154j858l762
$$ -5611 599 2385 -3323 -2817 3843 2905 -4276 -3138 1982 -1174 -7587 -4162 2992 1134 -2628
1252b628N597N228m761m709M055K317p947n224M881K948n060l23P262K258n514
$$ -2628 2969 8197 3436 -1273 2782 5099 -2848 -8072 -3191 -243 -5303 -5626 1636 3894 -1620
1267a620J149P065j191p813o06O679j177n409K827N948k810m577M341M267o272
$$ -1620 -471 6594 5403 -2410 -3016 3663 2486 -2923 -96 5852 3042 -1535 2806 7073 801
1282H01p423K089K604n029k306O373L572m124O15Q546K892o413k673M230n25o163
$$ 801 -6622 -4533 -1929 -6958 -9264 -2891 681 -3443 -2828 5718 8610 2197 -476 3754 3229 -2934
1298b934Q01N667j715n279L882P237k340o924Q01K690n430n479N233L645n100
$$ -2934 -2133 3534 1819 -3460 422 7659 5319 -1605 -804 1886 -3544 -9023 -3790 -145 -5245
1313e245j497Q161O231m172k727L894J86p449j879M962m33o986J819P977J414
$$ -5245 -6742 1419 7650 3478 751 4645 4831 -2618 -4497 465 32 -6954 -5135 2842 4256
1328D256m728K129M314m262o167K761M095m660m800N363O603j919k210N063J790
$$ 4256 -472 1657 5971 1709 -4458 -1697 2398 -2262 -7062 -1699 4904 2985 775 5838 7628
1343G628o670l837L841q2q016k009O207J853l238K211P261n05o080J314N114l327
$$ 7628 958 -2879 962 880 -7136 -9145 -2938 -1085 -4323 -2112 5149 4644 -1436 -122 4992 1665
1359A665o403J984N139k249l032N909N416m233m390L639J678p197m946L488J465
$$ 1665 -4738 -2754 2385 136 -2896 3013 8429 4196 -194 3445 5123 -2074 -7020 -3532 -2067
1374b067n070K83P861L078l763K65N291j124o823p8L750l341n225L290P185j014
$$ -2067 -7137 -6854 1007 4085 322 587 5878 4754 -2069 -2147 1603 -1738 -6963 -3673 3512 2498
1390B498l130L823M131n127m812K648J832o731l635N270M601k327P92O274J088
$$ 2498 -632 3191 7322 2195 -2617 31 1863 -4868 -8503 -3233 1368 -959 -167 6107 7195
1405G195o057r87M553k339q679j056N104P54l049M381O195k842m516K945M301
$$ 7195 1138 151 4704 2365 -6314 -7370 -2266 -1512 -4561 -180 6015 3173 -1343 1602 5903
1420E903n076o854J590L173k336L01O878L187m391j681O065J131q025m056J499
$$ 5903 827 -6027 -4437 -1264 -3600 -3299 3579 6766 2375 694 6759 7890 -135 -4191 -2692
1435b692j009l897K896O752n46m420K976O331k099n810o30K192m574k588O140
$$ -2692 -3701 -7598 -4702 2050 1504 -2916 60 6391 4292 -1518 -2148 44 -4530 -7118 -978
1450i78N175l139k387O087M196m164l678J482k407o896p61O122J248m727J397
$$ -978 4197 1058 -1329 4758 8954 4790 1112 2594 187 -6709 -7470 -1348 -100 -4827 -3430
1465c430P274J751m212J223K073n244o476K206N557k546l598M538N799j610j406
$$ -3430 3844 5595 1383 2606 4679 -565 -7041 -4835 722 -1824 -5422 -884 4915 3305 1899
1480A899M190k25o863m416L417K093m743r04O037K206k173K013N760k129p808
$$ 1899 6089 5864 -999 -5415 -1998 95 -4648 -5552 485 2691 518 2531 8291 6162 -1646
1495a646j280L067k578m720K329N075o92j439N558M970m379n194J326O22n117
$$ -1646 -2926 141 -2437 -7157 -4828 247 -445 -1884 3674 8644 4265 -929 397 1019 -4098
1510d098k840M140K531l638J179P581K844m609j423K372k687n827M0M484k011
$$ -4098 -6938 -2798 -267 -3905 -2726 4855 7699 3090 1667 4039 1352 -4475 -4435 49 -1962
1525a962l818M188P005K16l514J649J000o180m937K392K417m658j948N855N240
$$ -1962 -5780 -1592 5413 5629 2115 3764 4764 -1416 -6353 -3961 -1544 -6202 -8150 -2295 2945
1540B945l50P33L797q59o775j605L765q10o093q5N417J348q90L822L469m313o696
$$ 2945 2595 3328 7125 6266 -509 -2114 1651 841 -5252 -5337 80 1428 538 4360 7829 3516 -3180
1557c180J314L167m157n245J925L724q37J970P210K388n628l329L609J045n902
$$ -3180 -1866 1301 -2856 -8101 -6176 -2452 -3289 -1319 5891 8279 2651 -678 2931 3976 -1926
1572a926k765K150M3k343M165P111k54n602k70L339k121m893j23J144l698j306
$$ -1926 -4691 -2541 -2498 -4841 -676 6435 6181 579 309 3648 1527 -3366 -3489 -2345 -6043 -7349
1588g349P292O553k230k572K870J810l931k977J037k429o240N02O998L085l133
$$ -7349 -57 6496 4266 1694 4564 6374 2443 -534 503 -1926 -8166 -7664 -666 2419 -714
1603g14L46M012m26l967R96J832n149n346K997O429Q45j101L235L626k945k256
$$ -714 -368 3644 3218 -749 247 2079 -3070 -8416 -5419 1010 1855 754 3989 7615 4670 2414
1619B414K485p90p850m941K783K882j723J677N137J616l060O51M691k204p023
$$ 2414 4899 4109 -3741 -8682 -5899 -3017 -4740 -3063 2074 3690 630 1281 5972 3768 -3255
1634c255j655L311k65j396L833N502k023k480L271K195m908o334j62P9l591K39
$$ -3255 -4910 -1599 -1864 -3260 573 6075 4052 1572 4843 7038 2130 -4204 -4366 -4287 -7878 -7639
1650g639O196L277k673L29O056J906m470k710P82k879l986K161N305M82l322K224
$$ -7639 -1443 1834 -839 -510 5546 7452 2982 272 1054 -1825 -5811 -3650 1655 2137 -1185 1039
1666A039M690r39l571J96r58n430l700M085M267j726j040M559L506r20p8K555
$$ 1039 5729 4790 1219 1415 457 -4973 -8673 -4588 -321 -2047 -3087 1472 4978 4058 3980 6535
1682F535k430p769j996M388O52k872k1M201J135j345L354K636n100o439k75L427
$$ 6535 4105 -3664 -5660 -1272 -620 -3492 -3513 688 1823 478 3832 6468 1368 -5071 -5346 -1919
1698a919p85j758K925L320n84J502N815J755o436n289N76J16l863p49K864o35
$$ -1919 -2704 -4462 -1537 1783 1199 2701 8516 10271 3835 -1454 -878 -762 -4625 -5374 -2510 -3145
1714c145j821L972O932J81n682k175J330k266k366K589K474j984q83O328O085
$$ -3145 -4966 -994 5938 6119 437 -1738 -408 -2674 -5040 -2451 23 -1961 -2844 3484 9569
1729I569j550m437o34j418m665k111K502l45m577P46P477M247j475n63J602k510
$$ 9569 8019 3582 2948 1530 -3135 -5246 -2744 -3089 -7666 -6920 557 4804 3329 2766 4368 1858
1745A858m566P66K921l034m306K588O134J168m73J853K61m933l349K061J015m696
$$ 1858 -2708 -1942 979 -2055 -6361 -3773 2361 3529 3056 4909 5170 237 -3112 -1051 -36 -4732
1761d732k688L698M055J99K308M553j121m520j007K264k055n073j506K634K51
$$ -4732 -7420 -3722 333 532 2840 7393 6272 1752 745 3009 954 -4119 -5625 -2991 -2740
1776b740j27L994M425k493m059J125J829l274m106J042J097j258J360O745L769
$$ -2740 -2867 1127 5552 3059 -1000 125 1954 -1320 -5426 -4384 -3287 -4545 -3185 3560 7329
1791G329k808j503J823M08m374k251K83k359l509K821O146J025k448O75K622k245
$$ 7329 4521 3018 4841 5249 875 -1376 -1093 -3452 -6961 -4140 2006 3031 583 1258 3880 1635
1807A635k981O51Q9m498l193M666N533M14o19K593R93k973o75J129k457o442j887
$$ 1635 -1346 -695 -606 -5104 -8297 -3631 1902 2316 1697 4290 5283 2310 1635 2764 307 -6135 -8022
1824h022M503K953k97K029K843m73k274K257K219m511o141n4K829P58K92L127
$$ -8022 -3519 -566 -863 1166 4009 3536 1262 3519 5738 1227 -4914 -4968 -2139 -1381 -1089 2038
1840B038J560k373p37L309P41n360n532M77R63n01K736M833M90k150K190M661
$$ 2038 3598 1225 488 3797 4538 -822 -6354 -5877 -4914 -5415 -2679 2154 2644 494 2684 7345
1856G345l55n085l315j89k090q03L331L424j752k432L532L636j383l608j807j758
$$ 7345 6990 1905 -1410 -1599 -3689 -4492 -1161 2263 511 -1921 1611 5247 3864 256 -1551 -3309
1872c309k985J8M936K234k316P06M196K718j465j139m41m044m425J245L845l32
$$ -3309 -6294 -6276 -1340 894 -1422 -716 3480 6198 4733 3594 3153 -891 -5316 -4071 -226 -558
1888e58k666J532M162J017q22J246n53n019l498K250K431j821p18K459K564j99
$$ -558 -3224 -1692 2470 3487 2665 3911 3358 -1661 -5159 -2909 -478 -2299 -3017 -558 2006 1807
1904A807J645K771k071n871j838K058n07k280M01K527N86L6L951L543k643m445
$$ 1807 3452 6223 4152 -1719 -3557 -1499 -2006 -4286 -3885 -1358 -772 -736 3215 6758 4115 -330
1920c30m24R06j774j437J311J719j398O88N200K357l082l597L22j341l271k36
$$ -330 -754 152 -1622 -3059 -1748 -29 -1427 -739 4461 6818 3736 139 461 -880 -4151 -4387
1936d387J889n96j826K600N546K259k155m75m1k541k663J074J317k525j746L380
$$ -4387 -2498 -3094 -4920 -2320 3226 5485 3330 2855 2814 273 -2390 -1316 1 -2524 -4270 -890
1952h90M454M42q57N73j725l629j616K243l28l959m19L778L674L49J991J269k977
$$ -890 3564 4006 3149 3722 1997 -1632 -3248 -1005 -1333 -5292 -5711 -1933 1741 2090 4081 5350 2373
1969B373l489N95J963j984m240L27K674J161J557L164J106l763k569J886O98k851
$$ 2373 -1116 -521 1442 -542 -4782 -4455 -1781 -620 937 4101 5207 1444 -1125 761 1459 -1392
1985a392k549L51J013OL105M461j49m166m89K057n11l326j280K7j351K5M139L950
$$ -1392 -3941 -3590 -2577 -2571 534 4995 4846 680 191 2248 1737 -1589 -2869 -2842 -4193 -4168 -29 3921
2003C921q83k618M94K378j681k194k03j432k616R70M521K935j478j147K129M34
$$ 3921 3038 420 914 3292 1611 -583 -786 -2218 -4834 -3864 657 3592 2114 967 3096 3530
2019C530k223p22j29l414l345J348M506J489j101J074J712n72p61O80p80l696
$$ 3530 1307 585 456 -2958 -6303 -4955 -449 1040 -61 1013 2725 2153 1392 2072 1292 -2404
2035b404l433K393L155J03K39K352O84p78L50J587j906m812k086J588J084K10
$$ -2404 -5837 -3444 -289 -186 53 2405 3089 2311 2661 4248 2342 -2470 -4556 -2968 -1884 -1674
2051a674J307K091j86j059J848J697k473m045j155Q70n59N05L407J574j270l24
$$ -1674 -367 1724 1538 479 2327 4024 1551 -2494 -3649 -2779 -3338 -2833 574 2148 878 554
2067E54L035J652l423k496p11j209j094J215K823R30k502J318L554M45k192j556
$$ 554 3589 5241 1818 -678 -1389 -2598 -3692 -2477 346 1276 -1226 92 3646 4091 1899 343
2083C43n53k571j682K368K994j114j555K323K717l39n07pj628l986j370K638J392
$$ 343 -210 -2781 -4463 -2095 899 -215 -1770 553 3270 2931 2424 2417 789 -3197 -4567 -1929 -537
2100e37j277j39K073K046R3J031P17k610m224j3K236K22j730P01J581K62R82K448
$$ -537 -1814 -1953 120 2166 2259 3290 4007 1397 -2827 -2840 -604 -382 -2112 -1411 170 432 1414 3862
2118C862m1l334l471N12J551j367o33J380N68m1K062L885r2l748k034O88J28j201
$$ 3862 3821 487 -2984 -2472 -921 -2288 -2921 -1541 -973 -1014 1048 4933 4841 1093 -941 -253 -125 -1326
2136a326l26Q87q62j3K668L537j094l229m11k34j150j053Q48J80j940J019M299
$$ -1326 -1652 -765 -1627 -1640 1028 4565 3471 242 -169 -403 -1553 -2606 -1758 -1578 -3518 -2499 1800
2153A800K596j173j330M8j238j813R5R21j537k358P83M113J467n49M42j70j707
$$ 1800 4396 3223 1893 1941 703 -1110 -1015 -94 -1631 -3989 -3206 907 2374 1825 2267 2097 390
2170C90j998R13P86k538j485J867K981R36K18J581p63k624q61J208m40k889j372
$$ 390 -1608 -695 91 -2447 -3932 -2065 916 1852 2070 3651 2888 264 -597 611 171 -2718 -4090
2187d090J639J409P01J845J731j406j826M69J259j249k349j50M23L10J002K297
$$ -4090 -2451 -1042 -341 1504 3235 1829 3 472 1731 482 -1867 -2017 -1594 -1284 -282 2015
2203B015J945k005k130J397J57j970j758j72l29m84J472L091J035j554K10J309
$$ 2015 3960 1955 -175 1222 1379 -591 -2349 -2521 -2850 -3334 -1862 1229 2264 710 920 2229
2219B229l60j505n10q4j562j146J946L267n06j284Q31P85j190q54N47j380k942
$$ 2229 1869 364 -146 -230 -1792 -2938 -992 2275 1769 485 1316 2101 911 57 604 -776 -3718
2236c718n69K575K201m18J94J667j36p97L79R01k222l631L97K247R36o64J025
$$ -3718 -4287 -1712 489 71 265 1932 1796 999 1378 2279 57 -3574 -3177 -930 6 -658 367
2253C67J116q56l95J829K49k656k664M79J351M06N08K048J57j180Q15K001k41
$$ 367 1483 627 232 2061 2310 -346 -3010 -2531 -1180 -774 -266 1782 1939 759 1574 3575 3334
2270C334l496k263R2J5j75J258J620o48j301K207K496j098k114j046K80r72M31
$$ 3334 -162 -2425 -2333 -2318 -2493 -1235 385 -263 -1564 643 3139 2041 -73 -1119 -839 -1811 -1380
2287a380K089O17j216l22K584J013j274j833l68j541j536K65K595o7j857R59K717
$$ -1380 709 1326 110 -212 2372 3385 2111 278 -90 -1631 -3167 -2902 -307 -374 -2231 -1272 1445
2304A445R45n58m84q7k195j254J205J537j193r03J304J872k65j35J272j419k438
$$ 1445 2390 1832 1348 1261 -934 -2188 -983 554 -639 -1542 -238 1634 1369 1234 2506 1087 -1351
2321a351r90J503K51j490K73J494J093l69J800Q68j017k569NQ81j285j249N12
$$ -1351 -2341 -838 -587 -2077 -1804 -310 783 414 2214 3082 2065 -504 -499 382 -903 -2152 -1640
2338a640J230m37Q7K440P88j606j794L11L03j063n92J149M05o72J608K495P40
$$ -1640 -410 -847 -760 1680 2468 862 -932 -621 -318 -1381 -1973 -824 -419 -1091 517 3012 3752
2355C752j766p63p1q72j603n4P05j189q98J661K499j26q04L33n03j155m51J140
$$ 3752 1986 1223 1152 280 -1323 -1377 -672 -1861 -2759 -1098 1401 1275 471 804 301 -854 -1305 -165
2373a65m2j359p59K880J460qp1P00j425j503k04O70r31k038K97J749J002L72J097
$$ -165 -207 -1566 -2325 555 2015 2007 1936 2636 1211 -292 -496 174 -757 -2795 -2498 -749 253 625 1722
2392A722L00j521r49R42O51j521j478O07Q02K48Q66J295m2j978o40J440q4k377
$$ 1722 2022 501 -448 494 1145 -376 -1854 -1247 -445 -197 669 1964 1922 -56 -696 744 660 -1717
2410a717q30J139l30M76J766J848o31j403N35P01m24j710k31j57r49O80J618J230
$$ -1717 -2547 -1408 -1738 -1262 504 2352 1721 318 853 1554 1130 -580 -811 -968 -1917 -1237 381 1611
2428A611j104o55P60Q55j488n98K03j077j126J018K144R09q72K67J303l82q71
$$ 1611 507 -148 612 1467 -21 -619 -416 -1493 -2619 -1601 543 1452 580 847 2150 1768 897
2445H97L6k47j961j005Q30J523p2n34J224L41l66k58L25k68k312m60J146J008
$$ 897 933 686 -1275 -2280 -1450 73 1 -533 691 1032 666 408 733 465 -1847 -2307 -1161 -153
2463a53o05O22J558L4n31M6J203j320k081l17Q96l56k92J373N61n03j51R64O57
$$ -153 -758 -136 1422 1456 925 971 2174 854 -1227 -1544 -648 -1004 -1296 77 638 135 -16 948 1605
2482A605j215j476N56j14n26L52J379K44j203M09J377K32j690n34J02q16q79J249
$$ 1605 390 -1086 -530 -644 -1170 -818 561 805 -398 11 1388 1620 -70 -604 -502 -1318 -2197 -948
2500i48J047k99k66R72J735n48q81K7l09j529l13J135N08q79k68J404M91m75q3
$$ -948 99 -200 -466 506 2241 1693 812 839 530 -999 -1312 -177 331 -548 -816 588 1079 604 521
2519E21N04j290j354p0J386m2p74L71R63N96j8N39l3j349r05Q08K51n12n28Q98
$$ 521 1025 -265 -1619 -1689 -303 -345 -1119 -748 215 811 793 1332 1299 -50 -955 -147 104 -408 -936 -38
2539c8L80m3N28R39j83j916o41O16L21j060k01Q99L41m58J198J392o26j336r0
$$ -38 342 299 827 1766 1583 -333 -974 -358 -37 -1097 -1298 -399 -58 -516 682 2074 1448 112 22
2558B2L79q13m75P17J30r19N41J176R12j097m89O47m58q76j91M10N1j147Q40J531
$$ 22 401 -412 -887 -170 -40 -959 -418 758 1670 573 84 731 273 -603 -794 -384 -333 -1480 -640 891
2578H91O80j060m02L40k63j016K76L96j002o11J338Q83R1k34O00K47j257k59O73
$$ 891 1571 511 109 449 186 -830 -554 -158 -1160 -1771 -433 450 541 307 907 1154 -103 -362 311
2597C11l42r49k11R90Q57n68K69J068n53j299N52M31o92j216M98M03m01M53P55
$$ 311 -31 -980 -1191 -201 656 88 357 1425 872 -427 125 556 -136 -1352 -854 -451 -852 -399 356
2616C56O51n51o04M94M94j273o24M74M05p34M04J325M92p93j18Q01l54j003k97
$$ 356 1007 456 -148 346 840 -433 -1057 -583 -178 -912 -508 817 1309 516 398 1199 845 -158 -455
2635d55M97n46m62O85O94m75j34M36N89p51l15J14L42j277r2R17Q06n73J38O89
$$ -455 42 -504 -966 -281 413 -62 -196 240 829 78 -237 -123 219 -1058 -1150 -233 573 0 138 827
2655H27K38r76j74O13q16j020N20R82km79M82P81m36n03L73L53r35q48N07O24
$$ 827 1065 89 -85 528 -288 -1308 -788 194 192 -287 195 976 540 37 410 763 -172 -1020 -513 111
2675A11l83o3P95K11q29L29N83j51j221n38P46K68o46O41R75l96k39N07L79m37
$$ 111 -272 -335 460 671 -158 171 754 603 -618 -1156 -410 -142 -788 -147 828 432 193 700 1079 642
2695F42j408O96K12n44j44O40O09o87m55R00N27q41o11J56j24o64L13Q46m6j43
$$ 642 -766 -70 142 -402 -546 94 703 16 -439 461 988 147 -464 -308 -432 -1096 -783 63 17 -126
2715a26K8J306j68q41M03Lm39o53J48Q90r20l07J041L30k34n65N84l09o13m14
$$ -126 -98 1208 1040 199 602 605 166 -487 -339 551 -369 -676 365 695 461 -104 480 171 -442 -856
2735h56O62J19o19O5R60K45l87j20Q15k50j327L09P47n59p10O91O50k80m44R27
$$ -856 -194 -75 -694 -629 331 576 189 69 884 634 -693 -384 363 -196 -906 -215 435 155 -289 638
2755F38J96p18l72N25J03o35j52O07n4m8j27R47k90p08k72L96k59p37K26Q01n9
$$ 638 834 116 -256 269 372 -263 -415 192 138 90 -37 910 620 -88 -360 36 -223 -960 -734 67 8
2776Hr32J033M27j9p14O22j24l95k15M59R0n59k83J097L27o43k36K47j84o67J83
$$ 8 -924 109 536 517 -197 425 301 -94 -309 150 240 -319 -602 495 822 179 -57 190 6 -661 -478
2797d78O29p81k72M78O75j44l62P76K49o86l97O60K30n54p65N17M87q4l86P26
$$ -478 151 -630 -902 -424 251 107 -255 521 770 84 -313 347 577 23 -742 -225 262 178 -208 518
2817E18J16r98k08P44Q4p76j13M25L27l86P45K64k83q68N04N51n31n88J60J75
$$ 518 634 -364 -572 172 256 -520 -633 -208 119 -267 478 742 459 -409 95 646 115 -473 -313 -138
2837a38k14k59P40L31o92J13N29p4n31k71P17Qp05L93M89j24l12K98N19m67n71
$$ -138 -352 -611 129 460 -232 -119 410 336 -195 -466 251 259 -446 -53 436 312 0 298 817 350 -221
2858b21j9K91n24J06K08K22n59O2Q53j24n37j01O31q3m39K64l2N52n87q1P42M1
$$ -221 -240 51 -473 -367 -159 63 -496 -434 419 295 -242 -343 288 205 -234 30 -2 550 -37 -118 624 665
2880F65n81K34M1m61n36K47L86m29N9M85L81j79m99M36J81m69l82M82K7n63J0
$$ 665 84 318 359 -102 -638 -391 -5 -434 -375 110 491 312 -187 249 430 -39 -421 61 88 -475 -465
2901d65P35j00n12J56O68m86k52j95M68k51l60N72M84j84l32M06L56n51m29M08
$$ -465 270 170 -342 -186 482 -4 -256 -451 17 -234 -594 -22 462 278 -54 352 708 157 -272 136
2921A36J63n73l55Q31k86k97j10N07J78k19k52O17n06k10M06K81J26p08J24Q10
$$ 136 299 -274 -629 202 -84 -381 -491 16 194 -25 -277 340 -166 -376 30 311 437 -271 -147 663
2941F63p9m38R1n2l24l50J98N31m03k04L07J46k31k3L83l5p93J21Q68k11p65N24
$$ 663 584 146 237 185 -139 -489 -291 240 -163 -367 -60 86 -145 -168 215 180 -613 -492 376 165 -600 -76
2963g6N87k09l51J53O28m48o26L33M35m36o18L53K01j9j91N26M7m79q4M04J15
$$ -76 511 302 -49 104 732 284 -342 -9 426 -10 -628 -275 -74 -93 -284 242 289 -190 -274 130 245
2984B45n60K40L43J31n44J18J68l30k38q8M41L5l36K21J27n9l44P25L72o34m07
$$ 245 -315 -75 268 399 -145 -27 141 -189 -427 -515 -74 -39 -375 -154 -27 -86 -430 295 667 33 -374
3005c74O41K64o44j06K52L03o65K10N99l06o67K64K89j93j06K44J32k59j32J91
$$ -374 267 531 -113 -219 33 336 -329 -119 480 174 -493 -229 60 -133 -239 5 137 -122 -254 -63
3025f3K24l9j68m5P63p91J53K16J20p08K03M40l15r4j25J86N2j46j03L92Q9l81
$$ -63 161 122 -46 -91 672 -119 34 250 370 -338 -135 305 -10 -104 -229 -43 9 -137 -240 152 241 -140
3047a40j73O55j23k80R4K36j56m11L96L37k06n75N88J96n06n71O69J55k4m30K79
$$ -140 -313 342 219 -61 33 269 113 -298 98 435 229 -346 242 438 -68 -639 30 185 161 -269 10
3068A0K71k45K49k57Lk67K9M83j32n01J77M50m31k1K46P4o24P8M00O8l25J56K40
$$ 10 281 36 285 28 31 -236 -207 276 144 -357 -180 270 -161 -182 64 138 -486 -408 -8 60 -265 -109 131
3091A31j64o1j32O62k30l07q8M23L9m60P9L07j1n53K06P20q08j04rN71m25l90
$$ 131 -33 -94 -226 436 206 -101 -189 234 273 -187 -108 199 188 -365 -159 561 -247 -351 -360 211 -214 -604
3113f04Q67r2l78P5K18L3J57m49N81j17k87l7L06q8k52L03M6m48k16nO29k41k21
$$ -604 263 171 -207 -132 86 119 276 -173 408 291 4 -33 273 185 -67 236 282 -166 -382 -387 242 1 -220
3136b20J65K04m15K73M56k99j65l69O37m51k28K72J91J48l76K3J81Q5l01oM20
$$ -220 -55 149 -266 7 463 164 -1 -370 267 -184 -412 -140 51 199 -177 -154 27 112 -189 -195 225
3157B25q9k11Q7J88J7n66K87M54j37p56M67M91k48l84j02K52J1j82L70Nn87L30
$$ 225 136 -75 12 200 217 -349 -62 392 255 -501 -34 457 209 -175 -277 -25 -14 -196 174 179 -408 -78
3179g8K3J77l54J93J76L2m09K89J31j27k0J53K30m39k31J72L3J03l68J77J72L0
$$ -78 -55 122 -232 -39 137 169 -240 49 180 53 33 186 416 -23 -254 -82 -49 54 -314 -137 35 65
3201F5l13L72o3j34n68O72J86o42K95R3Q3j47RK52m7n00L90o6L4k53O48J19o56
$$ 65 -248 124 61 -73 -641 31 217 -425 -130 -37 46 -101 -92 160 113 -387 3 -63 -29 -282 366 485 -171
3224a71K92M3K8k22j13J08L45o53K42M4J67l62J89J07O2m44R9N00j25p27M29K81
$$ -171 121 164 192 -30 -143 -35 310 -343 -101 -57 110 -252 -63 44 106 -338 -239 261 136 -591 -162 119
3246A19j48j47M7J77k71M2N49j38j95k73K35K70p26L68L44m5k93K06P7m63K6M2
$$ 119 -29 -176 -129 48 -223 -181 368 230 35 -238 -3 267 -459 -91 253 208 -85 121 198 -265 -239 -197
3268a97Q0J9l41N33M64o80j60K41j56Q1J0L56Oq5k67L51k03P7k65L51k99j46O0
$$ -197 -117 -98 -439 94 558 -122 -282 -41 -197 -116 -106 250 256 171 -96 255 52 129 -136 215 -84 -230 -170
3291a70L46j78m3J8r8O9N2J87k78M2l38N14Q3k91N2J71M29n85j0L74j56n1k46
$$ -170 176 -2 -45 -27 -125 -56 -4 183 -95 -53 -391 123 206 -85 -33 138 567 -18 -28 346 190 139 -107
3314a07K19J48n38n8M44k95M2k1L25j18j16j2L45m82n4J91M20m79j27L40K54k64
$$ -107 112 260 -278 -336 108 -187 -145 -166 159 41 -75 -87 258 -224 -278 -87 333 -146 -273 67 321 57
3336E7k26K88k64J6K89Qm00L43j28L44l69Pp1M74j43k88J96N8k21k59M76l0n09
$$ 57 -169 119 -145 -129 160 168 -232 111 -17 327 -42 -35 -106 368 225 -63 133 191 -30 -289 187 157 -352
3359c52j32O70j58J20m15K17j42K6J14M27l65J6r5M45j8n77J87K62o6l13K60K99
$$ -352 -484 186 28 148 -267 -50 -192 -166 -52 375 10 26 -69 376 358 -219 -32 230 164 -149 111 410
3381D10m97j57O49k9j93l14L50P4m79J53j27P3K28l85M27J0J1k40J83N0m04J32
$$ 410 -87 -244 405 376 183 -131 219 293 -186 -33 -160 -87 141 -244 183 193 204 -36 147 197 -207 -75
3403g5L31l50l51N20M30k26k69oL09p04M7M52j66J85n3k13J34qm6k9K18k13P4
$$ -75 256 -94 -445 75 505 279 10 4 313 -391 -344 108 -58 127 74 -139 -5 -13 -59 -88 130 -83 -9
3426iK16k40k65m6O40k82J51J9R2j23m47O10j13l31J4M62p5k61J22j94L95k4m85
$$ -9 207 -33 -298 -344 296 14 165 184 276 153 -294 316 203 -128 -114 348 273 12 134 -60 335 311 -174
3449a74J3M58n76K43J34j35k74K00m9M38l63K67n4l89K55k7k87L74l31M09r3l13
$$ -174 -161 297 -279 -36 98 -37 -311 -111 -160 278 -85 182 128 -261 -6 -33 -320 54 -277 132 39 -274
3471b74K82M48l67n49K28M52r5J22k05o8R1j0K23k15n8k10N07M6M1q45K92m0O8
$$ -274 8 456 89 -460 -232 220 125 247 42 -26 65 55 278 63 5 -205 302 348 389 -456 -164 -204 -136
3494a36m1O6M46l99mK83j44m31K51M19m81K37l45K64K03m91L78K42m81j93L41
$$ -136 -177 -111 335 -64 -68 215 71 -360 -109 310 -171 66 -279 -15 188 -303 75 317 -164 -357 -16
3515a6j75J27lM4J76l9k59K09J29j96j95J71j41%J22R8L95k89k40J77K98j07m12
$$ -16 -191 -64 -67 -23 153 114 -145 64 193 -3 -198 -27 -168 -168 -46 52 447 158 -82 95 393 286 -126
3538a26P5J17m17J06M19j45j32L22o1J00q5j72J43k03j20J28K32k12o6N8M21k17
$$ -126 -51 66 -351 -245 174 29 -103 219 158 258 173 1 144 -59 -179 -51 181 -31 -97 -39 382 165
3560A65j13j2K40l47Q6k72l9L98m12N78l07L08j62K61m31l37J70M54l64j23L54
$$ 165 52 40 280 -67 19 -253 -292 106 -306 272 -35 273 111 372 -59 -396 -226 228 -136 -259 95
3581I5N2m52K31J17r6J45J59L2k49k88J57N01k68j50j77M56k30J3j14K51k82l97
$$ 95 147 -305 -74 43 -53 92 251 283 34 -254 -97 404 136 -14 -191 265 35 48 -66 185 -97 -494
3603d94L84j94L52l90K22L67j62n8J62k00k43J24n7M92k83j96q5L35L1K87n5o11
$$ -494 -110 -304 48 -342 -120 247 85 27 189 -11 -254 -130 -187 305 22 -174 -259 76 107 394 339 -272
3625b72L67j15K20o24qJ43M95j79O3M74l78n63j09M08K51l95n2K01j89jJ70L95
$$ -272 95 -20 200 -424 -432 -289 206 27 90 564 186 -377 -486 -78 173 -222 -274 -73 -262 -263 -93 302
3647C02l85J39l37L12J8j44J18k99J09r8O32k46j45k61M20J18k68Q7j83j22j49
$$ 302 -83 56 -281 31 49 -95 23 -276 -167 -265 367 121 -24 -285 135 253 -15 72 -111 -233 -382
3668c82K14K15l8j34o2L11r5j65p2k0K20j24K06L74k43j46K69J64l80k86q2L27
$$ -382 -168 47 9 -125 -187 124 29 -136 -208 -228 -8 -132 74 448 205 59 328 492 112 -174 -256 71
3690G1k2j87K58K74n74J36L05K36o20J52J54Q2l35j27J86J16k9J68Q6J26o59K91
$$ 71 49 -138 120 394 -180 -44 261 497 -123 29 183 265 -70 -197 -11 105 76 244 330 456 -203 88
3712H8J08l34j59L41j46l63L75J29j79J91JK33M6n28k89L42J04J54j88M6J5mJ53
$$ 88 196 -138 -297 44 -102 -465 -90 39 -140 51 52 285 331 -197 -486 -144 -40 114 -74 -28 -13 -17 136
3735A36J7J7m58R4J01n5k14M91Mj99L49oJ79l91n9K59j03l98j45L20J81l64N17
$$ 136 153 170 -288 -194 -93 -148 -362 129 133 -66 283 277 456 65 6 265 162 -236 -381 -61 120 -244 273
3758B73k11K01n79L07O1j82j98K85J4K0n4K9L54n79K95J80l78J66k68M6L26k44
$$ 273 62 263 -316 -9 52 -130 -328 -43 -29 -9 -63 -34 320 -259 36 216 -162 4 -264 -218 108 -136
3780a36m2J58R6j04L87Rk99k82O7K0j35L02k19K29l87K9K22N6j20K35o3NQ1k53
$$ -136 -178 -20 76 -28 359 368 69 -213 -146 -126 -261 41 -178 51 -336 -307 -85 -29 -149 86 23 28 109 -144
3804a44L43j51j62O2K50K62l34p8j83N4M0l12L56j58J05q0M14k18J55j96M0j77
$$ -144 199 48 -114 -52 198 460 126 48 -135 -81 -41 -353 3 -155 -50 -130 284 66 221 25 65 -112
3826a12j61K28P0l94M39k63L30p4J80J64l83K6k64R8o9K76l23O30k09P4o8O0J51
$$ -112 -273 -45 25 -369 70 -193 137 63 243 407 24 50 -214 -116 -185 91 -232 398 189 263 195 255 406
3849D06m32K04N7k91j47L04k19k00M09j32K22j39l70Q36m80m19J57M48m89K52
$$ 406 -26 178 235 -56 -203 101 -118 -318 91 -41 181 42 -328 508 28 -391 -234 214 -275 -23
3869b3K54m0J22k59N9j57J8k16M16l18N5j18P5M47j84l06J36k8j58N5K53l70J6
$$ -23 231 191 313 54 113 -44 -26 -242 174 -144 -89 -207 -132 315 131 -175 -39 -67 -225 -170 83 -287 -271
3892b71L10L8J54p0l06O28l33l77J47R7j99k59M17o2K22j96J36j66M5j27J39M37
$$ -271 39 77 231 161 -145 483 150 -227 -80 17 -182 -441 -24 -86 136 -60 76 -90 -45 -172 -33 404
3914D04p01J69J21j56K25O8k3q4K08k98K08p0m89l7K65JJ84K18K16m62K60j67
$$ 404 -297 -128 -7 -163 62 130 107 23 231 -67 141 71 -418 -455 -190 -189 -5 213 429 -33 227 60
3936F0K09k1k17nj40l9K38M8j82k1P7J75J56k38l69J50K14k09l21N63J3l14N2
$$ 60 269 248 31 26 -114 -153 85 133 -49 -70 7 182 338 100 -269 -119 95 -114 -435 128 141 -173 -121
3959a21J92K9k65L41k77j1l1M89j35j44J2N8k33k6O8K73j91j80l2K58r3k01M19
$$ -121 71 100 -165 176 -101 -112 -143 346 211 67 79 137 -96 -122 -54 219 28 -152 -184 74 -19 -220 199
3982A99k04J24j57j0k28J19J97j25L70n23Q6j53K43K33n0O0J56j14l47Q8Q1p8
$$ 199 -5 119 -38 -48 -276 -157 40 -85 285 -238 -152 -305 -62 171 121 181 337 223 -124 -36 45 -33
4004c3k63M18k26J80l8J64k64k8N8j4j4j20j35N47l04Q3Q0L46m32n9K55j01k4
$$ -33 -296 122 -104 76 38 202 -62 -90 -32 -46 -60 -180 -315 232 -72 11 91 437 5 -54 201 100 76
4027G6j74M04m21O3j22K71n10L81k12M4J72J0J3j81J57k24L66j22k40L86K89k64
$$ 76 -98 306 -115 -52 -174 97 -413 -32 -244 -200 -28 -18 -5 -186 -29 -253 113 -9 -249 137 426 162
4049A62l47k7L46O1m75K24L3q7k0J57K25l62pj86K20L16k75p3l1Q5J39l0L28j54
$$ 162 -185 -212 134 195 -280 -56 -23 -110 -130 27 252 -110 -117 -303 -83 233 -42 -115 -146 -61 78 48 376 222
4073B22n03L16j23J93l65K18j45K79j54L25k16j62J90q3R3j47JJ9K43n33M74J84
$$ 222 -281 35 -88 105 -260 -42 -187 92 -62 263 47 -115 75 -8 85 -62 -61 -42 201 -332 142 326
4095C26j10l01JJ40K53m77j02K6J96k39M95J70k12J99m62K20k04K37j04K01l23
$$ 326 216 -85 -84 56 309 -168 -270 -244 -48 -287 208 378 166 365 -97 123 -81 156 52 253 -70
4116g0m9K87q5pk08K39k02K4j48K42k70J60k98N19m22J05L05K42l12p3J93J46
$$ -70 -119 168 83 76 -132 107 -95 -71 -219 23 -247 -87 -385 134 -288 -183 122 364 52 -21 172 318
4138C18k77k52Q7Q2J39k41L09l0K53l90K40n12P8K01N4K05k81M8J46j55j22j7
$$ 318 41 -211 -124 -42 97 -144 165 135 388 -2 238 -274 -196 5 59 264 -17 31 177 22 -100 -117
4160a17J94l3j02J83j12k41J27M3M96m45M2j4L54j49j98L1j51j96L54n8L15o36
$$ -117 77 44 -58 125 13 -228 -101 -58 438 -7 35 21 375 226 28 59 -92 -288 66 8 323 -313
4182c13K96R1J57l53J56Pk94K04K5K39l74J9J22L30l26L7m5n7j03M15j24j35k1
$$ -313 -17 74 231 -122 34 41 -253 -49 -24 215 -159 -140 -18 312 -14 23 -22 -79 -182 233 109 -26 -47
4205d7q4K43K3k44N18l05j1k51L04l8j3l67N04p9m17K17L75r1j30j70J32Pk74
$$ -47 -131 112 135 -109 409 104 93 -158 146 108 95 -272 232 153 -264 -47 328 237 107 -63 69 76 -198
4228a98o9M50l36J75K44n3O8m27J13J33j70M6p0K97l7l13L56k24j63J11L0K9K9
$$ -198 -267 183 -153 22 266 213 281 -146 -33 100 -70 -24 -94 203 166 -147 209 -15 -178 -67 -37 -8 21
4251B1j86j07J47n2J03K33k28K60m1j79N5m9K01k34j91j54L94R3q4K57j01Q8j60
$$ 21 -165 -272 -125 -177 -74 159 -69 191 150 -29 26 -23 178 -56 -247 -401 -7 86 2 259 158 246 86
4274H6l41J63j4q3K38Q6l79L14J09J7J27m70K4K50P4k84j80K78N1q9q8L79J4p24
$$ 86 -255 -92 -106 -189 49 135 -244 70 179 196 323 -147 -123 127 201 -83 -263 15 66 -23 -111 268 282 -442
4298d42L33R7j36K17mJ40l68K11J14K3l94L06O5j46p1K70k58O4k1K9K00j30l4
$$ -442 -109 -12 -148 69 65 205 -163 48 162 185 -209 97 162 16 -55 215 -43 21 0 29 229 99 65
4321F5l72O05n8j61j96J14k82Q8J54L3O0j67K19M3l1n7n1K03k97k59L82r1Q0r2
$$ 65 -307 298 240 79 -117 -3 -285 -197 -43 -10 50 -117 102 145 114 57 6 209 -88 -347 35 -56 24 -68
4345f8L23k33MJ61K26m40nj5k07Q0J45j80L78k44k95O18n07J19Q7j64N5O6N00
$$ -68 255 22 26 187 413 -27 -32 -47 -254 -174 -29 -209 169 -75 -370 248 -259 -140 -53 -217 -162 -96 404
4368D04m93J94m8j83K23p2J22o4o4j34p3K90m5j1l8K51k01j96K52k60M7J09k1
$$ 404 -89 105 57 -126 97 25 147 83 19 -115 -188 102 57 46 8 259 58 -138 114 -146 -99 10 -11
4391a1R0n4k3j18L12j98K00j57J53j65J17j89N5N0k34L56P0k76j57J14J09k06
$$ -11 79 25 2 -116 196 -2 198 41 194 29 146 -43 12 62 -172 184 254 -22 -179 -65 44 -162
4413a62L1L31ql74J50K90l81M1J69j6l43L45j14K17p5j08j9M9O3j83K91Q6n17
$$ -162 -131 200 192 -182 -32 258 -123 -82 87 71 -272 73 -41 176 101 -7 -26 23 86 -97 194 280 -237
4436b37K56J43m47M33n3l0J73k56pK41k43r5J28M90l95n0j93L38r6m08L44k0K04
$$ -237 19 162 -285 148 95 65 238 -18 -25 216 -27 -122 6 496 101 51 -142 196 100 -308 36 16 220
4459B20l96L08n6L8j53L9j06p4n7K14P6J82j92jJ58l28K66p3J63l34o4k22K60
$$ 220 -176 132 76 114 -39 0 -106 -180 -237 -23 53 235 43 42 200 -128 138 65 228 -106 -170 -392 -132
4482a32O0M4o6M5L07j02O7k20j35M14k75j39K32q7K28P6j82k21O5p7K08k67J38
$$ -132 -72 -28 -94 -49 258 156 223 3 -132 282 7 -132 100 13 241 317 135 -86 -21 -98 110 -157 -19
4505a9j79J57K10r2k61L77k80k7k50K47o1N5L4J38J63l61O6J29j5j32J07O9J36
$$ -19 -198 -41 169 77 -184 193 -87 -114 -364 -117 -178 -123 -89 49 212 -149 -83 46 31 -101 6 75 211
4528B11j86L0K09m06J16P7L65l24j90L49M3l57N7pj6L5l62M81j86j57K69j49R3
$$ 211 25 55 264 -142 -26 51 416 92 -98 251 294 -63 -6 -13 -29 6 -356 125 -61 -218 51 -98 -5
4551ej71J03K18l47j03O01k42o3K22M4j82kJ28k88j41J81k16M4R4j36J59NJ68
$$ -5 -176 -73 145 -202 -305 296 54 -9 213 257 75 73 201 -87 -228 -47 -263 -219 -125 -261 -102 -97 71
4574G1N0m71L22J52l15J31J91j71M03m57N3N7K14k07q1R9j50J22qk33Q0K06J14
$$ 71 121 -350 -28 124 -191 -60 131 -40 363 -94 -41 16 230 23 -58 41 -109 13 5 -228 -148 58 172
4597A72l59k75O69M7l08j11k95N57k20J62j17K88r7j83R8j70J95o9J75n4o7j37
$$ 172 -187 -462 207 254 -54 -165 -460 97 -123 39 -78 210 113 -70 28 -142 53 -16 159 105 38 -99
4619i9o6k9J03j21K44j82K72n0K7J63K8m48L24r5p9RR4p9k8m1o2J2O5K42l89J49
$$ -99 -165 -194 -91 -212 32 -150 122 72 99 262 290 -158 166 71 -8 1 95 16 -12 -53 -115 -103 -38 204 -185 -36
4645c6O2j02M7j27J87J05J04k63o7L15l02j12J94J20m63M00N1l93M82l80j0L82
$$ -36 26 -76 -29 -156 31 136 240 -23 -90 225 -77 -189 5 125 -338 62 113 -280 202 -178 -188 194
4667A94m18J01M7K54k39K69q4J80l46j8J05m1L0o19O13k25K15k5J32k42J38n3
$$ 194 -224 -123 -76 178 -61 208 124 304 -42 -60 45 4 34 -585 28 -197 18 -7 125 -117 21 -32
4689c2l0j37P3J48J36k46J46k17J81q3j04K90j88J35m2L5K97m39o9N0L23l5q0
$$ -32 -62 -199 -126 22 158 -88 58 -159 22 -61 -165 125 -63 72 30 65 362 -77 -146 -96 227 192 112
4712A12m0j23R5K00k81J63k41K56k39L22l73m9M04l20p3K21n1j91K93k5p6l4l6
$$ 112 72 -51 44 244 -37 126 -115 141 -98 224 -149 -198 206 -114 -187 34 -17 -208 85 60 -16 -50 -86
4735h6J81J64l63L38r1k84K17l49M75k91J82m46K27lJ90l71M42R8k74j16r3p0
$$ -86 95 259 -104 234 143 -141 76 -273 202 -89 93 -353 -126 -129 61 -310 132 230 -44 -160 -253 -323
4757c23K59n6m9O2J41M2k17N7K77j4l20K27Q5o8j54q5L21j01j16K8j76P5J00M11
$$ -323 -64 -120 -169 -107 34 76 -141 -84 193 179 -141 86 171 103 -51 -136 185 84 -32 -4 -180 -105 -5 406
4781D06j45j55j19P1mJ35l90L12j85M25m54M0J14N1m3o7L10k21q0N4M1k23K36
$$ 406 261 106 -13 58 54 189 -201 111 -74 351 -103 -63 51 102 59 -8 302 81 1 55 96 -127 109
4804A09k91R8N1L40l49p8M40k57k36M92l32j26M28k76p6j06J47OR3J57j29M0j32
$$ 109 -182 -84 -33 307 -42 -120 320 63 -173 319 -13 -139 289 13 -63 -169 -22 -16 77 234 105 145 13
4827A3j16J48J67k63K38l25r8L75k88K92r1k5J59k41J00L24n17q0L07j88J52j67
$$ 13 -103 45 212 -51 187 -138 -236 139 -149 143 52 27 186 -55 45 369 -148 -228 79 -109 43 -124
4849a24J23r6K43j38n6p1J93k1J41k13J32J9R4j83k35P6j34P2L03q1j68J44k44
$$ -124 -1 -97 146 8 -48 -119 74 53 194 -19 113 132 226 43 -192 -116 -250 -178 125 44 -124 20 -224
4872b24J46J15J02Q5l53M08j86k91R5L02J5k78J57k1O7k16j07k73O56k6l54K42
$$ -224 -78 37 139 224 -129 279 93 -198 -103 199 214 -64 93 72 139 -77 -184 -457 199 173 -181 61
4894F1p9R8Lp0j3q7k87M68K08l15j43O12k49l41J18Ok5P3k57J96L25l24j24J67
$$ 61 -18 80 83 13 0 -87 -374 94 302 -13 -156 456 207 -134 -16 -10 -35 38 -219 -23 302 -22 -146 21
4918B1N3J98l21Q2J7o6J32J79k34J14j73J97k24k44K85r5j5p4K23j63J28k6k6
$$ 21 74 272 -49 33 50 -16 116 295 61 175 2 199 -25 -269 16 -79 -94 -168 55 -108 20 -6 -32
4941c2R2Q7o8Lj28Q3l92M76o7k09Q1K37k11L37k06k91L5J94J06P6j46j09K7J24
$$ -32 60 147 79 82 -46 37 -355 121 54 -155 -74 163 -48 289 83 -208 -173 21 127 203 57 -52 -25 99
4965I9l50K71P7p7l4R4N8R0l98P3J89j35m0J74n2K66k07j66J64l03j64M81P1m05
$$ 99 -251 20 97 20 -14 80 138 228 -170 -97 92 -43 -83 91 39 305 98 -68 96 -207 -371 110 181 -224
4989b24n1O6J55k36M88k06q1K96j38J64J71l81J10l25K00J30k95K36M6m1n8PL2
$$ -224 -275 -209 -54 -290 198 -8 -89 207 69 233 404 23 133 -192 8 138 -157 79 125 84 26 33 65
5012F5j03j00J74K7k31K37k1j17LJ0K56m86K68N2J10J09K4o3o43O97l49K46k20
$$ 65 -38 -138 36 63 -168 69 48 -69 -66 -56 200 -286 -18 34 144 253 277 214 -429 268 -81 165 -55
5035e5L9j91J50O4k6j06K49k19M9K50l09J85j83j02J62j61O4j8L88m71L29q2J1
$$ -55 -16 -207 -57 7 -19 -125 124 -95 -46 204 -105 80 -103 -205 -43 -204 -140 -158 230 -241 88 6 17
5058A7J37m56K75J50l9j94K26m6l19K5K27m1j50K62k54O8J4J17J81l39p9L20q3
$$ 17 154 -302 -27 123 84 -110 116 70 -249 -224 3 -38 -188 74 -180 -112 -98 19 200 -139 -218 102 19
5081A9l26K88j24L07k0j70K38j27k20K89k77k4L6N19j81n44J29J17J4k71N27j99
$$ 19 -307 -19 -143 164 144 -26 212 85 -135 154 -123 -147 -111 408 227 -317 -188 -71 -57 -328 199 0
5103@j83K47k07Q8J63R9k94k47L44j13j35K82K81l16K82k47k23J50J58j51l0j34
$$ 0 -183 64 -143 -55 108 207 -87 -334 10 -103 -238 44 325 9 291 44 -179 -29 129 -22 -52 -186
5125a86K71J08k66jj34Q5J11r4O4K4l7K5M0Oj41K69lJ15l73K54L3n9J0r6K29n3
$$ -186 85 193 -73 -74 -208 -123 -12 -106 -42 -18 -55 -30 10 16 -125 144 141 256 -117 137 170 111 121 25 254 201
5151B01k99NN2mqR9J31K5j11Oj26J02m7j8Lj73O4K1O9J64K9q7K42n37J27K06p6
$$ 201 -98 -93 -41 -45 -53 46 177 202 91 97 -29 73 26 8 11 -162 -98 -77 -8 156 185 98 340 -197 -70 136 60
5178F0j70j7K66K1k38J69k83k7R4j16N66l05j95L83j9k18M3l5M8j18k38N67J2
$$ 60 -110 -127 139 160 -78 91 -192 -219 -125 -241 325 20 -175 208 189 -29 14 -21 27 -91 -329 238 250
5201B50m44K00N9j54J80p1j48p3J32n2J91q8j49MN85m33o4J48J64m9j45l5Q7l59
$$ 250 -194 6 65 -89 91 20 -128 -201 -69 -121 70 -18 -167 -163 422 -11 -75 73 237 188 43 8 95 -264
5225b64n3K02J7R8j51K06K89m67K54j74n8j9K30N6n1j32j05P0k6J22k37O6R1k62
$$ -264 -317 -115 -98 0 -151 55 344 -123 131 -43 -101 -120 110 166 115 -17 -122 -52 -78 44 -193 -127 -36 -298
5249b98L33L17m23J1J56K82j65l69J73k06K78P9j08J1j2R5M1j29l42L95m1J98
$$ -298 35 352 -71 -60 96 378 213 -156 17 -189 89 168 60 71 59 154 195 66 -276 119 78 276
5271B76m00K10l96O36o06K52rn2q1K79J94m34J02J89k46j96L98M0m01K33j29L40
$$ 276 -124 86 -310 326 -280 -28 -37 -89 -170 109 303 -131 -29 160 -86 -282 116 156 -245 -12 -141 199
5293A99k04Q3m5P8o3j33k14L44j50L0J07r0L08m17J70L02l8k47J05n37K0K57L28
$$ 199 -5 78 33 111 48 -85 -299 45 -105 -75 32 -58 250 -167 3 305 267 20 125 -412 -392 -135 193
5316A93P9k02O8p3k51J61k11L26J08j87O3K22l27qO7L8k10R1J10J58M1l06M09
$$ 193 272 70 138 65 -186 -25 -236 90 198 11 74 296 -31 -39 28 66 -144 -53 57 215 256 -50 359
5339C59k09k27M4P3L1m1l5k2J71l13N6m6M48n77J62Q2k03K04L40l55m9m1P4J50
$$ 359 150 -77 -33 40 71 30 -5 -27 144 -169 -113 -159 289 -288 -126 -44 -247 -43 297 -58 -107 -148 -74 76
5363G6q7k16K80L3k76J21J0J59l6j07J29l53Q2M00l59j60J41J52J40j12r8L22
$$ 76 -11 -227 53 86 -190 -69 -59 100 64 -43 86 -267 -185 215 -144 -304 -163 -11 129 17 -81 241
5385B41k26n1J20J7k73J50k52M29M7l92m0Q2K13N6PJ30l70j96J97M50k79m72M74
$$ 241 15 -36 84 101 -172 -22 -274 155 202 -190 -230 -148 65 121 128 258 -112 -308 -111 339 60 -412 62
5408F2L89m14M8j42M3J78l56m1N0K15J4M5k08r8J95j64R4K21j01k8J22l75N01
$$ 62 451 37 85 -57 -14 164 -192 -233 -183 32 46 91 -117 -215 -20 -184 -90 131 30 2 124 -251 250
5431B50j41j62j13J68J03j23l15N64r2j87P0Q8J13p2M7j46j57L6Q1j21K03j42
$$ 250 109 -53 -166 2 105 -18 -333 231 139 -48 22 110 223 151 198 52 -105 -69 12 -109 94 -48
5453d8j83M10k28k03N56k74k78M17l21M23k62L04n33j7K50r2K26j16k88l5J24
$$ -48 -231 179 -49 -252 304 30 -248 169 -152 271 9 313 -220 -237 13 -79 147 31 -257 -292 -168
5474a68J55R3j76L4L22j64k24K83j54j04J80J21k4l31J83K5j56O5J52R6j93n3
$$ -168 -13 80 -96 -62 260 96 -128 155 1 -103 77 198 174 -157 26 51 -105 -40 112 208 15 -38
5496c8K06n2L4k37M16j12k01J00L1r1j27j47J27j34N9O5N6J56P1j85K11j45k64
$$ -38 168 116 150 -87 329 217 16 116 147 56 -71 -218 -91 -225 -166 -101 -45 111 182 -3 208 63 -201
5519b01M7L32j55J6l00K55Pk58J22j0R5K68j88J7J05j94K82j42n19M35j23K95
$$ -201 -154 178 23 39 -261 -6 1 -257 -135 -145 -50 218 30 47 152 -42 240 98 -421 14 -109 186
5541A86j90k59k2K08Q1L60n02J12K0Q9K6Lj25MM5k45K52M1L17l74K4M7J30k90
$$ 186 -4 -263 -285 -77 4 364 -138 -26 -6 83 109 112 -13 -9 36 -209 43 84 401 27 51 98 228 -62
5565f2K61k38mJ79q7K12k03k15N6J48N9l30K24l09J95j30L17j2K13l61J26J58
$$ -62 199 -39 -43 136 49 261 58 -157 -101 47 106 -224 0 -309 -114 -244 73 61 274 -87 39 197
5587A97k74L16k75J41j98j42N50o3k07m9M4l01K79R9p3k1n0K84j61J28m14K47
$$ 197 -77 239 -36 105 -93 -235 315 252 45 -4 40 -261 18 117 44 23 -27 257 96 224 -190 57
5609E7K94k59K17j59K30o61L61j98M65n44P0K56k98L05m3L6m3p8m4R6K20m63K36
$$ 57 351 92 309 150 380 -281 80 -118 347 -197 -127 129 -169 136 93 129 86 8 -36 60 280 -183 53
5632E3K31k73q7n6K07J7j13P1n6J32l06L07p2m1J9j95L32j75l03K76J09k48L30
$$ 53 284 11 -76 -132 75 92 -21 50 -6 126 -180 127 55 14 33 -162 170 -5 -308 -32 77 -171 159
5655A59k50k75J94J69K34k18O3n1N4o6r7k14K10k23J85M23O0o51K66r5K51r1l51
$$ 159 -91 -366 -172 -3 231 13 76 25 79 13 -84 -298 -88 -311 -126 297 357 -294 -28 -123 128 37 -314
5678c14M06j00M7j0K75k89k01M70m9j92l6k40L13J16k50K13n8oK38l75J51k78
$$ -314 92 -8 39 29 304 15 -186 284 235 43 7 -233 80 196 -54 159 101 95 333 -42 109 -169
5700a69K04J05n8j92q6J91J6M8j62K16k21J85l34J47o1K26m6J72l79R4L29J1m12
$$ -169 35 140 82 -110 -196 -5 11 59 -103 113 -108 77 -257 -110 -171 55 9 181 -198 -104 225 236 -176
5723a76j33K71J64r7n6K92j18n1j17K72j21l24J16k9J02l34J61K84q6j5M4J9k26
$$ -176 -309 -38 126 29 -27 265 147 96 -21 251 130 -194 -78 -107 -5 -339 -178 106 20 5 49 68 -158
5746a58M0M42k68J78k12O3j85NJ28K07j91q7j48L99j42l3m0k06O13o52L03k5P8
$$ -158 -118 324 56 234 22 85 -100 -95 33 240 49 -38 -186 213 71 38 -2 -208 405 -247 56 31 109
5769A09Q3l4K65k02k87P4Q6n00J05M12p5PP4j01M4r9o9M66m60l8j19J11J51j16
$$ 109 192 158 423 221 -66 8 94 -406 -301 111 36 43 117 16 60 -39 -108 358 -102 -140 -259 -148 3 -113
5793a13K83j79l7J15L6J62k45j7o5O6L9j12O8L18k99J03j36k05K21j67K62n5j64
$$ -113 170 -9 -46 69 105 267 22 5 -60 6 45 -67 1 319 20 123 -13 -218 3 -164 98 43 -121
5816a21j56N17q7m1Mo1j10j39O4Nk5L64j42j10r0l7K59J00j85o4N8L2N3l50J44
$$ -121 -277 240 153 112 116 55 -55 -194 -130 -125 -150 214 72 -38 -128 -165 94 194 9 -55 3 35 88 -262 -118
5841a18K38o1j13M6L95l40j88J15M41n12J48j16J26k51L96k52j97K69M7K69k37
$$ -118 120 59 -54 -8 387 47 -141 -26 415 -97 51 -65 61 -190 206 -46 -243 26 73 342 105
5862A05p6j40N9R9m4q5L67n30O2L80j4n07N25M9m77J79M23j93l9n3k2K39j19k47
$$ 105 29 -111 -52 47 3 -82 285 -245 -183 197 183 -324 201 250 -227 -48 375 182 143 90 68 307 188 -59
5886e9j39K26j18j45J54r7K60l47M97K4k68P5K7J67k18J17q3k98J51J00J45J73
$$ -59 -198 28 -90 -235 -81 -178 82 -265 232 256 -12 63 90 257 39 156 73 -225 -74 26 171 344
5908C44m74O25m36J49o04K0K73n5J6O6j79K49j19K09l14J36M74l30J6m58J14J93
$$ 344 -130 495 59 208 -396 -376 -103 -158 -142 -76 -255 -6 -125 84 -230 -94 380 50 66 -392 -278 -85
5930h5K40l81L05L4j13o6O6k80J33r2J26L4K21j12J37m5j3l63j0L02j75k96O53
$$ -85 155 -226 79 113 0 -66 0 -280 -147 -239 -113 -79 142 30 167 122 109 -254 -264 38 -137 -433 220
5953B20k98j96M0K97Qj65j45N9M93n50R6L22l82Q2L70m21n8L81q0K54k04l22J8
$$ 220 -78 -274 -234 63 71 -94 -239 -180 313 -237 -141 181 -201 -119 251 -170 -228 153 73 327 123 -199 -181
5976a81K61j46j02L31r3j40K77J21l90j16J0j35J28kRK65k28p2K89L24l09m06
$$ -181 80 -66 -168 163 70 -70 207 328 -62 -178 -168 -303 -175 -177 -168 97 -131 -203 86 410 101 -305
5998c05L24J0J2j60M44j88m50K26M4R7l46M88p5j05N1n3j86l9NJ75p3K41l95K50
$$ -305 19 29 41 -119 325 137 -313 -87 -43 54 -292 196 121 16 67 14 -172 -211 -206 -31 -104 137 -258 -8
6022hK80p7j79rK56m70L02R4J77j87k70J66j98o2k23J57N66l27r0L08K1j83N9
$$ -8 272 195 16 7 263 -207 95 189 366 179 -91 75 -123 -185 -408 -251 315 -12 -102 206 227 44 103
6045A03j20M08m52L89j29k74l28L24K94k22j07P2M07j33k60Q3J37l53K07k07L10
$$ 103 -17 391 -61 328 199 -75 -403 -79 215 -7 -114 -42 365 232 -28 55 192 -161 46 -161 149
6066A49k27J30K1K59l50J16K89l99k07J78K19j25l33J31J12L21m36K56j7j2n12
$$ 149 -78 52 73 332 -18 98 387 -12 -219 -41 178 53 -280 -149 -37 284 -152 104 87 75 -437
6087d37M39K1J5k00O3J54j31L0L17o1m14J79K10j48j16K40k63J65n30L54N4NO8
$$ -437 2 23 38 -162 -99 55 -76 -46 271 210 -204 -25 185 37 -79 161 -102 63 -467 -113 -59 -54 14
6110A4l08L44j26j05J2K43m0j94L34n1k22j61N44j5n00J82m1m4n2K62L5j82j5
$$ 14 -294 50 -76 -181 -169 74 34 -160 174 123 -99 -260 284 269 -231 -49 -90 -134 -186 76 111 -71 -86
6133h6l6K73m51L17J03L8j70L5J07k64q9K07L8j02K69l57M86j13m75J87K15k9
$$ -86 -122 151 -300 17 120 158 -12 23 130 -134 -223 -16 22 -80 189 -168 318 205 -270 -83 132 103
6155A03k50J21J95k00q3J11L00l49k42K98N2j91k5j92O50l08JJ14m92J74L06k71
$$ 103 -147 -26 169 -31 -114 -3 297 -52 -294 4 56 -135 -160 -352 298 -10 -9 105 -387 -213 93 -178
6177a78K09j05L53J55k71l75M09J86j98n8l72M66l41K35p7P4J47l29J9M3q0j37
$$ -178 31 -74 279 434 163 -212 197 383 185 127 -245 221 -120 115 38 112 259 -70 -51 -8 -88 -225
6199b25K17N4j12k57M80j11m4j03M13j81j98j5P0m7j08L47j9j47K65j62J14j70
$$ -225 -8 46 -66 -323 157 46 2 -101 312 131 -67 -82 -12 -59 -167 180 161 14 279 117 231 61
6221F1O8O2j31r1j69l9O2J26j54M72o2j42k43K84N3o5k97K81m6q7R8k9K81l89
$$ 61 129 191 60 -31 -200 -239 -177 -51 -205 267 205 63 -180 104 157 92 -205 76 30 -57 41 12 293 -96
6245i6L17k21K57l94j46M70j94R5j16k4o1J29K54k5o02J26N75n80L88k29M51k41
$$ -96 221 0 257 -137 -283 187 -7 88 -28 -52 -113 16 270 245 -357 -231 344 -236 152 -77 374 133
6267A33k64J09J72N0k71K25j7j41p7J93k87j04m5O08j99n4r9LK16l92M37m35K09
$$ 133 -131 -22 150 200 -71 154 137 -4 -81 112 -175 -279 -324 284 85 31 -68 -65 151 -241 196 -239 -30
6290c0k52J0L88k30O7P1J60l08K83l7O6m8l44M97r7m52j11M71L43o34j85M03J49
$$ -30 -282 -272 116 -114 -47 24 184 -124 159 122 188 140 -204 293 196 -256 -367 104 447 -187 -372 31 180
6313A80k10R2j36K19J22m99N80k52j10J54j86j59J49k7p2K68r6j54J32m4k7M25
$$ 180 -30 62 -74 145 267 -232 348 96 -14 140 -46 -205 -56 -83 -155 113 17 -137 -5 -49 -76 349
6335C49j88K1m27P02l36l17Q5L83r3o12M48J0J16Q6j79j90O2l3K07J94j34j94
$$ 349 161 182 -245 457 121 -196 -111 272 179 -433 15 25 141 227 48 -142 -80 -113 94 288 154 -40
6357d0K99k41J00k70KO1K58l77J73K38j45k61L51m1q5j68L12L7m35J12L87J17
$$ -40 259 18 118 -152 -150 -89 169 -208 -35 203 58 -203 148 107 22 -146 166 203 -232 -120 267 384
6379C84n06Q7L85j17l94K28j1j77l8J5J56k15N6K45j99k7K6L29k39j12N9K69m42
$$ 384 -122 -35 350 233 -161 67 56 -121 -159 -144 12 -203 -147 98 -101 -128 -102 227 -12 -124 -65 204 -238
6402b38K97j69K57N2l2J9j74j36k34M37K07m02k4J81P3k70m0K28k58L20k2j69
$$ -238 59 -110 147 199 167 186 12 -124 -358 79 286 -116 -140 41 114 -156 -196 32 -226 94 72 -97
6424i7K90m74L67m7j73K61l41L28k00J70k33K36j62L8M4R2j37k0j69M08m19J9
$$ -97 193 -281 86 39 -134 127 -214 114 -86 84 -149 87 -75 -37 7 99 -38 -58 -227 181 -238 -219
6446b19L92k31J46j36J25LoJ15o5L78l99q4O8k5j45j00K21M8j69J65K47k33k07
$$ -219 173 -58 88 -48 77 80 74 189 124 502 103 19 87 62 -83 -183 38 86 -83 82 329 96 -111
6469a11J73L59k59k54M51k89j33j36K91j68j64%J67K56m15K19k06Q1p7o4K43J67
$$ -111 62 421 162 -92 359 70 -63 -199 92 -76 -240 -240 -73 183 -232 -13 -219 -138 -215 -279 -36 131
6491A31j70j9L01J81n13J86M4j74L52l74J43k84O8J24K59l53n3n0M24k68q5M56
$$ 131 -39 -58 243 424 -89 97 141 -33 319 -55 88 -196 -128 -4 255 -98 -151 -201 223 -45 -130 326
6513C26l25j95Q9L11j63j31m3K07j24j47J20J51%j33N5M69o71j51M55J00l46n
$$ 326 1 -194 -105 206 43 -88 -131 76 -48 -195 -75 76 76 -57 -2 467 -204 -355 100 200 -146 -151
6535a51L99k19l10J72J31j25r4n8N3R0L4r2L82k70J18l3L78l39l50K26M47n97
$$ -151 248 29 -281 -109 22 -103 -197 -255 -202 -112 -78 -170 212 -58 60 27 405 66 -284 -58 389 -208
6557b08P8K79l4l59M7K50O0j4j37P3O5K4k31N11m14j17rN06l63J3J97k26K45l13
$$ -208 -130 149 115 -244 -197 53 113 99 -38 35 100 124 -107 404 -10 -127 -136 370 7 20 217 -9 236 -77
6581g7K06O3m2j66M02k7m76J2L38k38Q8k6J00L00l85k27J98k8j81J17Q6j20N0
$$ -77 129 192 150 -16 386 359 -117 -105 233 -5 83 57 157 457 72 -155 43 15 -166 -49 37 -83 -33
6604c3K05j2k23L92l82J68l02K30j77L61j97Q1j88q8p7J4N31l52j34K8K68L07
$$ -33 172 160 -63 329 -53 115 -187 43 -134 227 30 111 -77 -165 -242 -228 303 -49 -183 -155 113 420
6626D20m03k00L76k17pm0L44l02j54L07K6l86K04J95j3K06m28k52N13o8l8J21
$$ 420 17 -183 193 -24 -31 -71 273 -29 -183 124 150 -236 -32 163 150 356 -72 -324 189 121 83 204
6648B04R7m62k8N73j50m41L47k94J15%L8O1p9N2j25O8m2J06k67N23k82P7k10K93
$$ 204 301 -161 -189 384 234 -207 140 -154 -39 -39 -1 60 -19 33 -92 -24 -66 40 -227 296 14 91 -119 174
6672A74j71j51L89ol55K92j7j27k24K43m2J11m73L60k27Q1o7QL78m21J82K31l51
$$ 174 3 -148 241 235 -120 172 155 28 -196 47 5 116 -357 3 -224 -143 -210 -202 176 -245 -63 168 -183
6695a83j09J61K17J45k89q1j18J69j63l4N01n5l46K36n4j26K05j63L77j76k55
$$ -183 -292 -131 86 231 -58 -139 -257 -88 -251 -285 216 161 -185 51 -3 -129 76 -87 290 114 -141
6716a41lL07l16J01j24L81m83L88q5J76l44l69L89J91k52N3J89q0k6Q7J63k86
$$ -141 -144 163 -153 -52 -176 205 -278 110 25 201 -143 -512 -123 68 -184 -131 58 -22 -48 39 202 -84
6738h4Rl5J48j3K00MK04p63M93K3j57J26j25k55J72K52n2m4jj70j73K74q0O8j06
$$ -84 -75 -110 38 25 225 229 433 -330 163 186 29 155 30 -225 -53 199 147 103 102 -68 -241 33 -47 21 -85
6763h5Q7q0o8J66l7J96r0j55J54J87j69P7j97J22o8j4k35j76M48k75J82j09K06
$$ -85 2 -78 -146 20 -17 179 89 -66 88 275 106 183 -14 108 40 26 -209 -385 63 -212 -30 -139 67
6786F7J3N6j71o2j32L89p6M9O4J2l91n1J96k60K37L32K7k81n0L2j11P9l2J15j63
$$ 67 80 136 -35 -97 -229 160 84 133 197 209 -182 -233 -37 -297 -60 272 299 18 -32 0 -111 -32 -64 51 -112
6811a12m2J04J33o7j80K92K07k09k44K10J14l45J13k41K04p1j51M63j45m20N84
$$ -112 -154 -50 83 16 -164 128 335 126 -118 92 206 -139 -26 -267 -63 -134 -285 178 33 -387 197
6832A97J1l5k27l85M25K20k57K10P1l1l17kK55q6k00O3L88k10j83jJ89j09q6J
$$ 197 208 173 -54 -439 -14 206 -51 159 230 199 -118 -120 135 49 -151 -88 300 90 -93 -94 95 -14 -100 -99
6856i9R4L27k27Nl4J07m86N11j11l3j43K85j77R9l13J90j99K55j04K54k94K25
$$ -99 -5 322 95 100 66 173 -313 198 87 54 -89 196 19 118 -195 -5 -204 51 -53 201 -93 132
6878A32j75J5J05k87J87O2L1q9L16o4l49M16l59L02k34k89O40l29P5m11N31j00
$$ 132 -43 -28 77 -210 -23 39 70 -19 297 233 -116 300 -59 243 9 -280 360 31 106 -305 226 126
6900A26j26m6J68l73J22j7L53k67N0L4k2k51K65k4J20q2k38J04J11KK4J34j86
$$ 126 0 -46 122 -251 -129 -146 207 -60 -10 24 2 -249 16 -8 112 30 -208 -104 7 9 33 167 -19
6923a9m7Q1K06r3m23J15J68J13J41n2k11j01p0K20K68k46r0j94L54m78M21j19
$$ -19 -66 15 221 128 -295 -180 -12 101 242 190 -21 -122 -192 28 296 50 -40 -234 120 -358 63 -56
6945e6J40j47Q7J20j85o8k24L40J51j29k35L77L7o9j68j25oJ48m8OO3J22J7p9
$$ -56 84 -63 24 144 -41 -109 -333 7 158 29 -206 171 208 139 -29 -154 -160 -12 -60 -54 9 131 148 69
6969F9j43K9j0J71j15N8k15P3K73k96J89Rj32k75M33K45m58K00k92L04k49P6J08
$$ 69 -74 -45 -55 116 1 59 -156 -83 190 -106 83 92 -40 -315 118 363 -95 105 -187 117 -132 -56 52
6992E2k20N3K45j9m05K01J67K44j92n03L29M8N1j98J87p3l92J61L46m4j16O2K34
$$ 52 -168 -115 130 111 -294 -93 74 318 126 -377 -48 0 51 -147 40 -33 -425 -264 82 38 -78 -16 218
7015B18k29%MJ94K37l60O2j77j07m2J71K33Kl40K68J2l8k04K64k26j2Q7k11L31
$$ 218 -11 -11 -7 187 424 64 126 -51 -158 -200 -29 204 206 -134 134 146 108 -96 168 -58 -70 17 -194 137
7039A37l51J10p1L74l49M28r8j52N4l51L34k22L5j05M16l75J00j56L59j95L23
$$ 137 -214 -104 -175 199 -150 278 180 28 82 -269 65 -157 -122 -227 189 -186 -86 -242 117 -78 245
7060B45nK9k52m5J24j55j1J26K60n57K51j30K01o8j6m2K39n2k44K39q5m4J3J90
$$ 245 240 269 17 -28 96 -59 -70 56 316 -241 10 -120 81 13 -3 -45 194 142 -102 137 52 8 21 211
7084B11m1k89j78M36j27p2j41K8R9k03L06J43n11j3K07M96l36k75K45j30%P1m4
$$ 211 170 -119 -297 139 12 -60 -201 -173 -74 -277 29 172 -339 -352 -145 351 15 -260 -15 -145 -145 -74 -118
7107a18K41o4j82K55k36J42k4l4M11j19k1j70l44K46k75O68m08j55J53j4p1R1
$$ -118 123 59 -123 132 -104 38 14 -20 391 272 251 81 -263 -17 -292 376 -32 -187 -34 -48 -119 -28
7129b8K13n1J91l28M6p3J87l29L90r8l40J51K8O6m78J46J25K63l37L56J17K01
$$ -28 185 134 325 -3 43 -30 157 -172 218 120 -220 -69 -41 25 -453 -307 -182 81 -256 100 217 418
7151D18n66NK73k93K44q7m3J31j3j72J30j07k15K02l54L35O8L74l36l1j14M81
$$ 418 -148 -143 130 -163 81 -6 -49 82 69 -103 27 -80 -295 -93 -447 -112 -44 330 -6 -37 -151 330
7173C30l24J7J99m06K63l30L31q1J26j29j4Rj21R5J30j03j60K05l1p6k84j23N03
$$ 330 6 23 222 -184 79 -251 80 -1 125 -4 -18 -9 -130 -35 95 -8 -168 37 6 -70 -354 -477 26
7196B6O2j86K83j77ml73N9O61j41o5j32p9K15k76K22M5o4l9l7k9J97k70j15J83
$$ 26 88 -98 185 8 4 -369 -310 351 210 145 13 -66 149 -127 95 140 76 37 0 -29 168 -102 -217 -34
7220c4N9l69L85k2j95J00l6p9J71j13J30nk39K48K08n7n2o8m6J47n38M45J18o2
$$ -34 25 -344 41 19 -176 -76 -112 -191 -20 -133 -3 -8 -247 1 209 152 100 32 -14 133 -405 40 158 96
7244I6J3j71j6J53n16O77l60K17l52K76L42l03Mj40K3K9j00j28L08k90L01N9J0
$$ 96 109 -62 -78 75 -441 236 -124 93 -259 17 359 56 60 -80 -57 -28 -128 -256 52 -238 63 122 132
7267A32M5n2L1r6k54J73Q3J87k61j31K13L1l21J13M53m59k52N73m98K06J57j8
$$ 132 177 125 156 60 -194 -21 62 249 -12 -143 70 101 -220 -107 346 -113 -365 208 -290 -84 73 55
7289E5R2r6R4j92j31K35j91K17J13l43J20L02m88N7K82j56m0K02j93j16J48Q4
$$ 55 147 51 145 -47 -178 57 -134 83 196 -147 -27 275 -213 -156 126 -30 -70 132 -61 -177 -29 55
7311E5j50J2J80j63L44o1j16M2K09k04J5K0j81j11q0K68q5j00J93n3J03mm25L9
$$ 55 -95 -83 97 -66 278 217 101 143 352 148 163 183 2 -109 -189 79 -6 -106 87 34 137 133 -292 -253
7335b53J16J04M1R3J2l32o9K70j55O4k8K3K5p4J51M0J12n0nj56K83l60m7N41n26
$$ -253 -137 -33 8 101 113 -219 -288 -18 -173 -109 -137 -114 -89 -163 -12 28 140 90 85 -71 212 -148 -195 346 -180
7360a80L60r7N2l22L05o9J06J6j58j60J37K79k36Q2k13qj81L41K2k27J51P1p1
$$ -180 180 83 135 -187 118 49 155 171 13 -147 -10 269 33 115 -98 -106 -287 54 76 -151 0 71 0
7383@l9K76p5k54L1L37l82Q1J76k80J47k92K25j58M80N2m70L15j48k18K41K16
$$ 0 -39 237 162 -92 -61 276 -106 -25 151 -129 18 -274 -49 -207 273 325 -145 170 22 -196 45 261
7405B61l13q9K7l9K75j98j05J56n2j40L67j97J06j38K64k23q8R7j9N2j91k5M06
$$ 261 -52 -141 -114 -153 122 -76 -181 -25 -77 -217 150 -47 59 -79 185 -38 -126 -29 -48 4 -187 -212 194
7428A94K1l51k45M47K8k25J81J63k91j73N21k29k33J55J45j49Q4j50J29j02K7
$$ 194 215 -136 -381 66 94 -131 50 213 -78 -251 270 41 -192 -37 108 -41 43 -107 22 -80 -53
7449e3L5L11m3j66j77L5K69k29J97k74M17l28o9QL9M0J75O6k56L5p8K67k28Q6
$$ -53 -18 293 250 84 -93 -58 211 -18 179 -95 322 -6 -75 -67 -28 12 187 253 -3 32 -46 221 -7 79
7473G9Q2l32J26l3J92j62j51J87l9pj78L73k9r7M1k8K15j97l17J01J86J65m41
$$ 79 161 -171 -45 -78 114 -48 -199 -12 -51 -58 -236 137 108 11 52 24 239 42 -275 -174 12 177 -264
7496b64L55j81J50l09J11L64l40J88j53Q2R7J73j61n9l09J87J32l23K26J3J39
$$ -264 91 -90 60 -249 -138 226 -114 74 -79 3 100 273 112 53 -256 -69 63 -260 -34 -21 118
7517A18j54k12N0L68k03L11l90K43P7k40j34M41j57k47M14m27j21M17L6k01j31
$$ 118 -36 -248 -198 170 -33 278 -112 131 208 -32 -166 275 118 -129 285 -142 -263 154 190 -11 -142
7538a42K63k48K74j67p6K05q6n0P9k5j4j92J76p7p9j05K43K07j50j16K22p4l05
$$ -142 121 -127 147 -20 -96 109 23 -27 52 27 13 -179 -3 -80 -159 -264 -21 186 36 -80 142 68 -237
7561b37M2K35J40j73Lo0J41J0l57N70o14L68L6r4n2o6J10o8k5K77k2j76k06K59
$$ -237 -195 40 180 7 10 -50 91 101 -256 314 -300 68 104 10 -42 -108 2 -66 -91 186 164 -12 -218 41
7585D1j39K49k58N01o91K75J83l28K20M7k48J89j17M18m89K61o8K17l30J6K30
$$ 41 -98 151 -107 394 -297 -22 161 -167 53 100 -148 41 -76 342 -147 114 46 263 -67 -51 179
7606A79l79p7N2K17J51j44r2M04k26NL2m7l9p2L5K21j81M1N9j32j3P9j08k35L14
$$ 179 -200 -277 -225 -8 143 -1 -93 311 85 90 122 75 36 -36 -1 220 39 80 139 7 -6 73 -35 -270 44
7631D4J41o1l89R4Q4L88m66J50N6K2l3k87M95k95K57k76Q8l6J4J70k3l39M20k15
$$ 44 185 124 -265 -171 -87 301 -165 -15 41 63 30 -257 238 -57 200 -76 12 -24 -10 160 137 -202 218 3
7655CL1m7M1J04p7k42J13L56k28o6K69l88M8j32M14k91j3Q6l93N32p9O4J84k04
$$ 3 34 -13 28 132 55 -187 -74 282 54 -12 257 -131 -83 -215 199 -92 -105 -19 -412 120 41 105 289 85
7679H5k43J49j01J85k5R8k15K55p5k70J50J15K26l80j56nK43j44K81k04P8nl8
$$ 85 -158 -9 -110 75 50 148 -67 188 113 -157 -7 108 334 -46 -202 -207 36 -108 173 -31 47 42 4
7702DQ8j09Q8J64r0k06K64m03L27l05N3K33j29K10k96K4q8N1k1J29l53K86J25
$$ 4 92 -17 71 235 145 -61 203 -200 127 -178 -125 108 -21 189 -107 -83 -171 -120 -141 -12 -365 -79 46
7725D6K2m5j29J74Q0j79o4M16n14N4R9n5M04k20j00k65L61l1j04J3p1q8K82J25
$$ 46 68 23 -106 68 148 -31 -95 321 -193 -139 -40 -95 309 89 -11 -276 85 54 -50 -37 -108 -196 86 211
7749B11k78K03r3J15p3j70J04k02r4N2J70J13l96K83q5j86K89J8L69j27m63J08
$$ 211 -67 136 43 158 85 -85 19 -183 -277 -225 -55 58 -338 -55 -140 -326 -37 -19 350 223 -240 -132
7771a32K45k91K27r9K29J13m15L16k04j65Q1J5L21m24K66J11k31p5L58k25K36
$$ -132 113 -178 49 -50 179 292 -123 193 -11 -176 -95 -80 241 -183 83 194 -37 -112 246 21 257
7792B57k77k30L30J9k33K8l5K46n5j50K1L90l38m2Q5n1q3J6K41k76K12k08K47
$$ 257 -20 -250 80 99 -134 -106 -141 105 50 -100 -79 311 -27 -69 16 -35 -118 -102 139 -137 75 -133 114
7815A14j53m6R9k04J04J88L15n28j14N2L25K3k51J7J79l9j63K08m0j18J38k67
$$ 114 -39 -85 14 -190 -86 102 417 -111 -225 -173 152 175 -76 -59 120 81 -82 126 86 -32 106 -161
7837a61L34l1m7J47m86K09J9k35K22j45L13k20j73M58M6p3j07l12M85j50j83j67
$$ -161 173 142 95 242 -244 -35 -16 -251 -29 -174 139 -81 -254 204 250 177 70 -242 243 93 -90 -257
7859b57L84j06j49J91kJ28o9j06jJ05m59L32K17k97Pp7J53J11j88J85l17J45k21
$$ -257 127 21 -128 63 61 189 120 14 13 118 -341 -9 208 -89 -82 -159 -6 105 -83 102 -215 -70 -291
7882b91R1M54j22k34M6j24k21L39N2M5n68N03K78l38N2J92m13K95k31M64k23j11
$$ -291 -200 254 132 -102 -56 -180 -401 -62 -10 35 -533 -30 248 -90 -38 154 -259 36 -195 269 46 -65
7904f5j41M29o1k76j29K53K03j76J3K63l61M4K06m51N25m94L63j17n5q5j04M76
$$ -65 -206 223 162 -114 -243 10 213 37 50 313 -48 -4 202 -249 276 -218 145 28 -27 -112 -216 260
7926B60j74j52L8j12M15n99L74j21J78j27j4Q0j54J99l08L32l62K04K1L67l29
$$ 260 86 -66 -28 -140 275 -324 50 -71 107 -20 -34 46 -108 91 -217 115 -247 -43 -22 345 16
7947A6LK1J18K75p82M43j40qr6J06j22N19m35K4L6k2J10J96nk73k00K82j00J51
$$ 16 19 40 158 433 -349 94 -46 -54 -150 -44 -166 353 -82 -58 -22 -44 66 262 257 -16 -216 66 -34 117
7971A17J68k10k92J80N8J89k84q1J05P5j97K96J28l11L10o5j63K55l95J25l15
$$ 117 285 75 -217 -37 21 210 -74 -155 -50 25 -172 124 252 -59 251 186 23 278 -117 8 -307
7992c07L35j97R5J57o6J29j24K35l27J7p3m9j9L4p5N2J38r9J21L84j83q8j01P2
$$ -307 28 -169 -74 83 17 146 22 257 -70 -53 -126 -175 -194 -160 -235 -183 -45 -144 -23 361 178 90 -11 61
8016F1j20J50jkj38l2K9M1P3j0J46l75j2K24k91L7O1R2l0J87j45J35j7J57k43
$$ 61 -59 91 90 88 -50 -82 -53 -12 61 51 197 -178 -190 34 -257 -220 -159 -67 -97 90 -55 80 63 220 -23
8041b3q1P1J21J36m24J79j38j38L14q4K14Q4j53k93L67M5r3p7J17qk17l56J17
$$ -23 -104 -33 88 224 -200 -21 -159 -297 17 -67 147 231 78 -215 152 197 104 27 144 136 -81 -437 -320
8064c20M54k53K88k40j06L34R7k47O7J54l74j1O6M03m78K92j28K21j22k41p0K69
$$ -320 134 -119 169 -71 -177 157 254 7 74 228 -146 -157 -91 312 -166 126 -2 219 97 -144 -214 55
8086E5J08k76j70J07J55Mk41M7R6J49K85m16K41k02K17j11l33M21J80n72J22M41
$$ 55 163 -113 -283 -176 -21 -17 -258 -211 -115 34 319 -97 144 -58 159 48 -285 136 316 -256 -134 307
8108C07m15J89j26p4M63k75r9j09M7K1j31K31O4k6k85N12l26j03K7l6J55K37j6
$$ 307 -108 81 -45 -119 344 69 -30 -139 -92 -71 -202 29 93 67 -218 294 -32 -135 -108 -144 11 248 232
8131B32m26P5k79N10k30N4m6K62j9m8m7O4P6j98J63m9q4N3r4J49L6K07l61J03
$$ 232 -194 -119 -398 112 -118 -64 -110 152 133 85 38 102 178 -20 143 94 10 63 -31 118 154 361 0 103
8155A03J9k11k5J22J28p9K2o8m6j4P0O9j90J08K72l65L10l44K12j07k0n4j78L74
$$ 103 122 -89 -114 8 136 57 79 11 -35 -49 21 90 -100 8 280 -85 225 -119 93 -14 -34 -88 -266 108
8179A08l39J76n3l80K78K08J89k75qK33m0j89
$$ 108 -231 -55 -108 -488 -210 -2 187 -88 -96 137 97 -92
8191i2
$$ Imaginary data points
##PAGE= N=2
##DATA TABLE= (X++(I..I)), XYDATA
0@%%%%%%%%%Qj6J6j6J6j9K7l2M0m8N6o7P5q8J04j20J36j55J78k02K28k58K91l24
$$ 0 0 0 0 0 0 0 0 0 0 8 -8 8 -8 8 -11 16 -16 24 -24 32 -35 40 -48 56 -64 72 -83 95 -107 121 -137 154 -170
33a70L62m03M47m99N55o15O81p53Q35r25J024j136J259j399J558j739J950k199
$$ -170 192 -211 236 -263 292 -323 358 -395 440 -485 539 -597 662 -737 821 -918 1032 -1167
51a167K497k860L320l920M733n915P794j1253J9747p8090j44890Q0570R7701M9573
$$ -1167 1330 -1530 1790 -2130 2603 -3312 4482 -6771 12976 -65114 -210004 -129434 -31733 17840
65A7840J5391N2105L0148J0931L2474M1105n2165j23732q8270r561M872O070K4283
$$ 17840 33231 85336 115484 126415 158889 199994 147829 24097 -64173 -73734 -68862 -62792 -38509
78c8509J2164k7520M578P5556N6966m9156q7708l1869O031J150K7122N6376J9480
$$ -38509 -26345 -53865 -49287 26269 83235 34079 -53629 -85498 -79467 -78317 -51195 5181 24661
91B4661k4846K0359P9065L5902n1058o7110m0720m3014k8200L0256M4265j2402
$$ 24661 -185 20174 99239 135141 84083 16973 -23747 -66761 -94961 -64705 -20440 -32842
103c2842k5953M8641Q6789L1236j9585j6332l0813o4379l0127M1395K7331m4164
$$ -32842 -58795 -10154 76635 107871 88286 71954 41141 -23238 -53365 -11970 15361 -28803
115b8803l2346M8487O3783P364j4134o363m1034p5146k9496L2466J5212k5251
$$ -28803 -61149 -12662 51121 58485 44351 37988 -3046 -78192 -107688 -75222 -60010 -85261
127h5261k6M8275N2609M4003M8133J0215n9052n9989P110K2295k9891l8910J2116
$$ -85261 -85287 -37012 15597 59600 107733 117948 58896 -1093 6017 28312 -1579 -40489 -28373
140b8373K8934O695K6483N8353P294p3204o4375m89M126l2610k2358J1016P784
$$ -28373 561 7256 33739 92092 99386 26182 -38193 -38682 -34556 -67166 -89524 -78508 -70724
153g0724J4756O7254P9855L479n4825k4592P158j9835l4862l060K775k6024j11
$$ -70724 -55968 11286 91141 94620 39795 15203 22361 2526 -32336 -35396 -32621 -58645 -58756
166e8756P2377P2910n168m3600j6051o592k6602j5806O359j9245l9993J5387Q0261
$$ -58756 13621 86531 81363 37763 21712 15120 -11482 -27288 -20929 -40174 -80167 -64780 15481
179A5481N8503M1j2909o291k7516l1964J662J067n0780n3529K1453O7429L7589
$$ 15481 73984 74025 61116 54825 27309 -4655 -2993 -1926 -52706 -106235 -84782 -17353 20236
192B0236J0683J7275j383l8617j9837K6852K081o1506m8789K5228N3633L0861
$$ 20236 30919 48194 46811 8194 -11643 15209 17290 -44216 -93005 -67777 -14144 16717
204A6717K8477K8702j1056l7525o48K5882k0947o6170l5913J1645J5421K2054
$$ 16717 45194 73896 62840 25315 24667 50549 29602 -36568 -72481 -60836 -45415 -23361
216b3361N0042L3351k7021l4538J9999K8245l0242n8245k5654o38M56K9560N9254
$$ -23361 26681 60032 33011 -1527 18472 46717 16475 -41770 -67424 -68062 -67606 -38046 21208
229B1208K6356k2792p873L1986J2244l2421l1732j6947k9995k0639L7159N9866
$$ 21208 47564 24772 16899 48885 61129 28708 -3024 -19971 -49966 -70605 -33446 26420
241B6420Q438k6391Q026L2551j56k7361j6428k3237m8494k0683M2251M8044J111
$$ 26420 34858 8467 16493 49044 48888 21527 5099 -18138 -66632 -87315 -45064 2980 4091
254D091n780K6713K4809n436m689J558l5410o1685j6775L7727K6699m491P881
$$ 4091 -1689 25024 49833 44397 39708 41266 5856 -55829 -72604 -34877 -8178 -12669 -4788
267d788K6465P447l038J6924N282m7258n9223m983K8220Q166L599K8439K4914
$$ -4788 21677 29124 26086 43010 48292 1034 -58189 -63172 -34952 -26786 -23187 5252 30166
280C0166k597Q222L3729L834n3880n2109p594M226n978J1880K7271K082j1442
$$ 30166 27569 35791 69520 73354 19474 -32635 -40229 -36003 -41981 -30101 -2830 -748 -12190
293a2190K5824M3630n070m9831l1666m451j1133n891K8063K8550q365n288M0141
$$ -12190 13634 57264 52194 2363 -29303 -33754 -44887 -50778 -22715 5835 -2530 -7818 32323
306C2323M3630p250l4728k2208k3463l0948j445K9374O028k5883K407M7124L2557
$$ 32323 75953 68703 33975 11767 -11696 -42644 -44089 -14715 -8687 -34570 -32163 14961 47518
319D7518p690j2494r516l2350l2744J1479L0939n550k3432J4331M0897K1917M863
$$ 47518 39828 27334 17818 -14532 -47276 -35797 -4858 -10408 -33840 -19509 21388 43305 48168
332D8168O845j5589m8758l0500J7647J5399k4874k2047J9135K9658J5566K2498
$$ 48168 55013 39424 -9334 -39834 -22187 -6788 -31662 -53709 -34574 -4916 10650 33148
344C3148K3349j6542m5183j5701J9087Q25k5464p008J5810J0436J3855L7428K5057
$$ 33148 56497 39955 -5228 -20929 -1842 -1017 -26481 -33489 -17679 -7243 6612 44040 69097
357F9097k8090m4274o090R601j6778k5277j019O163j866K1247M8751K3241k4184
$$ 69097 41007 -3267 -9357 244 -16534 -41811 -42830 -36667 -38533 -17286 31465 54706 30522
370C0522k2554N306j433k2646j0128M791j0044j1383K9216N0098J1475k2549j0364
$$ 30522 7968 13274 11841 -10805 -20933 -16142 -26186 -37569 -8353 41745 53220 30671 20307
383B0307K200j7773k3177j755k835k4637q968L6406M0776N184n480R236j481k3619
$$ 20307 22507 4734 -18443 -20198 -23033 -47670 -56638 -20232 20544 25728 20248 29484 28003 4384
397D384j0895J0336r969l2817m645L5198K7565K575P265J1115j4210k4139Q65
$$ 4384 -6511 3825 -6144 -38961 -43606 -8408 19157 21732 28997 40112 25902 1763 2628
410B628O003k6801l4887K321K5020J2012R485K5671J3452j8819j2572J6700N978
$$ 2628 8631 -18170 -53057 -50736 -25716 -13704 -4219 21452 34904 16085 3513 20213 26191
423B6191k9768k7038M059R740K777J8552K9496J345k2462j279J7957p804l2949
$$ 26191 -3577 -30615 -26556 -16816 -14039 4513 34009 35354 12892 11613 29570 21766 -11183
436a1183j8739k263q926j008L0545L1291l960j3230J3371J9199r467k1013q911
$$ -11183 -29922 -32185 -41111 -42119 -11574 19717 15757 2527 15898 35097 25630 4617 -4294
449d294j3055k2153L939L6254K0347j2663n949J8860R325j3979j1040o137k5495
$$ -4294 -17349 -39502 -35563 691 21038 8375 2426 21286 30611 16632 5592 -545 -26040
462b6040k7844J0746L4664J2773o876J0474K0713L802k641O419q654l8307k7782
$$ -26040 -53884 -43138 -8474 4299 -2577 7897 28610 32412 29771 36190 27536 -10771 -38553
475c8553J4960K2026m348o087J3887J0497o394K624J2163j4131l9005j7261J6098
$$ -38553 -23593 -1567 -5915 -12002 1885 12382 5988 8612 20775 6644 -32361 -49622 -33524
488c3524J3082M5J1636K0142M814J371K2507J7713k2082l6139q979N863p781p449
$$ -33524 -20442 -20397 -8761 11381 16195 17566 40073 57786 35704 -435 -9414 -3551 -11332 -18781
502a8781J2690Q028r909K145K5640J0063k4331k4067j993k338j0623N570K0727
$$ -18781 -6091 1937 -7972 -5827 19813 29876 5545 -18522 -20515 -22853 -33476 -27906 -7179
515g179M231o829J6492L1585N463j8959j1164m352j7750j6010Q022J0402j0771
$$ -7179 -2948 -9777 6715 38300 43763 24804 13640 9288 -8462 -24472 -16450 -6048 -16819
528a6819p398K2102K4805j638p953L639o323k3628q656J5962O064j4137k66K3709
$$ -16819 -24217 -2115 22690 21052 13099 16738 10415 -13213 -21869 -5907 157 -13980 -14246 9463
542I463J5742j792J226K710j9426k7900m262P433j0298j5113R627K0334O078O040
$$ 9463 25205 23413 24639 27349 7923 -19977 -24239 -16806 -27104 -42217 -32590 -12256 -6178 -138
556a38K2380J1479j8966j7983Q759Q450j3355j0756J0150Q688j695R926K0309
$$ -138 22242 33721 14755 -3228 5531 13981 626 -10130 20 8708 7013 16939 37248
569C7248j994k5691j4112K145q806j9469k839P263l864j738K5370K8618j651j5205
$$ 37248 35254 9563 -4549 -2404 -11210 -30679 -33518 -26255 -30119 -31857 -6487 22131 20480 5275
583E275K329O766j1225j1797M402P90j4215J273K6809J9511p684r183L805m780
$$ 5275 7604 14370 3145 -8652 -4250 -3460 -17675 -16402 10407 29918 22234 13051 16856 12076
597A2076j6413m678M482j1005j7319R282K8352J2031l189N139N956j2189j3545
$$ 12076 -4337 -9015 -4533 -15538 -32857 -23575 4777 16808 13619 18758 24714 12525 -1020
610a020N046J362k3479j8927J2499K0683K352k32J0914L153j3388m082J0754k686
$$ -1020 4026 5388 -18091 -37018 -24519 -3836 -1484 -1716 9198 12351 -1037 -5119 5635 2949
624B949k0686p842J4577J1468L478J3443J4609o365j3539N262Q908j6902k7079
$$ 2949 -17737 -25579 -11002 466 3944 17387 31996 25631 12092 17354 26262 9360 -17719
637a7719m928P151l416j346J6625J1956q244n885J3077P351j4430j3583K005m73
$$ -17719 -22647 -15496 -18912 -20258 -3633 8323 79 -5806 7271 14622 192 -13391 -11386 -11859
651a1859o887Q967K0491L300j0522N176J5741l302j8158o356J388j2415j1586
$$ -11859 -18746 -9779 10712 14012 3490 8666 24407 21105 2947 -3409 -2021 -14436 -26022
664b6022J2100J8069j656n139J3026J3579o599j0669J463m505j8592q590J3100
$$ -26022 -13922 4147 2491 -2648 10378 23957 17358 6689 8152 3647 -14945 -23535 -10435
677a0435Q146o075J567J5007M664q640L99N324j1511k0075K42J3791R65m593J1757
$$ -10435 -2289 -8364 -6797 8210 12874 4234 4633 9957 -1554 -21629 -21387 -7596 -6631 -11224 533
692E33J6890q55n604Q835N232j7406j9138J159M444o665j949J2831O261n987L182
$$ 533 17423 16568 10964 19799 25031 7625 -11513 -10354 -5910 -12575 -14524 -1693 4568 -1419 1763
707A763J4338j161j8552p953N613l266r044P841J5859q54p501J0723J6516m746
$$ 1763 16101 14940 -3612 -11565 -5952 -9218 -18262 -10421 5438 4584 -2917 7806 24322 19576
721A9576j6728m510P87j0329p922R360P606p399j704J6924J1674o286n404L974
$$ 19576 2848 -1662 -875 -11204 -19126 -9766 -2160 -9559 -11263 5661 17335 11049 5645 9619
735I619n210j4299L33J3007r65j1998L595J7038M074q353j05K441j3210j4454
$$ 9619 4409 -9890 -9557 3450 2485 -9513 -5918 11120 15194 6841 6736 9177 -4033 -18487
749a8487M794Q232p693q130J1651J5066J165R75R922J105j5073o906R022J64j4472
$$ -18487 -13693 -5461 -13154 -21284 -9633 5433 6598 7573 17495 18600 3527 -3379 5643 5807 -8665
764h665m233J0697M850m145N866J0885o682j6366m54R287o024j2304L190J1133
$$ -8665 -12898 -2201 2649 -1496 4370 15255 8573 -7793 -8247 1040 -4984 -17288 -14098 -2965
778b965R74P62J3170R276q336r395M549J296j2966q424N315R8o984M536J5668
$$ -2965 -1991 -1229 11941 21217 12881 3486 8035 9331 -3635 -12059 -6744 -6646 -13630 -9094 6574
793F574K973j1104j276R703l067j2809j003Q235k866o108R961J4330j518o528
$$ 6574 9547 -1557 -2833 6870 3803 -9006 -10009 -1774 -4640 -10748 -787 13543 12025 5497
807E497N932M610j0444j0445L235J122j2216m207J2764P678o304J47J1097J096
$$ 5497 11429 16039 5595 -4850 -1615 -493 -12709 -16916 -4152 3526 -2778 -2631 8466 9562
821I562j1965k641P611l500j1368J820J1964J492m900P665R735n905j0228L682
$$ 9562 -2403 -5044 2567 -933 -12301 -10481 1483 2975 -1925 5740 15475 9570 -658 3024
835C024L801j0669j0796N393N709m779K1J3180O030q352k201R414K96j2325l643
$$ 3024 6825 -3844 -14640 -9247 -3538 -8317 -8296 4884 10914 2562 361 9775 10071 -2254 -5897
850e897P233j804p855N147J2724j113r956K010P765n138j1359R27L002o791l648
$$ -5897 1336 -468 -8323 -3176 9548 8435 -1521 489 8254 3116 -8243 -7316 -4314 -11105 -14753
865a4753J1122J0442m844l522J0028N488q791m285M767k376j2039p55J2115K398
$$ -14753 -3631 6811 1967 -1555 8473 13961 5170 885 5652 3276 -8763 -9518 2597 4995
879D995q864J407R239l53p913R89M244q034r967N736R601l120n074Q418Q350n496
$$ 4995 -3869 -2462 6777 6424 -1489 -500 3744 -4290 -14257 -8521 1080 -2040 -7114 1304 9654 4158
895D158l444P036J351j2639n731Q705L809p166r60R993K315o889K038P922n295
$$ 4158 714 7750 9101 -3538 -9269 -564 3245 -3921 -4881 5112 7427 538 2576 10498 5203
910E203j2725K90P771l336q034N087Q689k619l987Q119O247q779p307N167L819
$$ 5203 -7522 -7232 539 -2797 -10831 -5744 2945 326 -3661 4458 10705 1926 -5381 -214 3605
925C605p968l583Q398L231o528R35J0428K59j0779j688P635k026r620J176Q762
$$ 3605 -4363 -7946 452 3683 -2845 -1910 8518 8777 -2002 -3690 3945 1919 -7701 -6525 2237
940B237j285n465N989R175m501p305M311M550q415p585N412M097p467k634R603
$$ 2237 952 -4513 1476 10651 6150 -1155 3156 7706 -709 -8294 -2882 1215 -6252 -8886 717
955G17M347p649j892Q684O12r879j370P732P3p353L610R678j999o584N204P202
$$ 717 5064 -2585 -4477 4207 4819 -5060 -6430 1302 1375 -5978 -2368 7310 5311 -1273 3931 11133
971A1133n366r982L415M885o579o478O182N773o383l390Q541M826r074l380O646
$$ 11133 5767 -4215 -800 4085 -2494 -8972 -2790 2983 -3400 -6790 1751 6577 -2497 -5877 769
986G69J207p703L94R133j91p318L361J0640j873q833J296O144n165q086L603N525
$$ 769 1976 -5727 -5333 3800 3609 -3709 -348 10292 8419 -414 882 7026 1861 -6225 -2622 2903
1002B903o355n779P636O356n510m596O297L250p106k202P952J545q435k67J0473
$$ 2903 -3452 -9231 -1595 4761 -749 -5345 952 4202 -2904 -5106 2846 4391 -4044 -4311 6162
1017F162J513q438j91O228k435q035K252N935m705p683N052Q740l154n289O160
$$ 6162 7675 -763 -954 5274 2839 -5196 -2944 2991 -1714 -9397 -4345 4395 1241 -4048 2112
1032B112N530n875l628O828L286q644m383P154L059p463k678O147l35p975R52
$$ 2112 7642 1767 -1861 4967 8253 -391 -4774 2380 5439 -2024 -4702 1445 1110 -6865 -5913
1047e913P262k120q446K626R478j345n644M884O965l235n775N980N533p138o216
$$ -5913 1349 -771 -9217 -6591 2887 1542 -4102 782 7747 4512 -1263 4717 10250 3112 -3104
1062c104N324M192p205m543N806J444p792j314Q153M64q516K8R118M41o837K400
$$ -3104 2220 6412 -793 -5336 470 1914 -5878 -7192 961 1425 -7091 -7063 2055 2496 -4341 -1941
1078a941P766k012o067L885O768n052p043M555N153n794n623N126L434o813l654
$$ -1941 5825 3813 -2254 1631 8399 3347 -3696 859 6012 218 -5405 -279 3155 -3658 -7312
1093g312P241K892p086j827Q118K944o701J29P731l91p015J610O812l932q145
$$ -7312 -71 2821 -4265 -6092 2026 4970 -1731 -1602 6129 5738 -1277 333 7145 3213 -4932
1108d932K417O433l660p347L846N385n020m556N906M938n793l451P364M897n160
$$ -4932 -2515 3918 258 -7089 -3243 2142 -2878 -7434 -1528 3410 -2383 -5834 1530 6427 1267
1123A267j538P027J385o633j048O691k238r677m21O573k051p480J471O644k581
$$ 1267 -271 6756 8141 1508 460 7151 4913 -4764 -5185 1388 -663 -8143 -6672 -28 -2609
1138b609n114N280O450m299n281N833O550m271l341N913L200n967k051O732K22
$$ -2609 -7723 -2443 4007 -292 -5573 260 6810 2539 -802 5111 8311 2344 293 7025 7247
1153G247r587l443N901n96p504J07O917o41n601M506Q195k398o608L486O657m069
$$ 7247 -2340 -5783 118 -478 -7982 -7875 -958 -1599 -7200 -2694 5501 3103 -3505 -19 6638 2569
1169B569n028L854M302n532l797O945L827p807m729N388J792p316j591O265N53
$$ 2569 -2459 1395 5697 165 -3632 3313 7140 -667 -5396 -8 1784 -5532 -7123 -858 -305
1184c05n733K680R425P6o222J465O630k747o866J600M278n353n281M653N200m517
$$ -305 -6038 -3358 6067 6143 -79 1386 8016 5269 -1597 3 4281 -1072 -6353 -1700 3500 -1017
1200a017m885N081K974n571l118N582J429o330m1R410K579n365J161Q091q99p174
$$ -1017 -5902 -821 2153 -3418 -6536 -954 475 -5855 -5896 3514 6093 728 1889 9980 9081 1907
1216A907k23L819l751q169K078N615l321n463M417N970m129m643N045L142o260
$$ 1907 1684 5503 1752 -6417 -4339 1276 -2045 -7508 -3091 2879 -1250 -5893 -848 2294 -3966
1231c966l250O923L873n178j29Q051K207n929p89M646k211q320n41N382k961o060
$$ -3966 -7216 -293 3580 -1598 -1727 6324 8531 2602 1813 6459 4248 -4072 -4613 769 -2192 -8252
1247h252L766P430j563m192M349M779n254m770M485L157o145l799P053M338n193
$$ -8252 -4486 2944 1381 -2811 1538 6317 1063 -3707 778 3935 -2210 -6009 1044 5382 189
1262A89j800N989K63p604j705N555j858p915O57Q128J252l680L403O831j875m785
$$ 189 -1611 4378 4641 -2963 -4668 887 -971 -8886 -8229 -101 1151 -2529 874 7705 5830 1045
1278A045L195M245o474o726K973M460l614k897N032K511n565k167O249P6q526
$$ 1045 4240 8485 2011 -4715 -1742 2718 -896 -3793 1239 3750 -1815 -3982 2267 2343 -6183
1293f183l135N839J898m068K491P455K40m365M014O469l953q586N90L142l941
$$ -6183 -9318 -3479 -1581 -5649 -3158 4297 4537 172 4186 10655 6702 -1884 -1294 1848 -2093
1308b093m383N270M337m456k264O643M352o841n126L693O64n661L07O629J283
$$ -2093 -6476 -1206 3131 -1325 -3589 3054 7406 565 -4561 -868 -204 -5865 -5558 1071 2354
1323B354m843J977Q122k26o982j110K963m016o383K788N525k900l347O073P122
$$ 2354 -2489 -512 7610 7384 402 -708 2255 -1761 -8144 -5356 169 -2731 -6078 -5 7117
1338G117k840l613L228J536o384l682N156J683n403p41P520K465n036n57M158
$$ 7117 4277 664 3892 5428 -956 -4638 518 2201 -3202 -3943 3577 6042 1006 449 4607
1353D607k117q357N1M605k294n662L998P078m27k462M755M821m585n433L079K184
$$ 4607 2490 -5867 -5816 -1211 -3505 -9167 -5169 1909 1482 -980 3775 8596 4011 -1422 1657 3841
1369C841n733l908N066L649m146k25O826J377o615k543L694j835o458J50N789
$$ 3841 -1892 -5800 -734 2915 -1231 -1456 5370 6747 132 -2411 1283 -552 -7010 -6860 -1071
1384a071o79l383M511P839j309m984K187K490n358n791L034L070m861k582P078
$$ -1071 -1750 -5133 -622 7217 5908 924 3111 5601 243 -5548 -2514 556 -4305 -6887 191
1399A91N264l149j678L831K13p260j244M865j540o414J480Q274J795k977J864
$$ 191 5455 2306 628 4459 4672 -2588 -3832 1033 -507 -6921 -5441 2833 4628 1651 3515
1414C515M070m268o684J608L152n594n914M218O092o51l49N465K465n775k640
$$ 3515 7585 3317 -3367 -1759 1393 -4201 -10115 -5897 195 -456 -805 4660 7125 1350 -1290
1429a290M871L07p218l546N387K294k311L305N439j601o356J090M553m132p440
$$ -1290 3581 3888 -3330 -6876 -1489 805 -1506 1799 7238 5637 -719 371 4924 792 -6648
1444f648l10L528j167q73O578N293m090l425M739K857n257n252J970K65m151J897
$$ -6648 -6958 -3430 -4597 -5470 1108 6401 2311 -1114 3625 6482 1225 -4027 -2057 -1792 -5943 -4046
1460d046P391J532m238K93N613n76o101j817J612l951m761M458O914j355l559
$$ -4046 3345 4877 639 932 6545 5969 -132 -1949 -337 -4288 -9049 -4591 2323 968 -2591
1475b591M099M800k474l932J527M1o839k413N888L452l060k99O537J992m123p79
$$ -2591 1508 6308 3834 -98 1429 1470 -5369 -7782 -1894 1558 -1502 -1801 4736 6728 2605 1826
1491A826L106l576p537l05N503k78l358L423O222q19l006L371K221o439o318J837
$$ 1826 4932 1356 -6181 -6486 -983 -1261 -4619 -1196 5026 4207 1201 4572 6793 354 -5964 -4127
1507d127K593l379j041N631L599k871j65N908N32p535k752K106q64m089J970O033
$$ -4127 -1534 -4913 -5954 -323 3276 405 240 6148 6680 -855 -3607 -1501 -2365 -6454 -4484 1549
1523A549M69l296M110N938k199n835n19R49m645l613M111M140l006r70N833L697
$$ 1549 2018 -1278 2832 8770 6571 736 217 1166 -3479 -7092 -2981 1159 -1847 -2817 3016 6713
1539F713l153k891J125k636o273o41N601J141l901J784P121K430k482J187J555
$$ 6713 3560 669 1794 -842 -7115 -7756 -2155 -1014 -4915 -3131 3990 6420 3938 5125 6680
1554F680n205o448J874M061k384m530L621N126n96m05L793q23p157m220L846J873
$$ 6680 1475 -4973 -3099 962 -1422 -5952 -2331 2795 2199 1794 5587 4764 -2393 -6613 -2767 -894
1570h94m129j059N159K623q78L683N168k719p675j166K907j667n258O12L424j492
$$ -894 -5023 -6082 -923 1700 822 4505 9673 6954 -721 -1887 1020 -647 -5905 -5293 -1869 -3361
1586c361J70O725M321m512n067K123J662m172k570K606O12k480K372P946K008
$$ -3361 -3191 3534 7855 3343 -1724 399 2061 -2111 -4681 -2075 -1463 -3943 -1571 6375 8383
1601H383n056k019K008j583n739m36J619k889k541M493P374O56k962J807K178
$$ 8383 3327 1308 3316 1733 -4006 -4442 -2823 -5712 -8253 -3760 3614 4270 1308 3115 5293
1616E293l480l098J529K01n225j687O159M991j501m79L039o93n484j677J969k599
$$ 5293 1813 -1285 244 445 -4780 -6467 -308 4683 3182 2703 5742 5049 -435 -2112 -143 -2742
1632b742o569N4O516K260j96L118M560k665l228J584J738m695n578K042L144q08
$$ -2742 -9311 -9257 -2741 -481 -677 2441 7001 4336 1108 2692 4430 -265 -5843 -3801 -657 -1465
1648a465O93N504J784m918k027K622l86o370l305K587O74j308M149P162L18l716
$$ -1465 -772 4732 6516 1598 -429 2193 1807 -4563 -7868 -5281 -4607 -5915 -1766 5396 5714 1998
1664A998J525L665k393n138j133O2l456j644N560M604k454k518K990K509l253
$$ 1998 3523 7188 4795 -343 -1476 -1414 -4870 -6514 -954 3650 1196 -1322 1668 4177 924
1679I24k601J422k484m875J180P315K932k626O06M122L20l433o5J17n561o226
$$ 924 -1677 -255 -2739 -7614 -6434 881 3813 1187 1793 5915 6235 2802 2737 2854 -2707 -8933
1695h933J555N398L11j726L140L370q34l8L076n80o793m149L385L390j445L60
$$ -8933 -7378 -1980 -1669 -3395 -255 3115 2281 2243 5319 4739 -2054 -6203 -2818 572 -873 -513
1711e13L762O10j720J798L711l666q237l328K474K1j210K760M005q44m30N633
$$ -513 3249 3859 2139 3937 7648 3982 -4255 -7583 -5109 -5088 -6298 -3538 467 -377 -807 4826
1727D826M120m694o147l94R82k149j63L978K089k659Q29O405J092m774m107l85
$$ 4826 8946 4252 -1895 -2289 -1307 -3456 -3619 359 2448 -211 618 7023 8115 3341 -766 -1151
1743a151k219l401K008L878j221k197M456O288J65l197p46p15m310k928K925K103
$$ -1151 -3370 -6771 -4763 -885 -2106 -4303 153 6441 6606 3409 2663 1948 -2362 -5290 -2365 -262
1759b62l491r69M486M559p36j269J368k654n260r14L797K34l246J177N233K686
$$ -262 -3753 -4722 -236 4323 3587 2318 3686 1032 -4228 -5142 -1345 -1111 -4357 -3180 2053 4739
1775D739n22K309J350m487n577J86J314l020l221K011L196l19J696M753J318m747
$$ 4739 4217 6526 7876 3389 -2188 -2002 -688 -3708 -6929 -4918 -1722 -2041 -345 4408 5726 979
1791I79l368K410K08k949j389K861R98r24L970N437o55n359j351J193k800l611
$$ 979 -2389 21 229 -2720 -4109 -1248 -250 -1174 2796 8233 7578 2219 868 2061 -739 -4350
1807d350L98R37k099o93N984N660j401k726R22q5l469j533J452q64m194J013O294
$$ -4350 -3952 -3015 -5114 -5807 177 5837 4436 1710 2632 2547 -922 -2455 -1003 -1867 -6061 -5048 1246
1824A246L341j151r04J162k169l124K75J307l766l809K584N903K415j3J667P69
$$ 1246 4587 3436 2532 3694 1525 -1599 -1324 -17 -3783 -7592 -5008 895 3310 3297 4964 5733
1840E733l267k348K494o26n961l533K893L601N39J491K765q85l439j33L272k116
$$ 5733 2466 118 2612 1986 -3975 -7508 -4615 -1014 -475 1016 3781 2896 -543 -676 2596 480
1856D80n515j732K635J990J350M321K925k150k979K580K240l721n671j152N83
$$ 480 -5035 -6767 -4132 -2142 -792 3529 6454 4304 1325 3905 6145 2424 -3247 -4399 -3816
1871c816j278J900N073J396l178n22L384J175l761l075j73j559j319L226N824
$$ -3816 -5094 -3194 1879 3275 97 -425 2959 4134 373 -2702 -2875 -4434 -5753 -2527 3297
1886C297q8k691J399L120o18k964j185j579m060j415L884L853j328o41K909K452
$$ 3297 3209 518 1917 5037 4419 1455 270 -1309 -5369 -6784 -2900 953 -375 -1016 1893 4345
1902D345j432m97P82k536n170o84M037J380j403Q19K846N46j306J240Q06m253
$$ 4345 2913 2416 3198 662 -4508 -5192 -1155 225 -1178 -359 2487 3033 1727 2967 3773 -480
1918d80n412N76K829p1l48K533K810o84Q45L149J90m676m011L29Q24j995Q35K978
$$ -480 -5892 -5316 -2487 -2558 -2906 -373 2437 1753 2598 5747 5937 1261 -2750 -2421 -1597 -3592 -2757 221
1936B21L20j454K212M000p39m780k196j4j493j246K881K035o25m51M288L831j097
$$ 221 541 -913 1299 5299 4560 -220 -2416 -2430 -3923 -5169 -2288 -253 -878 -1329 2959 6790 5693
1953E693l488j272j500k889k52L021M20k685N45M815K567j565j250n79k835l591
$$ 5693 2205 933 -567 -3456 -3708 -687 -267 -2952 -2407 2408 4975 3410 2160 1581 -1254 -4845
1969d845J463K907o93k915J911M394J752m26R26j096m238k791J782J644k709j381
$$ -4845 -3382 -475 -1168 -4083 -2172 2222 3974 3548 4474 3378 -860 -3651 -1869 -225 -2934 -4315
1985d315K483K627N28K203J939k318m448j130K785m78k713j005K284Q05P40L845
$$ -4315 -1832 795 1323 3526 5465 3147 -1301 -2431 354 -124 -2837 -3842 -1558 -753 -13 3832
2001C832J829k899l858j50K003j978k183R0N30m37K473M591R82k714k073J122
$$ 3832 5661 2762 -1096 -1246 757 -1221 -3404 -3314 -2784 -3221 -748 3843 4825 2111 38 1160
2017A160L91k395j249M04j556o02K840N162M44k366j043J023j280k000k64l24
$$ 1160 1551 -844 -2093 -1689 -3245 -3847 -1007 4155 4599 2233 1190 2213 933 -1067 -1331 -1655
2033a655l178n11L610M273j88q26Q12L94k163p60R90j721m058K44M116K627k37
$$ -1655 -4833 -5344 -1734 2539 2351 1525 2337 2731 568 -192 798 -923 -4981 -4737 -621 2006 1769
2050A769M83J589j267j931L54O49k864l978O42K536J433P30K224Q67k572p51K204
$$ 1769 2252 3841 2574 643 997 1646 -1218 -5196 -4554 -2018 -585 145 2369 3236 664 -87 2117
2067B117K4l636k766P36J582J7K135K942J84k404K68K253j057l579j884M71o00
$$ 2117 2141 -1495 -4261 -3525 -1943 -1926 209 3151 3335 931 1199 3452 2395 -1184 -3068 -2597 -3197
2084c197J31K954L097j135j770J186K168j134k571n75j625j748N28L800J788j302
$$ -3197 -3066 -112 2985 1850 80 1266 3434 2300 -271 -846 -2471 -4219 -3691 109 1897 595
2100E95r29K517Q39j725o79l16k828k687J727M091L24j213R26K180K72l51L47
$$ 595 -334 2183 3022 1297 618 302 -2526 -5213 -3486 605 929 -284 642 2822 3094 2743 3090
2117C090j207m067k358K034K405o80l87J394P60n45J142J456j623m496j391K297
$$ 3090 1883 -2184 -4542 -2508 -103 -783 -1170 224 984 439 1581 3037 1414 -3082 -4473 -2176
2133b176J355r38O77J880L60J75K149J739k726m180o50R88k14p61J468P71p27
$$ -2176 -821 -1759 -1082 798 1158 1333 3482 5221 2495 -1685 -2335 -1347 -1561 -2322 -854 -83 -810
2150h10L28L948O49k898k866j24L09j080P19J535j80j224K362L348N74k755j378
$$ -810 -482 3466 4115 1217 -1649 -1773 -1464 -2544 -1825 -290 -470 -1694 668 4016 4590 1835 457
2167D57l43k067j051J158J226j477o96L036L023j65j255p2r74k686j93J485L88
$$ 457 114 -1953 -3004 -1846 -620 -2097 -2793 243 3266 3101 1846 1774 800 -1886 -2079 -594 -206
2184b06k055R6K932J704l19j7K57k546k507L70J689j121j828J143K445R06R87
$$ -206 -2261 -2165 767 2471 2152 2135 2392 -154 -2661 -2291 -602 -1723 -3551 -2408 37 943 1930
2201A930J766P7k763k036J223M46j836j090Q76R21j62J644K545o89l206o85O02
$$ 1930 3696 3773 1010 -1026 197 643 -1193 -2283 -1407 -486 -648 996 3541 2852 -354 -1039 -437
2218d37l13j834j56J100j74J29L037K522r17j966L2P24j422j600L81p37j515R73
$$ -437 -750 -2584 -2740 -1640 -1814 -1685 1352 3874 2957 991 1023 1747 325 -1275 -894 -1631 -3146 -2173
2236b173L322J540j282q78O46l68j468k89O33j363k229J513L684J001l93j3J50
$$ -2173 1149 2689 1407 529 1175 807 -661 -950 -317 -1680 -3909 -2396 1288 2289 1896 1883 2033
$$ [...]
8191a9
##END NTUPLES=NMR FID
##END=
