##TITLE=1H_CA-8525-2-2
 CDCl3, 8 sc, 
 9.1.2019
##JCAMPDX= 6.0         $$ Bruker NMR JCAMP-DX V2.0
##DATA TYPE= NMR FID
##DATA CLASS= NTUPLES
##ORIGIN= UXNMR, Bruker Analytische Messtechnik GmbH
##OWNER= root
$$ XWIN-NMR		Version 3.5
$$ Wed Jan  9 15:56:54 2019 Russian Standard Time (UT+4h)  she@DPX200
##.OBSERVE FREQUENCY= 200.1313
##.OBSERVE NUCLEUS= ^1H
##.DELAY= (6, 6)
##.ACQUISITION MODE= SIMULTANEOUS
##.ACQUISITION SCHEME= undefined
##.AVERAGES= 8
##.DIGITISER RES= 18
##SPECTROMETER/DATA SYSTEM= spect
##.PULSE SEQUENCE= zg30
##.SOLVENT NAME= DMSO
##.SHIFT REFERENCE= (INTERNAL, DMSO, 0, 15.7039)
##AUDIT TRAIL= $$ (NUMBER, WHEN, WHO, WHERE, WHAT)
$$ ##TITLE= Audit trail, XWIN-NMR		Version 3.5
$$ ##JCAMPDX= 5.01
$$ ##ORIGIN= Bruker BioSpin GmbH
$$ ##OWNER= she
$$ F:/spectra/data/she/nmr/H-F/1/audita.txt
$$ ##AUDIT TRAIL=  $$ (NUMBER, WHEN, WHO, WHERE, WHAT)
(   1,<2019-01-09 15:55:30.28 +0400>,<she>,<DPX200>,
      <created by zg, POWCHK disabled, PULCHK disabled
       configuration hash MD5:
       00 E9 B6 7A A2 85 ED C7 34 08 36 98 17 FE 4E 26
       data hash MD5: 16K
       95 36 FA 10 07 C5 99 06 23 A0 0B 74 1F B5 B4 D1>)
$$ ##END=
$$ 
$$ hash MD5
$$ CA 77 C8 FB 42 9A 49 72 47 47 BC A7 AE 93 3A D7
##$RELAX= 
##$RELAX= 
##$RELAX= 
##$RELAX= 
##$RELAX= 
##$RELAX= 
$$ Bruker specific parameters
$$ --------------------------
##$DU= <F:/spectra>
##$EXPNO= 1
##$NAME= <H-F>
##$PROCNO= 1
##$TYPE= <nmr>
##$USER= <she>
##$AMP= (0..31)
100 100 100 100 100 100 100 100 100 100 100 100 100 100 100 100 100 100 
100 100 100 100 100 100 100 100 100 100 100 100 100 100 
##$AQSEQ= 0
##$AQ_mod= 1
##$AUNM= <au_zg>
##$AUTOPOS= <>
##$BF1= 200.13
##$BF2= 200.13
##$BF3= 200.13
##$BF4= 200.13
##$BF5= 200.13
##$BF6= 200.13
##$BF7= 200.13
##$BF8= 200.13
##$BYTORDA= 1
##$CFDGTYP= 0
##$CFRGTYP= 5
##$CHEMSTR= <none>
##$CNST= (0..31)
1 1 145 1 1 1 1 1 1 1 1 1 1 1 1 1 1 1 1 1 1 1 1 1 1 1 1 1 1 1 1 1 
##$CPDPRG= <>
##$CPDPRG1= <>
##$CPDPRG2= <>
##$CPDPRG3= <>
##$CPDPRG4= <mlev>
##$CPDPRG5= <mlev>
##$CPDPRG6= <mlev>
##$CPDPRG7= <mlev>
##$CPDPRG8= <mlev>
##$CPDPRGB= <>
##$CPDPRGT= <>
##$D= (0..31)
0 1.2 0 0 0 0 0 0 0 0 0 0.03 0 0 0 0 0 0 0 0 0 0 0 0 0 0 0 0 0 0 0 0 
##$DATE= 1547034929
##$DBL= (0..7)
120 120 120 120 120 120 120 120 
##$DBP= (0..7)
150 150 150 150 150 150 150 150 
##$DBP07= 0
##$DBPNAM0= <>
##$DBPNAM1= <>
##$DBPNAM2= <>
##$DBPNAM3= <>
##$DBPNAM4= <>
##$DBPNAM5= <>
##$DBPNAM6= <>
##$DBPNAM7= <>
##$DBPOAL= (0..7)
0.5 0.5 0.5 0.5 0.5 0.5 0.5 0.5 
##$DBPOFFS= (0..7)
0 0 0 0 0 0 0 0 
##$DE= 6
##$DECBNUC= <off>
##$DECIM= 24
##$DECNUC= <off>
##$DECSTAT= 4
##$DIGMOD= 1
##$DIGTYP= 9
##$DL= (0..7)
0 120 120 120 120 120 120 120 
##$DP= (0..7)
150 150 150 150 150 150 150 150 
##$DP07= 0
##$DPNAME0= <>
##$DPNAME1= <>
##$DPNAME2= <>
##$DPNAME3= <>
##$DPNAME4= <>
##$DPNAME5= <>
##$DPNAME6= <>
##$DPNAME7= <>
##$DPOAL= (0..7)
0.5 0.5 0.5 0.5 0.5 0.5 0.5 0.5 
##$DPOFFS= (0..7)
0 0 0 0 0 0 0 0 
##$DQDMODE= 0
##$DR= 18
##$DS= 0
##$DSLIST= <SSSSSSSSSSSSSSS>
##$DSPFIRM= 0
$$ [...]
##$SUBNAM2= <"">
##$SUBNAM3= <"">
##$SUBNAM4= <"">
##$SUBNAM5= <"">
##$SUBNAM6= <"">
##$SUBNAM7= <"">
##$SUBNAM8= <"">
##$SUBNAM9= <"">
##$SW= 24.933730806125
##$SWIBOX= (0..15)
0 0 2 0 0 0 0 0 0 0 0 0 0 0 0 0 
##$SW_h= 4990.01996007984
##$TD= 16384
##$TD0= 1
##$TE= 0
##$TE2= 300
##$TE3= 300
##$TEG= 300
##$TL= (0..7)
0 120 120 120 120 120 120 120 
##$TP= (0..7)
150 150 150 150 150 150 150 150 
##$TP07= 0
##$TPNAME0= <>
##$TPNAME1= <>
##$TPNAME2= <>
##$TPNAME3= <>
##$TPNAME4= <>
##$TPNAME5= <>
##$TPNAME6= <>
##$TPNAME7= <>
##$TPOAL= (0..7)
0.5 0.5 0.5 0.5 0.5 0.5 0.5 0.5 
##$TPOFFS= (0..7)
0 0 0 0 0 0 0 0 
##$TUNHIN= 0
##$TUNHOUT= 0
##$TUNXOUT= 0
##$USERA1= <user>
##$USERA2= <user>
##$USERA3= <user>
##$USERA4= <user>
##$USERA5= <user>
##$V9= 5
##$VALIST= <valist>
##$VCLIST= <CCCCCCCCCCCCCCC>
##$VD= 0
##$VDLIST= <DDDDDDDDDDDDDDD>
##$VPLIST= <PPPPPPPPPPPPPPP>
##$VTLIST= <TTTTTTTTTTTTTTT>
##$WBST= 1024
##$WBSW= 4
##$XGAIN= (0..3)
0 0 0 0 
##$XL= 0
##$YL= 0
##$YMAX_a= 91527
##$YMIN_a= -99196
##$ZGOPTNS= <>
##$ZL1= 120
##$ZL2= 120
##$ZL3= 120
##$ZL4= 120
##$ABSF1= 10
##$ABSF2= 0
##$ABSG= 5
##$ABSL= 3
##$ALPHA= 0
##$AQORDER= 0
##$ASSFAC= 0
##$ASSFACI= 0
##$ASSFACX= 0
##$ASSWID= 0
##$AUNMP= <proc_1d>
##$AZFE= 0.1
##$AZFW= 0.1
##$BCFW= 1
##$BC_mod= 2
##$BYTORDP= 1
##$COROFFS= 0
##$CY= 11.3945322036743
##$DATMOD= 1
##$DC= 2
##$DFILT= <>
##$DTYPP= 0
##$F1P= 18.9103706918063
##$F2P= -1.10871071338519
##$FCOR= 0.5
##$FTSIZE= 0
##$FT_mod= 4
##$GAMMA= 1
##$GB= 0.15
##$INTBC= 1
##$INTSCL= 1
##$ISEN= 128
##$LB= 0.24
##$LEV0= 0
##$LPBIN= 0
##$MAXI= 10000
##$MC2= 0
##$MEAN= 0
##$ME_mod= 0
##$MI= 1.114404
##$NCOEF= 0
##$NC_proc= 0
##$NLEV= 6
##$NOISF1= 3.799351
##$NOISF2= 2.8
##$NSP= 1
##$NTH_PI= 0
##$NZP= 0
##$OFFSET= 15.70392
##$PC= 1
##$PHC0= -8862.422
##$PHC1= 21.80006
##$PH_mod= 1
##$PKNL= yes
##$PPARMOD= 0
##$PSCAL= 0
##$PSIGN= 0
##$REVERSE= no
##$SF= 200.130013532006
##$SI= 16384
##$SIGF1= 3
##$SIGF2= 2
##$SINO= 400
##$SIOLD= 16384
##$SREGLST= <1H.CDCl3>
##$SSB= 0
##$STSI= 0
##$STSR= 0
##$SW_p= 3612.71676300578
##$SYMM= 0
##$S_DEV= 0
##$TDeff= 0
##$TDoff= 0
##$TI= <>
##$TILT= no
##$TM1= 0
##$TM2= 0
##$TOPLEV= 0
##$USERP1= <user>
##$USERP2= <user>
##$USERP3= <user>
##$USERP4= <user>
##$USERP5= <user>
##$WDW= 1
##$XDIM= 8192
##$YMAX_p= 0
##$YMIN_p= 0
$$ End of Bruker specific parameters
$$ ---------------------------------
##NTUPLES= NMR FID
##VAR_NAME=  TIME,          FID/REAL,        FID/IMAG
##SYMBOL=    X,             R,               I
##VAR_TYPE=  INDEPENDENT,   DEPENDENT,       DEPENDENT
##VAR_FORM=  AFFN,          ASDF,            ASDF
##VAR_DIM=   8192,          8192,            8192
##UNITS=     SECONDS,       ARBITRARY UNITS, ARBITRARY UNITS
##FACTOR=    0.0002004,     1,               1
##FIRST=     0,             0,               0
##LAST=      1.6414764,     0,               0
##MIN=       0,             -99196,          0
##MAX=       1.6414764,     91527,           0
$$ Real data points
##PAGE= N=1
##DATA TABLE= (X++(R..R)), XYDATA
$$ [...]
2160d35J115j078k172O93K813m24j911J462K610n60j641O70J010k940k207K231
$$ -435 680 -398 -2570 -1877 936 512 -1399 63 2673 2113 472 1142 2152 -788 -2995 -764
2176g64J343j255j297K397J030j218l40J879m88l406m38J965O63j844N11K430
$$ -764 579 -676 -1973 424 1454 236 -104 1775 1287 -2119 -2557 -592 71 -1773 -1262 1168
2192A168L8r90J602J581j670l229N27J632j142j727J584J355j527l45K346J524
$$ 1168 1206 216 1818 3399 1729 -1500 -973 659 -483 -2210 -626 729 -798 -1143 1203 2727
2208B727k744j830J641M41j858k25K141K43j873J152K997j22k265p28J489j288
$$ 2727 -17 -1847 -206 235 -1623 -1848 293 536 -1337 -185 2812 2690 425 -303 1186 -102
2224a02j937P77J726j442j261K436J676o26j430J197L27k089j058K402K45k684
$$ -102 -2039 -1262 464 -978 -2239 197 1873 1247 -183 1014 1341 -748 -1806 596 841 -1843
2240a843j89L089N50j130j60J547r75k715M59J782j261k111J032K762m86p11J805
$$ -1843 -2032 1057 1607 477 317 1864 889 -1826 -1367 415 -846 -2957 -1925 837 351 -360 1445
2257A445J581k172j641J814O25k010j967K047J061j463N22K192j62k698n49J785
$$ 1445 3026 854 -787 1027 1652 -358 -2325 -278 783 -680 -158 2034 1872 -826 -1375 410
2273D10pk652j38J688r6r57J760K834j366k015J088J622j601j615Q60L98j727
$$ 410 403 -2249 -2387 -699 -795 -1752 8 2842 1476 -539 549 2171 570 -1045 -185 213 -1514
2290a514o1K485J207j879j066J866K51k095l94J194q23j933J173K923o2j600P31
$$ -1514 -1575 910 2117 238 -828 1038 1289 -806 -1200 -6 -829 -2762 -1589 1334 1272 -328 403
2307D03J506j034j225Q66M63k072j735J646K103j225p67J921R87j921k22J939
$$ 403 1909 875 -350 516 979 -1093 -2828 -1182 921 -304 -1071 850 1837 -84 -306 1633
2323A633o59k502n39K030N46r50L87J654m34j226O62J352j720k211O7J803p55
$$ 1633 974 -1528 -2067 -37 509 -441 -54 1600 1166 -60 602 1954 234 -1977 -1910 -107 -862
2340h62r81J468J613j149q89K012Q83k236r53R70N50j448L27J826R5j588J28K547
$$ -862 -1843 -375 1238 89 -800 1212 2095 -141 -1094 -124 426 -1022 -695 1131 1226 -362 -234 2313
2358B313m34k336j93N43r48j473J220K010o69j626J701J979q12j407O22L85k101
$$ 2313 1879 -457 -650 -107 -1055 -2528 -1308 702 33 -1593 108 2087 1275 -132 490 875 -1226
2375a226o45K094Q12j612m21J976Q38j582R0J282j190k312M57J816o41j319R07
$$ -1226 -1871 223 1035 -577 -998 978 1816 234 324 1606 416 -1896 -1439 377 -264 -1583 -676
2392f76J884k57j234J372J281k417j761J332J076k018k88J413J190j055m21K353
$$ -676 1208 951 -283 1089 2370 -47 -1808 -476 600 -1418 -1706 -293 897 -158 -579 1774
2408A774j9k155o62J896l44j672K25J923p88p05J029J947j027j968L33Q02j221
$$ 1774 1755 -400 -1062 834 490 -1182 -957 966 178 -527 502 2449 1422 -546 -213 589 -632
2425f32j347J144P75j456N0K333J162j571j253J674k60j680Q2J388k24j570P56
$$ -632 -1979 -835 -60 -1516 -1466 867 2029 458 -795 879 619 -1061 -979 409 185 -1385 -629
2442f29K255l08j287L57Q82q51j814J020R89j612p95R77J768m89n40Q36Q84j776
$$ -629 1626 1318 31 388 1270 419 -1395 -375 614 -998 -1793 -816 952 463 -77 759 1643 -133
2460a33q90J327K19k030m39J783O05q76O68J245k23k046N19J421q20k099Q66J369
$$ -133 -1023 304 523 -1507 -1946 -163 442 -434 234 1479 1256 -790 -271 1150 330 -1769 -903 466
2478D66n03p00J484J341j606j154J235R58j861j177Q30M67j074K61J665N86j763
$$ 466 -37 -737 747 2088 482 -672 563 1521 -340 -1517 -687 -220 -1294 -1033 632 1218 -545
2495e45p2J870n24j505P3Q90m65j027R47J810m40j273Q26J196j131j242R27L34
$$ -545 -617 1253 729 -776 -703 187 -278 -1305 -358 1452 1012 -261 565 1761 630 -612 315 649
2513F49j625j151K147Q51j396m36J989J16j244k99J356m87k129M86J737j40j079
$$ 649 -976 -2127 20 871 -525 -961 1028 1144 -100 -399 957 470 -1659 -1173 564 424 -655
2530f55L39J722o48j275J315N75j971j035R44J469j026o69J338O81j040l64J556
$$ -655 -316 1406 758 -517 798 1373 -598 -1633 -689 780 -246 -915 423 1104 64 -300 1256
2547A256P8k070n84J095J89j214M28J484J8j428L27J963p71j770L55R32p47j002
$$ 1256 1334 -736 -1320 -225 -36 -1250 -822 662 680 -748 -421 1542 771 -999 -644 288 -459 -1461
2565a461J270J378j040r28J928N42j213j077R53K16j658m19J723J94j466L62J610
$$ -1461 -191 1187 147 -781 1147 1689 476 -601 352 568 -1090 -1509 214 408 -1058 -696 914
2582I14J33j324J11R22q63j469Q29J562q39j135J052J607j033p88J563k11j329
$$ 914 1047 -277 -166 756 -107 -1576 -747 815 -24 -1159 -107 1500 467 -321 1242 1031 -298
2599b98o46J164O24j537k38J376M66j443J87J592o91j652J44J406p32j205P25
$$ -298 -944 220 844 -693 -931 445 911 -532 -345 1247 556 -1096 -952 454 -278 -1483 -758
2616g58J556p53p58J139J324j560p79Q38P80j493n52J236L78j086MJ615J05j544
$$ -758 798 45 -713 426 1750 190 -589 249 1029 -464 -1016 220 598 -488 -484 1131 1236 -308
2634c08l25J354k84j458J60Q42k08q35O17J913p98j329R12Q51j460q65J311N54
$$ -308 -633 721 437 -1021 -861 -19 -227 -1062 -445 1468 670 -659 253 1104 -356 -1221 90 644
2652F44j540n51J774J139j701k13R43L91j331n63J688j77j597j65J968r0r67M55
$$ 644 -896 -1447 327 1466 -235 -448 495 886 -445 -1008 680 503 -1094 -1259 709 619 -348 107
2670A07J043n91j241O69P12r90j243J042R35n46m85J092N46j368j25J021M14j669
$$ 107 1150 559 -682 -13 699 -291 -1534 -492 443 -103 -588 504 1050 -318 -443 578 992 -677
2688f77o62J609K59j032K53J465p4j674O40J084n27j681J67J004k74j092J102
$$ -677 -1339 270 529 -503 -250 1215 1141 -533 107 1191 664 -1017 -850 154 -120 -1212 -110
2705a10J159j144q69J343O42j215o59J038K68j231k21J526L76j259J32J560m11
$$ -110 1049 -95 -964 379 1021 -194 -853 185 453 -778 -999 527 903 -356 -224 1336 925
2722I25j416M33P85m80j391M95J367o75q27J070O87p18j046R68L89j135r44J491
$$ 925 -491 -58 727 247 -1144 -649 718 43 -784 286 973 255 -791 177 566 -569 -1513 -22
2740b2M83j181k44J251O84j294N5J304m04j673K39J343n47q55Q23J067n79j289
$$ -22 461 -720 -964 287 971 -323 -268 1036 632 -1041 -802 541 -6 -861 -38 1029 450 -839
2758h39J264Q76r68j365R81O82j563n34J539N07r00l74J155P19j737j83J046K0
$$ -839 425 1301 333 -1032 -51 631 -932 -1466 73 580 -320 -694 461 1180 -557 -740 306 326
2776C26j104J23J534m89r41N48J682q14j017K13R21j241j081J187Q50r52q52J537
$$ 326 -778 -655 879 390 -551 -3 1679 865 -152 61 982 -259 -1340 -153 697 -255 -1107 430
2794D30Q16j275n53J259q2j220l83J357r0j449M80J732o39p20L03J120q49j368
$$ 430 1246 -29 -582 677 595 -625 -1008 349 259 -1190 -710 1022 383 -337 -34 1086 237 -1131
2812a131R99P65q73q98J175R31j083m04J417L64j231n63J119K96j434n46J450
$$ -1131 -132 633 -240 -1138 37 968 -115 -519 898 1262 31 -532 587 883 -551 -1097 353
2829C53P8j403R6J654p21q60O60Q21q20p39O66R77o43p72J338P42j022o44P55
$$ 353 431 -972 -876 778 57 -803 -143 678 -142 -881 -215 762 119 -653 685 1427 405 -239 516
2848E16M07j218n80Q41O80j399j13Q94N70j093l68J320k92p94N16P12k43j416
$$ 516 923 -295 -875 -34 646 -753 -866 28 598 -495 -863 457 165 -629 -113 599 356 -1060
2866a060Q44J312p12j062R43O94j069o39J108J47j003n53J194L55r49j71J343
$$ -1060 -216 1096 384 -678 265 959 -110 -749 359 506 -497 -1050 144 499 -450 -621 722
2883G22O6j030k89J415j42j496k8J397l73p37L44J051o50j111R77P09p42j260
$$ 722 788 -242 -531 884 742 -754 -782 615 242 -495 -151 900 250 -861 116 825 83 -1177
2901a177J197M12r36k71J028Q27j223J71R36K4j334J72P85N3j413J95J151l25
$$ -1177 20 432 -504 -775 253 1080 -143 28 964 988 -346 -174 611 664 -749 -554 597 272
2919B72r06P1J300o71j193N79P76n23r50Q22R21p51l68J137K27n92m54Q72L10
$$ 272 -634 -563 737 66 -1127 -548 228 -295 -1245 -423 498 -253 -621 516 743 151 -303 569 879
2938H79r74l64R10J90j161J69J096k75j384K13J317m31j116P11P26n81q69Q70
$$ 879 -95 -459 451 641 -520 -351 745 470 -914 -701 616 185 -931 -220 506 -75 -944 -74
2956g4R32p05j067J315M73j279m05J441J75j127l78J363J0j258Q2J374j83j350
$$ -74 858 153 -914 401 874 -405 -810 631 806 -321 -699 664 674 -584 -502 872 689 -661
2974f61L31R50n79j063Q75J028m93j443Q30J175j210q49J178K70q67m67J217M45
$$ -661 -330 620 41 -1022 -147 881 388 -1055 -225 950 -260 -1109 69 339 -528 -995 222 667
2992F67j068l97J278M54j166j73J007n9o80nJ044n75r43P67P63q64n45kJ001n14
$$ 667 -401 -798 480 934 -232 -405 602 543 -137 -142 902 327 -616 151 914 50 -495 -497 504 -10
3012a0p25O48O70r31n47J118L82r43k51R67M92r54l53R99L76j560N6J284j88r05
$$ -10 -735 -87 583 -348 -895 223 605 -338 -589 378 870 -84 -437 562 938 -622 -566 718 530 -375
3032c75n2J137l57j067N13R40j173l61R03L99p41n91O71Q19j136l89J158J53r18
$$ -375 -427 710 353 -714 -201 739 -434 -795 108 507 -234 -825 -154 665 -471 -860 298 451 -467
3051d67p73J644k23q51M88P36oj140M90J119o94r91L87J013m62j016Q66Q41q52
$$ -467 -1240 404 181 -670 -182 554 548 -592 -102 1017 323 -668 -281 732 270 -746 120 961 109
3070A09o56O78O16p12n05O14J82q31j57J258k82j210K99J195l24o27K71O23l96
$$ 109 -547 131 747 35 -470 144 326 -505 -662 596 314 -896 -597 598 274 -353 -82 541 145
3089A45o94P69M48m59p78Q41L75o11p20P22M95l49j094J285J47o44m07P71J80
$$ 145 -549 220 668 209 -569 272 647 36 -684 38 533 184 -910 375 522 -122 -529 242 422
3108D22j109L09R19p0j288N61R22m40r87L90Q96l78r80P05R34p98l97O82L87q93
$$ 422 -687 -378 541 471 -817 -256 666 226 -761 -371 525 147 -833 -128 806 8 -389 293 680 -213
3128b13l59Q62O6q25k0N58N70j082J0R94o22q55L84J175j90j200O12O58l12q98
$$ -213 -572 290 356 -469 -489 69 639 -443 -433 561 -61 -916 -532 643 453 -747 -135 523 211 -687
3148f87O94N70o79l54O85M38p34l85N10P16r87m03Q04K38q98J55O89J11j053J88
$$ -687 7 577 -102 -456 229 667 -67 -452 58 774 -213 -616 188 426 -472 -317 372 483 -570 -382
3168c82P57j87j091L48J098o45m28K63R43n63q41R56N68r51k73O04M24j037J97
$$ -382 375 188 -903 -555 543 -102 -530 -267 676 113 -728 228 796 -155 -428 176 600 -437 -240
3187b40Q34J28r16l41J053j5j001J68R90l87r62N05N30J9q86L56Q65o14o71O42
$$ -240 594 722 -194 -535 518 503 -498 -330 660 273 -689 -184 346 365 -521 -165 700 86 -585 57
3207E7O87j040k31O62O62r63k10J140m3q86o0O36J17q42o0Q09N1j049O79L49k69
$$ 57 744 -296 -527 135 797 -166 -376 764 721 -165 -225 411 528 -314 -374 435 486 -563 116 465 196
3228A96p69N59L43j91p90N36O62q66k26P63M22p19n12P16L00n94j51M89J44q17
$$ 196 -573 -14 329 138 -652 -116 546 -320 -546 217 639 -80 -592 124 424 -170 -321 168 312 -505
3248e05L03P09j67n82J24R12o79n84L75P56p04j031J016J28l91k02N49N07q53
$$ -505 -202 507 340 -242 -118 794 115 -469 -94 662 -42 -1073 -57 71 -320 -522 27 534 -319
3267c19k23Q13J22n84n15R41n4k42J39M24j87m69j98P51k54j072P00L75r1p42
$$ -319 -542 271 393 -191 -706 235 181 -61 78 502 315 -154 -352 399 145 -927 -227 148 57 -685
3287f85N96N24l14o14Q27L50r56j51M46J01n65j66P71J88p36r1J055r7p90j06
$$ -685 -89 435 121 -493 334 684 -272 -423 23 124 -441 -607 164 352 -384 -475 580 483 -307 -413
3307d13J088l89p26J41P34n79l35K92R43l93r18O27M33n31n00M77N39o24j90Q66
$$ -413 675 286 -440 -299 435 -144 -479 -187 756 363 -555 72 505 -26 -526 -49 490 -134 -324 542
3327E42j75p09n5P09j90n32k04R89l00o60J93J009k49j056P43N78j11q79L89O57
$$ 542 367 -342 -397 312 122 -410 -614 375 75 -585 -392 617 368 -688 55 633 522 -357 32 689
3347F89o36n88P73J33n41l78J059k2p59j99Q40K4o80n9Q74j75q23L00P63m55m72
$$ 689 53 -535 238 371 -170 -548 511 489 -270 -469 371 395 -285 -344 530 355 -468 -168 595 140 -332
3368c32J74N05l86m31J68Q63l91p78Q63K58l83k83J00J81o08j5O96J70o61j84
$$ -332 -158 347 -39 -470 -302 561 170 -608 255 513 130 -153 -53 128 -480 -495 201 371 -290 -474
3388d74O75P5r81M02O97k93n92K27N67qp52N51L74k64n45O34M55q19l52L35O76
$$ -474 201 276 -705 -303 394 101 -491 -264 303 295 -457 94 468 204 -341 293 748 -71 -423 -88 588
3409E88r15j74O37M8n29L06L87j54o31J83M06r5m34J39O18m55l38L96O75l99o86
$$ 588 -327 -501 136 184 -345 -39 348 194 -437 -254 152 57 -377 -238 380 -75 -413 -17 658 259 -427
3430d27K59Q21r85j61P42r6o41K16Q35n9o36j38M60j2m81k98Q52n7o43L32M25
$$ -427 -168 653 -332 -493 249 153 -488 -272 563 504 -132 -270 190 178 -303 -601 251 194 -449 -117 308
3451C08k15n24N11L92m87n48L55N97p84J08L36N33n42m63R54o2m94r0O19k44o89
$$ 308 93 -431 80 472 -15 -563 -208 389 -395 -287 49 582 40 -423 531 469 -25 -115 504 260 -429
3472d29M23R9qk29j89R45p63k10P3M44l05m89M38M08k57l98P53L33m94m95P90
$$ -429 -6 93 85 -144 -333 612 -151 -361 -288 156 -149 -638 -200 208 -49 -447 306 639 145 -350 440
3493D40o5l93j82N00o4o37q7Q71l1n97L45L24k2j132L58M80j40l93J60O78n43
$$ 440 375 -18 -200 300 236 -401 -488 383 352 -245 100 424 402 -730 -372 108 -32 -425 -265 413 -130
3514a30k63O34L78q14l23O02R0o48J2N10K77o44n9O85j85l27j34N79n4o23M89
$$ -130 -393 241 619 -195 -518 84 174 -474 -462 48 325 -319 -378 307 122 -205 -339 240 186 -437 52
3535E2M85m26n89M30L52L2n95L3N32m29n71N01L21n38r2P26o8j47r7L54K04p83
$$ 52 537 111 -478 -48 304 336 -259 -226 306 -123 -694 -193 128 -410 -502 224 156 9 -88 266 470 -313
3557c13L26K86k66l95J60L17M5n36O24K96m71m17K80K87p02j97Q54L9l48k14M13
$$ -313 13 299 33 -362 -202 115 160 -376 248 544 73 -344 -64 223 -479 -676 178 217 -131 -345 68
3578F8J16m96K78J55J54m41J24M06j59m70L28L80k65j9j92L35k34n51M98R1l89
$$ 68 184 -312 -34 121 275 -166 -42 364 205 -265 63 443 178 159 -33 302 68 -483 15 106 -283
3599b83k42R83j35j91k42O10k8n82j1J50J61l91r4N40K14n04K06M3N1p28M34K10
$$ -283 -525 458 323 132 -110 500 472 -110 -121 29 190 -201 -295 245 459 -45 161 204 255 -473 -39 171
3621A71k94k21J12O53k80l93N27L00p90m9M31J74p85j17N29o3k85j53P48J64o80
$$ 171 -123 -344 -232 421 141 -252 275 575 -215 -264 167 341 -444 -561 -32 -95 -380 -533 215 379 -301
3642c01J68K88R7p54N4N80m0j80N2N36l34l27M20K53o09k45L86K94n72RO51l09
$$ -301 -133 155 252 -502 -448 132 92 -88 -36 500 166 -161 259 512 -97 -342 44 338 -234 -225 426 117
3664A17j47r4K76K5m93P1N12k22j40O6K67n5k20K39J80p8m71K35j12m3l21K22
$$ 117 -30 -124 152 177 -316 -245 267 45 -95 -29 238 183 -37 202 382 304 -167 68 -44 -87 -408 -186
3686a86N53n66o5M94n9m76R7M67j14m87R6L61K36r95M62M89k5o07J44N21l18l54
$$ -186 367 -199 -264 230 171 -305 -208 259 145 -342 -246 115 351 -644 -182 307 282 -325 -181 340 22 -332
3708c32L34J42j41l35M94K00m66q4N23L12p58k36M88qn67O16J89k92k18k55Q42
$$ -332 2 144 3 -332 162 362 -104 -188 335 647 -111 -347 141 133 -434 182 371 79 -139 -394 448
3729D48p5o88j35Q50n60j44J68J46K25n79O76m8n70L46L61P8r13J66R2L19l82
$$ 448 373 -315 -450 400 -160 -304 -136 10 235 -344 332 284 -286 60 421 499 -414 -248 -156 163 -219
3750b19k53P45n7l41j74N87j49m40j84N42j28m63O23M90n34j17O17l1n39m48Q52
$$ -219 -472 273 216 -125 -299 288 139 -301 -485 57 -71 -534 89 579 45 -72 545 514 -25 -473 379
3771C79l64n19M03M31n8j69r3M20P4o77PL45j78j80N6J31K95q41M84O66n99k10
$$ 379 15 -504 -101 330 272 103 10 430 504 -173 -166 179 1 -179 -123 8 303 -538 -54 612 13 -197
3793a97k7N45o50J57L10N8k36j1K3O62n59l05K53K59m79l92P04j21l78j8Q27J12
$$ -197 -224 321 -329 -172 138 196 -40 -51 -28 634 75 -230 23 282 -197 -589 115 -6 -384 -402 425 537
3815E37o36J80J16k38k88P6M83o17j2K46K35k34M0L23L58m48j79N99m09m35J35
$$ 537 -99 81 197 -41 -329 -253 230 -387 -399 -153 82 -152 -112 211 569 121 -58 541 132 -303 -168
3836a68J46N93m80l4R8J52m94P0M21j61m25o6M31l85K95K53J47n29j89N98K01
$$ -168 -22 571 91 57 155 307 -187 -117 304 143 -282 -348 83 -302 -7 246 393 -136 -325 273 474
3857D74p26n9L81k39N1j83P28m57k37K17K41k8m58J46K20J11p93M18M53k30m68
$$ 474 -252 -311 70 -169 -118 -301 427 -30 -267 -50 191 163 -295 -149 71 182 -611 -193 260 30 -438
3878d38M14L24k12k31K60K36q13j70Q45n2l24J05N47m5m74l4R00p61l22J15L50
$$ -438 -24 300 88 -143 117 353 -460 -630 215 163 -161 -56 491 446 -28 -62 838 77 -245 -130 220
3899B20l05K5J83K78l52l18N89l96R4n61L88K18k48q7M43K15m92j06M89j36o71
$$ 220 -85 -60 123 401 49 -269 320 -76 18 -543 -155 63 -185 -272 171 386 -106 -212 277 141 -530
3920e30J99N54k79k59K67L16j38n45O85J39k38m07J14N6k22O6L05Rk66j4O76j56
$$ -530 -331 223 -56 -315 -48 268 130 -415 270 409 171 -236 -122 -66 -288 -222 83 92 -174 -188 488 332
3942C32j54j30j86J17l14Q1M47k2n58J98N47J62m37K9J58j98l25R5L71l8l07K23
$$ 332 178 48 -138 -21 -335 -254 193 171 -387 -189 358 520 83 112 270 72 -253 -158 213 175 -132 91
3964I1N78m53m65O23j72k10l64M08J17m21k88L55M57m99K44K24j15n27K78L49
$$ 91 669 216 -249 374 202 -8 -372 36 153 -268 -556 -201 256 -243 1 225 110 -417 -139 210
3984B10l29k5J43R3K00m42J09L11o4n20L37J67n43J67M2J29%j95M90p0l61K16
$$ 210 -119 -144 -1 92 292 -150 -41 270 206 -314 23 190 -353 -186 -144 -15 -15 -210 280 210 -151 65
4006F5K18l21j82R6J23j98o1L27O96m94m95M22N8m69k51O12J13n34k57O50Qkl96
$$ 65 283 -38 -220 -124 -1 -199 -260 67 763 269 -226 196 254 -215 -466 146 259 -275 -532 118 126 124 -272
4029b72N96o6n33o7O78k5p49R7O41p1m32M7O85n66m82P41K14n48j48L20Oj45j21
$$ -272 324 258 -275 -342 336 311 -438 -341 300 229 -203 -156 529 -37 -519 222 436 -112 -260 60 66 -79 -200
4052b00M2N23k64l20Q45k90k60k20J19K03n02nN41j22m01M81L01k45n25L38J7
$$ -200 -158 365 101 -219 626 336 76 -144 -25 178 -324 -329 212 90 -311 170 471 226 -299 39 56
4073E6k50J06J13K8K22k76kK65l69M7K25k6n32K21M78j06q2o6J26j29k2j9r2j14
$$ 56 -194 -88 25 53 275 -1 -3 262 -107 -60 165 139 -393 -172 306 200 118 52 178 49 27 8 -84 -198
4097a98n57Q52l56J28l98O77j0o7n50M93O9k98k71M70j34l4R3N26m06j28L35J5
$$ -198 -755 97 -259 -131 -529 148 138 71 -479 14 83 -215 -486 -16 -150 -184 -91 435 29 -99 236 251
4119B51Rp18M54J09j35k31K92K07k97j51N44j45l81k03K84K43k96M4J61m3N9K53
$$ 251 260 -458 -4 105 -30 -261 31 238 -59 -210 334 189 -192 -395 -111 132 -164 -120 41 -2 57 310
4141C10O7J02m76J25Q0j54k48K58j12L07k48j18L34k60m51L45J76m03J47kK91
$$ 310 377 479 3 128 208 54 -194 64 -48 259 11 -107 227 -33 -484 -139 37 -366 -219 -221 70
4162G0l94J91O58m94P8k88L76J26o34K74J06O5l82J85J82j81lL84J89l67n05L19
$$ 70 -324 -133 525 31 109 -179 197 323 -311 -37 69 134 -248 -63 119 -62 -65 319 508 141 -364 -45
4184d5J79l89k49N40O0k42j88N04j82k17q5N16j82M8l98K91Oj72P0M54j86j65
$$ -45 134 -255 -504 36 96 -146 -334 170 -12 -229 -314 202 20 68 -330 -39 -33 -205 -135 319 133 -32
4206c2J27K4K02o50N34p8k41L12l74J52j35j87M68K00m99j54q9M68m56L30L25
$$ -32 95 119 321 -329 205 127 -114 198 -176 -24 -159 -346 122 322 -177 -331 -420 48 -408 -78 247
4227B47j44m18L18L37k40j13j02L39l89L0R7R8m1O9J1J64n18K41M4J49m42k47
$$ 247 103 -315 3 340 100 -13 -115 224 -165 -135 -38 60 19 88 99 263 -255 -14 30 179 -263 -510
4249e10L27K25p8M0P3k7M0m22N75p5n05R7J56L51l88K30K41j44n17J91O46k56
$$ -510 -183 42 -36 4 77 50 90 -332 243 168 -337 -240 -84 267 -121 109 350 206 -311 -120 526 270
4271B70k70R7k3j39K9J53o8k89J47M53l36j97k34O79q1m60L07K16l88j85K36R7
$$ 270 0 97 74 -65 -36 117 49 -240 -93 360 24 -173 -407 272 191 -269 38 254 -134 -319 -83 14
4293A4r5q8Q6J35o4m24Q44k61k80J87L1J92j16j02Q7P4m31L67rj92J64j29J63
$$ 14 -81 -169 -83 52 -12 -436 408 147 -133 54 85 277 161 59 146 220 -211 156 147 -45 119 -10 153
4316A53k04k16K84J22o11J69M6L90J70k26K13p8k34M0K71l4l31k19K34Q3l10J48
$$ 153 -51 -267 17 139 -472 -303 -257 133 303 77 290 212 -22 18 289 255 -76 -295 -61 22 -288 -140
4338a40M62j49l11J30M68k21l97J14J33j63j73J10L16m88o9K92K37k45j33K79
$$ -140 322 173 -138 -8 460 239 -158 -44 89 -74 -247 -137 179 -309 -378 -86 151 -94 -227 52
4358E2J06k90p4K79p2l06K30J98M49p63Q8M11j91l25l8K58ol87O89j18K1m29K31
$$ 52 158 -132 -206 73 1 -305 -75 123 572 -191 -103 308 117 -208 -246 12 6 -381 308 190 211 -218 13
4381A3K00k45k07m7M21k43k72M09J70l68J78L37k62k75P7K65j02k14j14M83j3
$$ 13 213 -32 -239 -286 135 -108 -380 29 199 -169 9 346 84 -191 -114 151 49 -165 -279 204 191
4402A91m74L37K24l11j67O61m29j61J03N2k47J02L5L34Rn93J84J71J51m36jN37
$$ 191 -283 54 278 -33 -200 461 32 -129 -26 26 -221 -119 -84 250 259 -334 -150 21 172 -264 -265 272
4424B72k09k7O1j03J50k07J26J7k09k16O52k32q8k2r6O38n50J17N5L93m14O1o2
$$ 272 63 36 97 -6 144 -63 63 80 -129 -345 307 75 -13 -35 -131 507 -43 74 129 522 108 169 107
4447A07K0n37L74K11J30l74k5M83n11N6J34J32l61m7J71L86k03m16M40J09l49
$$ 107 127 -410 -36 175 305 -69 -94 389 -122 -66 68 200 -161 -208 -37 349 146 -270 170 279 -70
4468g0m8M37K12n19k87L73J1l75K42L23O1o67J04L25j86k53l4L27N3j96K30K57
$$ -70 -118 319 531 12 -275 98 109 -266 -24 299 360 -307 -203 122 -64 -317 -351 -24 29 -167 63 320
4490C20j63m16N23l9m35J51L21l19k9K05j37L10n77J57K39J41j72o3R7L7m64J73
$$ 320 157 -259 264 225 -210 -59 262 -57 -86 119 -18 292 -285 -128 111 252 80 17 114 151 -313 -140
4512a40J31J49k62P5K05J32k00j79J52j01o1K41m9j69K67k26o1J57m1J83L7p08
$$ -140 -9 140 -122 -47 158 290 90 -89 63 -38 -99 142 93 -76 191 -35 -96 61 20 203 240 -468
4534d68M06OJ80k85j47O08k34m41M72L28l26j54K41R1j37l15K80O0l42K5M80r2
$$ -468 -62 -56 124 -161 -308 300 66 -375 97 425 99 -55 186 277 140 -175 105 165 -177 -152 328 236
4556B36n49J38N03n07j91Q2N30k68m1J0J26L4j70N0P0n7LM5K94l73j62L58J29
$$ 236 -313 -175 328 -179 -370 -288 242 -26 -67 -57 69 103 -67 -17 53 -4 -1 44 338 -35 -197 161 290
4579B90j13m48N71l09r8j90L15L4l67O28m02K26k48K35L0k29M5j65K11N8n19O61
$$ 290 177 -271 300 -9 -107 -297 18 52 -315 313 -89 137 -111 124 154 -75 -30 -195 16 74 -445 216
4601B16J6k45k20M11QR6o13K41R8l03N48l61M97l93k18K58j3J36j24K36m19p0
$$ 216 232 -13 -233 178 186 282 -331 -90 8 -295 253 -108 389 -4 -222 36 23 159 35 271 -148 -218
4623b18L50K13n70J49J25m5r7j05J14J32k38K02j95K07l06L87ML34q1n25L93m6
$$ -218 132 345 -225 -76 49 4 -93 -198 -84 48 -190 12 -183 24 -282 105 109 443 362 -163 230 184
4645A84m37L1M14o7j65j79J63r9N9k54L91oj69K20l15L92m84L63K0j96K11K29
$$ 184 -253 -222 192 125 -40 -219 -56 -155 -96 -350 41 35 -134 86 -229 163 -321 42 62 -134 77 306
4667C06k2m99P9L26j90k15N4L42j37j39K79k44J65N5jp4K5l85o5L98j20k40M60
$$ 306 284 -215 -136 190 0 -215 -161 181 44 -95 184 -60 105 160 159 85 110 -275 -340 58 -62 -302 158
4690A58J07j33l59N46j16k35j95K57L6r7j8N9m0l38M19K72p5m53M06l69J24k11
$$ 158 265 132 -227 319 203 -32 -227 30 66 -31 -49 10 -30 -368 51 323 248 -205 201 -168 -44 -255
4712b55k2J93P0j66K75K84q4m25L0M59m23K0K06J02k55J03p1J89j62Q5J84L7m13
$$ -255 -277 -84 -14 -180 95 379 295 -130 -100 359 -64 -44 162 264 9 112 41 230 68 153 337 374 -39
4735c9J55J3l83K07K78k9k48P9K8K36k90k74L79om38K47l1J24k49o7J29K48j10
$$ -39 116 129 -254 -47 231 202 -46 33 61 297 7 -267 112 106 -332 -85 -116 8 -241 -308 -179 69 -41
4758d1M2j56K00k0Ql2j25J77l2L56m97j08J13K22k66L09j84j59J22l63J89J45
$$ -41 1 -155 45 25 33 1 -124 53 21 377 -120 -228 -115 107 -159 150 -34 -193 -71 -434 -245 -100
4780a00J90j68K13k83N0k03M54Q5n84L53J79k44j76N9L62J46p01K51K24m11P2
$$ -100 90 -78 135 -148 -98 -301 153 238 -346 7 186 -58 -234 -175 187 333 -368 -117 107 -304 -232
4801b32K48P5k36jL47J9j07k2j18j02J85k36L39j27l0P8j45o6o7j21M06j59P3
$$ -232 16 91 -145 -146 201 220 113 91 -27 -129 56 -180 159 32 2 80 -65 -131 -198 -319 87 -72 1
4824AK65K5l2l42J39J27k36k34qN74m61o9M52k02r2k25J01M20o6j59R8j23M9k18
$$ 1 266 291 259 -83 56 183 -53 -287 -295 279 -182 -251 201 -1 -93 -318 -217 203 137 -22 76 -47 2 -216
4848b16M78l08rO6K47k58J8p9K17k84P7K43Q2j44j35J99j48k82L8L15j82j40L32
$$ -216 262 -46 -55 11 258 0 18 -61 156 -128 -51 192 274 130 -5 194 46 -236 -198 117 -65 -205 127
4871A27J2k53N4p9K40j50k98N71k4l27N0K29j01L9j08O1J81l76K34k04L8OnJ64
$$ 127 139 -114 -60 -139 101 -49 -347 224 200 -127 -77 152 51 90 -18 43 224 -152 82 -122 -84 -78 -83 81
4895H1K59l77j49L85k38j30J7K09k83J3LL62J1m41n3L94Qk33N26m09j15K36r4
$$ 81 340 -37 -186 199 -39 -169 -152 57 -226 -213 -210 152 163 -278 -331 63 71 -162 364 -45 -160 76 -18
4918a8L02l64l30N36j17l2l12J71M11l05L23j76j68L0j7m8k53J2J89K8K20j84
$$ -18 284 -80 -410 126 9 -23 -335 -164 247 -58 265 89 -79 -49 -66 -114 -367 -355 -166 -138 82 -102
4940a02K04o5k59K13N6K02n24P7p2O23l72O1R5j44R0j73J64P8m14L70j73L48k55
$$ -102 102 37 -222 -9 47 249 -275 -198 -270 353 -19 42 137 -7 83 -90 74 152 -262 108 -65 283 28
4963B8k63N23k34k3oN1L4j0J04l1n12J04K44Q5j92j79N67J55m75j3J84p2n5n5
$$ 28 -235 288 54 31 25 76 110 100 204 173 -339 -235 9 94 -98 -277 290 445 -30 -43 141 69 14 -41
4987d1mLN7K60k19j59M45n89K73R3k24R9j04M8j68J72J58l71L44K13j87L5N5J3
$$ -41 -45 -42 15 275 56 -103 342 -247 26 119 -105 -6 -110 -62 -230 -58 100 -271 73 286 99 134 189 202
5011B02k71j46M06J27k18j12m5P9L8n7p2L9j40J85J8J49k63lJ47o9q1j20M13j19
$$ 202 -69 -215 191 318 100 -12 -57 22 60 3 -69 -30 -170 15 33 182 -81 -84 63 -6 -87 -207 206 87
5035H7l28K25K1L65m58J28J96Rl45J9R5k64j92N78q3q4M3l23O29k80Q5j93L29
$$ 87 -241 -16 5 370 -88 40 236 245 -100 -81 14 -250 -442 136 53 -31 12 -311 318 38 123 -70 259
5058B59n32k3N3M17l19L13j53O4j47K10j10O3j99J57l45K86j85N3N09l21k55O7
$$ 259 -273 -296 -243 174 -145 168 15 79 -68 142 32 95 -104 53 -292 -6 -191 -138 371 50 -205 -138
5080a38L12j80k57J37J44j04R1P0q0k1q9K32J14l64j65K95Kj80K26j11K74k67
$$ -138 174 -6 -263 -126 18 -86 5 75 -5 -26 -115 117 231 -133 -298 -3 -1 -181 45 -66 208 -59
5102e9K84r5k7j95J38n1j86P2J27K2K4m66M93q1j26R2J46q1k69M12l63K13J2k86
$$ -59 225 130 103 -92 46 -5 -191 -119 8 30 54 -412 81 0 -126 -34 112 31 -238 174 -189 24 36 -250
5126b50L52o8n4J96k85K48j22p3J60oj63K31K05m65j16J80l5j37J48J50J04o3
$$ -250 102 34 -20 176 -109 139 17 -56 104 98 -65 166 371 -94 -210 -30 -65 -202 -54 96 200 137
5148A37k44P6j45J50J91j11J53k38O2K2j44K24j39J86k71l7M12n0k34J49K11k37
$$ 137 -107 -31 -176 -26 165 54 207 -31 31 53 -91 133 -6 180 -91 -128 284 234 0 149 360 123
5170A23k7q7j04L13k44J52k5j68N2J10k5n8k40J55J92k85O7lK99k19J0k32J42
$$ 123 96 9 -95 218 -26 126 101 -67 -15 95 70 12 -228 -73 119 -166 -99 -102 197 -22 -12 -244 -102
5193a02p1J0J13j98J96M9j71j9M07k40K15k69j56J23O7K43l37n5N01k40k54Q3
$$ -102 -173 -163 -50 -248 -52 -3 -174 -193 214 -26 189 -80 -236 -113 -46 197 -140 -195 306 66 -188 -105
5215a05M81k19k7J23k41Qj66K24j3k52J45J03k01M41j86O0n9N2l41J72l2P0j22
$$ -105 376 157 130 253 12 20 -146 78 65 -187 -42 61 -140 301 115 175 116 168 -173 -1 -33 37 -85
5238h5J04j18J17m3N10m51L28k90J60j61l37J89K10k96O7K56k7Kl13J32J84Nn87
$$ -85 19 -99 18 -25 485 34 362 72 232 71 -266 -77 133 -163 -96 160 133 135 -178 -46 138 143 -444
5261d44K29j72J40M35j09j87N4K35m04P8J58J5J91J66j75n0n0j87J94J5M2J6k11
$$ -444 -215 -387 -247 188 79 -108 -54 181 -223 -145 13 28 219 385 210 160 110 -77 117 132 174 190 -21
5284b1L13j82J14j57l4J40j89J61Kq2Q2j66J25k43L2J4L98q5m26L99k88%J02J14
$$ -21 292 110 224 67 33 173 -16 145 147 65 147 -19 106 -137 -105 -91 307 222 -204 195 -93 -93 9 123
5308A23k91k13L66Q0K02m23L06k16J03m1q9K36k51R9K56l77N0j6R4k12j06J67
$$ 123 -168 -381 -15 65 267 -156 150 -66 37 -4 -93 143 -108 -9 247 -130 -80 -96 -2 -214 -320 -153
5330a53J03K94l04J52m98N54k72J58r9k2J22k06K45m4M8R1L34l68m5k32J43M2
$$ -153 -50 244 -60 92 -406 148 -124 34 -65 -87 35 -171 74 30 78 169 503 135 90 -142 1 43
5352D3k2k69J73j35LL21M4m08M19O0k36j65M26L7j01j77j76J25Lo7K24j9q7K6
$$ 43 21 -248 -75 -210 -207 114 158 -250 169 229 -7 -172 254 291 190 13 -163 -38 -35 -102 122 103 16 42
5376D2k45o3J00J05k7J01k67J96R1J21n1n2r9lk51Q3M11k69K43o0M0j51P8M20
$$ 42 -203 -266 -166 -61 -88 13 -254 -58 33 154 103 51 -48 -51 -302 -219 192 -77 166 106 146 -5 73 493
5400D93l95J1k72N3K27k93P6K82k35J05J1o8Q0k03K84k98j25K36j61L49o7j79
$$ 493 98 109 -163 -110 117 -176 -100 182 -53 52 63 -5 75 -128 156 -142 -267 -31 -192 157 90 -89
5422h9k31Q6N96m37p6K58N9l76M6J00J28n6j83M57j86j83J85n2nJ5K39l8l12j03
$$ -89 -320 -234 362 -75 -151 107 166 -210 -164 -64 64 8 -175 282 96 -87 98 46 41 56 295 257 -55 -158
5446a58J41j4r3J37l6M3K4L9j34K49m03M9r1K19J35m9M0K23l54m6J24j10q0K17
$$ -158 -17 -31 -124 13 -23 20 44 83 -51 198 -205 -156 -247 -28 107 58 98 321 -33 -79 45 -65 -145 72
5470G2j90L42l38j4M18r6k42j62J89j7l4n5m5jJ53r4l08M03K25j46j57J81Q1M6
$$ 72 -118 224 -114 -128 290 194 -48 -210 -21 -38 -72 -127 -172 -173 -20 -114 -422 -19 206 60 -97 84 165 211
5494B11j98J05O1k08J53k35K00m31J5N87k38j46K03l88M64l04K42N1P9j70n3J39
$$ 211 13 118 179 -29 124 -111 89 -342 -327 260 22 -124 79 -309 155 -149 93 144 223 53 0 139
5516A39j51J18l04K12J8J39k41L46k01l3L26k86J51l25J26l9k9o2l41O11k14K66
$$ 139 -12 106 -198 14 32 171 -70 276 75 42 368 82 233 -92 34 -5 -34 -96 -437 174 -40 226
5538B26n35J83J29j72J56K6j72K47j45L06l93K67J04k72J98k33J45P5k85Mj14
$$ 226 -309 -126 3 -169 -13 13 -159 88 -57 249 -144 123 227 -45 153 -80 65 140 -145 -141 -255
5559b55K09J66m2J02P9j69k7j00M01k81K9j8o6J25j82O8O1k51K85K14m50P4p6
$$ -255 -46 120 78 180 259 90 63 -37 364 83 112 94 28 153 -29 39 100 -151 134 348 -102 -28 -104
5582a04k4K21K7Q7jl1J01j69j74k3Kk32M45k7o1j54J31P0n4K12j60j80L52k58
$$ -104 -128 93 120 207 206 175 276 107 -67 -90 -88 -320 125 98 37 -117 14 84 30 242 82 -98 254 -4
5606dj98M56j76Nl01J05J79n5m29K56K88J81j50l08N1L89j40l88L05po8j69M11
$$ -4 -202 254 78 83 -218 -113 66 11 -418 -162 126 307 157 -151 -100 289 149 -239 66 59 -9 -178 233
5629B33m18J91R3L3k2k65K41M6l16R4l7K80j22O1l13M08%k78J28N5k23L88j49
$$ 233 -185 6 99 132 110 -155 86 132 -184 -90 -127 153 31 92 -221 187 187 -91 37 92 -131 257 108
5652A08K9l89J37J70J0p0k02n2%J47L0J14j5n3M1k54Q0O8J10J66p3r1K5j3J63
$$ 108 137 -252 -115 55 65 -5 -207 -259 -259 -112 -82 32 17 -36 5 -249 -169 -101 9 175 102 11 36 23 186
5677A86j05j87L22l82J42N8N9j95J19k68K97j51L34j49j55m2j35M44l22K86r9
$$ 186 81 -106 216 -166 -24 34 93 -102 17 -251 46 -105 229 80 -75 -117 -252 192 -130 156 57
5698E7mn1j42R7R2k24J95J47Kk31L32l73L5K04l11N5L76k64l3Q2k1K15Q9j25m3
$$ 57 53 2 -140 -43 49 -175 20 167 169 -62 270 -103 -68 136 -175 -120 256 -8 -41 41 20 235 324 199 156
5723A56k0l54M50l16j83K67L4R7r1j80J35q5J41K2m8l40K00Q2qK02k0j15nL6k
$$ 156 136 -218 232 -84 -267 0 34 131 40 -140 -5 -90 51 73 25 -315 -115 -33 -41 161 141 26 21 57 55
5748E5J41j94J37N3j63k3j71M7M37k91j71L51J06l50J68K0l0j57j85L20M0r6l69
$$ 55 196 2 139 192 29 6 -165 -118 319 28 -143 208 314 -36 132 152 122 -35 -220 100 140 44 -325
5771c25K95p4m4K52K34l57pRK13P6m59RK39N5j23MK65l51J35R4p6j78J9N3jJ7
$$ -325 -30 -104 -148 104 338 -19 -26 -17 196 272 -187 -178 61 116 -7 -3 262 -89 46 140 64 -114 -95 -42 -43 -26
5797b6j67oK4r2Q1M19P8l36j54L16k75lkK94J60k38l16O6K5%K84k36p5R4J71L0
$$ -26 -193 -199 -175 -267 -186 233 311 -25 -179 137 -138 -141 -143 151 311 73 -243 -177 -152 -152 132 -104 -179 -85 86 116
5823A16Ol1p7j35N5m1k99J41M21n1j58K03k50q8M82l46J11J07o5j67j19J22K65
$$ 116 122 91 14 -121 -66 -107 -406 -265 156 105 -53 150 -100 -188 294 -52 59 166 101 -66 -185 -63 202
5846B02m46M66l38J50j04l13L92K33l52K35k12J89kj42k33L77n5mk81K34N2l44
$$ 202 -244 222 -116 34 -70 -383 9 242 -110 125 -87 102 100 -42 -275 102 47 43 -238 -4 48 -296
5868b96K14K79k65k28L11j0K77m68K84J68k98k06N70l38K97k49J51n12M93j60
$$ -296 -82 197 -68 -296 15 5 282 -186 98 266 -32 -238 332 -6 291 42 193 -319 174 14
5888A4k02J94K5J20J10o62J50L47k4j45J42J12O1j73J3m3j35K18j71K1O4N1j13
$$ 14 -188 6 31 151 261 -401 -251 96 72 -73 69 181 242 69 82 39 -96 122 -49 -28 36 87 -26
5911b6k57J05o8J98J37Q2j03l22M06l44R4n6J35L0J89k78O6jL65n56J77L80l83
$$ -26 -283 -178 -246 -48 89 171 68 -254 152 -192 -98 -154 -19 11 200 -78 -12 -13 352 -204 -27 353 -30
5934c0n3j18M74r8j03l50K33M11o99K25j59J10n2J24K18m2j04k5M7J7J10j98k2
$$ -30 -83 -201 273 175 72 -278 -45 366 -333 -108 -267 -157 -209 -85 133 91 -13 -38 9 26 136 -62 -84
5957h4J60r4j42N3o7J55Rk72L07m3O6P3j57o0M0N3j57K4K81l38K60j5J11k26K12
$$ -84 76 -18 -160 -107 -174 -19 -10 -282 25 -18 48 121 -36 -96 -56 -3 -160 -136 145 -193 67 52 163 -63 149
5982A49k92m6K29m33L31J79M6M8l0Or4k01k27M01p1k0K6j60j0J26%M4m6k6L71
$$ 149 -143 -189 40 -393 -62 117 163 211 181 187 93 -108 -335 66 -5 -25 1 -159 -169 -43 -43 1 -45 -71 300
6007C00r7j57k6m8q3j96K89j47P0J07j95J11k61K60l42K75l5Q0K71k44J82j35
$$ 300 203 46 20 -28 -111 -307 -18 -165 -95 12 -183 -72 -333 -73 -415 -140 -175 -95 176 -68 114 -21
6029b1L33l61m9J08J8l30K20J1r2L45k90P5P7l05K18J55K1Ol89M37nL2l33K1j25
$$ -21 312 -49 -98 10 28 -302 -82 -71 -163 182 -108 -33 44 -261 -43 112 133 139 -250 187 182 214 -119 -98 -223
6054b23K8K23j36K25k57J23L18n6n36J24J35N0K41l73J0M6j57J23%L44l87J24
$$ -223 -195 28 -108 117 -140 -17 301 245 -291 -167 -32 18 259 -114 -104 -58 -215 -92 -92 252 -135 -11
6076a1L2p0o8Q3Q4j05l36K5N95j77m25N43k33k37N88j76l09L09j34RL63k79p5
$$ -11 21 -49 -117 -34 50 -55 -391 -366 229 52 -373 170 -63 -300 288 112 -197 112 -22 -13 350 71 -4
6099dJ8m1L36j74l17J73J55j02j45M68q63O22jj62k59J95K61mk34N4K6l87O17
$$ -4 14 -27 309 135 -182 -9 146 44 -101 367 -496 126 125 -37 -296 -101 160 156 -78 -24 2 -385 232
6122B32m81L59r3j31J64J98k36l4N1k76L74j82J43j90K05n3j7m8J70P5j77K09
$$ 232 -249 110 17 -114 50 248 12 -22 29 -247 127 -55 88 -102 103 50 33 -15 155 230 53 262
6144B62j62j87J23l8l01L15j19o4K27J26k52J51nk68K61o0J30j29J40l34NM29
$$ 262 100 -87 36 -2 -303 12 -107 -171 56 182 -70 81 76 -192 69 9 139 10 150 -184 -179 250
6166B50l11k08M16k25K95j76k92K14R1J31mj15K03k88o6m1K0L22k72j39K07R1
$$ 250 -61 -269 147 -78 217 41 -251 -37 54 185 181 66 269 -19 -85 -126 -106 216 -56 -195 12 103
6188A03j53J96l36N7k28K31J14k35K93j52j82L69P4k25J81L3j8L3J94j89o4k24
$$ 103 -50 146 -190 -133 -361 -130 -16 -251 42 -110 -292 77 151 -74 107 140 122 155 349 160 96 -128
6210a28J00j6K72l64Q4L1j30k22O40k39L5j54k15M40Pk9J11k05R6j34J17j74J2
$$ -128 -28 -44 228 -136 -52 -21 -151 -373 267 28 63 -91 -306 134 141 112 223 18 114 -20 97 -77 -65
6233f5k6N7K24l23K43k7j56J32k01M72k66l08M40o4Q5l49J46P2j40Q5k23J85K31
$$ -65 -91 -34 190 -133 110 83 -73 59 -142 330 64 -244 196 132 217 -132 14 86 -54 31 -192 -7 224
6256B24l89J68m4K44m13M7N7j34Q1n4K34K4l36N77l45r2N80l53l21k76M73n9J18
$$ 224 -165 3 -41 203 -210 -163 -106 -240 -159 -213 21 45 -291 286 -59 -151 429 76 -245 -521 -48 -107 11
6279A1l3j02M82m38J0K47M5k19J34j09O8l26O18l39R4j1k40K53j97J63q0P7qK05
$$ 11 -22 -124 358 -80 -70 177 222 3 137 28 96 -230 388 49 143 132 -108 145 -52 111 31 108 100 305
6303C05p7k94l5o8N36m99Q5L31k70k6k43K46J83m91j7L19k09K88j61j27L62l0
$$ 305 228 -66 -101 -169 367 -132 -47 284 14 -12 -255 -9 174 -317 -334 -15 -224 64 -97 -224 138 108
6325A08l63K80j33K41n8m74L51j76J62K01m42P5K72j9l6j07J20r6M32n06N7o0
$$ 108 -255 25 -108 133 75 -399 -48 -224 -62 139 -303 -228 44 25 -11 -118 2 -94 338 -168 -111 -171
6347a71J32R5k98K66j09k41J29j2O9K77l33K25m4r9N2P9j75N5J22J02k09J90j37
$$ -171 -39 56 -242 24 -85 -326 -197 -209 -140 137 -196 29 -15 -114 -62 17 -158 -103 19 121 -88 102 -35
6370c5K39j97L69q5l69mJ22n6k4J31J01l32M15m26K82l21K18%k80L07J89l55O
$$ -35 204 7 376 291 -78 -82 40 -16 -40 91 192 -140 275 -151 131 -190 28 28 -252 55 244 -111 -105
6393a05M44k32j85J17l03K50K77l70j1j90M02nj81N6l8R6k04J5N79m07L27j50
$$ -105 339 107 -78 39 -264 -14 263 -107 -118 -308 94 89 -92 -36 -74 22 -182 -167 412 5 332 182
6415A82k64J47l23L37M4l04L3J29M8q0k66J50K00j1K13k56n6K52k21M24l93o4
$$ 182 -82 65 -258 79 123 -181 -148 -19 29 -51 -317 -167 33 22 235 -21 -77 175 -46 378 -15 -79
6437g9J06R7K9j90m5j20N54m44R6j8J53l91N87m32j1mJ28j53lK73j57k95K94P8
$$ -79 27 124 153 -37 -82 -202 352 -92 4 -14 139 -252 335 -97 -108 -112 16 -137 -140 133 -24 -319 -25 53
6461E3p1L33l03l79M85P3j30J84l22O0J46j94J74l35K91P6j94K9j7Q5m6j45K08
$$ 53 -18 315 12 -367 118 191 61 245 -77 -17 129 -65 109 -226 65 141 -53 -24 -41 44 -2 -147 61
6484F1J66k47q5K78k41P7j17J18j7l4L32n30j29K31J94J0r4n7JJ36JJ22j40K14
$$ 61 227 -20 -105 173 -68 9 -108 10 -7 -41 291 -239 -368 -137 57 67 -27 -84 -83 53 54 176 36 250
6508B50j05j23K39j35k14L09j3l87M64l60k1J03n3k07M18m39K56L6j92N8L3K36
$$ 250 145 22 261 126 -88 221 208 -179 285 -75 -96 7 -46 -253 165 -274 -18 18 -174 -116 -83 153
6530A53J45k09K3l67p6K66Q1J94k12J02m6k99J08K49J58k43j03L9j0J4J8j35N9
$$ 153 298 89 112 -255 -331 -65 16 210 -2 100 54 -245 -137 112 270 27 -76 -37 -47 -33 -15 -150 -91
6553i1K08J45o14R0L98j20k3K42j42m0J0R1m51J71O9Q5J61j52L99l24K7p2J70
$$ -91 117 262 -352 -262 136 16 -7 235 93 53 63 154 -297 -126 -57 28 189 37 436 112 139 67 237
6576B37n97N91n06R6L0J60M9k44J91P5k6j56N2q6J71p6P5k94L46j76L8Q9J55j76
$$ 237 -360 231 -275 -179 -149 11 60 -184 7 82 56 -100 -48 -134 37 -39 36 -258 88 -88 -50 39 194 18
6600A8J36J47m87o9L22j32L11j12j09N9R9j94k6n7J53l38K56O8l05M42n28L02
$$ 18 154 301 -186 -255 67 -65 246 134 25 84 183 -11 -37 -94 59 -279 -23 45 -260 182 -346 -44
6622d4j04J8N7R4j85J1M19l03k77J08m9L18j54o6o2L67r9M7j79p1J20J61J57J68
$$ -44 -148 -130 -73 21 -164 -153 266 -37 -314 -206 -255 63 -91 -157 -219 148 49 96 -83 -154 -34 127 284 452
6646D52o04J0K19k59M87m63J26J77o9k48L5J03J32Q2J80l51k18K02J20p7p5k9
$$ 452 -152 -142 77 -182 305 -158 -32 145 76 -172 -137 -34 98 180 360 9 -209 -7 113 36 -39 -68
6668f8l3O8O9j03O7J24k92K31oO7j01l3p1J73k62K3R2O6j10J06oK6j82J16P7k94
$$ -68 -101 -33 36 -67 0 124 -168 63 57 124 23 -10 -81 92 -170 -147 -55 11 -99 7 1 27 -155 -39 38 -256
6694b56K65j25NL92O7l05j71J0L0K99k1k84p4M29l09J8O4j49K59l99K49J95m08
$$ -256 9 -116 -111 281 348 43 -128 -118 -88 211 190 -94 -168 261 -48 -30 34 -115 144 -255 -6 189 -219
6717b19N60m27Q4j40R3k87L41q1j40N23o19L38O6o80L94L97j13j00o6k6j70L40
$$ -219 341 -86 -2 -142 -49 -336 5 -76 -216 307 -312 26 92 -588 -194 203 90 -10 -76 -102 -272 68
6739F8q6R7l5m1j76M44j85n1k27J22j33O0K07K4M7k34l1Q4j1J34j90K75j00j47
$$ 68 -18 79 44 3 -173 271 86 35 -192 -70 -203 -143 64 88 135 -99 -130 -46 -57 77 -113 162 62 -85
6763h5J39L5J73j97O4j3l7J0J47m38J77n3M08K1o42M01m24K99L28k81k21L3P0
$$ -85 54 89 262 65 129 116 79 89 236 -202 -25 -78 330 351 -291 110 -314 -15 313 32 -189 -156 -86
6786h6K68j98M0j38M7M5n4J09j4J04l04Q6J19k05o6J54Q1j04K31r2j16p3R2j08
$$ -86 182 -16 24 -114 -67 -22 -76 33 19 123 -181 -95 24 -181 -247 -93 -12 -116 115 23 -93 -166 -74 -182
6810a82L95k62j7J63O2k88J62K3l62K73N6lj30K79J43l60q3K9J49r3M8Q8l10O28
$$ -182 213 -49 -66 97 159 -129 33 56 -306 -33 23 20 -110 169 312 -48 -131 -102 47 -46 2 90 -220 408
6834D08k19k1j64L9K6q4K53k94M51n02L06Q0n32J31J86j21rj13J30K29j45K3m0
$$ 408 189 168 4 43 69 -15 238 -56 395 -107 199 279 -253 -122 64 -57 -66 -179 -49 180 35 58 18
6857A8q0K4m9O1j6L8K29k01O6k59J38l7j5N2j20J39m4j49L23j14l3P1K49m1m27
$$ 18 -62 -38 -87 -26 -42 -4 225 24 90 -169 -31 -68 -83 -31 -151 -12 -56 -205 118 4 -29 42 291 250 -177
6882a77J55L76k62k37N3j13L2K27j07L9L57l55q7O0K67k04m5J44j83L0jJ43P5
$$ -177 -22 354 92 -145 -92 -205 -173 54 -53 -14 343 -12 -99 -39 228 24 -21 123 -60 -30 -31 112 187
6905A87l37K06j16L55j96n2r6PL34l67J21J17k58j03K39j9r4K61l09K10J34j53
$$ 187 -150 56 -60 295 99 47 -49 -42 292 -75 46 163 -95 -198 41 22 -72 189 -120 90 224 71
6927G1J00j02j29K28P6k18j28k50M48n32O36r2j93M00n46J49L4L2l0L4j60J40
$$ 71 171 69 -60 168 244 26 -102 -352 96 -436 200 108 -85 315 -231 -82 -48 -16 -46 -12 -172 -32
6949c2J76k18j07O1J53m3j34K56l27J31p8L46O5k83j48J19J16M6j09J4m6k0n6
$$ -32 144 -74 -181 -120 33 -10 -144 112 -215 -84 -162 184 249 -34 -182 -63 53 99 -10 4 -42 -62 -118
6972a18L26Q5j69m22O63l22k24Q4K36j42J5j98K17KJ79n7l42P5L38j65j92%j0
$$ -118 208 293 124 -298 365 43 -181 -97 139 -3 12 -186 31 33 212 155 -187 -112 226 61 -131 -131 -141
6995a41P3o5K90Q4q7k76J93j62J27n9L06j35j42J4k21J2L85l9j76K76l31J48J74
$$ -141 -68 -133 157 241 154 -122 71 -91 36 -23 283 148 6 20 -201 -189 196 157 -19 257 -74 74 248
7018B48k48L6k22j5J97j68K18m24Q26l94j24J36J50M9n01M52m35j45J48J77j1
$$ 248 0 36 -186 -201 -4 -172 46 -378 448 54 -70 66 216 265 -236 216 -219 -364 -216 -39 -50
7039e0R2l17L77j25Qn2J19L7k6j33m2J42M3Q5J13j77j40J93m60M01q2K28m62K25
$$ -50 42 -275 102 -23 -15 -67 52 89 63 -70 -112 30 73 158 271 94 -46 147 -313 88 6 234 -228 -3
7063cj16L4J49j22J11j44K47l10j67M61o0K8k83P1J96K9k99J30J04j0Q0J61k35
$$ -3 -119 -85 64 -58 53 -91 156 -154 -321 140 80 108 -175 -104 92 121 -178 -48 56 46 126 287 52
7086E2m7K42l68j7K80J21r8j73k69M11j30J61k02K07l18R8M2Q0Q9q2R0L9j75M5
$$ 52 5 247 -121 -138 142 263 165 -8 -277 134 4 165 -37 170 -148 -50 -8 72 161 79 169 208 33 78
7110G8m4N1j42P4j86K32J79k08K01k31m40L89j27J49M0P7mj44N8J37n7K8j07J47
$$ 78 34 85 -57 17 -169 63 242 34 235 4 -436 -47 -174 -25 15 92 88 -56 2 139 82 110 3 150
7134A50q1k58M23k50O1k4o6j6o5j31K69PR5k19N56l05j06J53J02l30J75j18j36
$$ 150 69 -189 234 -16 45 21 -45 -61 -126 -257 12 19 114 -105 451 146 40 193 295 -35 140 22 -114
7157a14J70k58L13k18K99l53K16M0j49K66j90k31K92Q9j49p2K48O9k85l4J43k7
$$ -114 56 -202 111 -107 192 -161 55 95 -54 212 22 -209 83 172 23 -49 199 268 -17 -51 92 65
7179F5j50J63j05N3j64J48m8j71K24r4Q4k68J44J84J21l30j05K15j7J25k00M5
$$ 65 -85 78 -27 26 -138 10 -38 -209 15 -79 5 -263 -119 65 186 -144 -249 -34 -51 74 -126 -81
7201h1K32q8l34J62M8r5L98k67J07r2j66O9J58o8q3M0K19q0j31n2P9j30L52O5
$$ -81 151 63 -271 -109 -61 -156 242 -25 82 -10 -176 -107 51 -17 -100 -60 159 79 -52 -104 -25 -155 197 262
7225B62j04n77L71J1j88K83kJ38m17K52mL0j27p4J42k36L07K27l49O7q9P8j16
$$ 262 158 -419 -48 -37 -225 58 56 194 -223 29 25 55 -72 -146 -4 -240 67 294 -55 12 -77 1 -115
7248a15k25K23MK59k54J60k93N04m12J26pj26N2J56J23k8ok75J50J30j36O9N1
$$ -115 -340 -117 -113 146 -108 52 -241 263 -149 -23 -30 -156 -104 52 175 147 141 -134 16 146 10 79 130
7271A30j94j28M98l48p2L53j94k25O50k43m66M17p7m66M74m04L50oJ32j20K26
$$ 130 -64 -192 306 -42 -114 239 45 -180 470 227 -239 178 101 -365 109 -295 55 49 181 61 287
7292B87l12K29q8l46L71l25J71l0J61j88J77k29K34l44J48m5K25k38J16r4K7K10
$$ 287 -25 204 116 -230 141 -184 -13 -43 118 -70 107 -122 112 -232 -84 -129 96 -142 -26 -120 -93 117
7314A17R6o3k69j41M83j15k3k17J88q3l65N49l76J50J85k86K00j21K9J08r0k0
$$ 117 213 150 -119 -260 223 108 85 -132 56 -27 -392 157 -219 -69 116 -170 30 -91 -62 46 -44 -64
7336f4J2K47k06K4Q2J33Q6n28O16l72q6L37l64L79l37J34K8j56j0j05K40k8j89
$$ -64 -52 195 -11 13 95 228 314 -214 402 30 -56 281 -83 296 -41 93 121 -35 -45 -150 90 62 -127
7359a27p6K08j14J04J84p4L8l22J42K7J5J37J47m38J52k18L52Mk15R1j97M26n96
$$ -127 -203 5 -109 -5 179 105 143 -179 -37 -10 5 142 289 -149 3 -215 137 141 -74 17 -180 246 -350
7382c50L72J44j80p3N2o4PJ56j32K31m04M37j96J38k51p6o2N6J04J99q3K6k41
$$ -350 22 166 -14 -87 -35 -99 -92 64 -68 163 -241 196 0 138 -113 -189 -251 -195 -91 108 25 51 -190
7405a90K30l7j46k26L36n2j40M31l23J98k76K18j38L48j71j02j12N29o14K30K39
$$ -190 40 3 -143 -369 -33 -85 -225 206 -117 81 -195 23 -115 233 62 -40 -152 377 -237 -7 232
7426B32j90l57M02j97j39J53O0J43n2k28K46oO2j46L10n03L97k03m5K9j86%L33
$$ 232 42 -315 87 -110 -249 -96 -36 107 55 -173 73 67 129 -17 293 -210 187 -16 -61 -32 -218 -218 115
7449A15p1j36M43l89J46k05K71j88N8N2j32n4K80k30K67j23k68L96j7k81J97l00
$$ 115 44 -92 351 -38 108 -97 174 -14 44 96 -36 -90 190 -40 227 104 -164 232 215 -66 131 -169
7471a69K23l1l4j82K75p9J11j01k2k2OK86j75j45j9l7j44M46J80k07k97J97l51
$$ -169 54 23 -11 -193 82 3 114 13 -9 -31 -25 261 86 -59 -78 -115 -259 187 367 160 -137 60 -291
7494b91J74L2J0K90l17kl0J17K15o1l10J87R8l26J48K4j87J49m7q4M01j85j01
$$ -291 -117 -85 -75 215 -102 -104 -134 -17 198 137 -173 14 112 -214 -66 -42 -229 -80 -127 -211 190 5 -96
7517i6K41k49J60k08K31K87n17K93l17K2J60p3LJ03l9J02k38L55j92m3j01J00
$$ -96 145 -104 56 -152 79 366 -151 142 -175 -153 7 -66 -63 40 1 103 -135 220 28 -15 -116 -16
7539a6j5J07k84k24O37l11L30k34J47j17j52J9J86l87J27K40k27M93l02k96K00
$$ -16 -31 76 -208 -432 205 -106 224 -10 137 20 -132 -113 73 -314 -187 53 -174 319 17 -279 -79
7560g9j3J71j19j20J35K85M0l17k19M88l00N8Q2J7o8J1n9q1L11l81J12N4J20k30
$$ -79 -92 79 -40 -160 -25 260 300 -17 -236 252 -48 10 92 109 41 52 -7 -88 223 -158 -46 8 128 -102
7584a02j49K00j0m54O57k49m7K92Kk22k84K60O3r5J44j42K1K89q6k06L63m76K60
$$ -102 -251 -51 -61 -515 142 -107 -154 138 140 -82 -366 -106 -43 -138 6 -136 -115 174 88 -118 245 -231 29
7607B9O5p4J81j28r6N3J97n82M59J51k36K8O8N2k43J38K57l32p6J45j37J7j06
$$ 29 94 20 201 73 -23 30 227 -355 104 255 19 47 115 167 -76 62 319 -13 -89 56 -81 -64 -170
7630a70Q5Jj19j7L11j88L9jK94j76n1J55m01L14l08L04k3j00j43J90P6O8j42J36
$$ -170 -85 -84 -203 -220 91 -97 -58 -59 235 59 8 163 -238 76 -232 72 49 -51 -194 -4 72 140 -2 134
7654A34P1l38K01l2j4j33j81K43p8J54p2p0Q4k34K26M1K25j92L78p84L23j97L93
$$ 134 205 -133 68 36 22 -111 -292 -49 -127 27 -45 -115 -31 -265 -39 2 227 35 413 -371 -48 -245 148
7677A48O6l54n6J26j24K38r4k57K69L21l56o3N09l68l0O7J40j72J46l44m0M78
$$ 148 214 -140 -196 -70 -194 44 -50 -307 -38 283 -73 -136 373 5 -25 42 182 10 156 -188 -228 250
7699B50k95J72l75K18J33j31J70k71M04Rk28j70J55l9K01k28j19J75J12j04k14
$$ 250 -45 127 -248 -30 103 -28 142 -129 275 284 56 -114 41 2 203 -25 -144 31 143 39 -175
7720a75M5J73j5Q2j40l19L79J81l70M29J38o00L58k77Q3o8k40Q9R4J48j36K82
$$ -175 -130 43 28 110 -30 -349 30 211 -159 270 408 -192 166 -111 -28 -96 -336 -247 -153 -5 -141 141
7742A41k08j63J16r9K67m8L9k04J6Q6j80K84j46L52k34K00k98J5M2l1r9L13J2
$$ 141 -67 -230 -114 -213 54 6 45 -159 -143 -57 -237 47 -99 253 19 219 -79 -64 -22 -53 -152 161 173
7765A73k36l08P09k75j27j40K57J41p4J04j99j9k25K22J79o8q0K3j24M7M8j03
$$ 173 -63 -371 338 63 -64 -204 53 194 120 224 25 6 -219 3 182 114 34 57 -67 -20 28 -75
7787g5M50n24J44J81j5j57j41Q6J30k84k04M74n5j85K68k78K06o3L1O0k4J04k13
$$ -75 375 -149 -5 176 161 4 -137 -51 79 -205 -409 65 10 -175 93 -185 21 -42 -11 49 25 129 -84
7810h4Q2M6j24K15j40j16J86k55j57L23R4j09K73k73k0N7j21J21j72N3j33J48
$$ -84 -2 44 -80 135 -5 -121 65 -190 -347 -24 70 -39 234 -39 -59 -2 -123 -2 -174 -121 -254 -106
7832a06K92j80j79M16k04j53J25j47l4j81M69J87n17K28J99l42K74l26L00J1l34
$$ -106 186 6 -173 243 39 -114 11 -136 -170 -351 118 305 -212 16 215 -127 147 -179 121 132 -202
7853b02K3l0K57oj27M0L33m61L72k82k20L33j33J2R7K24m18M6MJ16l25N63k70
$$ -202 -179 -209 48 42 -85 -45 288 -173 199 -83 -303 30 -103 -91 6 230 -188 -142 -138 -22 -347 216 -54
7876e4J8k03J70Pj22K92k00j07L25j87M11l63K50k56k1J10j36r7L0K68k54L99
$$ -54 -36 -239 -69 -62 -184 108 -92 -199 126 -61 350 -13 237 -19 -40 70 -66 -163 -133 135 -119 280
7898B80k29K2j49J04k26M38m32L84l29K92nm25L83j42m6K82o1j83mK29k0O9l10
$$ 280 51 73 -76 28 -198 240 -192 192 -137 155 150 -275 108 -34 -80 202 141 -42 -46 183 163 232 -78
7921g8K3K4Q6n5o6J68j65r4K48mk34j09K94Rk0m31M17k47L96k57o0Q6P3R4j07
$$ -78 -55 -31 55 0 -66 102 -63 -157 91 87 -147 -256 38 47 27 -404 13 -234 162 -95 -155 -69 4 98 -9
7946in4L94m13J51M5l53K86n3j47R2K81j89o2o4k1L67m39J61r1K30j63QL09k41
$$ -9 -63 331 -82 69 114 -239 47 -6 -153 -61 220 31 -31 -95 -116 251 -188 -27 -118 112 -51 -43 266 25
7970B5l45M91j89L4m7k8L35k83r4l29J51K36R4JJ09k85J49K78m97J03M11k73J51
$$ 25 -320 171 -18 16 -31 -59 276 -7 -101 -430 -279 -43 51 52 161 -124 25 303 -194 -91 320 47 198
7993A98mk00j15J63O1j17pP1opk09J33J04j31j18K35L2Q8k6j82O9J4M9j15j3m5
$$ 198 194 -6 -121 42 103 -14 -21 50 44 37 -172 -39 65 -66 -184 51 83 171 145 -37 32 46 95 -20 -33 -78
8019g8l9J23k32K16M2j08k06P6K33k58L23o4J06m64L53k91K46l46L60k53mK01
$$ -78 -117 6 -226 -10 32 -76 -282 -206 27 -231 92 28 134 -330 23 -268 -22 -368 -8 -261 -265 -64
8041f4P9j02j0J81k62M16n11K25r3J41q0M3O7J77m52J52j04K66q7l20L47j49J09
$$ -64 15 -87 -97 84 -178 238 -273 -48 -141 0 -80 -37 30 207 -245 -93 -197 69 -18 -338 9 -140 -31
8064c1L03k30LpO6l4j12J58j72k6pJ39j42m4J52k05J69n3L01m44L52j30l68O93
$$ -31 272 42 45 38 104 70 -42 116 -56 -82 -89 50 -92 -136 16 -189 -20 -73 228 -216 136 6 -362 331
8088C31l81r5J56j67%K96l72J39R3J17Knk9j24J0PM5j17p6J53j68K68j45m3Pl9
$$ 331 -50 -145 11 -156 -156 140 -232 -93 0 117 119 114 85 -39 -29 -22 23 -94 -170 -17 -185 83 -62 -105 -98 -137
8114a37M3j46N30k42L0o0K39l19J65p2j44L05m61L89k7k10J14p0J53j2n0K35l73
$$ -137 -94 -240 290 48 78 18 257 -62 103 31 -113 192 -269 120 93 -117 -3 -73 80 68 18 253 -120
8137a20L53j25j49K95l57L37k91K07k47K90l81K87K0k14J97l44K88r9K63k30L09
$$ -120 233 108 -41 254 -103 234 -57 150 -97 193 -188 99 119 -95 102 -242 46 -53 210 -20 289
8158B89k01k53O7k5j27K04K46l18J28l26N69nl97j29K03Q6RN5l61J27Q4J34j53
$$ 289 88 -165 -98 -123 -250 -46 200 -118 10 -316 253 248 -149 -278 -75 11 20 75 -286 -159 -75 59 -94
8181i4K21P1k56N0m1J36Nk04K82k21
$$ -94 127 198 -58 -8 -49 87 92 -112 170 -51
8191e1
$$ Imaginary data points
##PAGE= N=2
##DATA TABLE= (X++(I..I)), XYDATA
0@%%%%%%%%%%%Pj5J6j6J6j7K5l2L2m0M8n4O3p3Q3r2J06j21J36j53J73j94K16k41
$$ 0 0 0 0 0 0 0 0 0 0 0 0 7 -8 8 -8 8 -9 16 -16 16 -24 24 -30 33 -40 43 -49 57 -64 72 -81 92 -102 114 -127
35a27K69k99L31l68M10m54N02n55O14o81P54q38R33j042J171j318J494j712J986
$$ -127 142 -157 174 -194 216 -238 264 -291 323 -358 396 -442 491 -551 620 -698 796 -916 1070
54A070k339K818l511M603o601J1434m4633o2037N8049L6389j116O785M4961R077
$$ 1070 -1269 1549 -1962 2641 -3960 7474 -37159 -99196 -41147 -4758 -5874 911 45872 54949
68E4949j9513J3953L7280k7629o7758k2881K0424j1371k3358J6893K5205k2513
$$ 54949 35436 49389 86669 59040 -8718 -31599 -11175 -22546 -45904 -29011 -3806 -26319
80b6319j7214L9937L5531l2934m2437Q703J5954j6750J844M2011J6104k7304M705
$$ -26319 -43533 -3596 31935 -999 -43436 -34733 -18779 -35529 -33685 8326 24430 -2874 1831
93A831N0556J5267m0295k4030O600j7266l2373J2276L5019j0841k9247K3985M8230
$$ 1831 52387 67654 27359 3329 9929 -7337 -39710 -27434 7585 -3256 -32503 -8518 39712
106C9712J568k3738M966M132l3898k1201K9937K0600k9974j8551L4240K7207j7106
$$ 39712 41280 17542 22508 26640 -7258 -28459 1478 22078 -7896 -26447 7793 35000 17894
119A7894j0081J4797j6163m9034j0533L2325J483l1390L271L9259J4396m224K3425
$$ 17894 7813 22610 6447 -42587 -53120 -20795 -19312 -50702 -47431 -8172 6224 2000 25425
132B5425K4078k6102l6208J4390K5967j9784k6835J6763K1837j1202q98L3922
$$ 25425 49503 23401 -12807 1583 27550 7766 -19069 -2306 19531 8329 7431 41353
144D1353P473m3867k8117J7456L693l1846j1795K0709K501j3868K4333M4522k061
$$ 41353 48826 4959 -23158 -5702 -2009 -33855 -45650 -24941 -22440 -36308 -11975 32547 30486
157C0486l3542n06K1649j0864k5595P678J4965j7651j0560L6240L3870j6851k3319
$$ 30486 -3056 -3562 18087 7223 -18372 -10694 4271 -13380 -23940 12300 46170 29319 6000
170F000J0735N227k6792j3802J6162l524l1516J846M3770J9335j8166k959J7728
$$ 6000 16735 21962 -4830 -18632 -2470 -5994 -37510 -35664 8106 27441 9275 6316 24044
183B4044q476k5987L420J5240k1128l0547J5385L5519K897r826J6133J1211k3346
$$ 24044 15568 -10419 -6999 8241 -12887 -43434 -28049 7470 10367 541 16674 27885 4539
196D539j6125J9104N885l4556k1359K3918K2068o561N350K5826K15k6540O46K4093
$$ 4539 -11586 7518 13403 -21153 -42512 -18594 3474 -3087 2263 28089 28304 1764 2410 26503
210B6503r037l7175p446J9255M78p746K1607K3040j5903k2019J5736J8746k1890
$$ 26503 17466 -19709 -27155 -7900 -7422 -15168 6439 29479 13576 -8443 7293 26039 4149
223D149k9878L953P627j3314K013L3084J3601k1365n455K7338Q060k5805j1975
$$ 4149 -25729 -21776 -14149 -27463 -25450 7634 21235 -130 -5585 21753 29813 4008 -7967
236g967R473r851k0036J4274L2715j994k1724Q508K3370o343k0399J437J464k5493
$$ -7967 1506 -8345 -28381 -14107 18608 16614 -5110 3398 26768 20425 26 1463 2927 -22566
250b2566j6081K5285K2877j2359r750K1570J4897j3009n707J3197r194l3316n727
$$ -22566 -38647 -13362 9515 -2844 -12594 8976 23873 10864 5157 18354 9160 -24156 -29883
263b9883K6706Q105j6270K996K1720O55j2338R963J2886k2214l0529O642J9954
$$ -29883 -3177 4928 -11342 -8346 13374 14029 1691 11654 24540 2326 -28203 -21561 -1607
276a607o146j0262J6972J6490r653k226K2715O435k9804k0666J1614N657j5360
$$ -1607 -7753 -18015 -1043 15447 5794 3568 26283 32718 2914 -17752 -6138 -481 -15841
289a5841n87J9997J030j4958J0935K6602m607k9735n925J0927q195j3815J2605
$$ -15841 -16428 3569 4599 -10359 576 27178 22571 -7164 -13089 -2162 -10357 -24172 -11567
302a1567J6967j0591r461K4056K2900j2999j8126M843O59k0365o307J9594M245
$$ -11567 5400 -5191 -14652 9404 32304 19305 1179 6022 6681 -13684 -19991 -397 3848
315C848j9784K2K8424J2222j5303l725Q694j1678k2294N341J8647q746j8779J1271
$$ 3848 -15936 -15914 12510 24732 9429 5704 14398 2720 -19574 -14233 4414 -4332 -23111 -11840
329a1840K4910q1q602J0020M449k2519j6115J4304J0103j8468j1589J8024J5009
$$ -11840 13070 12989 4387 14407 18856 -3663 -19778 -5474 4629 -13839 -25428 -7404 7605
342G605n430M252J8336l392k5396n021J7019k938k1118l75J6221q5o242J6221
$$ 7605 2175 6427 24763 21371 -4025 -9046 7973 5035 -16083 -16458 -237 -322 -6564 9657
356I657J7570j4431k1739N508J1937j3558j6443Q590Q450r712J920K5887J1294
$$ 9657 27227 12796 -8943 -3435 8502 -5056 -21499 -12909 -4459 -14171 -12251 13636 24930
369B4930j8051r782J3671J758j8893n163J1329n048j4359J1011K6272Q65j7849
$$ 24930 6879 -2903 10768 12526 -6367 -11530 -201 -5249 -19608 -8597 17675 18540 691
382F91J948J2061r083j6308N194O289j6514j0807K0548K0232p232q163J2714N458
$$ 691 2639 14700 5617 -10691 -5497 792 -15722 -26529 -5981 14251 7019 -1144 11570 17028
396A7028j5720o168J1918l008k2880l386K2011R066r860L032J4829n316j5671
$$ 17028 1308 -4860 7058 4050 -18830 -22216 -205 8861 -999 2033 16862 11546 -4125
409d125N364J1631j4723k1794N920J7082j948n432J4467J0630j2884p599J4619
$$ -4125 1239 12870 -1853 -23647 -17727 -645 -2593 -8025 6442 17072 4188 -3411 11208
422A1208N325k0845j4159J0454O159q664L630J8357J175j4852K234J7446m128
$$ 11208 16533 -4312 -18471 -8017 -1858 -10522 -6892 11465 12640 -2212 22 17468 13340
435A3340k1066m187R025n421r180J3613J6471p243j0673J2431J4037j0937j4601
$$ 13340 -7726 -11913 -2888 -8309 -17489 -3876 12595 5352 -5321 7110 21147 10210 -4391
448d391L772N20j4740l869J8067Q635j3962k674J7804N760j3382l950P466q121
$$ -4391 -619 -99 -14839 -18708 -641 7994 -5968 -8642 9162 14922 1540 -2410 5056 -3065
462c065j6991N735J8830n56j1775Q616J7141k566r341P103M034j8946j5138J0690
$$ -3065 -20056 -14321 4509 3953 -7822 794 17935 15369 6028 13131 17165 -1781 -16919 -6229
476f229J0663j0993p462J2995P866r403p90J3182k881k1249m834J4279K611j1172
$$ -6229 4434 -6559 -14021 -1026 6840 -2563 -3353 9829 6948 -14301 -19135 -4856 -2245 -13417
490a3417M595J5996J59o768J1045J4299j1084j8927K061Q382q674r356Q832P777
$$ -13417 -8822 7174 7333 565 11610 25909 14825 -4102 -2041 6341 -2333 -11689 -2857 4920
504D920r694k934J6468P734j5402j0426P727J068j2749n79J3884M57j1134O998
$$ 4920 -4774 -7708 8760 16494 1092 -9334 -1607 -539 -13288 -13867 17 474 -10660 -3662
518c662J9258R23j4383j143O790q643j2414O342R744r387q893J4100J4960n605
$$ -3662 15596 16519 2136 993 7783 -860 -13274 -6932 2812 -6575 -15468 -1368 13592 7987
532G987o679P754K373j4125n575J2611J841j4752k114J5840O346q974J022R012
$$ 7987 1308 9062 11435 -2690 -8265 4346 6187 -8565 -10679 5161 11507 2533 3555 12567
546A2567p230j6186J356J0413p728j4200N812J4229j454l374J2036R372j1358
$$ 12567 5337 -10849 -9493 920 -6808 -21008 -15196 -967 -2421 -5795 6241 15613 4255
559D255r151J0360O098j2596q298J0120N439p584K279J4750j85j5868k601J0316
$$ 4255 -4896 5464 11562 -1034 -9332 788 6227 -1357 922 15672 15487 -381 -2982 7334
573G334l934j5314q95Q601l808p145J1019J4751n657j0273O757Q412q958r437
$$ 7334 3400 -11914 -12809 -4208 -8016 -15161 -4142 10609 4952 -5321 1436 9848 890 -8547
587h547O240L427j0751k266J6100Q162r871l392J0944J371j2331k277Q089m538
$$ -8547 -2307 1120 -9631 -11897 4203 12365 2494 -898 10046 11417 -914 -3191 4898 360
601C60j3093M173J5618M17r248M360R575o121j0727M653M563j2578j1135R941
$$ 360 -12733 -8560 7058 7475 -1773 2587 12162 6041 -4686 -33 4530 -8048 -19183 -9242
615i242J0419n690l661J1612N587r306k456J0806l20j4979k946J1921K379p632
$$ -9242 1177 -4513 -8174 3438 9025 -281 -2737 8069 7749 -7230 -10176 1745 4124 -3508
629c508M257J2173l191j0608M600Q784q715j4937K289P990o017n343J0473Q596
$$ -3508 749 12922 9731 -877 3723 12507 3792 -11145 -8856 -866 -6883 -12226 -1753 6843
643F843p742m545J2142N676j2241p445P614Q34j0428J050J3079R83j0439J978
$$ 6843 -899 -5444 6698 12374 133 -7312 302 1136 -9292 -8242 4837 5820 -4619 -2641
657b641J2991j453j2321J53O297o618q889P916J0985n374o785J0229R966p325
$$ -2641 10350 8897 -3424 -3271 3026 -3592 -12481 -4565 6420 1046 -5739 4490 14456 7131
671G131o979N961P18j2655n753J0786L201j0342j655J2014L202r078J093Q631
$$ 7131 152 6113 6831 -5824 -11577 -791 2410 -7932 -9587 2427 5629 -3449 -2356 6275
685F275m658j2133K235J1544k403q360O159J1337k929n648P512N486j1366j0533
$$ 6275 1617 -10516 -8281 3263 860 -7500 -1341 9996 7067 1419 8931 14417 3051 -7482
699g482O203M463r729n236R442M637p981P02J1927R88j2757k052R829j269r243
$$ -7482 -1279 3184 -6545 -11781 -2339 2298 -5683 -4981 6946 7934 -4823 -6875 2954 1685 -7558
714g558K218J0446k155p115P554J0757o212j0673L366N471r185p603O732N543
$$ -7558 -5340 5106 2951 -4164 3390 14147 7935 -2738 628 6099 -3086 -10689 -3957 1586
728A586q967k824J2675O130q424l631Q660R34j0882r01R694j184j0240L338J2379
$$ 1586 -7381 -10205 2470 8600 176 -3455 5205 6139 -4743 -5644 4050 2866 -7374 -4036 8343
743H343p53q801K485P665o954j0306M763O370p730p342Q760Q718m724l630R423
$$ 8343 7590 -1211 1274 8939 1985 -8321 -3558 2812 -4918 -12260 -3500 5218 494 -3136 6287
758F287L654j0489l628Q561Q90j1432j592R450J697p612K599R489k511j0609K349
$$ 6287 9941 -548 -4176 4385 5275 -6157 -7749 1701 3398 -4214 -1615 7874 5363 -5246 -2897
773b897P933n102j0219M731Q508m163m644Q808P778p652n470P393L466r778n404
$$ -2897 5036 -66 -10285 -5554 2954 -1209 -5853 2955 10733 3081 -2389 5004 8470 -1308 -6712
788f712O880J726q724m3J0962J498r398M91R307k307r799J092P716l979q065O575
$$ -6712 168 1894 -6830 -6873 4089 5587 -3811 -3320 5987 3680 -6119 -5027 2689 -1290 -9355 -2780
804b780J0112l914o568O675O366p267o566O196K774r929l878R881M353q103j708
$$ -2780 7332 3418 -3150 3525 9891 2624 -3942 2254 5028 -4901 -8779 1102 5455 -2648 -4356
819d356J0042J035r559k57Q237l139j0608K012R371k062p060M819Q629m312p079
$$ -4356 5686 6721 -2838 -3095 5142 2003 -8605 -6593 2778 716 -6344 -1525 7104 2792 -4287
834d287N563N783q237o952O241N790o849k495R174L672p720j522R251K63j0549
$$ -4287 1276 7059 -1178 -8130 -1889 3901 -2948 -5443 3731 7403 -317 -1839 7412 7675 -2874
849b874k212Q005j316q441J957R092k181p686M242P876m617q586L663O095n937
$$ -2874 -5086 2919 1603 -6838 -4881 4211 2030 -5656 -1414 6462 1845 -6741 -3078 3017 -2920
864b920n264P550O258o428l185Q906M266q278l285P035J96r105r94Q510k49q185
$$ -2920 -8184 -634 5624 -804 -3989 4917 9183 905 -2380 4655 4851 -4254 -5248 3262 3013 -5172
880e172J683R141j551p983J898O628m524q274M860P198n392n694O822O688n374
$$ -5172 -3489 5652 4101 -3882 -1984 4644 120 -8154 -3294 3904 -1488 -7182 -360 6328 954
895I54m174O786L247q743l912P933K028q340p70Q863R48p672J527Q139k441r466
$$ 954 -3220 3566 6813 -1930 -5842 2091 4119 -4221 -4991 3872 4820 -2852 -1325 6814 4373 -5093
911e093K024P501l661p646M150P327m441n435O691N541o850n547O059L805p919
$$ -5093 -3069 4432 771 -6875 -2725 4602 161 -5274 1417 6958 108 -5439 620 4425 -3494
926c494l304P792K816p369q15R294Q44p953l49P536j681q036K065P298k792p107
$$ -3494 -6798 994 3810 -3559 -4374 4920 5764 -2189 -2538 4998 3317 -4719 -2654 4644 1852 -5255
942e255M862P452m259o489M505N198o735n930O056L519p273l011P729L225o957
$$ -5255 -393 7059 2800 -3689 816 6014 -721 -6651 -595 2924 -4349 -7360 369 3594 -3363
957c363j329Q143O82p753k3Q199j022p976K248Q306j803p078M116O457m856p320
$$ -3363 -4692 3451 4133 -3620 -3643 4556 3534 -4442 -2194 6112 4309 -2769 1347 7804 2948 -4372
973d372M488M983o703n841N766M707o520k993P192L676p644j887Q167R02p480
$$ -4372 116 5099 -1604 -7445 -1679 3028 -3492 -6485 707 4383 -3261 -5148 3019 3921 -3559
988c559o29Q158p8p027K033P584k504p342L074O506m656o954L974N419n235n431
$$ -3559 -4188 3970 3892 -3135 -1102 6482 3978 -3364 -290 6216 1560 -5394 -1420 3999 -1236 -6667
1004f667O137N228o113l564P030L290p011k539P236J280p886m02Q049l99p466
$$ -6667 -530 4698 -1415 -4979 2051 5341 -1670 -4209 3027 4307 -3579 -3981 4068 3669 -3797
1019c797P18P463j941p684K502O521l761o440M848O550m225n143N743N239n515
$$ -3797 -3079 4384 2443 -5241 -2739 3782 21 -6419 -1571 4979 754 -4389 1354 6593 1078
1034A078m060O305L029p550k754O783J343p496j472O927o8p703P61P289j910o648
$$ 1078 -2982 3323 6352 -1198 -3952 2831 4174 -3322 -4794 2133 2065 -5638 -4877 2412 502 -6146
1050f146K645P284k701n851M610O439l868n159N347N007n939n041N834L262o937
$$ -6146 -3501 3783 1082 -4769 -159 6280 2412 -2747 2600 7607 1668 -3373 2461 5723 -1214
1065a214l594O752J890q047j493P482N00p405J67P521p16p042K752P171k301o427
$$ -1214 -4808 1944 3834 -4213 -5706 1776 2276 -5129 -4962 2559 1843 -5199 -2447 4724 2423 -4004
1081d004L417O678m187o049M801N158n858m565N617L643o328l841O891K578o655
$$ -4004 -587 6091 1904 -4145 656 5814 -44 -4609 1008 4651 -1677 -5518 1373 3951 -2704
1096b704j684P422Q17o638j35P374n11p478J452O665k518o911K977N714l726o067
$$ -2704 -4388 3034 3851 -2787 -2922 4452 3941 -3537 -2085 4580 2062 -4849 -1872 3842 116 -5951
1112e951M580N200m702m463N556M159n775k906O557K491n879j517O634J347o986
$$ -5951 -1371 3829 -873 -5336 220 4379 -1396 -4302 2255 4746 -1133 -2650 3984 5331 -1655
1127a655m41O432p12p183L91O213k188o922K992O143l097n757M173N952m456m978
$$ -1655 -2096 4336 3624 -3559 -3168 3045 857 -6065 -3073 3070 -27 -5784 -1611 4341 -115 -5093
1143e093N470M580n772l374O475K931n947k130O433J544p149q64O144k12p047
$$ -5093 377 4957 -815 -4189 2286 5217 -730 -2860 3573 5117 -2032 -2896 3248 3036 -4011
1158d011L60O696j532n982K742O441l056n960L890N077m801n181M828M170n266
$$ -4011 -3651 3045 1513 -4469 -1727 4714 1658 -4302 -412 4665 -136 -5317 -489 3681 -1585
1173a585l423N993L271n861k339O448J723o339j616O669Q2o244J303O601r49n997
$$ -1585 -5008 985 4256 -1605 -3944 2504 4227 -2112 -3728 2941 3023 -3221 -1918 4683 3734 -2263
1189b263J467O235l278o015K436M619m565m931M428M876m602l531N473L620n631
$$ -2263 -796 5439 2161 -3854 -1418 3201 -1364 -6295 -1867 3009 -1593 -5124 349 3969 -1662
1204a662k409O219J890o299j184O781J053o106L68O334p90o529J134N500l198
$$ -1662 -4071 2148 4038 -2261 -3445 3336 4389 -1717 -1349 4985 4195 -2334 -1200 4300 1102
1219A102o360K457N376l396m468M510M899m304l537M936L521n870l018N478K018
$$ 1102 -5258 -2801 2575 -821 -5289 -779 4120 -184 -3721 1215 4736 -1134 -4152 1326 3344
1234C344n773q26N756J233o486J64O173r04o324L47N584j933n300L125N884k474
$$ 3344 -2429 -3255 2501 3734 -2752 -2588 3585 2681 -3643 -3296 2288 355 -4945 -1820 4064 1590
1250A590m403M373M920m331m783L780L334n902l515N170K282n790j858O569J119
$$ 1590 -2813 1560 6480 2149 -2634 1146 4480 -1422 -4937 233 2515 -3275 -5133 1436 2555
1265B555n434q21N515n06o004J380N997o41m983K503O617k103m740L216L673m869
$$ 2555 -2879 -3700 1815 1309 -4695 -3315 2682 2041 -2942 -439 6178 4075 -665 2551 6224 1355
1281A355n367L911L046m945l206M847K771m499k052N512J357o150j204O212K32
$$ 1355 -4012 -101 2945 -2000 -5206 -359 2412 -2087 -4139 1373 2730 -3420 -4624 1588 1820
1296A820n552J124O166l16m905K715N439l080o028K444L931m062n137M339L496
$$ 1820 -3732 -2608 3558 3242 -1663 1052 6491 3411 -2617 -173 3758 -304 -5441 -1102 2394
1311B394m015k761O215K592n136k344M918J243n717j348N680K72n285J292O286
$$ 2394 -1621 -4382 1833 4425 -711 -3055 1863 3106 -2611 -3959 1721 1993 -3292 -2000 4286
1326D286o96n914J325M534k864n481K269M751l701l732M826M969l564k945M530
$$ 4286 3590 -2324 -999 3535 671 -4810 -2541 2210 -1491 -5223 -397 4572 1008 -1937 2593
1341B593K588n148k438M589J037n880j424O223Q71n237K76N564j746n849R39M909
$$ 2593 5181 33 -2405 2184 3221 -2659 -4083 2140 3011 -2226 -1950 3614 1868 -3981 -3042 1867
1357A867k572n320K676N388j591l364M393L998l535l965M308K446n377l233M380
$$ 1867 -705 -6025 -3349 2039 448 -2916 1477 5475 1940 -2025 2283 4729 -648 -3881 499
1372D99K166m447q49N576O29n598k71N476j043n877k32M685j193m283L372N398
$$ 499 2665 -1782 -2631 2945 3574 -2024 -2295 3181 2138 -3739 -3971 714 -479 -4762 -1390 4008
1388D008k287m458L463M241l959m534L184K471m343j927N256K985m775j316N509
$$ 4008 1721 -2737 726 4967 1008 -3526 -342 2129 -2214 -4141 1115 4100 -675 -1991 3518
1403C518R77n339q66L878r64n632J142N589p55m790K260N079k375m475K626K950
$$ 3518 4495 -844 -1710 2168 1204 -4428 -3286 2303 1548 -3242 -982 4097 1722 -2753 -127 2823
1419B823m328m871M579M154l524k151M797L104m030j417M434M24o086j675N084
$$ 2823 -1505 -6376 -1797 2357 -1167 -3318 1479 4583 553 -864 3570 3994 -2092 -3767 1317
1434A317M17m460P79N278n46m732J876M451k869o081J901L606k583l273M029L784
$$ 1317 1734 -2726 -1947 3331 2785 -1947 -71 4380 1511 -4570 -2669 937 -1646 -4919 -890 2894
1450B894l239k065M910K934n257l029L869Q70m903l82M976O87m391R95N788n18
$$ 2894 -345 -2410 2500 5434 177 -2852 1017 1887 -3016 -3398 1578 2265 -2126 -1131 4657 4139
1466D139n698L25L801k391n005K331M639k710l490M047M630l288l230L315J434
$$ 4139 -1559 -1234 2567 176 -4829 -2498 2141 -569 -4059 -12 4618 1330 -1900 1415 2849
1481B849n222k013M166J584m124j007N566J991l912j01M363j517n452M42N146
$$ 2849 -2373 -4386 -220 1364 -2760 -3767 1799 3790 -122 -223 4140 2623 -2829 -2387 2759
1496B759k346m524K327M625j019l453L442L023m405m020L076K544m461k595M041
$$ 2759 413 -4111 -1784 2841 1822 -1631 1811 4834 429 -3591 -515 2029 -2432 -5027 -986
1511i86K402l422J39N228J072n741q76M386p86m822L96M690q92l050K982M853
$$ -986 1416 -2006 -1867 3361 4433 -1308 -2184 2202 1416 -3406 -3010 1680 788 -2262 720 5573
1527E573k284m492J729L086l561m108K638J964l386j704N354K754l449j950L800
$$ 5573 3289 -1203 526 3612 51 -4057 -1419 545 -2841 -4545 809 3563 114 -1836 1964
1542A964M13m608o64L831p57m298J219O156o5l851J859L565k550m291J814K252
$$ 1964 2377 -2231 -2895 936 179 -4119 -2900 3256 3191 -660 1199 4764 2214 -2077 -263 1989
1558A989l226m083L735M023k343k299L883K298m607j487L771O03n523j510N021
$$ 1989 -1237 -5320 -1585 2438 95 -2204 1679 3977 -630 -2117 1654 2257 -3266 -4776 245
1573B45J347l526J658M222r16m415J222L869k801n250J013L705j495k311M047
$$ 245 1592 -1934 -276 3946 3030 -1385 -163 3706 905 -4345 -3332 373 -1122 -3433 614
1588F14L577l191k138L717J982m411l268L119R76l822Q4M960O24m429K46M434
$$ 614 4191 1000 -1138 2579 4561 150 -3118 1 977 -2845 -2761 2199 2823 -1606 -1360 3074
1604C074n83m840o09L181j881l699L020N056j693k783L088M043k724k884K114
$$ 3074 2491 -2349 -2958 223 -1658 -5357 -2337 2719 1026 -1757 1331 5374 2650 -234 1880
1619A880R77m635k270M387K183l826j063M321J080m137k62L155j588n443J110
$$ 1880 2857 -1778 -4048 339 2522 -1304 -2367 1954 3034 -1103 -1365 1790 202 -5241 -4131
1634d131M708m20l425K483L925q95k379K797K411m860l729K164L200l355j854
$$ -4131 577 157 -3268 -785 3140 2245 -134 2663 5074 214 -3515 -1351 1849 -1506 -3360
1649c360L448K154k985m07M590k60m819j921L517K97l355O59M636o68l163K648
$$ -3360 88 2242 -743 -1150 3440 3180 -1639 -3560 -43 254 -3101 -2442 2194 1526 -1637 1011
1665A011M089k129m606M58K424k891k811L135K560l518j204M968K929l654j778
$$ 1011 5100 2971 -1635 -1177 1247 -1644 -4455 -1320 1240 -2278 -3482 1486 4415 761 -1017
1680a017K639M13m183O1L698o0l895N29N141P66l892R8K351k767l882J670K838
$$ -1017 1622 2035 -2148 -2087 1611 1551 -2344 -1815 3326 4092 200 298 2649 -118 -4000 -2330 508
1697E08k808k968L311M405j389j389L142P44l926j555L589P19m159j474M389J001
$$ 508 -2300 -5268 -1957 2448 1059 -330 2812 3556 -370 -1925 1664 2383 -1776 -3250 1139 2140
1713B140k558Q64L545j773m904Q71K890j739m033J566L070p43j063L388L364l464
$$ 2140 -418 446 3991 2218 -2686 -1815 1075 -664 -4697 -3131 -61 -804 -1867 1521 4885 1421
1729A421l071K725J602l556k360K912Q99k924M84N044P07m026p98L299q56l968
$$ 1421 -1650 1075 2677 -879 -3239 -327 572 -2352 -1868 3176 3883 -143 -941 2358 1502 -2466
1745b466j05K785j437k778K791M889j393l318J897K573k821k941J963R68l852
$$ -2466 -2571 214 -1223 -4001 -1210 3679 2286 -1032 865 3438 617 -2324 -361 607 -3245
1760c245j473M481K867k845r87L631O12l601n17K988j097m547O95M228M57k397
$$ -3245 -4718 -237 2630 -215 -1202 2429 3041 -560 -1077 1911 814 -3733 -3038 1190 1647 -750
1776g50J630L115j985k888J245K463l995l752K254K617j576p07L585J816l329
$$ -750 880 3995 2010 -878 367 2830 -1165 -4917 -2663 -46 -1622 -2329 1256 3072 -257
1791b57p61L447P57m554j620K816K37k238J489L570q84k832J565L827k189m338
$$ -257 -1018 2429 3186 -1368 -2988 -172 65 -2173 -684 2886 2002 -830 735 4562 2373 -1965
1807a965J48K002k017j647L204K703k585j614L405K482l368k368J788k52l627
$$ -1965 -1817 185 -1832 -3479 -275 2428 -157 -1771 1634 4116 748 -1620 168 -84 -3711
1822c711r1M545O73l734Q48M738J95l163M7J977k505l566K268L358j379k322K031
$$ -3711 -3802 743 1416 -2318 -1470 3268 3463 300 347 2324 -181 -3747 -1479 1879 500 -1822 209
1839B09L256j489j894J517N03m248k699L657J307k694o50L491J575j795O60K897
$$ 209 3465 1976 82 1599 2102 -2146 -4845 -1188 119 -2575 -3225 266 1841 46 706 3603
1855C603j319m619J32L369p97k633J364L051j377j570L396K135l716l813J884
$$ 3603 2284 -2335 -2203 1166 369 -2264 -900 2151 774 -796 2600 4735 1019 -2794 -910
1870i10J514k839j338K748J490k225M79M282R14l787j533K319o70k811L05K597
$$ -910 604 -2235 -3573 -825 665 -1560 -1081 3201 4115 328 -1205 1114 444 -2367 -2062 535
1886E35q51k799K722M072j042l268R04J284k378k231K490J741k815j455M129K915
$$ 535 -316 -3115 -393 3679 2637 -631 273 1557 -821 -3052 -562 1179 -1636 -3091 1038 3953
1902C953k202j344J965L50m385m39K807p49l842K94M086O67k139J401K331k362
$$ 3953 1751 407 2372 2722 -1663 -2102 705 -44 -3886 -3592 494 1161 -978 423 2754 392
1918C92k706J723K154k581k115J966K822j019l41K950Q49l607j525K251P21m046
$$ 392 -2314 -591 1563 -1018 -3133 -1167 1655 636 295 3245 4094 487 -1038 1213 1934 -2112
1934b112j304K499M04j840J394L605q91l274Q55K786j192l598O39K146j332j300
$$ -2112 -3416 -917 -513 -2353 -959 2646 1755 -1519 -664 2122 930 -2668 -2029 117 -1215 -2515
1950b515L879K262k066k034J975J403k879j778J518k23k940M46M077J273k684
$$ -2515 1364 3626 1560 -474 1501 2904 25 -1753 -235 -458 -3398 -2952 1125 2398 -286
1965b86l54K863j45k738N4J362j834l110K139L625l70k165J602K232j939j626
$$ -286 -640 2223 2078 -660 -606 756 -1078 -4188 -2049 1576 1206 -959 643 2875 936 -690
1981f90J636L17l744j726L578J649j696K98K463L09k294M60K217j270l905n52
$$ -690 946 1263 -2481 -4207 -629 1020 -676 -378 2085 2394 100 560 2777 1507 -2398 -2950
1997b950K941K93k152R75K818j179j709J889J813k747k987J248J559j757n30L278
$$ -2950 -9 284 -1868 -893 1925 746 -963 926 2739 -8 -2995 -1747 -188 -1945 -2475 803
2013H03J262k372m9L149O19k984j736J734n92k375J251K908n17k882J910L106
$$ 803 2065 -307 -356 2793 3412 428 -1308 426 -166 -2541 -1290 1618 1101 -1781 129 3235
2029C235r75l125M35O92k377j272K300J905k222q38L111K042j784r58J608q94
$$ 3235 2260 -865 -430 262 -2115 -3387 -1087 818 -1404 -2242 869 2911 1127 169 1777 883
2045H83k858n86L081N79k733J81L297L94j611N39J313k309l043J241K069r29k304
$$ 883 -1975 -2561 520 1099 -1634 -1453 1844 2238 627 1166 2479 170 -2873 -1632 437 -492 -2796
2062b796J479K622p34j111K957M42l509k155K449R35k656m39K612O96j630J755
$$ -2796 -1317 1305 571 -540 2417 2859 -650 -2805 -356 579 -2077 -2516 96 792 -838 917
2078I17K703j175l277O3J856o42k549R97J427j174r52K908K222k238j929Q13R05
$$ 917 3620 2445 -832 -769 1087 445 -2104 -1107 320 -854 -1806 1102 3324 1086 -843 -30 875
2095H75j714j544J811N51k470M00L523J573k341q01J794o00k463K98K104j750
$$ 875 -839 -2383 -572 -21 -2491 -2091 1432 3005 664 -137 1657 1057 -1406 -1108 996 -754
2111g54k106J804L225l18j635J165Q43k267j665J589P05k347j922K952J702j071
$$ -754 -2860 -1056 2169 1851 216 1381 2224 -43 -1708 -119 586 -1761 -3683 -731 971 -100
2127a00l35K313k2k706m66K868r46l223J20K592O65j199J335K199j547k440J525
$$ -100 -435 1878 1856 -850 -1316 1552 606 -2617 -2497 95 760 -439 896 3095 1548 -892 633
2144F33J483k202k514J113J482j428n0L188Q75k548p40K312M86k816j349J201
$$ 633 2116 -86 -2600 -1487 -5 -1433 -1483 1705 2580 32 -708 1604 2090 -726 -2075 -874
2160h74K7j350P14L440l19k506Q59K278q31k355P5J352k071r02K713J935j429
$$ -874 -847 -2197 -1483 1957 1638 -868 -9 2269 1438 -917 -842 510 -1561 -2463 250 2185 756
2177G56j402K224J003j676j374J429r66k493n44L058P68j976M67K092k00j890
$$ 756 -646 1578 2581 905 -469 960 -6 -2499 -3043 15 783 -1193 -726 1366 1166 -724
2193g24P96J413j588k916J688K079l25j129J459J730j661n04J777P6k780j735
$$ -724 72 1485 -103 -3019 -1331 748 423 -706 753 2483 822 318 2095 2171 -609 -2344
2209b344J531P64j499J73K135K73j669M24K815q92l079j29J609n94j526J366J852
$$ -2344 -813 -49 -1548 -1375 760 1033 -636 -212 2603 1711 -1368 -1497 112 -482 -2008 -642 1210
2226A210p78j655K442J693j729k316O71M36j668o17K452O71j550l86K950R87k160
$$ 1210 432 -1223 1219 2912 1183 -1133 -462 -26 -1694 -2311 141 812 -738 -1124 1826 2813 653
2243F53n54P94q14k014N43K269j005j891Q35K761j85j850P49P95k230j570J778
$$ 653 99 893 79 -1935 -1392 877 -128 -2019 -1184 1577 1392 -458 291 1086 -1144 -2714 -936
2260i36J388j497j120K683J586r68k29J474l69k949k06K062n95j991J40K050j46
$$ -936 452 -1045 -2165 518 2104 1136 907 2381 2012 -937 -1143 919 324 -1667 -1527 523 377
2277C77r34J088J215j285k571Q60J942j441j694J422J627p35j78K270Q26k108
$$ 377 -557 531 1746 461 -2110 -1250 692 -749 -2443 -1021 606 -129 -307 1963 2789 681
2293F81j192J322L68k603j49J408j56j601J279K573j44k070k73J616r19j463P08
$$ 681 -511 811 1179 -1424 -1573 -165 -321 -1922 -643 1930 1786 -284 -557 1059 140 -1323 -615
2310f15Q07j168r21K070K372j664j211J166O08k006j071J626k5k324l2K900J004
$$ -615 192 -976 -1897 173 2545 881 -330 836 1444 -562 -1633 -7 -32 -2356 -2388 512 1516
2327A516j526j66K005p01j653L02J897j652k172J176K014n38q61J240R58j545
$$ 1516 -10 -176 1829 1128 -525 -223 1674 22 -2150 -974 1040 502 -359 881 1839 294
2343B94j671J195J097k190j683J835J265j115N91K065Kj573m1J778l20k188l67
$$ 294 -1377 -182 915 -1275 -2958 -1123 142 -973 -382 1683 1685 112 71 1849 1529 -659 -1026
2360a026J433n73j109J295K101j358j611J338J294j902j581Q50O20j548k36K208
$$ -1026 407 -166 -1275 20 2121 763 -848 490 1784 -118 -1699 -849 -229 -1777 -2013 195
2376A95R90j278m88K153N30j866j087J467j037j812Q13K341j5j852Q66J837q12
$$ 195 1185 -93 -581 1572 2102 236 -851 616 -421 -2233 -1420 921 906 -946 -80 1757 945
2393I45j174N37O34j998j129J709J605j476q10J682Q25j230l88J218o01j768j229
$$ 945 -229 308 942 -1056 -2185 -476 1129 -347 -1157 525 1350 120 -268 950 349 -1419 -2648
2410b648K525L48j393J81K015J73j312O90J397j629j980P64J643j088r91J387
$$ -2648 -123 225 -1168 -987 1028 1201 -111 579 1976 347 -1633 -869 774 -314 -1305 82
2426H2J030j175o76K089N88k304j231J332L86j721K6J812O2j407N56K537m16j957
$$ 82 1112 -63 -739 1350 1938 -366 -1597 -265 121 -1600 -1574 238 300 -1107 -551 1986 1570 -387
2444c87m6J098n79j557O43J712j028q80J475J577j197j179O97L39j550n59J307
$$ -387 -433 665 86 -1471 -828 884 -144 -1024 451 2028 831 -348 349 688 -862 -1421 -114
2461a14M25j654J69J589J173j412n53J487n55j841K70J463m44j681P54J697j77
$$ -114 311 -1343 -1174 415 1588 176 -377 1110 555 -1286 -1016 447 3 -1678 -924 773 596
2478E96p56Q35J255j684j315J180J134j869j166J945Q34j132J31J839l19k292
$$ 596 -160 675 1930 246 -1069 111 1245 -624 -1790 155 989 -143 -12 1827 1508 -784
2494g84j84J243k57j830Q2J476q8r04J270J665m38j965Q28J460j591j212Q46J017
$$ -784 -968 275 18 -1812 -1730 -254 -342 -1246 24 1689 1251 -714 114 1574 -17 -1229 -383 634
2512F34r13r16J925J358k099p07J525L90j989k38J139j26j554L20K349M2j631
$$ 634 -279 -1195 730 2088 -11 -718 807 1197 -792 -1030 109 -17 -1571 -1251 1098 1140 -491
2529d91M92J222p04j402N90P21j092j071J372J466p57n31J452L70j840n78J253
$$ -491 1 1223 519 -883 -293 428 -664 -1735 -363 1103 346 -185 1267 1637 -203 -781 472
2546D72J45j725j69J669K76j270L25J658k25j831O00J235j216j904O65J537o66
$$ 472 617 -1108 -1277 392 668 -602 -277 1381 1156 -675 -75 1160 -56 -1960 -1295 242 -424
2563d24p22J293J179j243p80J167J045j882j009J436j70p81K33J862nj602L71
$$ -424 -1146 147 1326 83 -697 470 1515 -367 -1376 60 -110 -891 -658 1204 1199 -403 -32
2580c2J508q3j984Q9P52o52q90P66J133n53j175J423Q51q59q61O19N71j546m34
$$ -32 1476 1393 -591 -502 250 -402 -1292 -526 607 54 -1121 302 1153 294 -567 52 623 -923 -1357
2599a357J548R95j453l48J796O26j893J06J202m27k061R4J667k68j168N18J549
$$ -1357 191 1186 -267 -615 1181 1807 -86 20 1222 795 -1266 -1172 495 227 -941 -423 1126
2616A126m36j137P58Q84j721j062J129P54q13o50J181J189j237k62J395o6j565
$$ 1126 690 -447 311 1195 -526 -1588 -459 295 -518 -1168 13 1202 -35 -297 1098 1032 -533
2633e33k95J249p0j261N01R33K0j197P44J695j084j847N52J279j041j007J333
$$ -533 -828 421 351 -910 -409 524 544 -653 91 1786 702 -1145 -593 686 -355 -1362 -29
2650b9O79j007m71J437R41j522q91J173K24j446k16J397Lj222L90J723M3j453
$$ -29 650 -357 -828 609 1550 28 -863 310 534 -912 -1128 269 272 -950 -560 1163 1206 -247
2668b47P0J503p87j156J78J436j182j235J623R41p50o83N20O93j332j021J735
$$ -247 -177 1326 539 -617 -439 997 -185 -1420 203 1144 394 -289 231 924 -408 -1429 306
2685C06J80j747j99J791L38q67j27J567l67j857P64J226p53j409Q74J264o64o15
$$ 306 486 -1261 -1460 331 669 -198 -325 1242 875 -982 -218 1008 255 -1154 -280 984 320 -295
2703b95N37J059r98j319J308L03r54r60J514j42r72n9J684J63j308j23J344k37
$$ -295 242 1301 303 -1016 292 595 -359 -1319 195 53 -919 -978 706 869 -439 -562 782 545
2721E45j376L5J185k71j186Q03J677p79j214N79J052n68j345J046J75j117m85
$$ 545 -831 -796 389 118 -1068 -265 1412 633 -581 -2 1050 482 -863 183 358 -759 -1244
2738a244J404R97j105p72J510O7j410j94J095l28j473P89R95k5j181P35J299r23
$$ -1244 160 1157 52 -720 790 857 -553 -747 348 20 -1453 -664 331 306 -875 -140 1159 236
2756B36r06R72P07j131j084J115P94q88k05Q32N85j279l95J435N2j401n83J095
$$ 236 -670 302 1009 -122 -1206 -91 703 -185 -390 442 1027 -252 -647 788 840 -561 -1144 -49
2774d9l2j026N41J160J9j316O59J223n88j422L08R84n80p04R22R99q29j325J613
$$ -49 -81 -1107 -566 594 613 -703 -44 1179 591 -831 -523 461 -119 -823 99 1098 269 -1056 557
2793E57P19j194r58J105K22j245k12J243J81j160J84J462l4j393K37R17q15r24
$$ 557 1276 82 -876 229 451 -794 -1006 237 418 -742 -558 904 870 -523 -286 631 -184 -1108
2811a108N82J113p32j137J227R96q82p86R76N46j154p72J350Q30j351k27J458
$$ -1108 -526 587 -145 -1282 -55 941 59 -727 249 795 -359 -1131 219 1049 -302 -529 929
2828I29J21j362L67J021p89j119Q5J144m75j106O46J092o35r14R71R78r19j069
$$ 929 1050 -312 55 1076 287 -832 -747 397 -78 -1184 -538 554 -81 -995 -24 954 35 -1034
2846a034J141N17p21n86J141L42p26n64J146N38j589j53J088k57j184L38P88k84
$$ -1034 107 624 -97 -683 458 800 74 -490 656 1194 -395 -548 540 283 -901 -563 225 -59
2864e9o93M84J293n57j034M47J013p30r87J156N62j351m38J224N47j139n31J452
$$ -59 -752 -268 1025 468 -566 -119 894 164 -823 333 895 -456 -894 330 877 -262 -793 659
2882F59j20j243R0P43L72j251J58J492m2q60p2J088n77q08L07J037p06j424O20
$$ 659 539 -704 -614 129 501 -750 -592 900 858 -2 -74 1014 437 -371 -64 973 267 -1157 -537
2901e37J117q82n24O79P37p80r85J173L68j029k00J272J46j457P96J263m52p14
$$ -537 580 -302 -826 -147 590 -190 -1175 -2 366 -663 -863 409 555 -902 -106 1157 705 -9
2919iq8J303j079p84L40P89r33p59R01J159j139o90J104N38j119n14R75M80r82
$$ -9 -97 1206 127 -657 -317 472 -461 -1220 -319 840 -299 -989 115 653 -466 -980 -5 475 -507
2938e07K9J424p1j019J57Q75q5j211K58Q78o73j129N91J059q10o45Q22J047j102
$$ -507 -478 946 875 -144 13 888 803 -408 -150 728 55 -1074 -483 576 -234 -879 -57 990 -112
2957a12n24J201J42j061l56J024K30q70k49J037J97j021p8J117o2j227p1J134
$$ -112 -636 565 707 -354 -710 314 544 -326 -575 462 659 -362 -440 677 615 -612 -683 451
2975D51Nj176N88J087o27n50K14R48j074m70P56M95n78p99J119J22j213k73J548
$$ 451 456 -720 -132 955 328 -222 -8 940 -134 -604 152 647 69 -730 389 511 -702 -975 573
2994E73k24j003k44J069J95j471M94J485k11j300N24Q18l19p20J10Q73n84p12
$$ 573 349 -654 -898 171 366 -1105 -611 874 663 -637 -113 705 386 -334 -224 649 65 -647
3012f47R48M38q98o09Q62O91j212n29J426k19j027J93Q38Lq66P8J254l59r06K66
$$ -647 301 739 -159 -768 94 785 -427 -956 470 251 -776 -583 255 258 -608 -530 724 365 -541 -275
3032b75R24n24p78P30O48o09o96M60Q71o94p08P59P32r90l20N63M33j016o3J145
$$ -275 649 125 -653 77 725 116 -580 -120 751 57 -651 108 840 -150 -470 93 526 -490 -553 592
3052E92K7r92L5J110l05j330N24Q02k16r72N34Q08l45q26R44N43p40p88Q05O03
$$ 592 619 -373 -338 772 467 -863 -339 463 247 -725 -191 617 272 -554 390 933 193 -595 210 813
3072H13p68q09J156K64j377K77P86m8r29J71Q25O5j070K7J242m54q69N89P40o25
$$ 813 45 -764 392 656 -721 -444 342 294 -635 -464 361 426 -644 -617 625 171 -698 -109 631 6
3092Fr65J135N03n28m43M61P02j029k45O60L98q95l90P92M05j008K34N65K10j059
$$ 6 -959 176 679 151 -292 169 871 -158 -403 257 655 -240 -630 162 567 -441 -207 358 568 -491
3112d91p7J032j46r23L11Q24o32n22M43Q88o04p42P67K20o46k2O80M30q84l10
$$ -491 -568 464 318 -605 -294 530 -102 -624 -181 707 103 -639 128 348 -298 -320 360 790 -94 -404
3132d04R80O0j061R4J026o3r96L89N53l70q63N48R85j032o71O79L71l14p77J089
$$ -404 576 636 -425 -331 695 632 -364 25 578 208 -655 -107 878 -154 -825 -146 225 -89 -866 223
3152B23K94m36j014J105L34r57n9R10k4n02m47J342o9j083j44J332m42j118O92
$$ 223 517 81 -933 172 506 -451 -510 400 376 -126 -573 769 700 -383 -527 805 363 -755 -63
3171f3N73l67p09M57P98q73m22P82L40o13p23J019N04j004k64P78J57n11j16N30
$$ -63 510 143 -566 -109 689 -184 -606 176 516 -97 -820 199 703 -301 -565 213 370 -141 -257 273
3191B73L17j064kJ263m34q62M47O80l54r55M34Q57m03q42L11Q26p01m83P12L08
$$ 273 590 -474 -476 787 353 -509 -62 618 264 -691 -257 600 197 -645 -334 492 -209 -692 20 328
3211C28n48l86P31J68l54n74R94o7p43o5Q02K74j105L74R45j35j254L25R32m38
$$ 328 -220 -606 125 293 -61 -635 359 292 -451 -516 286 560 -545 -171 774 639 -615 -290 642 204
3231B04p48L29N93j75r63Q04K29l04p30R04L54j038P7O36K83q97K78M73J48r03
$$ 204 -544 -215 378 203 -760 44 273 -31 -761 143 497 -541 -464 172 455 -442 -164 309 457 -446
3251d46q2J041l23q08O46N53M3q65M18L74k91m67M73L61p85m16P23M25j307J99
$$ -446 -528 513 190 -618 28 581 624 -241 177 551 260 -207 266 627 -158 -574 149 574 -733 -534
3271e34P63J42r23j13J179l38o14K08P32o9r33L39O58k36p35L83J028p81p50P23
$$ -534 229 371 -552 -665 514 176 -438 -230 502 433 -500 -161 497 261 -474 -91 937 156 -594 129
3291A29L42n24o12Q47N01p77l52O36j0n86j03J042l07q32J90O60L32j164L32P67
$$ 129 471 -53 -665 182 683 -94 -446 190 180 -406 -509 533 226 -606 -416 244 576 -588 -256 511
3311E11l55o91N60M10j47j010M98N75k75j72K84N74q19l14O03N90r69j95O41l02
$$ 511 156 -535 25 435 288 -722 -224 351 76 -96 188 762 -57 -371 232 822 -147 -342 299 -3
3331cn37M6J230n29q03J80J040l09j070O51P27n18q51Q37M41m12p01J124k6n08
$$ -3 -540 -494 736 207 -596 -416 624 315 -755 -104 623 105 -746 91 532 120 -581 543 517 9
3351Ik96P56k24n23j69P57jp77j73R22o4n13k35J225p86m15N0P06n04j75K97P18
$$ 9 -287 469 245 -278 -447 310 309 -468 -641 281 217 -296 -531 694 -92 -507 -457 249 -255 -430 -133 585
3373E85n74n92O35L25k98o95P47M11j060nP49n8k36k75Q79k28o49J47M44l29l92
$$ 585 11 -581 54 379 81 -614 133 544 -516 -521 228 170 -66 -341 538 310 -339 -192 252 -77 -469
3394d69K08Q59m45m79K80O18m53n90L98L85o63m3O94Mm22j96O38K33o17j96J159
$$ -469 -261 598 153 -326 -46 572 119 -471 -73 312 -351 -394 300 304 -118 -314 324 557 -60 -256 903
3415I03m34p97R2N15m3q98L24N80j86k82M32L91n97l52K96O44r28m5O30K18l98
$$ 903 469 -328 -236 279 236 -662 -338 242 56 -226 206 597 0 -352 -56 588 -340 -385 245 463 65
3436F5l78N31K75o25k25P40j65o28J22N75J10o71K48O30m26m01n0Q51n99l82L37
$$ 65 -313 218 493 -132 -357 383 218 -410 -288 287 397 -274 -26 604 178 -223 -273 578 -21 -403 -66
3457f6M89l86n09N08M07o31j46L18K56m58j99N87K47n32m85Q52K73m96j83P10
$$ -66 423 37 -472 36 443 -188 -334 -16 240 -218 -417 170 417 -115 -600 252 525 29 -154 556
3477E56m82m03L74L62n20m79N61L34k50k12M94J21l83j54K18r2m00M55k0K04n34
$$ 556 74 -329 45 407 -113 -592 -31 303 53 -159 335 456 73 -81 137 45 -355 100 80 284 -250
3498b50J94L47M01n86J42K59l73m46j23P91k06p92N51O98m05o51P99O8o09m9M45
$$ -250 -56 291 692 106 248 507 134 -312 -435 356 150 -642 -91 607 202 -449 350 418 -191 -240 205
3519B05j99j75l92Q65J61q46J12O82J89p84l9O65j94p88J08Q03l45m51L26P87
$$ 205 6 -169 -561 304 465 -381 -269 413 602 -182 -221 444 250 -538 -430 373 28 -423 -97 690
3539F90m32m78J92M22n83l11P03J54m40k44N78K41r00J51N94k66l88k9N42L3o94
$$ 690 258 -220 -28 394 -189 -500 203 357 -83 -327 251 492 -408 -257 337 71 -317 -346 196 229 -465
3560d65M93M12k09m73L82N39n23l90L24L43n68M6K35N09r67M9N10o7p36R2N14
$$ -465 28 440 231 -242 140 679 156 -234 90 433 -135 -89 146 655 -312 -263 247 180 -556 -464 50
3581E0J9l12l7L99k8n13M52M80l54j89k24O27l47m31K61N54k16m57N41K10j86
$$ 50 69 -243 -280 119 91 -422 30 510 156 -33 -257 370 23 -408 -147 407 191 -266 275 485 299
3602B99m48L76p5l43n37R46R1n07p1O05J27p43O1M63J10q21J84P02m61m14K85
$$ 299 -149 227 152 -191 -728 218 309 -198 -269 336 463 -280 -219 244 354 -467 -283 419 -42 -456 -171
3623a71M30J7n67L85K14m30k52L69J67m63k93J104l9k95l75M69l26m16L46M44
$$ -171 259 276 -291 94 308 -122 -374 -5 162 -301 -594 510 471 176 -199 270 -56 -472 -126 318
3643C18l42j17k7M14k16n04M45N06r4o95M98J96l84k32J78K63l22J1N79q0m52
$$ 318 -24 -141 -168 246 30 -474 -29 477 383 -312 186 382 -2 -234 -56 207 -115 -104 475 395 -57
3664e7k30M02J37n88O9M60j43l89n1P91q1o57M07K99n26j21J45M06m98l61Q68
$$ -57 -287 115 252 -336 -267 193 50 -339 -390 401 320 -337 70 369 -157 -278 -133 273 -225 -586 282
3685B82M58m65n07P5N19m35k52P10k06p10K57N43l0n86L59J95k52k0O6K44l58
$$ 282 740 275 -232 -157 362 -73 -325 385 179 -531 -274 269 239 -347 12 207 -45 -65 1 245 -113
3706a13j89R5M99k51k77J76J54K57q67P89K63p67j32L75L99l18j02L41M1m19l
$$ -113 -302 -207 292 41 -236 -60 94 351 -516 273 536 -231 -363 12 411 93 -9 332 373 -46 -49
3727d9J64K47n74N7L65l47j10J06J83jk72K13N03n33l07K29K26j06l88M39L83
$$ -49 115 362 -212 -155 210 -137 -247 -141 42 41 -231 -18 485 -48 -355 -126 100 -6 -394 45 428
3748D28r40M09O21k37n32J4K73q4n31M15N10n06j83J63O44n9n76J95J80n60k5
$$ 428 -512 -103 518 281 -251 -237 36 -48 -579 -164 346 -160 -343 -180 464 405 -171 24 204 -356 -381
3769c81M60R1j75m45M82J77l38J67K62M3p24r3M72Q4R5k58J92O9m89L10N08m26
$$ -381 79 170 -5 -450 32 209 -129 38 300 343 -381 -474 -2 82 177 -81 111 180 -309 1 509 83
3791H3k54K3N16m95j65j36P97m20l66P51l0n34J16Q6K66k82m44N77R5m75K95L04
$$ 83 -171 -148 368 -127 -292 -428 369 -51 -417 334 304 -230 -114 -28 238 -44 -488 89 184 -291 4 308
3813C08J18o99M94j06p4m17K01M34j11n74N52L11l22m66N25j68k77J05m1L61n89
$$ 308 426 -273 221 115 41 -376 -175 259 148 -426 126 437 115 -351 174 6 -271 -166 -207 154 -435
3834d35M23N1J79k76K2L42Q9l54j98M58J05o22K09L58N1p38N25j04m55R5K26L02
$$ -435 -12 39 218 -58 -36 306 395 41 -157 301 406 -216 -7 351 402 -336 189 85 -370 -275 -49 253
3856B53m66k59O72j21m33J68L53M1o23M89j05J34j54k77O03k83n7m7N02j76m22
$$ 253 -213 -472 200 79 -354 -186 167 208 -415 74 -31 103 -51 -328 275 -8 -65 -112 390 214 -208
3877b08N37P3n09n8Q0L60l62k71N95j29l12K77R8L0n09m2M11l28k87K18N84P9
$$ -208 329 402 -107 -165 -85 275 -87 -358 237 108 -204 73 171 201 -308 -350 61 -267 -554 -336 248 327
3899C27o37R5N91j80o30M18K52m46l34M33L17j07l89M78j0l21K4J53K5k04n58
$$ 327 -310 -215 376 196 -434 -16 236 -210 -544 -111 206 99 -290 188 178 -143 -119 34 59 -145 -703
3920g03P65q2nj12L24k02j51J10L37l93j60N21m35J58n94Q95L78p71m22O61J61
$$ -703 62 -20 -25 -137 187 -15 -166 -56 281 -112 -272 249 -186 -28 -622 273 651 -120 -542 119 280
3941B80n78J15Q8L80o95K30P82m39m61K73K10k1n24J17M85k22k93J57J63j13q0
$$ 280 -298 -183 -95 285 -410 -180 602 163 -298 -25 185 164 -360 -243 242 20 -273 -116 47 -66 -146
3962a46L19L3n39K73K10M3n8n68M63J13k92o8N91q4n70M95R7l33m20M08%j51j75
$$ -146 173 206 -333 -60 150 193 135 -433 30 143 -149 -217 374 290 -280 215 312 -21 -441 -33 -33 -184 -359
3985c59K25M06k45J6K01j06l07j48L86J06j73j77L12Q2l43J64L8N7k65m01K54
$$ -359 -134 272 27 43 244 138 -169 -317 69 175 2 -175 137 219 -124 40 78 135 -130 -531 -277
4006b77N14m34m6N72l47k58N11K38l87m79M04K26o8m49J24N86l91RR1P4l27j60
$$ -277 237 -197 -243 329 -18 -276 235 473 86 -393 11 237 169 -280 -156 430 39 48 139 213 -114 -274
4028b74K70M50p76L84K75L2m67N2L86J08q86K61L32m65P8K49K7k23r1j24P00m87
$$ -274 -4 446 -330 54 329 361 -106 -54 332 440 -446 -185 147 -318 -240 9 36 -187 -278 -402 298 -189
4050a89k3J65M7j80L2N8L65p38L83O38m01l00P3N72k60m49J05J91Km50p4O29l44
$$ -189 -212 -47 0 -180 -148 -90 275 -463 -80 558 157 -143 -70 502 242 -207 -102 89 91 -359 -433 196 -148
4073a48j60K15L02Lm99N42J62m89l17O42J15n75J19J68j4l57L37M85n45l54J75
$$ -148 -308 -93 209 212 -287 255 417 -72 -389 253 368 -207 -88 80 66 -291 46 531 -14 -368 -193
4094a93K88J50p18L82L52l60p3J76K35k02k97K80Q9l46r7M11J58j65q9N08l04
$$ -193 95 245 -473 -91 261 -99 -172 4 239 37 -260 20 109 -237 -334 77 235 70 -19 489 185
4115A85m21K83K30m34p0J12K92J03l51J57L58j14n14L08L62l03m35L4L64j66l93
$$ 185 -236 47 277 -157 -227 -115 177 280 -71 86 444 330 -184 124 486 183 -252 -218 146 -20 -413
4136d13M35K06o74L50lN2k5j41J45L36o54K31N56j69l98k9N66k51k70J1J86P2
$$ -413 22 228 -446 -96 -99 -47 -72 -213 -68 268 -386 -155 401 232 -166 -195 371 120 -150 -139 47 119
4158A19m04M53n8J29n24L20J69n4k33J97m03O1n5M31K75o26L07K40k48l11M36
$$ 119 -285 168 110 239 -285 35 204 150 -83 114 -289 -228 -283 148 423 -203 104 344 96 -215 221
4179B21j65L08o23J74L14k43R5Q5J33l65l06M64j81o6j37O71j9p56J20N03L28
$$ 221 56 364 -259 -85 229 -14 81 166 299 -66 -372 92 -89 -155 -292 379 360 -396 -276 227 555
4200E55q09M49R1j34k98J82K14k62l34L25L54l13q7K96J53n49j20L19J62k67j56
$$ 555 -254 195 286 152 -146 36 250 -12 -346 -21 333 20 -67 229 382 -167 -287 32 194 -73 -229
4221b29N04j30k64l7J11J54j24j56K65k30k62J60K5J21k51K03N85j84j85m7K87
$$ -229 275 145 -119 -156 -45 109 -15 -171 94 -136 -398 -238 -213 -92 -343 -140 445 261 76 29 316
4242C16l77j68N33N6l23m15M90rl53J15K34k41o2O3K22k2k58k6N66l95j3K67N5
$$ 316 -61 -229 304 360 37 -378 112 103 -250 -135 99 -142 -204 -141 81 59 -199 -225 341 -54 -67 200 255
4265B55j32o18N89K73m44l46L82L25o22M04Q4J67l66J10J65j18n8k97K23O6j41
$$ 255 123 -495 94 367 -77 -423 -41 284 -338 66 150 317 -49 61 226 108 50 -247 -24 42 -99
4286i9K61J07k11n44M31M9k8j84L0K57n36L46J23K68m03Q6k14N95l11j27l0J98
$$ -99 162 269 58 -486 -55 -6 -34 -218 -188 69 -467 -121 2 270 -133 -47 -261 334 23 -104 -134 64
4308F4j27J18K71m18O1L33k27K26o26L36J80k59j78R5M48m74r6N89j37j62l65
$$ 64 -63 55 326 -92 -31 302 75 301 -325 11 191 -68 -246 -151 297 -177 -273 316 179 17 -348
4329c48N60j40n66L17K43p4k33L24k2o1m9O9K81l88j90K26q3J76N6q6ml83M73
$$ -348 212 72 -494 -177 66 -8 -241 83 61 0 -49 20 301 -87 -277 -51 -134 42 98 12 8 -375 98
4352I8k55K75m06q6J96L57l16j28L56J40l65j05M73l01J47k26K05O1l40L16R4
$$ 98 -157 118 -288 -374 -178 179 -137 -265 91 231 -134 -239 234 -67 80 -146 59 120 -220 96 190
4373A90k35M2k27P87m31l61K38P3m2o4j74O38l87j71J32M0n4J7r2N4q3k67P00
$$ 190 -45 -3 -230 557 126 -235 3 76 34 -30 -204 434 47 -124 8 48 -6 11 -81 -27 -110 -377 323
4396C23l03k70K23K95l21o6O8K22k22j88J63K42j30j92K02J57k42J59k2k20O9
$$ 323 20 -250 -27 268 -53 -119 -51 171 -51 -239 -76 166 36 -156 46 203 -39 120 98 -122 -53
4417e3j60K47N0j42j07K56N9k33k9L90j10k73J43K81m28N6L4J09j96J29K04k83
$$ -53 -213 34 84 -58 -165 91 150 -83 -112 278 168 -105 38 319 -109 -53 -19 90 -106 23 227 -56
4439e6P7l53K89J83k18j31N20k47j33K37j92J32j69J15K72l85o0M1K73k91l5n7
$$ -56 21 -332 -43 140 -78 -209 311 64 -69 168 -24 108 -61 54 326 -59 -119 -78 195 -96 -131 -188
4461a88M65m49L8Q2L72m70J56J37j6j73q4J71L86l87l23K30J63p0k81R6J4k25
$$ -188 277 -172 -134 -52 320 -150 6 143 127 -46 -130 41 427 40 -283 -53 110 40 -241 -145 -131 -356
4483c56L22J1k7N0j08K74j83M6LJ30L42o76L5J33j48j4K61P3m37L66K2J09m69
$$ -356 -34 -23 -50 0 -108 166 -17 29 32 162 504 -172 -137 -4 -152 -166 95 168 -269 97 119 228 -241
4506b41J83K7L1l70K29N03n03J88k13L95k85l42L43Q4K6k50R4K51o0l2j70L42
$$ -241 -58 -31 0 -370 -141 362 -141 47 -166 229 -56 -398 -55 29 55 -195 -101 150 90 58 -112 230
4528B30j65J34n06M21k88k7L03m6j18J68j4l83M2L76j63Q6k87J86L22m64q3R8
$$ 230 65 199 -307 114 -174 -201 102 56 -62 106 92 -291 -249 127 -36 50 -237 -51 271 -193 -276 -178
4550a78O86m20l05J96M47m53j28L08p8k63J40K52k36l71M64J65J58m74p9j7L30
$$ -178 508 88 -217 -21 426 -27 -155 153 75 -188 -48 204 -32 -403 61 226 384 -90 -169 -186 144
4571A44m97L95q7j99j61O96M5n03kM37k32j46k86L61K87j31p8J41R5l11j48p1
$$ 144 -353 42 -45 -244 -405 291 336 -167 -169 268 36 -110 -396 -35 252 121 43 184 279 -32 -180 -251
4593b51O9L22n90M72o7Pj40L84j91j6m0L12n01N5J73rq5m9J78J2k58J60K95k51
$$ -251 -182 140 -450 22 -45 -38 -178 206 15 -1 -41 271 -230 -175 -2 -11 -96 -145 33 45 -213 -53 242 -9
4617iK71l88M26o0j88Q2p7N0l00J88O6k6L5m1N58p15J81j52J98k07N3J37k85K32
$$ -9 262 -126 300 240 52 134 57 107 -193 -5 61 35 70 29 587 -128 53 -99 99 -108 -55 82 -203 29
4641B9n40M29P1l2J37PJ92k71p6O6j5m34J25L17J30q5k91K63k14j01J48K63l26
$$ 29 -511 -82 -11 -43 94 101 293 22 -54 12 -3 -437 -312 5 135 50 -241 22 -192 -293 -145 118 -208
4664b08J65J42J26l42l6K47JO7l05J7P4L4j29K98J7k56mL29r5r5l09J77K2l00
$$ -208 -43 99 225 -117 -153 94 95 162 -143 -126 -52 -18 -147 151 168 -88 -92 237 142 47 -262 -85 -63 -363
4688c63K80L54l93%N8J07O0k78K40J98JK8k80n3j01J00N8l76M82o1j54J4o2J48
$$ -363 -83 271 -122 -122 -64 43 103 -175 65 263 264 292 12 -41 -142 -42 16 -360 122 61 -93 -79 -141 7
4712GJ24j04j97M25j68n6k22K37p8pj11m6K23m8l2J26j40j28L23L37l34l35L65
$$ 7 131 27 -170 255 87 31 -191 46 -32 -39 -150 -196 27 -21 -53 73 -67 -195 128 465 131 -204 161
4735A61J9j07l23M79m5k8o33O72K16m64j03J3J72k86l24O71J95l29L24j70q6J39
$$ 161 180 73 -250 229 184 156 -477 195 411 -53 -156 -143 29 -257 -581 90 285 -44 280 110 24 163
4757A63o6M4k62P6k18M24j47l75L69r6J06l13L74N9k14k47J79J26O0P1o9Q4j5
$$ 163 97 141 -121 -45 -263 161 14 -361 8 -88 18 -295 79 138 -76 -323 -144 -18 42 113 44 128 113
4780A13m12M33q5n92N53r1L41j09k48J57J22q9k32K69J03l08N0K33k83k21K74
$$ 113 -299 134 49 -543 10 -81 260 151 -97 60 182 93 -139 130 233 -75 -25 208 -75 -296 -22
4801b2L33k45m31K48Q2k89M22Q8K22m91K15P3j07l11L52K1j60k21K63J11l23J62
$$ -22 311 66 -365 -117 -35 -324 98 186 408 -83 132 205 98 -213 139 160 0 -221 42 153 -170 -8
4823h%K41m42P0Q8J80j66k7j17J76j31M0N43m56Q7K7M8j8J3k61K78k09k7j8L83
$$ -8 -8 233 -209 -139 -51 129 -37 -64 -181 -5 -136 -96 447 -9 78 105 153 135 148 -113 165 -44 -71 -89 294
4848B94l17j03M7j5K30l80K56J57l19J73J83j28k76R2P3J03j47J6K41l17N2J00
$$ 294 -23 -126 -79 -94 136 -244 12 169 -150 23 206 78 -198 -106 -33 70 -77 -61 180 -137 -85 15
4870A5L0J20q6p1J65o2k93j37K88k51K17k35L26k59j0L83q6O5j92J72J7n2J27
$$ 15 45 165 79 8 173 111 -182 -319 -31 -282 -65 -300 26 -233 -243 140 54 119 -73 99 116 64 191
4893A91l72O44o24K34j11P5l3J96j47j11K5k06K11o8k2L2K97l53k83M72p5J78
$$ 191 -181 463 -161 73 -38 37 4 200 53 -58 -33 -239 -28 -96 -118 -86 211 -142 -425 47 -28 150
4915A50l86L28j11J59k74J75k09O2L20l37M6j9J19j7O0l24P5P8M9j32K82r0J76
$$ 150 -236 92 -19 140 -134 41 -168 -106 214 -123 -77 -96 23 6 66 -258 -183 -105 -56 -188 94 4 180
4938A80k36j43K42k63L9J35R2k05J27M9j26J09k73M95j70k21J0P4N8q0O1L82l15
$$ 180 -56 -199 43 -220 -181 -46 46 -159 -32 17 -109 0 -273 222 52 -169 -159 -85 -27 -107 -46 336 21
4961B1l10K28M10l91k75N92j87j66J4MJ38j85L37q0l07K27o2J54K5j08J0J63P
$$ 21 -289 -61 349 -42 -317 275 88 -78 -64 -60 78 -107 230 150 -157 70 8 162 187 79 89 252 259
4984B59l12N2L78l32k5j19N3J71l58K04L70o12lK84N6LJ47j02k5j7k86L66j07
$$ 259 -53 -1 377 45 20 -99 -46 125 -233 -29 341 -271 -274 10 66 69 216 114 89 72 -214 152 45
5007D5K12j46j49O7P4j95N20k35m17J85L35l29NK1M7l76J88P3l5K4K56l83L20
$$ 45 257 111 -38 29 103 -92 428 193 -224 -39 296 -33 -28 -7 40 -336 -148 -75 -110 -86 170 -213 107
5030A07j8j54K25j39j54l8L74j78l07N21k86J21j16R3j6L0l9m4Q5J28j25L0k6
$$ 107 89 -65 160 21 -133 -171 203 25 -282 239 -47 74 -42 51 35 65 26 -18 67 195 70 100 74
5053G4j27J81M5l8J00l72K14k4n26N84k57J73J10l98K97J69j53l46N05j45j36
$$ 74 -53 128 173 135 235 -137 77 53 -473 111 -146 27 137 -261 36 205 52 -294 211 66 -70
5074g0K75l42J76rL5K21n01K28J79j41m41K96K3jP5k53k9K12k34L60J19J94k28
$$ -70 205 -137 39 30 65 286 -215 13 192 51 -390 -94 -71 -72 3 -250 -279 -67 -301 59 178 372 144
5097A44j68K44j82om4Q9J7m9k13L83l71J91j19L82m21n3M53p9l11P7K92n1j78
$$ 144 -24 220 38 32 -12 77 94 45 -168 215 -156 35 -84 298 -123 -176 277 198 -113 -36 256 205 27
5120B7m4k16J26N6q9J85J26n8l32K56j67k3j29P6K80k17J64j89K43k44M02k90
$$ 27 -17 -233 -107 -51 -140 45 171 113 -219 37 -130 -153 -282 -206 74 -143 21 -168 75 -169 233 -57
$$ [...]
8191A45
##END NTUPLES=NMR FID
##END=
