##TITLE=1H_CA-8525-2-1
 CDCl3, 8 sc, 
 9.1.2019
##JCAMPDX= 6.0         $$ Bruker NMR JCAMP-DX V2.0
##DATA TYPE= NMR FID
##DATA CLASS= NTUPLES
##ORIGIN= UXNMR, Bruker Analytische Messtechnik GmbH
##OWNER= root
$$ XWIN-NMR		Version 3.5
$$ Wed Jan  9 13:59:25 2019 Russian Standard Time (UT+4h)  she@DPX200
##.OBSERVE FREQUENCY= 200.1313
##.OBSERVE NUCLEUS= ^1H
##.DELAY= (6, 6)
##.ACQUISITION MODE= SIMULTANEOUS
##.ACQUISITION SCHEME= undefined
##.AVERAGES= 8
##.DIGITISER RES= 18
##SPECTROMETER/DATA SYSTEM= spect
##.PULSE SEQUENCE= zg30
##.SOLVENT NAME= CDCl3
##.SHIFT REFERENCE= (INTERNAL, CDCl3, 0, 15.7039)
##AUDIT TRAIL= $$ (NUMBER, WHEN, WHO, WHERE, WHAT)
$$ ##TITLE= Audit trail, XWIN-NMR		Version 3.5
$$ ##JCAMPDX= 5.01
$$ ##ORIGIN= Bruker BioSpin GmbH
$$ ##OWNER= she
$$ F:/spectra/data/she/nmr/H-F/1/audita.txt
$$ ##AUDIT TRAIL=  $$ (NUMBER, WHEN, WHO, WHERE, WHAT)
(   1,<2019-01-09 13:58:07.59 +0400>,<she>,<DPX200>,
      <created by zg, POWCHK disabled, PULCHK disabled
       configuration hash MD5:
       00 E9 B6 7A A2 85 ED C7 34 08 36 98 17 FE 4E 26
       data hash MD5: 16K
       9A 3C BC D1 8C AA 6E 2D AC 77 09 F8 19 6F 82 97>)
$$ ##END=
$$ 
$$ hash MD5
$$ CC C0 E0 8D CC B5 34 27 0A 2F D5 29 5C 0C 14 34
##$RELAX= 
##$RELAX= 
##$RELAX= 
##$RELAX= 
##$RELAX= 
##$RELAX= 
$$ Bruker specific parameters
$$ --------------------------
##$DU= <F:/spectra>
##$EXPNO= 1
##$NAME= <H-F>
##$PROCNO= 1
##$TYPE= <nmr>
##$USER= <she>
##$AMP= (0..31)
100 100 100 100 100 100 100 100 100 100 100 100 100 100 100 100 100 100 
100 100 100 100 100 100 100 100 100 100 100 100 100 100 
##$AQSEQ= 0
##$AQ_mod= 1
##$AUNM= <au_zg>
##$AUTOPOS= <>
##$BF1= 200.13
##$BF2= 200.13
##$BF3= 200.13
##$BF4= 200.13
##$BF5= 200.13
##$BF6= 200.13
##$BF7= 200.13
##$BF8= 200.13
##$BYTORDA= 1
##$CFDGTYP= 0
##$CFRGTYP= 5
##$CHEMSTR= <none>
##$CNST= (0..31)
1 1 145 1 1 1 1 1 1 1 1 1 1 1 1 1 1 1 1 1 1 1 1 1 1 1 1 1 1 1 1 1 
##$CPDPRG= <>
##$CPDPRG1= <>
##$CPDPRG2= <>
##$CPDPRG3= <>
##$CPDPRG4= <mlev>
##$CPDPRG5= <mlev>
##$CPDPRG6= <mlev>
##$CPDPRG7= <mlev>
##$CPDPRG8= <mlev>
##$CPDPRGB= <>
##$CPDPRGT= <>
##$D= (0..31)
0 1.2 0 0 0 0 0 0 0 0 0 0.03 0 0 0 0 0 0 0 0 0 0 0 0 0 0 0 0 0 0 0 0 
##$DATE= 1547027886
##$DBL= (0..7)
120 120 120 120 120 120 120 120 
##$DBP= (0..7)
150 150 150 150 150 150 150 150 
##$DBP07= 0
##$DBPNAM0= <>
##$DBPNAM1= <>
##$DBPNAM2= <>
##$DBPNAM3= <>
##$DBPNAM4= <>
##$DBPNAM5= <>
##$DBPNAM6= <>
##$DBPNAM7= <>
##$DBPOAL= (0..7)
0.5 0.5 0.5 0.5 0.5 0.5 0.5 0.5 
##$DBPOFFS= (0..7)
0 0 0 0 0 0 0 0 
##$DE= 6
##$DECBNUC= <off>
##$DECIM= 24
##$DECNUC= <off>
##$DECSTAT= 4
##$DIGMOD= 1
##$DIGTYP= 9
##$DL= (0..7)
0 120 120 120 120 120 120 120 
##$DP= (0..7)
150 150 150 150 150 150 150 150 
##$DP07= 0
##$DPNAME0= <>
##$DPNAME1= <>
##$DPNAME2= <>
##$DPNAME3= <>
##$DPNAME4= <>
##$DPNAME5= <>
##$DPNAME6= <>
##$DPNAME7= <>
##$DPOAL= (0..7)
0.5 0.5 0.5 0.5 0.5 0.5 0.5 0.5 
##$DPOFFS= (0..7)
0 0 0 0 0 0 0 0 
##$DQDMODE= 0
##$DR= 18
##$DS= 0
##$DSLIST= <SSSSSSSSSSSSSSS>
##$DSPFIRM= 0
$$ [...]
##$SUBNAM2= <"">
##$SUBNAM3= <"">
##$SUBNAM4= <"">
##$SUBNAM5= <"">
##$SUBNAM6= <"">
##$SUBNAM7= <"">
##$SUBNAM8= <"">
##$SUBNAM9= <"">
##$SW= 24.933730806125
##$SWIBOX= (0..15)
0 0 2 0 0 0 0 0 0 0 0 0 0 0 0 0 
##$SW_h= 4990.01996007984
##$TD= 16384
##$TD0= 1
##$TE= 0
##$TE2= 300
##$TE3= 300
##$TEG= 300
##$TL= (0..7)
0 120 120 120 120 120 120 120 
##$TP= (0..7)
150 150 150 150 150 150 150 150 
##$TP07= 0
##$TPNAME0= <>
##$TPNAME1= <>
##$TPNAME2= <>
##$TPNAME3= <>
##$TPNAME4= <>
##$TPNAME5= <>
##$TPNAME6= <>
##$TPNAME7= <>
##$TPOAL= (0..7)
0.5 0.5 0.5 0.5 0.5 0.5 0.5 0.5 
##$TPOFFS= (0..7)
0 0 0 0 0 0 0 0 
##$TUNHIN= 0
##$TUNHOUT= 0
##$TUNXOUT= 0
##$USERA1= <user>
##$USERA2= <user>
##$USERA3= <user>
##$USERA4= <user>
##$USERA5= <user>
##$V9= 5
##$VALIST= <valist>
##$VCLIST= <CCCCCCCCCCCCCCC>
##$VD= 0
##$VDLIST= <DDDDDDDDDDDDDDD>
##$VPLIST= <PPPPPPPPPPPPPPP>
##$VTLIST= <TTTTTTTTTTTTTTT>
##$WBST= 1024
##$WBSW= 4
##$XGAIN= (0..3)
0 0 0 0 
##$XL= 0
##$YL= 0
##$YMAX_a= 196184
##$YMIN_a= -150533
##$ZGOPTNS= <>
##$ZL1= 120
##$ZL2= 120
##$ZL3= 120
##$ZL4= 120
##$ABSF1= 10
##$ABSF2= 0
##$ABSG= 5
##$ABSL= 3
##$ALPHA= 0
##$AQORDER= 0
##$ASSFAC= 0
##$ASSFACI= 0
##$ASSFACX= 0
##$ASSWID= 0
##$AUNMP= <proc_1d>
##$AZFE= 0.1
##$AZFW= 0.1
##$BCFW= 1
##$BC_mod= 2
##$BYTORDP= 1
##$COROFFS= 0
##$CY= 11.3945322036743
##$DATMOD= 1
##$DC= 2
##$DFILT= <>
##$DTYPP= 0
##$F1P= 18.9103706918063
##$F2P= -1.10871071338519
##$FCOR= 0.5
##$FTSIZE= 0
##$FT_mod= 4
##$GAMMA= 1
##$GB= 0.15
##$INTBC= 1
##$INTSCL= 1
##$ISEN= 128
##$LB= 0.24
##$LEV0= 0
##$LPBIN= 0
##$MAXI= 10000
##$MC2= 0
##$MEAN= 0
##$ME_mod= 0
##$MI= 1.114404
##$NCOEF= 0
##$NC_proc= 0
##$NLEV= 6
##$NOISF1= 3.799351
##$NOISF2= 2.8
##$NSP= 1
##$NTH_PI= 0
##$NZP= 0
##$OFFSET= 15.70392
##$PC= 1
##$PHC0= -8852.524
##$PHC1= 13.40007
##$PH_mod= 1
##$PKNL= yes
##$PPARMOD= 0
##$PSCAL= 0
##$PSIGN= 0
##$REVERSE= no
##$SF= 200.130013532006
##$SI= 16384
##$SIGF1= 3
##$SIGF2= 2
##$SINO= 400
##$SIOLD= 16384
##$SREGLST= <1H.CDCl3>
##$SSB= 0
##$STSI= 0
##$STSR= 0
##$SW_p= 3612.71676300578
##$SYMM= 0
##$S_DEV= 0
##$TDeff= 0
##$TDoff= 0
##$TI= <>
##$TILT= no
##$TM1= 0
##$TM2= 0
##$TOPLEV= 0
##$USERP1= <user>
##$USERP2= <user>
##$USERP3= <user>
##$USERP4= <user>
##$USERP5= <user>
##$WDW= 1
##$XDIM= 8192
##$YMAX_p= 0
##$YMIN_p= 0
$$ End of Bruker specific parameters
$$ ---------------------------------
##NTUPLES= NMR FID
##VAR_NAME=  TIME,          FID/REAL,        FID/IMAG
##SYMBOL=    X,             R,               I
##VAR_TYPE=  INDEPENDENT,   DEPENDENT,       DEPENDENT
##VAR_FORM=  AFFN,          ASDF,            ASDF
##VAR_DIM=   8192,          8192,            8192
##UNITS=     SECONDS,       ARBITRARY UNITS, ARBITRARY UNITS
##FACTOR=    0.0002004,     1,               1
##FIRST=     0,             0,               0
##LAST=      1.6414764,     0,               0
##MIN=       0,             -150533,         0
##MAX=       1.6414764,     196184,          0
$$ Real data points
##PAGE= N=1
##DATA TABLE= (X++(R..R)), XYDATA
0@%%%%%%Oj4J6j6J7k5L2m0M8n6P2q7J02j19J37j61J88k16K50k87L28l74M25m79
30b53N39o07O82p64Q53r53J062j181J311j452J608j782J973k184K420k685K982
47A569l316L698m141M661n278O029o964Q168r782J2073j5624K1929l6539J33809
61A10292Q5892j18572L3881J207l5030n7470N109j7932l0831r768K9961j8030
73b1291m6820k7599j744k9859j1182L8957L5468k8976j0071P0487P7511o041l1388
86G452R323J1563l0081j2572K6589Q14m3624m227N1958K6273k5041o968J9397
99C0856j6481m1418O813L9477n097l3846J1098M5835K0744M600J8780m859m6332
112C0170k2798K6912j836o2111l5564L3598K2369k8336n414M3878J2105m6480
$$ y = [0, 0, 0, 0, 0, 0, 0, 6, -8, 8, -8, 9, -16, 16, -24, 24, -32, 40, -47, 55, -64, 73, -88, 100, -116, 134, -153, 175, -199, 226, -253, 286, -321, 361, -403, 450, -503, 559, -622, 689, -763, 845, -937, 1036, -1148, 1272, -1413, 1569, -1747, 1951, -2190, 2471, -2807, 3222, -3742, 4426, -5356, 6717, -8907, 13022, -23517, 110292, 196184, 77612, 111493, 112700, 77670, 20200, 25309, 7377, -23454, -33222, -3261, -21291, -68111, -95710, -97454, -127313, -138495, -99538, -64070, -93046, -103117, -32630, 44881, 38840, 7452, 16775, 28338, -1743, -14315, 12274, 13088, -30536, -34763, 17195, 43468, 18427, 11459, 30856, 14375, -27043, -20230, 19247, 14150, -19696, -8598, 37237, 57981, 62581, 81361, 76502, 30170, 7372, 34284, 32448, -29663, -65227, -31629, -9260, -37596, -43010, 868, 12973, -33507]
124c3507k2687L2150J8219k2744j0443J8297J3049J5192M2279K7153k7878k8918
136B0162K0143J3559m4337m2504R607O689l6320j4181M6207L1365k8346k3145
148d1101K1448J3196j9962n249J6647q192k0682K9100N8381J3226k1219Q824K7332
161G1749j0591k6875K997J969l6702k9169K1568K5417j1437r421J8417k544l4409
174a9031o705K8617r967n5543j6439M4754L0365j1025L518K8826N246j5617O528
187A3527J3823k1473l3853n20J2421p686L749L3094J0693l3151j1304L9107J7746
200C6173m2005l4404J7234J9773p785Q289L4586R448j8625O168K7680l727l3265
213A9540j4258o04k2930j7594K4460K3853k2249k5003K1201K8543j3741k3550
$$ y = [-33507, -56194, -24044, -5825, -28569, -39012, -20715, -7666, 7526, 49805, 76958, 49080, 20162, 40305, 53864, 9527, -32977, -23370, -16681, -53001, -67182, -20975, 10390, -17956, -41101, -19653, -6457, -26419, -31668, -15021, -23213, -43895, -14795, 43586, 56812, 35593, 44417, 71749, 61158, 34283, 37280, 39249, 2547, -26622, -5054, 20363, 8926, -495, 17922, 15378, -19031, -25736, 2881, -7086, -62629, -79068, -34314, -3949, -14974, -11456, 17370, 22616, 6999, 13527, 27350, 5877, -27976, -28496, -16075, -23761, -20012, 13082, 23775, -9376, -20680, 18427, 36173, -5832, -40236, -23002, -3229, -11014, -2725, 31861, 41309, 22684, 28852, 56532, 52805, 19540, 5282, 4678, -18252, -35846, -11386, 12467, -9782, -34785, -13584, 14959, 1218, -22332]
225b2332K717k974k3382K864L7313J4978k0330L729L8016J4144j9241k775J4031
238C6758j9690l8537J911K9499j167k4099K539K0019K23n504J0601l991l5044
251b6482j7490K4094J5124k0050m444L2677J8174j3370M392L1044J3l9274j8370
264a3962J7821M408j8011q77J3505l584o145K1373J7815k2628k8791O338J1052
277a686j8131j3399K1259J5631j4433j193L4153J8270k1670j7769O841m631k1785
290a8543M34J7697p720k1362J4340L5843K715k2651p25J0402j5217k0158J0672
303a4273J4544j4494j1574K2273K4500k555j554J4198n813k9666n216K4439j199
316A3610l2057o875K8797J3242j1569K949J4403j2496k7311L52J3800j1587j9678
$$ y = [-22332, -19615, -22589, -45971, -43107, -5794, 9184, -11146, -7417, 30599, 44743, 25502, 22727, 36758, 17068, -21469, -19558, 9941, 8774, -15325, -12786, 7233, 7456, 1952, 12553, 8562, -26482, -43972, -19878, -4754, -24804, -29248, 3429, 21603, 8233, 12625, 43669, 43682, 4408, -13962, 3859, 8267, -9744, -10621, 2884, -700, -6845, 14528, 32343, 9715, -19076, -12738, -1686, -19817, -33216, -11957, 3674, -10759, -11952, 22201, 40471, 18801, 1032, 7873, 3242, -18543, -18109, -412, -8132, -29494, -15154, 20689, 23404, 753, 28, 10430, -4787, -24945, -14273, 271, -14223, -25797, -3524, 20976, 18421, 16867, 31065, 25252, -4414, -9630, 14809, 13610, -18447, -25322, 3475, 16717, 5148, 8097, 22500, 10004, -17307, -16955, -3155, -14742, -34420]
329c4420P421J5173k034N646K8861J1142k5943j5177K1664J2332k2859j7101J2875
342b420P163r434P593K4424j249k5466n836J2658q077k1793m84Q553j1792q324
356c4484K6879K8941q040j7560J1408J6221j0649j2822O853j317j8499O05K8022
369A5558J0794j7302m811J5097l336k2414l225J0338j5077k6963P211K9327N693
382H90j1308P513J4756m734p003J2478L390k3982j2879K0054J5147j0497k914
395I11J9864M255k0602m909J6197n121l0710j1362J4769M863p288R800J7337m350
409C654q886J5779J6620j5457k1904O638J1077j1054o315J8901J2104j6049q626
422c518J6495N843k0758j4439L823n102j4583P455K2959J039j3615J1284K5790
$$ y = [-34420, -26999, -11826, -13860, -8214, 20647, 31789, 5846, -9331, 12333, 24665, 1806, -15295, -2420, 4743, -4691, 2902, 27326, 26077, 611, -5225, 7433, -644, -22437, -22921, -14368, -26160, -34484, -7605, 21336, 13296, -4264, 7144, 23365, 12716, -106, 6747, 5430, -13069, -12464, 15558, 26352, 9050, 4239, 19336, 16000, -6414, -9639, 699, -14378, -41341, -34130, -4803, 890, -10418, -2905, 11851, 7117, 114, 12592, 15982, -8000, -20879, -825, 14322, 3825, 911, 20775, 25030, 4428, -481, 15716, 10595, -20115, -31477, -16708, -11845, -19133, -9333, 8004, 3654, -5232, 10547, 27167, 11710, -10194, -3556, 7521, -3533, -9848, 9053, 21157, 5108, -3518, 12977, 18820, -1938, -16377, -12554, -17656, -32239, -24784, -1825, -786, -14401, -3117, 22673]
435B2673J51j6135J871R196j3226j4614J1903J6435r210j0763J1809R469j2243
448G316q500O053q898k7126p075K0475O705j5697J040K4301R772p049P456J5815
462B4588q001j8858L922J5491l897j0208Q710R828j0846o560J5053K355k7764
475f187k1625Q477O431j4313o243J6659Q060o609R405K4243L298j7058j689J1741
489A4590l394j2182P105J1672j0779j3217J4111J7297j3081k1517j22K704j3733
502b0546q304J1572N731j1628K970K5537J3440r442m15J3282k947j7158J905J5264
516A9261o659j9673L031J8443k1j3558Q31K643j4608j3137Q089N620j4997p733
530c2468J7838J5468m304K119J8984M332j6725l751J5944P22j9426m770J2677
$$ y = [22673, 22824, 6689, 8560, 17756, 4530, -10084, 1819, 18254, 9044, -1719, 10090, 19559, 7316, -1184, 4869, -4029, -31155, -38230, -17755, -11050, -26747, -25707, -1406, 8366, 1317, 8773, 24588, 16587, -2271, 1651, 17142, 13245, 3037, 11747, 21575, 10729, 4169, 19222, 21577, -6187, -27812, -19335, -12904, -27217, -33460, -16801, -8741, -15350, -5945, 18298, 21596, 4538, 2849, 14590, 11196, -986, 6119, 17791, 7012, -6205, 7906, 25203, 12122, -9395, -9517, -6813, -20546, -28850, -17278, -11547, -23175, -20205, 5332, 18772, 9330, 8915, 22197, 19250, 2092, 3997, 19261, 12602, -7071, -4040, 14403, 14382, 824, 1655, 4298, -10310, -23447, -15358, -9738, -24735, -32468, -14630, 838, -3466, -1347, 17637, 21969, 5244, 1493, 17437, 18159, -1267, -6037, 6640]
543F640J379q068O339J0708j0885j6856M890R662j3076j6138P556J1959n674j709
557a3273K0048J3125j1061p019J2650L726j5412p449P750l261j4710N480J9014
570I608j050j6861J512J3803n507j6975K373R826p570r370J4054J8463k391m594
584E321J1370O476j1707n635R500k341k0522n838J6456M819j3300j506J3449j850
598D692j6170m04J0160p903j7073L014J4588M3l154J3944J2557p174n651J4061
612A5530Q406j5562j2406R596O846r014k032J3340J979j4974j964J1742m903j9665
626a3081m568P853n473j0375R958J6929m413j0343J1740J6415n959j2022M339
639A000N385q755l769J3338O190j2010k747J4462L146j4849m423Q420o409j7397
$$ y = [6640, 8019, -49, 6290, 16998, 6113, -10743, -5853, 3809, -9267, -25405, -17849, -5890, -11564, -13273, 6775, 19900, 8839, 1820, 14470, 18196, 2784, -4665, 3085, -176, -14886, -9406, 9608, 8558, -8303, -6791, 7012, 1505, -15470, -13097, -3271, -10841, -20211, -6157, 12306, 9915, 5321, 16691, 23167, 11460, 5825, 15325, 12984, -7538, -13376, 3080, 7899, -5401, -6907, 6542, 4692, -11478, -11882, -1722, -9625, -26698, -23684, -9096, -9053, -12207, 1737, 14294, 7120, 1469, 15530, 23936, 8374, -4032, 5564, 12410, 3396, 1364, 14704, 16683, 1709, -255, 11487, 6584, -13081, -17649, -9796, -15269, -25644, -15686, 1243, -3170, -13513, -1773, 14642, 8683, -3339, 1000, 6385, -2370, -6139, 7199, 13389, 1379, -1368, 13094, 16240, 1391, -3032, 5388, -1021, -18418]
653a8418K595J7927o13j3255N570J7600Q67r457M801N691j1682j1436Q598P851
667F639j1111p483J1201P161j0093l123J0655q11j7723m712J3437K874j0772L348
681a0513J6238L324n946R183J3798p727j5446L615R182r358j3562O165P966q563
695a644p125R542N476j3093r738P407J145j1548J03J3269K555p955Q069K0051
709A6514L08j3355K308J2518o226j5041K939J0255p097j0884P593J0762o928q544
723d878O272K350j3073n568J1428K879j2423m2J7297N575r836J685J2698l326
737A1038j5236L09J0828o181j3425M377J1943l867p528R326R351j0211j0246Q619
751i03P099r877p115R896O400o900Q97J3508R14j3016j069R657l750j4701R08
$$ y = [-18418, -15823, 2104, 1491, -11764, -6194, 11406, 12273, 2816, 7617, 13308, 1626, -9810, -1212, 6639, -4472, -11955, -754, 6407, -3686, -6809, 3846, 3035, -14688, -19400, -5963, -3089, -13861, -10513, 5725, 9049, 3103, 12286, 26084, 18357, 2911, 6526, 15708, 6350, -7212, -1047, 6919, -1644, -8769, 773, 6249, -6844, -16582, -9175, -8030, -19578, -19475, -6206, -3651, -11606, -3537, 16514, 16822, 3467, 5775, 18293, 12067, -2974, -35, 10220, 3123, -7761, -168, 10594, 3666, -4878, 1394, 3744, -9329, -14897, -3469, -590, -13013, -13055, 4242, 9817, -19, 1666, 14364, 11038, -4198, -3889, 6939, 758, -12667, -8290, 3653, -214, -7742, 1584, 10935, 724, -9522, -903, 6196, -3681, -10796, -900, 5500, -1400, -503, 13005, 13919, 903, -166, 9491, 5741, -8960, -8052]
766h052J0602n125j0625P916J5061n131j3005N193J0587o887j0215N407N920p537
780e891k859J1768O857q558k395J0990j07j2446j112R839m253j3901L541J5353
794F826p14j1240L709J1909m765j1024M112O798r137r834R223R519p132m868J0586
809C968N753r944l744J0021O4j3646k396J1886J068r562L585J1983l237j0191
823d392N131J0183q406j3817N019J0776o329q862Q855J0517o431n962Q841N772
837A0895j0285n894P247J291r509L61J1413k68j0772K865J2227l835j4078K560
851e782J0119n725j1731N797J1840m277p340Q435Q919o458o797P479L815j0298
865b004m685J0232L190r528j024J1432P99j1082j67R231l915j2616J829J0096
$$ y = [-8052, 2550, -2575, -13200, -5284, 9777, 4646, -8359, -3166, 7421, 534, -9681, -4274, 1646, -5891, -8750, 3018, 9875, 1317, -1078, 9912, 9805, -2641, -3753, 6086, 1833, -12068, -8527, 6826, 6112, -5128, -1419, 10490, 5725, -5299, -1187, 5611, -3526, -13360, -4137, 5382, -1750, -6618, 3968, 9721, -223, -3967, 6054, 6118, -7528, -9924, 1962, 3030, -6532, -2947, 9036, 5799, -4392, 739, 10922, 2516, -11301, -6282, 4494, -1835, -10697, -1842, 8675, 2244, -3718, 5123, 10895, 610, -5284, 1963, 3254, -6255, -5894, 5519, 5251, -5521, -2656, 9571, 5736, -8342, -5782, 4337, -1388, -13119, -7322, 4518, 241, -7099, 1336, 10255, 3797, -3000, 4479, 8294, -2004, -6689, 3543, 6733, -2795, -3819, 7613, 8412, -2670, -2837, 6394, 2479, -10137, -8308, 1788]
879A788m160r388P327J0757n306p732Q454Q551r332q795P977P079q468m839R805
894C718M645q605j127R666l58j1708n28Q166l222j0635L580J1355m860j0089P333
909b669J2368o191j1014N608Q434o906p684P659O665p482m035J0080M382q923
923B92l272Q619o75j0883m95J0489k225j0821L375J1766k101r238L774Q683o078
938A210q867O433Q052p954o893R153P485p463n721Q704L621j0305m321Q688J077
953B899j0015q21J0313O84q220L311R901m001r080N147R433o949j0188O499R799
968H712o903q302P180O880q292o934P477L867r502l946Q750K426q205J262J1133
983E603q75r170L680J0394l183j0513L548R959m938r472N629Q496o965p949O297
$$ y = [1788, -2372, -11760, -4433, 6324, 1018, -6714, 1740, 10291, 959, -7836, 141, 7220, -1248, -6087, 3718, 8363, -242, -1369, 8297, 7939, -3769, -4297, 3869, 647, -9988, -6408, 4947, 87, -10002, -2669, 9699, 3508, -7506, -1898, 6536, -370, -8054, -395, 6270, -1212, -5247, 4833, 9215, 292, -2980, 5639, 4964, -5919, -6414, 4075, 1850, -8971, -5596, 6170, 4069, -5169, -1395, 7288, 1210, -7657, -1224, 6828, -1126, -8019, 1134, 8619, 1156, -4565, 4139, 7760, -2545, -6866, 1822, 2899, -7116, -7937, 2376, 3060, -5160, -1849, 8052, 4051, -5029, 118, 9551, 2602, -7586, -1087, 8712, 1809, -6493, 687, 7567, -725, -7659, -182, 3685, -5817, -9763, -1013, 1413, -6792, -5530, 5603, 4728, -4442, -762, 9632, 6449, -4064, -516, 9443, 4505, -4967, 662, 9158, 2193, -5756, 541]
998E41N853r371o499P602M446r536l635J0308L263q648n20J1001Q36r302J435
1013b226R616k263q955L788Q582m475q053O254P452p398q941P493O092q940p236
1028i210P356N516q326l609Q806L457q238j456R214O71q725J380R007k238q704
1043e099M405R753m845r208M783Q656o078q640N629O462p275o348P982M651q295
1058c467l678R042L243q824j920R451R42q926N26J0508j254r823K322Q902l577
1073C467q728L851O878o615p351O836O819p746o442Q004O741p823m313R497M829
1088G904q600k570R658K099q794j005P730j458r290J472P529n581r303M751Q114
1103B656n948q199O568Q600o046n774Q308P244o115l271R132M369p550k923P975
$$ y = [541, 6394, -2977, -9476, -1874, 2572, -6964, -10599, -291, 2972, -5676, -6196, 4805, 5641, -3661, -2226, 7390, 5127, -3828, -40, 8542, 4067, -3986, 2268, 9720, 2322, -6619, 874, 6966, -1974, -9210, -1854, 3662, -4664, -8273, 533, 3990, -4248, -5704, 3510, 4181, -4544, -3164, 5843, 3605, -5099, -694, 9059, 4214, -4994, -211, 8445, 2367, -6273, -644, 5818, -1457, -7805, 177, 4828, -3467, -7145, 1897, 5140, -3684, -5604, 3847, 4789, -4137, -3611, 6897, 5643, -4180, -1858, 7044, 3467, -5261, -1410, 5468, -1147, -8498, -1662, 5157, -2589, -9031, -1027, 5714, -2109, -6422, 3075, 7904, -696, -3266, 6392, 8491, -303, -1308, 6422, 4964, -4326, -2854, 4675, -906, -10209, -5458, 2656, -3292, -11491, -4923, 3677, -2369, -8143, 165, 7409, 1294, -1977, 7155, 11524, 3974, 1051, 9026]
1118I026N25r925j419P014k581j0910P11Q309l545r701L429Q995l648o641O237
1133d124P760m436m363Q585P250o702m012Q831L985r554l982P815L61j1044k648
1148f278P648p65r887R69Q037j857p299L803Q617l744o504P319Q425n596n843
1163b955P764O873p545o136O371L578r440m943O625J278q829j620Q289O67p239
1178g262K171R207j727p668M419R159l314q086N242Q042m656p439N465M889q280
1193A62o436N889K804r417m149P892K865p555J65R484J718p595J088R671m82q055
1209a951K185P918k449o708M269O469o060p469N579M379q706p365O552M167p735
1224f925l337Q831L928p010j242R285J806p658l43Q273j499o893L394Q177l553
$$ y = [9026, 9551, -374, -1793, 5221, 2640, -8270, -7559, 750, -2795, -12496, -9067, -72, -3720, -10361, -4124, 3636, -800, -5163, 3422, 10672, 3970, -42, 8789, 12774, 3220, -762, 7053, 7414, -3630, -6278, 1370, 605, -9282, -8313, -276, -2133, -9432, -5629, 2988, -756, -7260, 59, 8484, 2888, -2955, 4809, 11682, 4137, -1999, 4372, 7950, -1490, -6433, 192, 1470, -7359, -8979, -690, -23, -7262, -5091, 4116, 2389, -5279, -860, 8299, 4985, -3101, 2141, 10183, 5527, -1912, 3553, 8442, 162, -6274, -385, 2419, -6998, -11147, -3255, -390, -7945, -7780, 1704, 3422, -4173, -3085, 6586, 6104, -1951, 234, 8152, 5703, -1005, 3264, 9733, 3673, -3796, 1783, 6162, -2544, -9909, -3357, 810, -6925, -10262, -1431, 2497, -4513, -5755, 3530, 5336, -2322, -2665, 5608, 4109, -2784, 610, 8787, 5234]
1239E234p784M591P282o033q566M002N289p366o197O736M855o350l574Q352L889
1254D360p094j909P670O00q030O10Q948J66p868K629Q727k101p753K678N411n451
1270A593p959L981N236o335n633O954N614p033l399Q028L648q167k743Q463K203
1285D451p315m27R091R29o618J075P157k768q620K269N063n571p189M840O155
1300B522n359n003O982N971o083m891P086L331o967k763Q124L076p188m18Q937
1315G357m07p575L31O059m469q926K085O722m297o212M832P712l313m454O435
1330A880N018o691m451P425M037p012l026Q212K738o957j560O919j369r768j753
1345f358O174j795q178J483P403j753m164O176P234m785n329O224O283o619m902
$$ y = [5234, -2550, 2041, 9323, 3290, -5276, -1274, 4015, -3351, -9548, -2812, 2043, -4307, -7881, 471, 4360, -2734, -4643, 3027, 3627, -4403, -3793, 5155, 5321, -2547, 82, 8809, 6708, -1045, 1633, 7044, 1593, -6366, -2385, 2851, -3484, -9117, -2163, 3451, -3582, -6981, 1047, 4695, -3472, -6215, 2248, 4451, -2864, -3291, 5800, 6729, 111, 1186, 8343, 5575, -3045, -776, 4287, -1284, -8473, -3633, 2522, -2837, -7840, -858, 5113, -970, -5861, 1225, 4556, -2411, -5174, 2950, 6026, -1162, -1580, 7357, 6950, -625, -294, 5765, 1296, -7630, -5545, 1177, -3120, -9332, -4500, 3212, -101, -4555, 1880, 6898, 207, -4244, 3181, 7218, 206, -2820, 5392, 8130, 1173, -387, 6532, 5163, -4605, -6358, -184, -1979, -10157, -8674, -1271, -3024, -7188, -1012, 6222, 1437, -3892, 2332, 8615, 1996, -2906]
1360b906O640M256o323k742Q097K249q850l923N664k73q355j781N884r89o015
1375i367M046Q749k139o448M765O858m225o316M863N206o123m421Q159M913o410
1390B110l812O331K044q216l194N932r13p801L4Q701J022o541K283P451j505o671
1406b745K692N094n039o524N179N972m771m060P009M207p220l685O803J736q926
1421d278l495P052K780o573M45Q062J225o528J341O338k592p751J671N361m395
1436a337n242O047O416n211m350N650M799p465n205N293K301p183j586Q357K665
1451C949n768j79P771M85p314O8N036k891p480L030P158k375n463M525O161m233
1467B480n435M859K147p760m882O811M186o290j853Q203K832o218q04P382p75
$$ y = [-2906, 3734, 7990, 1667, -1075, 7022, 9271, 421, -3502, 2162, 1889, -6466, -8247, -2363, -3352, -9367, -5321, 3428, 1289, -5159, -394, 6464, 2239, -4077, 786, 5992, -131, -4552, 3607, 8520, 2110, -1702, 4629, 6673, -1543, -4737, 1195, 282, -7519, -7485, 1216, 2238, -4303, -2020, 5431, 3926, -2745, -53, 5041, 2, -6522, -1343, 4629, -142, -4202, 2807, 7014, -206, -3891, 2912, 4648, -4278, -7773, -721, 2059, -4514, -4069, 3993, 5218, -1310, 31, 6369, 3777, -3974, -2303, 3058, -1337, -6579, -532, 5884, 673, -3677, 1973, 6772, -693, -5898, -605, 1696, -5487, -7073, 1284, 3949, -1819, -1998, 5773, 6258, -1056, -988, 4048, 1157, -6323, -3293, 3865, 1490, -3973, 552, 6713, 2480, -2955, 1904, 4051, -3709, -8591, -1780, 2406, -3884, -5737, 2466, 5298, -920, -1724, 5658, 4883]
1482D883r014q15P102l66n855K341O525j752m276M760M465o573p039L715M096
1497B197o110l492O360L939n668j281Q093K561q359l092N597J068o712L50P050
1512B501m20n641M399P848k465o898J929L576m552n600L960M319n991l394P857
1527A428M732o106l631M960J058p324j809O824L75o907J323R040K002n027Q53
1542A791N441k713o741J859M582m528o021M533N806l634l359N699K383p537l896
1557f335O275K014p783k303P433L782m888J974P303q7p503M57N473l197p201J202
1573c384M911l084l567N549N319n399m758M589L272o501l628N370K269n494N49
1588c987Q849K889o077o82N929p68p537p69M514l345o589K642P387j464n039L476
$$ y = [4883, -4131, -4946, 2156, 1790, -4065, -1724, 4801, 3049, -1227, 3533, 7998, 1425, -5614, -1899, 2197, -3913, -7405, -1045, 2894, -2774, -4055, 4038, 6599, -1760, -4852, 745, 1813, -4899, -4549, 2501, 2081, -3560, 839, 8687, 6222, -676, 1253, 4829, 277, -5323, -1363, 2956, -3035, -6429, 1428, 6160, 54, -3577, 1383, 2441, -4883, -6692, 132, 507, -6400, -5077, 3963, 5965, 938, 1791, 7232, 4519, -2222, -363, 4219, -309, -6330, -1797, 4009, 375, -2984, 2715, 5098, -2439, -6335, -60, 1954, -5829, -8132, -699, 3083, -1805, 169, 7472, 7385, -118, 339, 5812, 2615, -4586, -3384, 1527, -1557, -5124, 425, 5744, 345, -4413, 176, 3448, -3053, -6681, -1311, 958, -4536, -3987, 4862, 7751, 1674, 992, 6921, 6153, -1384, -2153, 2361, -984, -7573, -4931, 2456, 992, -4047, -571]
1604e71L932m037m050M279K531o262k931P548M632l874q47O665J023p111j115
1619a88N145k169q870j240N720N44m059K441N745k517m653M341M219m824o025
1634f390M286M547l338q53P362L369o240k306O647N06q819l995L514j31n584J661
1650e764O945j152n507K667P177k045o323J140L690k842l008N962N153l927k877
1665g11O679L708n209m009K733r56p373j016P149P95o747O5P067R48n385P24L939
1682B401m145n921L237O087k348l856N096N372k476k059M360J297p806l957N357
1697F39J855n579j940O437J490m508J589N598j936p880l04M822j205m836K539
1712c219N308j611k264N264M825m770n913K866K371n617l232M805J812n096L30
$$ y = [-571, 3361, -676, -4726, -447, 2084, -4178, -7109, 439, 5071, 1197, 350, 7015, 8038, 927, -188, 4957, 2788, -6082, -7322, -1602, -1058, -5117, -2676, 3069, 552, -4101, 240, 4459, -365, -6390, -2104, 2443, -895, -1748, 5614, 8983, 2743, 437, 7084, 7590, -1229, -5224, -1710, -1841, -7425, -5764, 1181, 29, -5478, -2811, 4366, 2321, -4002, -2862, 828, -2014, -5022, 940, 6093, 2166, -711, 5968, 9676, 4467, 458, 3191, 2235, -5138, -6154, 995, 1790, -4957, -4892, 2175, 3123, -2262, -1538, 2401, -1744, -7665, -4428, 1659, -689, -4545, 551, 5923, 3447, 1388, 5748, 7045, -761, -4718, 639, 2494, -3085, -5025, 1412, 2902, -1606, -17, 5581, 3645, -4235, -4539, 283, -922, -5758, -3219, 2089, 478, -1786, 3478, 8303, 3533, -2380, 486, 2857, -2760, -5992, -1187, 625, -4471, -4141]
1727d141P403K336o663j514M825j186n732J326N511j232m578M000P803j256m263
1742B639J376K019n565m755K835J769o332k802O206M230m025p01M775M1o558l89
1758e237O537L79n843P76P412J618k255K813M301m758o269J695L246n540n935
1773g060K390L614k985j013O116J955o059k873N585J879n101j607N167J151l072
1788a913L619P469q10o664K14M450k969o100k29J987l716k825N816M710l492l689
1804d142M512K717m209j801L943J5n622J225P892K106n096l52M530q44n530J32
1820e24K420m899o076L062N734m61k905L450L697l055j810M792P62o618k690N384
1836B63L735l695k62M639O35n157N99L861k362p965r80M339m28l204L453N321
$$ y = [-4141, 3262, 5598, -1065, -2579, 2246, 1060, -4672, -3346, 2165, 933, -3645, 355, 8158, 6902, 2639, 4015, 6034, 469, -4286, -1451, 318, -6014, -8816, -2610, 1620, -2405, -3106, 1669, 1710, -4848, -5237, 1300, 1679, -4164, -3388, 4024, 5642, 3387, 6200, 10501, 5743, -526, 1169, 4415, -1125, -7060, -4670, -1056, -4041, -5054, 1062, 3017, -3042, -5915, -330, 1549, -3552, -5159, 8, 1159, -1913, 1706, 9175, 8365, 1701, 1915, 6365, 3396, -2704, -2933, -946, -4662, -7487, -1671, 3039, -453, -4142, 370, 3087, -1122, -2923, 1020, 1035, -4587, -3362, 4530, 6636, 1540, 1188, 5718, 4874, -656, -524, 1896, -3003, -9079, -6017, -283, -744, -3649, -199, 3498, 443, -1367, 3425, 4187, -2431, -5121, 263, 3998, 303, 41, 4680, 5315, 158, 757, 4618, 2256, -5709, -6689, -2350, -2778, -5982, -2529, 2792]
1852B792k399k669M540M125m412m964K180J831l094p34N330K045m239p34N784
1867E382O93o376k624K732j987n034J712O174k33m591L545N973j170m076J128
1882A248J194m457k812M241L623l125k259N499K759l843j617K831j801o555j145
1897f219N298Q41m780Q16N656O75k969K157L521m393n225K074M316k465k626L613
1913B90L535k584J6M610J202o858l753L665R80m514r11M012j69k969K826N819
1929E197j565o344j73L948k167l411K630L318k756j482N231N036l465l489J550
1944B058M61m470j250L542m65m746O54O572K386m457n44L024j664m702J617L434
1960A450k893m124L161N791l59k374K309J366m563k797L763R64n508k716M722
$$ y = [2792, 393, -2276, 2264, 6389, 1977, -2987, -807, 1024, -2070, -2804, 2526, 4571, 332, -402, 5382, 6075, -301, -2925, -193, -2180, -7214, -5502, 672, 439, -4152, -607, 5366, 4196, 120, 1248, 2442, -2015, -4827, -586, 3037, -88, -2347, 3152, 5911, 2068, 451, 3282, 1481, -5074, -6219, -921, -80, -4860, -4044, 1612, 2287, -682, 1475, 4996, 603, -4622, -2548, 1768, -697, -3323, 290, 3825, 1241, 1257, 5867, 7069, 211, -3542, 123, 1103, -3411, -4322, -310, -479, -3448, -622, 5197, 3632, -2712, -2885, 1063, -1104, -4515, -1885, 1433, -1323, -2805, 2426, 7462, 3997, 508, 2058, 2519, -1951, -3201, 341, -124, -4870, -4216, 2356, 4742, 285, -259, 2765, 1101, -3601, -1984, 1450, -1443, -5567, -2406, 3385, 3026, 652, 2961, 4327, -236, -3033, 730, 1694, -3814, -6530, -1808]
1975a808L186j852O70M372l61n572K05M363j441n562r0M430J89k069L494L651
1991E805l462m340K300K543l668m385J788K110k561N18N884J811m310r84M207
2006C256M68n124j310L435j365l371L021N914n94m535J468L149k378m360J137
2021a189J163m263k273M795M407k947j145L556J563l758j272L323j302n789K26
2036d905N707J529k918R96L871q66l380J661K983m729n041J811L457q49k211L339
2052D55K765l359j549M194P54n221k887L061J124k573J604M511k71l447J847N287
2068F295j710o139p15K729j662k894L677L365k462k776L704L877l556l679J151
2083g95j02l672O4N090J265m224M15N138J432l490p72J690k218m700K097M351
$$ y = [-1808, 1378, -474, 196, 4568, 4207, -1365, -1160, 3203, 1762, -3800, -3890, 540, 729, -1340, 2154, 5805, 2343, -1997, 303, 2846, -822, -5207, -3419, -1309, -3870, -3352, 2532, 4343, 33, -951, 3256, 3724, -1400, -2710, 725, -640, -4011, -990, 4924, 4330, -205, 1263, 4412, 2034, -2326, -1189, -26, -4289, -6562, -1767, 2640, -307, -1452, 2104, 3667, -91, -1363, 1960, 658, -5131, -4905, 802, 2331, -587, 409, 4280, 3414, 34, 1695, 4678, -51, -5092, -3281, 176, -673, -2884, 455, 3220, -139, -1688, 2506, 3260, -1961, -4848, -1787, -663, -3236, -1632, 2879, 2608, -839, 1008, 6295, 4585, -1554, -2269, 460, -1202, -4096, -419, 2946, 484, -2292, 1412, 5289, 1733, -1946, -795, -897, -4569, -4505, 585, 1850, -2374, -1959, 3179, 4611, 1121, 349, 2039, -179, -4879, -2782, 1569]
2099A569j295l587K513M634q32k328J369P91n067k605L979K354l412j879M336
2114E40K128k124Q17K674j470n361p73M366p12l926R70L773m59j458L312L306
2130E603l842m667J509K621k394k554K383K243j797L28M747J264m519k283K660
2145A302k36l992J1L213j009l209K753N129o28m481L09K031k024l217K377J783
2161A12k550j767M976M134k339j750K789L0m043j018K711j21m738j10M584R72
2177A872k483J049K357k284m236J448L203l058l731K547L930k22k83L531J597
2192E237l586k187L345N83l651k633K319Q80j876J395L607r43n048M29L507j527
2208a49m331O08K784j071j375M194M093j788k920K240K342k879k491J463m68l173
$$ y = [1569, 274, -3313, -800, 3834, 3002, 674, 2043, 2834, -2233, -4838, -859, 1495, -1917, -3796, 540, 2668, 544, 1361, 4035, 2565, -2796, -3569, 797, 85, -3841, -2871, 902, 443, -1015, 2297, 5603, 1761, -2906, -1397, 1224, -1170, -3724, -1341, 902, -895, -567, 4180, 5444, 925, -1358, 1302, 1066, -2926, -2915, 298, -711, -3920, -1167, 3962, 3334, -1147, -838, 1193, -831, -4048, -1671, 112, -2438, -4205, 771, 4905, 2566, 816, 3605, 3635, -408, -1426, 1285, 1164, -3574, -3684, 900, 1872, -611, 438, 2795, 511, -3725, -2277, 926, -2132, -5863, -3316, 614, 392, 109, 3640, 5237, 1651, -536, 2809, 3392, -259, -2892, -573, 307, -1569, -174, 3433, 2490, -2558, -2129, 1378, -149, -4480, -3872, -1088, -2159, -3534, 660, 4753, 2965, 45, 2285, 4627, 1748, -743, 720, 252, -2921]
2224b921Q5M438J348l819q68L427k10l252m46K272j981l079K396N461k91k964
2240d04J948L114j654k682J549N30m685k811L211K871k026j275L069R04k497M20
2256d18K690j169m961K68M067O31k098J738L519j394k387K306K018l847m581R14
2272b704K194k017j346K814J849k274p71L962J167l865j748K418J18k260J688
2287g75M004l62l301K295L564j176m160p9J081l177k118K113K835k687j659L742
2303A40K180k030j638J901j31l345R8L519P33k633N65L855N79k844J394J743l216
2320H70m003J174K891j690k782K178L097j374j255K623J052l928k453K691J256
2335C47k601k11K879J125j601R03L711j112m578k23K814r32l119J142K501j774
$$ y = [-2921, -2836, 1602, 2950, -869, -1737, 1690, 1480, -1772, -2218, 54, -1927, -5006, -2610, 2851, 2560, -404, 1544, 4658, 3004, 322, 1871, 2401, -2284, -5095, -1884, 987, -1039, -2314, 755, 1659, -838, -418, 2272, 1103, -3858, -3590, 477, 1108, -990, 748, 4267, 2873, 486, 2792, 4810, 963, -3618, -2704, -510, -2527, -3873, -1059, 790, -1484, -2255, 1707, 2874, -991, -2739, -321, -203, -2463, -775, 3229, 2867, -434, 1861, 5425, 4249, 89, 10, 1091, -2086, -4204, -2091, 744, -1943, -3602, 140, 2320, 290, -1348, 553, 422, -2923, -2825, 694, 1427, -1206, -641, 3214, 3793, 949, 2343, 4086, 870, -3133, -1959, 932, -758, -3540, -1362, 1735, 361, -894, 1729, 2781, -1147, -3600, -909, 347, -2254, -2465, 414, 1539, -62, 841, 4552, 3440, -1138, -1361, 1453, 521, -2598, -1456, 1045, -729]
2351g29j696L860K977k720l353J420J445k595j654K548P29k562M85M513J334k933
2367A069r87K250q64l181L32K183k037k729K191M046m93k423J308J222k384k156
2383b653K568J250k958j696L573L365j701p42K234j46l234n49K324j405m087J03
2399c754L546k59j713J975K678k295k534K050K292k427k880K002K521q23l75L387
2415C391J244l168j376K294M09l913j730J955m03k561J485L586l55l158R75L229
2431A904j479k923J064J982j892j000L532K953k243j420K127J415l001j880J506
2446F45m06l129q47L258J291k775M24K746k41k247Q37K083k056l097K299K985
2462A770q64j544K467J669j990j697J884N91l443k750K534J385k189Q1L346K23
$$ y = [-729, -2425, 1435, 4412, 1692, -1661, -241, 1204, -1391, -3045, -497, 232, -2330, -1845, 2668, 4002, 1069, 82, 2332, 1468, -1713, -1381, 802, -1235, -3964, -1773, 2273, 1780, -643, 665, 1887, -497, -2653, -85, 1165, -1793, -3489, 84, 3449, 1748, 1006, 3240, 3094, -140, -689, 1635, 230, -3857, -3754, -208, -467, -2180, -205, 2473, 178, -2356, -306, 1986, -441, -3321, -1319, 1202, 379, 4, 3391, 4635, 1467, 91, 2385, 2794, -1119, -2849, -894, -1297, -3858, -2373, 1213, 858, -2300, -1325, 1904, 425, -2498, -1434, 548, -1344, -2344, 1188, 4141, 1898, 478, 2605, 4020, 1019, -861, 645, 239, -2890, -3737, -479, 812, -1963, -1539, 1207, 966, -1281, -444, 1639, -417, -3514, -1215, 1770, 906, -638, 1829, 3498, 1508, -189, 1695, 2286, -1157, -3907, -1373, 12, -2177, -2096, 1250, 1473]
2478A473k166L69L302r82l725J92K498j144j678J736K724k079k219K875K319k854
2494F41l034J316Q04k343o79L134J241k311L02L398O80k670r90K041q29k992J081
2511a210K968j283k204J869K828j288k444J082R42l571j385K351J925j994j155
2526b569K637J949j469p36K239n3l467j2K501j79k485N93K856j16j804J306K003
2543C194k481l196J315J913j836k103K279J877j679o17K721R94k869j217K400
2558F95L24k898M6K652j73j773J425K833q43k803L12K086j639k536J576J748k109
2575a077j217K750K122k435j491J871J028k995r99K313L54k546K71L258Q58k196
2591a31M53K080r17k961J180J969j683k746K050K387j241j179J947J245k855j760
$$ y = [1473, -693, -324, 2978, 1996, -1729, -1537, 961, -183, -1861, -125, 2599, 520, -1699, 1176, 3495, 641, -2393, -1077, -273, -2616, -3295, -161, 1080, -1231, -929, 2469, 3149, 479, -511, 1530, 701, -2291, -1210, 1758, 475, -1729, 140, 2968, 1680, -764, 318, 1260, -2311, -3696, -1345, 580, -1414, -2569, 68, 2017, 548, -188, 2051, 1998, -1469, -1481, 1020, 841, -1644, -1051, 1805, 1689, -115, 1191, 3194, 713, -2483, -1168, 745, -1091, -3194, -915, 962, -717, -1334, 1387, 2381, -488, -1705, 695, 1019, -1879, -1833, 819, 646, -1127, 298, 3131, 2288, -515, -203, 1883, 244, -2292, -716, 1032, -1077, -2294, 456, 2578, 143, -1348, 523, 1551, -1444, -2443, -130, 224, -2322, -2051, 1207, 2065, -131, 322, 2402, 1485, -1476, -296, 1673, -10, -2756, -706, 1681, 440, -739, 1208, 2453, -402, -2162]
2607b162K584Q03k846j358K108J716j745L91K005J57k348n2K318j048k604P95
2623a286K082o65j670K203K173j729k325J917J796k415k152J542R57k090n30L225
2639A033J252k964m31K397K77k553l10K025r15k324J308L136p81k312J066J851
2655A755r22k260J395Q54k308j317K791J861k157r23K671Q52k128n17K020n15
2671A152k811k06K524m8k150P50K052p00k027J425J727k370k266J857K020j517
2687e88r07J888J953k106o46K829M86l115j079J945J83k515K41K463m53k219Q32
2704h08K286j207k375R63J435j388j454J814K089j799p64K497K106k689j263J902
2720A345N79k905r55K775O11k355m54K533R8k410J51J568p32k123Q45K092o18
$$ y = [-2162, 422, 1225, -1621, -2979, -871, 845, -900, -509, 1496, 1653, -695, -747, 1571, 523, -2081, -1286, 796, 131, -1539, 664, 2837, 1108, -1217, 700, 2496, 81, -2071, -529, 428, -1662, -2192, 1033, 2285, -679, -1110, 1287, 1564, -989, -1299, 726, -189, -2513, -1205, 1931, 1150, -1162, -96, 1755, 833, -1427, -32, 822, -1486, -2803, -12, 1849, -308, -1231, 1440, 2292, 164, -353, 1667, 1152, -1659, -1865, 659, 611, -1539, -789, 1263, 563, -1464, -39, 1688, -682, -2948, -1091, 929, -588, -1495, 393, 2346, 240, -406, 2423, 2909, -206, -1285, 660, 843, -1672, -1431, 1032, 579, -1640, -808, 1478, 271, -2104, -1141, 294, -1094, -2548, -734, 1355, -444, -1208, 1289, 3395, 706, -557, 1345, 1924, -981, -1936, 839, 1450, -905, -1359, 1174, 1272, -1138, -987, 581, -151, -2274, -1429, 663, 45]
2737D5j737J655K045j331j213J581J264k451j592J863J159j942r51K488N64j890
2753d43p8K084j27k565L46J381l75k060Q93K345j114j478J385K320k131k025J766
2770A24J295k040j422K384N03j810m12K671N13k368o03K150l50k053M04J613J0
2787F09k048J102K553q94k089R27J500j298j711J317J197k069r40J984J575k270
2803e55q10J974N26k477o24K486j36k206J43K715J69j963J332J890r57k195J193
2820E05J788j963j946J751J237j680j065J734J117k503q53J874J68k213l84K022
2836d11Q33j773N39K634L0k185Q75J897q15k408R08J343j228j775J821J144j693
2853b64j731J742Q47k052r20J762O57j548m95K488Q16j749K57K308N7k102j6J866
$$ y = [45, -1692, -37, 2008, 677, -536, 1045, 2309, -142, -1734, 129, 1288, -654, -1605, 883, 1447, -443, -521, 1563, 1436, -1129, -783, 598, 223, -1837, -944, 1401, 287, -1191, 194, 2514, 383, -1642, 124, 1419, -621, -2043, 341, 844, -966, -1378, 1293, 1806, -562, -1165, 985, 635, -1418, -1014, 599, 609, -1439, -337, 2216, 1322, -767, 160, 1660, 362, -1349, -32, 1165, -904, -1844, 140, 1715, -555, -1365, 609, 1135, -1342, -1966, 520, 384, -1822, -1679, 1036, 1205, -758, 574, 2464, 1507, -688, 505, 2293, 330, -1616, 135, 1372, -308, -1373, 361, 1478, -1025, -1878, -4, 164, -2049, -2433, -411, 422, -1351, -812, 1822, 1852, -333, 542, 2439, 1624, -784, 124, 1467, 239, -1536, 285, 1429, -264, -1995, -253, 594, -1458, -2378, -616, 41, -1507, -2002, 486, 1302, -447, -190, 2118, 2175, 73, 57, 1923]
2871A923j142j879Q72J415j151j863J583J428j661j347J490R63j756p48J747J738
2887A612k187l01K490M53k126k23K301p09k343K70J396m08j881M75J973q47j891
2904a946J492J921j629j289J217J766j773p20K419Q99k445n02K428K66k602l20
2920h18J683k80k353LK359p06j972Q28J963m88j478J117J152j265j166J920J505
2937B004k020n97J657J487k194j128K115j42k398K8J940k70k306K6K495k00j761
2954a264Q70J832j471j746J181J937r92j517J279J672j239j384K109N13j763j266
2970a249K124K93j908p37K255j67j565J43J624r8j915J56J937n01j990J084J397
2987H83j038j163J281J644j482j266J798R10j976p06K045L89k046m77K100Kj897
$$ y = [1923, 781, -1098, -226, 1189, 38, -1825, -242, 1186, -475, -1822, -332, 631, -1125, -1873, -126, 1612, -575, -876, 1614, 2067, -59, -282, 2019, 1310, -1033, -763, 633, 225, -1656, -1181, 792, -55, -1946, -454, 1467, -162, -1451, -234, 1532, -241, -961, 1458, 2357, -88, -590, 1838, 2104, -498, -818, 865, 585, -1768, -1765, 594, -112, -2084, -1256, 707, 219, -1259, -142, 1010, -255, -1421, 499, 2004, -16, -613, 1044, 2531, 337, -791, 1324, 1182, -1216, -1188, 752, 482, -1824, -1798, 697, 497, -1264, -394, 1438, -33, -1779, -598, 1339, 347, -1170, 109, 1781, 542, -842, 1267, 1780, 17, -1249, 875, 1168, -740, -1477, 778, 611, -954, -811, 813, 715, -1200, -1044, 893, 392, -1598, -514, 883, -155, -1318, -37, 1607, 125, -1141, 657, 1567, -409, -1115, 930, 1319, -727, -1204, 896, 898, -999]
3004i99j36K218j99k094N33J645p65j415O28J967j196j447J542J268j781j080
3020a311J518O75j369p61J636P08j713m15K363k00k049j35J806j54j780N36J547
3037I02J40k034Q81K015j526j663J370J482j701j270J138J298j961p13J622O85
3053F65j838l05J901M08j666k4J788n0j800O18J998k91k182O69J494p53j504R73
3071A01R29j828o38J530P61j700r03J551J210k143k40K221l9j620l69K707j56
3088A374j982K08J977o24j652P01J515p72k125Q04J593j004j280J094Q88r57r47
3105a189J353P81j754n54J696Q51j925k74J953mj843M52J893k88k399N84K140
3122A473j119j602Q92J645j158j405J309J330j563r07J290R40j796k41J675L50
$$ y = [-999, -1135, 1083, 884, -1210, -677, 968, 203, -1212, -584, 1383, 187, -1260, 282, 1550, -231, -1311, 207, 882, -487, -1248, 388, 1096, -617, -1032, 1331, 1131, -918, -1053, 753, 599, -1181, -645, 902, 1042, -992, -111, 1904, 378, -1285, 85, 1567, -134, -1404, -266, 1032, -929, -1642, -20, 665, -1173, -1478, 423, 831, -835, -859, 929, 879, -921, -303, 1695, 1404, -778, -109, 1385, 632, -872, 101, 1030, -798, -1436, 94, 855, -845, -1748, -197, 1013, -1130, -1370, 851, 812, -808, -1177, 1530, 1374, -608, -400, 1577, 953, -699, 2, 1517, 745, -1380, -576, 1017, 13, -1267, -173, 715, -242, -1189, 164, 945, -809, -1363, 333, 1184, -741, -1015, 938, 934, -909, -457, 1436, 1148, -1251, -667, 1473, 354, -1248, -356, 1289, 131, -1274, 35, 1365, -198, -1105, 185, 1125, -671, -912, 763, 1113]
3138A113j856j59J612K01j996L41J389Q6j741O17J634q38j322N48J565j347q35
3155i88J265J095j147j403J687R21j857q22K074K54j998j49J872Q7j706j79J690
3172F96k46j730N18J787q93j314J070J314q06j590J440Q78p62j185R37J006j403
3189b83l21J116N55j522n65J661K84j926J56J874l66j898L95J624k67j672P61
3206c94J121p13j108J366Q83j289j093J546R14j394p82J939J67j494l45J813J18
3223A255j805l6J798o65j630OJ943p99j369Q13J405o02j330L80J747j370j001
3240a260J081J007r53j093J993O05j661l10J366J93j342l54J731l79j835L09J994
3257A092q34j556O65J463q24j144P28J391j349j205J481J051j150q10J828N00
$$ y = [1113, -743, -902, 710, 911, -1085, -744, 645, 731, -1010, -393, 1241, 403, -919, -371, 1194, -153, -988, 277, 1372, 225, -1178, 509, 1430, -427, -1249, 825, 1079, -919, -1068, 804, 891, -815, -994, 696, 450, -1280, -762, 1025, 132, -1182, -112, 1202, 396, -1194, 246, 1124, 362, -823, 114, 1120, -283, -604, 512, 1067, -455, -1020, 641, 925, -1001, -845, 1029, 663, -1235, -840, 784, 517, -1155, -394, 727, 14, -1094, 272, 1155, -134, -1227, 319, 1233, -161, -943, 996, 1163, -331, -676, 1137, 1255, -550, -586, 1212, 547, -1083, -1077, 866, 67, -1302, -489, 916, 314, -1016, -636, 1111, -259, -1260, -179, 828, -125, -1218, 775, 1380, -281, -591, 775, 968, -374, -728, 1003, 624, -1211, -902, 1092, 258, -1298, -633, 830, 6, -1138, -410, 981, -368, -1573, -92, 959, -191, -1001, 827, 1327]
3273A327j310l95J121L37j796L9J673k95j698K36J694m35j711O83J538q79j318
3290a189J049J144j137r86J391R24r94p69J085R40j941o98J698J37j220m47J276
3307B63K87j835L51J970n37j385M44J386o53j302R65J291r41j183J000J118j347
3324a08p66J122O53j602r16J418O74j826J65J813K2j487M58J370l88j457O49J614
3342A408o31j237Q72J119p76j404R98P84j374r87J214O24j552l27R15Q64j436
3359i26k16K201k66j765O11J540l89j393M40J693q59j260J030J179q64j503M54
3376b93Q37q80q30Q91O63j169k99J189Q17j342k37J232L6j327l4J754m51j501
3394i44N73J384l42j481Q37P81l39j499J043O59p59j461J481J201j226j039J442
$$ y = [1327, 17, -378, 743, 1080, -716, -677, 996, 701, -997, -761, 933, 498, -1213, -530, 1008, 129, -1189, -140, 1004, -133, -1119, 272, 1196, 202, -567, 518, 1458, -483, -1181, 517, 654, -566, -1013, 263, 550, -1285, -934, 1036, 499, -886, -442, 944, 291, -1011, -46, 1245, 304, -879, 121, 1239, -108, -874, 248, 901, -701, -1617, -199, 475, -1351, -1186, 627, 649, -838, -380, 990, 602, -855, -206, 1408, 777, -460, 412, 1531, 755, -649, 349, 1133, -241, -1228, -14, 610, -942, -1269, -354, 510, -926, -1142, 1059, 793, -972, -361, 1179, 790, -603, -163, 1530, 671, -589, 441, 1620, 756, -747, -293, 544, -336, -1166, -275, 388, -781, -1080, 109, 926, -416, -653, 579, 615, -712, -746, 1008, 557, -944, -371, 1013, 671, -810, 27, 808, 469, -1030, 13, 672, -87, -1548, -67, 1134, -92, -1131, 311]
3411C11M91j109o49J338M2j755N17J568mj466O26J337p61j090L68J080j045q02
3429a003O74J041p01o21P74Q84j002p90J187J02j042k30J048L99j347J54J439
3446I66k71j127N0J366n11j480K30J160o16j275Q14J542p02q18Q50J036j321o19
3464g26R29P41j192l18J270L71j283m3J221k22j285kJ124n94j596N45J226k65
3482i9r80N98J245j080l20J019L45j062l97J119P81j012k32J070L23j267j56J063
3500I58k30j107n24J198p63r46O18J442q78r31R92J350j076r59R32O56p91m92
3518e51J261P24j354l22J240L29j652l49J089k83j282K56J214k20r38M47J280
3535H89l45r66M19J209j392m02O62P89r94m25J014M26p68m90O66L4j384m8J421
$$ y = [311, 802, -307, -956, 382, 424, -1331, -814, 754, 750, -716, -90, 1247, 486, -604, -236, 844, -201, -1003, -329, 712, 11, -610, 164, 1048, 46, -744, 443, 545, -497, -727, 321, 720, -627, -473, 966, 695, -432, -382, 984, 473, -1007, -777, 383, -233, -1508, -694, 848, 146, -672, 178, 1214, -107, -726, 203, 944, -248, -566, 704, 1075, -208, -251, 970, 748, -537, -539, 585, -9, -1605, -1060, 166, -99, -1079, -481, 764, -316, -636, 383, 728, -334, -731, 388, 1169, 157, -75, 995, 1318, 51, -105, 958, 728, -379, -903, 295, -468, -1414, -796, 646, -232, -1163, -171, 1179, 103, -856, 76, 732, -59, -551, 710, 1434, 80, -242, 998, 1327, -325, -674, 415, 132, -1150, -894, 320, 100, -838, -391, 889, 544, -422, -3, 1206, -186, -588, 74, 863, -131, -556, 458, 884, 116, -374, 292, 326, -1058, -1106, 315]
3554C15n8j303O80J180q4r83L19J309p85j206O27J211j099j020R00J097j249l36
3572d85Q94M82j368m78Q62J33p03n21J442po04J63J313p8j012L6R54m45r17K51
3592h8R15n53r62P45R71q34r20P58N10q89q95J370K96j323n9J710j39r00K23J061
3612I97m79r96K14J075n33r79O89Q74n17q09P84N86j089o18M93Q85r80q87J043
3631b47Q22q98k30J101K08j149j40J213j61j244N9J052j56p36L76J285o29j076
3649e50P64M53n99q01J07J112j020j71R49P81j227l23J291o6r86l23J023m61p90
3668h37K63J582l41j410M91J067k84r62L80O26j038n50O16J342n38j006P44Q64
3686A009j104l90R22M6j294J34P68J89q15M7Q60J48r97J94R15p25q81L62R59l42
$$ y = [315, 257, -1046, -366, 814, 730, -253, 66, 1375, 590, -616, 11, 1222, 123, -897, 3, 1100, -149, -485, 409, 891, -477, -955, -93, 40, -663, -1184, 258, 251, -353, -190, 1123, 1045, 33, 69, 1023, 578, -339, -88, 827, 274, -688, 57, 1028, 194, -726, 32, 542, -347, -1242, 128, 424, -899, -958, 752, 613, -287, -64, 997, 518, -478, -264, 811, 278, -701, -12, 862, 345, -464, 320, 906, -183, -801, -308, 577, -403, -1290, -247, 575, -323, -553, 548, 756, -393, -533, 680, 519, -725, -666, 386, 230, -506, -130, 1155, 526, -550, 214, 667, 68, -733, -626, 486, -534, -705, 244, 1025, -202, -525, 766, 700, -286, -609, 414, -47, -837, -574, 1008, 667, -743, -252, 815, 531, -431, -51, 575, -463, -1013, -397, 945, 407, -599, 145, 1009, -95, -485, 437, 483, -811, -677, 91, 280, -535, -488, 372, 520, -477, -283, 632, -93, -974, -612, 347, 5]
3706Ep95R33P91q43l67O40Q20j436o26P32O75j049p5J017j2r72N90O89n03r20
3726g06L35P35o23o40K18J113m58m79P55R24j263m17O40N18q69k55P94L96q87
3745a69k66J140o1n62m43P89l83j047L49Q35m56n51P36R29n10q07N77O27r28p83
3765i84O99Q14p81m09J005N21p86k43J162m41p52l82Q98m6r10M06M16n7n42N27
3785A15P94r94p53N42O90m97p52O19O95q58j30J036O85j003o80P92K96j135J58
3804c80P94k57n90l2J415j81r10K07M73j009n05P71N18p96l56P72Q87o41l91O07
3824C96K04p27m71P30L12j136j65J375k01n29J07P44k11j105N76Q08n70j114P42
3843b35Q11l43n67P09O23j027m79Q12J03q53k95N72L72o34N29O90j22j087L06
$$ y = [5, -790, 143, 934, 91, -276, 364, 1184, -252, -878, -146, 529, -520, -595, 422, 410, -562, 28, 717, 214, -706, -371, 364, -259, -899, -681, 432, -26, -505, 250, 1174, -89, -506, 134, 652, -217, -472, 322, 718, -169, -435, 705, 644, 82, -361, 428, 45, -1002, -653, 182, -274, -825, -89, 840, 330, -477, 100, 727, -201, -984, -285, 529, -252, -661, 344, 865, 79, -164, 998, 557, -195, -577, 321, 275, -635, -229, 187, 130, -412, 115, 909, -85, -838, -296, 394, -103, -855, -236, 459, -399, -529, 507, 1192, 189, -491, 301, 597, -538, -380, 414, 157, -433, -465, 950, 769, -141, 66, 539, -470, -975, -204, 314, -482, -838, -66, 821, 180, -211, 396, 600, -127, -598, 132, 444, -692, -857, 518, 317, -212, -105, 639, 428, -677, -101, 707, 137, -977, -235, 576, 233, -334, 375, 998, -29, -508, 304, 407, -446, -741, -169, 203, -431, 98, 788, 666, -421, -115]
3862a15R11k11j073l2Q29k33q43P55Q06n78n38Q61K70n89q54P94L16j222m02J224
3882G6M37j015k44J554l45q30L72M21n76o36M20Q99j91n59Q46Q4m89o53Q84K37
3902F92j078m70Q86K08o75k24J089L9p42j39O30j89o10l55R71j41l47N38N55k91
3922C47m50K38P55q76p79Q31M51o54l37Q20K10o37m88N23P40j132j47M53L93p42
3942d81r1J257k91o24L31Q92k40j207M91L55p44n85M32N15Mn95J006K05m30l18
3962a18J58K64p90l8J041lq21k8J131j86q64J83P29n15q06J59P74o02q84O18Q62
3983B64J16q88J036N05j130m12P38J9o10j0P51J17o23M0O62l8o39l15N04k9j185
4004a127O78R12o66o12R49M97l50p35O61N25p11o97R57M00p25j58R84m51l60l1
$$ y = [-115, 796, 585, -488, -520, 309, 76, -767, -12, 794, 216, -322, 539, 809, 220, -634, 160, 476, -746, -1148, 76, 513, -502, -746, 808, 463, -367, 5, 426, -150, -786, -366, 533, 342, -217, 629, 713, 224, -429, 455, 692, -386, -856, 30, 238, -437, -661, 428, 467, -275, -414, 216, 27, -583, -938, 33, -108, -455, 83, 638, 347, -103, 135, 890, 14, -765, 66, 517, -137, -474, 346, 556, -81, -569, -46, 694, -438, -585, -132, 261, -481, -572, 685, 394, -230, 101, 993, 753, -454, 37, 392, -352, -937, -505, 10, 14, -581, 425, 630, 200, -118, 40, 304, -486, -524, 517, 514, -307, -335, 796, 610, -254, -71, 658, 143, -663, -504, 270, -332, -1216, -598, 264, 380, -508, 528, 1033, -97, -509, 229, 248, -362, -372, 379, 496, -127, -87, 575, 537, -102, -417, 87, 58, -1127, -449, 463, -203, -815, 134, 631, 281, -454, 207, 732, 21, -676, 281, 681, -44, -202, 782, 331, -29, -60]
4024f0M45l47m44k33O87l8q31R6J268l78p79O72K54j30p68N54J048j218l04N26
4044B0R70q61l27P84M97j151l76Q32k61j037L00P42M3o86O37O34o82l24J70M20
4064C44l67m29K27M88n65j35P39N67j103J75O14r6r01R9N13K6o56K66R41m2p74
4085f9M11L35l63p85N81K02m61p39P69P79m79p86Q49p1l23l69M45L30j068O9P53
4106A0K78q40N50K99Pn47N80J99k45p87K36P67l26k85L44M30p32m3K56K97q62
4127d14l96M85J98l52k8N18j03j55qR38k53p53q9O07j5n15O61K82o21j54M46P35
4149A014p31o01L14J00o44p7M99K40p13L4R06m9p56m38J180j88n51J90N58P7o82
4170c18K65M93J40q07J25N14n35o60M39Q95o25o19Q27N59r13j55Q89o0n76m28
$$ y = [-60, 385, 38, -406, -639, 48, 10, -821, -725, 543, 165, -614, 58, 312, 182, -586, -32, 1016, -202, -506, 20, 990, 129, -198, 586, 1083, -68, -444, 388, 127, -910, -610, 132, 175, -511, 126, 760, 78, -246, -76, 344, -23, -452, -225, 263, -302, -437, 302, 869, -234, -59, 555, 459, -442, -343, 170, 196, -460, -194, 747, 705, -69, 342, 677, 314, -471, 110, 312, -149, -888, -119, 660, 181, -605, 244, 173, -150, -519, -74, 256, -812, -743, 10, 288, -552, -2, 297, 304, -243, 337, 536, 291, -496, -260, 507, 181, -104, 240, 670, -62, -105, 151, 448, -414, -810, -325, -127, -479, -507, 11, -92, -247, -255, 683, 430, -323, -412, 195, 180, -335, 326, 608, -13, -167, 279, 1014, 283, -318, -4, 96, -548, -625, -126, 114, -599, -565, 341, 292, -464, -902, 278, 90, -461, -271, 287, 364, -318, -53, 440, 580, -227, -102, 412, -123, -783, -344, 551, -74, -693, 134, 693, -220, -375, 514, 454, -122, -550]
4190e50Q52Q6j207L55R03m43j46J42O57o40n83K85O61n65n65N31J077q12n86J099
4210E51M4o74K7K65K77p40N4O37j02o62J66N61J0r14K62N54j34r56L20N72m50
4231c32J6O51K89l01n15M07P03p45n64N26M19r77O9J143o96k73j64P45Nq82L03
4252a73L37m24m88L79R23o18l03O35L49q81j43M78L53p24j05M24M14p34M67J05
4272B71J86p01K52K54p3j181Q24L50r7p04N82K35J91p91Q34o7o81j83L58N49j048
4293f40J98O10N67j083K80O86n1o86L6J77k44l33j02P99k50n04O52N45q56m07
4313f06O19M40m14p40P76J76n7o25Q14J41r14L07M49L7q18j52R47j58p63K82P17
4334D58j10p65O02L92l22p59K39L11J59o16Q20k06j21m10M38N08r37J0P32j09
$$ y = [-550, 302, 388, -819, -464, 439, -4, -150, -8, 649, 9, -574, -289, 372, -193, -758, -227, 850, 38, -548, 551, 595, -79, -52, 213, 490, -250, -196, 441, 339, -323, -157, 404, 414, -500, -238, 316, 182, -774, -454, 118, -332, -316, 335, 624, 323, -192, 215, 918, 173, -391, 135, 554, -423, -354, 789, 93, -180, -344, 401, 406, -476, -173, 164, -260, -748, -369, 554, -64, -367, 268, 617, -264, -407, 71, 424, -300, -405, 19, 433, -301, 166, 271, 457, -244, 8, 262, 189, -992, -168, 182, 85, -619, -37, 198, 389, -402, 432, 365, -316, -499, -141, 408, -640, -442, 168, 735, -348, -68, 618, 567, -119, -83, 94, -150, -483, -585, 214, -36, -540, 112, 657, -199, -606, 13, 453, 39, -701, 75, 251, 194, -431, 383, 524, -390, -83, 366, 403, -415, -567, 380, 222, -541, -259, 458, 348, -417, 185, 577, 255, -504, -265, 46, 205, -411, 409, 203, 82, -328, 110, 618, -319, -309, 423, 314]
4354C14p76K57L36L90o74N3J082m92p70K15Q0J5o24K02O70j88m76M60L33l60n04
4375d57O47Q5o73j34N68M50q14k81J094k3o91j6R42n51p57L51Q75n47n68O60M95
4396F55l64n45M14M70p20l74O32J67n99k08N03j50O7k56P72m05q60N93K61J07
4416A60n29K20Q30o01k41N02K16m82j65N7L63n13m75O98P6m75o5N62K34p31JN00
4438A42J10m27J5M77P0q23N13M50m15k47K65N14l26r22Q93K92r00L09L0N40o73
4459a13k70O23k38m86j65R04Km71o1N44K17o44r3O82k42l62j36L92m99l45P26
4480c5M24m03m30R16J92p07k02N99J34j107L00N66N0o91L06O47n73J04k29M67
4500C28j28n50j85Q69m14m77O91K22l98l44Q45k89k57m33N40L31p10Q8O20J08
$$ y = [314, -462, -205, 131, 521, -153, -100, 982, 490, -280, -65, 15, 30, -594, -392, 278, 90, -386, 74, 407, 47, -457, 190, 275, -398, -532, 36, 486, -328, -609, 485, 462, -229, -245, 697, 146, -611, -260, 615, 68, -500, 160, 655, 291, -254, 160, 630, -90, -464, 168, 335, -264, -472, 31, -119, -52, -308, 464, 59, -801, -208, 53, 160, -369, -149, 681, 80, -161, 341, 557, 75, -90, -33, 330, -183, -658, 40, 116, -359, -424, 138, 372, -359, -358, 142, 252, -175, -160, 317, 387, -436, 77, 527, 112, -135, 130, 644, 318, -604, 289, 581, -319, -10, 20, 560, -113, -383, 240, 2, -484, -649, 255, 257, -214, -275, 269, 486, -158, -251, 431, 189, -173, -309, 83, -416, -761, -35, 389, -14, -444, 472, 664, -43, -245, 354, 488, -619, -319, 247, 297, -394, -88, 559, -14, 90, -139, 328, 200, -350, -535, 334, -80, -557, 134, 356, -42, -386, 459, 170, -87, -520, 20, 351, -359, -271, 349, 457]
4520D57p64J52M91J71o38L7M67k9r06R6P76k37n62N14L54l56l60M05L33l36o35
4541e70O44L82p69p9N39K73r01L22O58j96p76l9Q07Op79M02L31l86J7K88R1k08
4563E7o03O08J20k08l11N42K53p23J67N20Q3q32N15O7m09j05L17J65k1m64Q1N78
4585C97k90m35K43K04m31l15N72K14l87K50K16K8k32r6M33l11m02l0P45p9p87
4606d93O8Q55k49p98O44L75j40p79N12J61l95Q6R7L68m14K00J59Ol94j60M32k08
4628f7m06r7P49K6m63J64M40k5p44M04K57n3l22L66K11p5m76K23J45j32l94K00
4650f9M26q24J57L21k02k71L7M94K05n29K87N06j50n57k8O46m35n52N37M04j15
4671B88l00J93L51k59n94O59jl17n12O57R8o54K19l8O46j145M81O05j22r11N90
$$ y = [457, -307, -155, 336, 507, -131, -94, 373, 344, -562, -466, 310, 73, -489, 25, 379, 23, -337, 68, 401, 65, -570, 74, 456, -313, -392, 147, 420, -481, -159, 499, 303, -473, -512, 295, 301, -478, -76, 255, -131, -114, 174, 265, 57, -546, 62, 182, -26, -337, 205, 458, -265, -98, 422, 505, -327, 188, 255, -154, -259, 58, 223, 202, -262, -181, 397, 107, -328, -85, 119, -312, -627, -55, 159, -228, 22, 238, 266, 34, -62, 371, 60, -342, -372, 373, 294, -493, -425, 430, 181, -617, 27, 402, 262, -517, -5, 156, -239, -153, -56, 312, -102, 98, 257, 263, -131, -291, 141, -67, -473, -570, 179, 205, -258, -94, 346, 321, -423, -19, 238, 185, -137, 229, 440, 365, -111, 112, 257, 125, -269, -69, 357, -467, -310, 11, -191, -462, -425, 69, 274, -255, 32, 538, 388, -169, -197, 449, 14, -538, -1, 403, 288, -12, 181, 532, 273, -321, 338, 337, 20, -492, 165, 263, -391, -172, -210, 436, -709, -228, 377, 255, -656, -66]
4692f6L47k03k65n2R39n53l15L5N06l40k32J44L69l03l11M14J39m81n2N89j35
4713A74o21k2N27J17k45Q9L31k88n36M90L92k66p51L83N11n97K1K14M71m28j21
4734a55L38P7m51N0K31K38m53o1K95k30k84M31M15n2o63J53Q64p36l86K76K59
4755A56p5o18O41K73n20M9J25J20k3k68P0M35n28R0L83J68m33k37M29l3m38l3
4777b67M34K32n15l3L85m45j57M28K40n42j95O45j11l48O6N95m2n53n8Q94l40
4798C13l61j11M16l03l32L34N20m55m20J84M41k8o76L65N05n87k39N47K80l84
4818Ij04N97k21k49q1M63j39n76LL70K83r50L76K46n8j83j9K37j83k63M52J49
4840A59k22l76M61L98o20O8L12P1m43O04k54n3m26q2Q21j48n97K11n7M06m37K74
$$ y = [-66, 281, 78, -187, -239, 700, 147, -168, -133, 373, 33, -199, -55, 314, 11, -300, 114, 253, -228, -280, 309, 174, -447, -469, 58, 175, -70, 19, 350, 62, -474, 16, 408, 142, -609, -226, 285, -312, -291, -77, 394, -34, -155, 183, 260, -191, -141, 90, 328, -125, -186, 109, -121, -405, 26, 441, 389, -274, -121, 743, 7, -379, -103, 156, 81, -537, 104, 377, -143, -94, 31, 151, 128, -140, -70, 365, -163, -73, 310, 478, 45, -192, 237, 204, -234, -267, 167, 399, -116, -149, 236, -209, -366, 62, 302, -240, -435, 210, 99, -249, -183, 412, 370, -183, -241, 653, 313, -48, -159, 257, -46, -378, -44, 476, 21, -399, -215, 226, 198, -478, -113, 392, -195, -434, 113, 393, 9, -95, 502, 281, 32, -49, 414, 275, -301, -298, 72, 355, -595, -219, 27, -31, -214, -233, 4, -179, -442, 10, 159, -63, -439, 22, 420, -200, -132, 180, 251, -192, 412, 158, 105, -321, -403, 418, 270, -327, -116, -173, 233, -204, 70]
4862G0J07l27o5K34O9m02p8N77j2k60j03l5M17l54J17K70Np11O39R7r5k81J69
4885D8L92j44o40N38l0l72J30L34j11k84jJ33L94l65j10M76k90k56k90M55r5j62
4907b50M54l4J2o71L45L76j14m57M33L0l09J8M06J40k61m24N30l5p2j29J89J38
4929C15q06M28L5K20m23M2M24L1m40R3K86J24m28L2L31n6m30L99L7R3n00L70J56
4952C33k89P5L06l43l88M62j53K35m39k15N32R1n72o7O21K8n20M26L75l08l13
4973a23M6L88k13l40M74K38o43j13L41p2r2O9M60m24k09k97O56l39k89L23N16
4994C57k76l90K76M16k85l83K68K61l69m5J54K48l65K87m67N50l33k69N96k00
5014C1j03o2O4j23L34m01L85k25j64M21J8j94L1k31O56n92k48L85n6J19k86M34
$$ y = [70, 177, -150, -215, 19, 88, -314, -392, 185, 173, -87, -190, -225, 192, -162, -45, 225, 230, -481, 158, 255, 160, -121, 48, 440, 296, -344, 194, 164, -208, -78, 256, 145, -139, -140, -7, 387, 22, -88, 388, 98, -158, -448, 7, -88, -250, 204, 170, 182, -489, -144, 232, 118, -339, 94, 124, -185, -167, 239, 379, 118, -306, 224, 189, 117, -12, 177, 315, -491, -63, -28, 192, -231, -189, 235, 266, -174, -81, 205, 329, -99, -67, 264, 208, -222, 177, 214, 307, -193, 177, 333, 44, 119, 425, 82, -306, 156, 3, 238, -201, -416, 116, 207, -365, -432, 189, 217, -303, 123, 498, 190, -123, -77, 311, 98, -242, 232, 470, -173, -286, 55, -17, -109, -40, 420, -4, -213, -510, 146, -193, -482, -159, 357, 81, -309, -33, 383, 98, -285, -17, 244, -125, -170, -16, 232, -133, 154, -313, 237, -96, -365, 231, 31, -72, -134, -70, -193, 141, -260, 125, -100, -264, 157, 175, -19, 12, -219, 437, -155, -403, -18, -74, 45, -241, 193]
5036A93m7j53L7J39k26k14L1M35k55j44L70O2J1l63K03J84k70N4k90J42J75j00
5058b6K6K90l13m20N44J79p66K1N99J78m17nM34K88q39N4L43M8p97N32K48l54
5080a53p5o7L41j70l31K41l3rl8K80J17l45r1L22M74m68P7K94j26k36k31N89l71
5103ij5l44O31j2k81j69L25j22j46K39k40J58J0j02L97m92j5J10J34j06j55J36
5125f8K45m7m39P40l08l89M09J69l55k79L25J07Mj00J15K42l38j86O3J86m61l0
5147c95K43L89l59J30MK30n66J27K77K60n69J2N13j21j12j4L95o20l3L61M7j52
5169D7j51n1L81m00j49M86J69n83M7M41N4n44M5O15k79n35M52K02j61m49M30j38
5191g1l6M8K05n5l1J07k71L80k83k18L98Q9j94k47K19q1k74K24J14o3l44J99K75
$$ y = [193, 146, -7, 30, 169, -57, -271, -240, 195, -60, -204, 166, 228, 239, -124, 79, 263, -7, 47, -243, -101, 74, -26, 0, 290, -23, -443, 101, 280, -486, -465, 134, 312, -105, -110, 324, 612, -227, -173, 170, 218, -579, -47, 201, -153, -228, -295, 46, -124, -455, -214, -247, -256, -294, -14, 103, -242, -333, -11, 463, -5, 72, 366, 240, 4, -227, 362, -9, -24, -368, 263, 251, -30, -199, 126, 4, -142, 97, -143, 15, 25, -77, 320, -172, -187, -77, 57, -49, -204, -68, 177, 130, -309, 431, 123, -266, 143, 312, -43, -322, 3, 110, 114, 14, 129, 371, 33, -153, -90, 96, -365, -395, -152, 237, -122, 8, 12, 242, -324, -197, 80, 340, -229, -217, 296, 175, 63, 49, 444, -176, -209, 152, 199, 47, -104, -155, 226, -174, -323, 163, 332, -251, -204, 237, 291, -253, -208, 407, 128, -407, 45, 247, 86, -363, 67, -71, -107, -59, 146, 91, 60, 167, -104, 276, -7, -225, 173, 262, 68, -179, 40, -41, -315, -91, 23, -40, -384, -185, 90]
5214I0j42k94M49K68l37k33L91j1om28K40K16k29j34L61J3l30J03k10K83j42J61
5236G9O3j69k02J40P4P3l98K3N68n74R8J35M27k94j83R3M92p79J65L72j56l47
5258c00J97M1J68k75k6N72m72j27J75N64n01j38j18L47r0l23J67J21Q2k52K83
5279I5J64m29P9J94O4m92K32j4K98k13J13K17N8m70K04J40j39k12L54M9k25k65
5301a98J69J68k09l47N62k6k10j39J74o9K43k88R1kj41J63R0K88l31lK07j35q9
5324c2j12M71k35k96K72j24K16m02L16J04J0m17J5M63l46j61L67L40n75O5M24
5345C63l91k46K87Kol1p4N09m07j67k67M77j13k38K59K81n29j03M61L25k66n24
5367c98M92Ol01J42P3J49l87K92J5j62k8k9L36J8l81L04R8j62n93P61Q1j36m01
$$ y = [90, -52, -346, 103, 371, 34, -199, 192, 181, 175, -253, -13, 203, -26, -160, 201, 214, -116, -13, -223, 60, -82, 79, 142, -27, -229, -89, -15, 58, -340, -317, 251, -323, -225, -90, 337, 43, -140, -47, 445, -334, -169, 203, 47, -300, -103, -62, 106, -169, -195, 377, -95, -222, -47, 517, 16, -122, -240, 107, 17, -306, -139, -18, 64, -188, 95, 259, -170, -91, 103, 167, -325, -93, -107, 191, -22, 91, 308, 366, -104, 100, 240, 101, -111, 243, 292, 67, -198, -29, 139, -70, -417, 145, 119, -91, -230, -56, -125, 118, -170, -79, -81, -222, -59, 31, 319, -12, -15, 192, 57, -32, -144, 327, 92, -204, 68, -56, 160, -242, 74, 178, 188, -229, -214, 249, -97, -258, 109, 449, -126, -61, 363, -28, -274, 13, 15, 9, -22, -96, 413, 6, -161, -428, 49, -64, -302, -43, 238, -291, -394, 67, 392, 126, -398, 94, 100, -201, -59, 14, 163, -224, 68, 83, -79, -107, -136, 200, 218, -163, 141, 239, 77, -516, 245, 326, 190, -211]
5390b11M24k29j21k21O18j69l97J03O68o55o1n7O58j87m5rJ19p4l58J36L18k00
5412E0p5L59k38r8n1M69l04l11j27N26l34j55J53O4N70o70j02N82m9o70O5L93
5434D7J07j57j21J92R3m12J03J72j20p1R7R9J21n32L78J35k34r3N02j42j09k76
5456b21N94k5m50K4K27j9j97j25K5K27k52K15K58k36j98K76K04j38k76O7L28k77
5478C1K82j84m0k01j33L58J33m33L9j6M4K17j01N7K88l92J16L5j95j58J50K51
5500A48l69J91l7K67l68j7K82J39l19K49j12J8j43K9J75l5k68M7L16l8j71%r2
5523a08O2L1p8M6J86j80p0K78j09j81K53N3n38M08L1n3j90J8K81r1k13P5N07n26
5547a08J72J61j60j37K28n3j11l8k62K89O2k09mP8N03o66K35K14j82k26R9J66
$$ y = [-211, 213, -16, -137, -358, 260, 91, -306, -203, 465, -190, -251, -308, 350, 163, 118, 109, 228, 154, -204, -68, 250, 50, -25, 334, 96, -2, -53, 416, 112, -199, -326, 200, -134, -289, -136, -72, 498, -172, -274, 308, 259, -411, -346, 47, 154, -3, -124, 68, 161, -251, -148, 24, -96, -167, -70, 29, 150, -382, -4, 131, -103, -196, 306, 164, 55, -221, 373, 348, -102, -78, 149, 130, -67, -192, -167, 60, -192, 23, 281, 45, -153, 123, 327, 189, -87, -20, 308, 31, 313, 129, 89, -112, -245, 113, 246, -187, -148, -164, -120, 97, -4, 53, 341, -51, 65, 100, -95, -253, -103, 148, -221, -30, -67, 200, -168, -185, 97, 236, -83, 166, 54, 72, -71, -42, 133, 98, -170, -123, 193, 155, -16, -16, -108, -46, -15, -93, -47, 139, -41, -111, 167, 58, -123, 130, 183, -355, 53, 84, 31, -159, -141, 140, 49, -164, -89, 418, -108, 64, 225, 65, -72, 156, 103, -8, -46, -308, -19, 43, -166, -170, -92, 411, -255, -20, 194, 12, -214, -115, 51]
5569E1j33J42k79K51j66p5N07Oj33j97j2j50K13k65J79J45J39k93J55L0m84J70
5591a99K92M8j98rL94n8m33L26P2j68k5L5j30N30o81K22j21q2K13kJ59k71K1J0
5615e5J8O9l04K38J82k84K32j04l23J09K10N01n09j28J78Q7j67k89L42J16k04
5636h5k15L27L5l13R1K0N19m88n7N64k63Q9j34J43j93K2j07j37K73Om39L38K72
5659B68m89K69L23n74L52k67J83r2l66L45l4L1K4Q4K71m81k63N84Q3j65j65K12
5681A33p9k11K14k8Q0j23lJ56k97K40J4k85k0j71N44O9p74O73o8K07k27k08J43
5704b1k10M0K50OP3k50J47M1j59k1O3K00l35M0K52J92k18m81L31J82l24mK39l40
5728c07K95m66O66j73l81K12j44K49j79R6L74k13m23K37J05L6m03L92L07j63o45
$$ y = [51, -82, 60, -219, 32, -134, -209, 298, 304, 171, -26, -38, -188, 25, -240, -61, 84, 223, -70, 85, 115, -369, -199, 93, 141, -57, -66, 328, 270, -163, 163, 235, 67, 42, 77, -53, 477, -204, 18, -103, -185, 28, 26, 185, -86, -65, -55, -37, 32, -272, -34, 148, -136, 96, -8, -331, -222, -12, 489, -20, -148, 30, 117, -50, -339, 3, 119, -85, -300, 27, 62, -251, -160, -140, 379, -109, -166, 398, 135, 224, 90, 233, 40, 62, -45, -182, 91, 97, -342, -4, 268, -221, 48, 371, -203, 149, -118, 65, -27, -393, -48, -82, -51, -27, 57, 328, -153, -416, 168, 251, 86, -79, 133, 54, -157, 57, 29, 109, -14, -17, 139, -158, 82, 96, -189, -209, -380, 164, 233, -541, 132, 64, 271, 44, -164, -21, -231, -191, 59, 65, 138, -112, 35, 76, -83, -104, -41, 159, -176, -136, 116, 308, 90, -391, -60, 122, -202, -206, 33, -307, -12, -478, 188, 15, -366, -154, -298, -49, -228, -132, 242, 29, -394, -157, -52, -16, -419, -27, 280, 117, -528]
5749e28N33N35n12JJ74p5j80n8pL55n15L4l3M37n29K82P1K12m21K01k39R9j00
5772b63o1N07l73k09K78K91l51L7K82n8k92K45j43R7j11j4N3M20m11K9R7o8j81
5795a99J21M5k72K49l53P30l74k31L47L22o42kK44L1m5j74K68J9Q0j42k68J65
5817h1o6L10M9j15n34N08L81m44Q0k66K32o6k24K57j05l7j0K97j32J8j65Q9J39
5840A15n50O11m81L63p8K0J70k32M3j06L29j89O0J29p1Q2l95R5L20m35q5N26m03
5863a62m1n1L60L57n81j5Q1m9j06P2J46n44M81M52n01P5l45Q8J09J62j07Q0J28
5886H9L4k31J75o8k3j76K26N4k12J2J09L73n70J86K8K06j60j70L91j35j26l57
5908c45L90L8k52J62J26m30K63L2j58K03j50O2M53p39M98oO3n25K86N3J08l03
$$ y = [-528, 5, 540, 28, 29, 203, 128, -52, -110, -117, 238, -277, -243, -276, 161, -368, -86, -15, 197, -224, -23, -262, -163, -263, -324, 183, -190, -399, -121, 170, -181, -144, 138, 80, -212, 33, -110, -13, -124, -138, -85, 335, -76, -47, 50, -18, -199, -78, -33, -305, -56, -409, 321, -53, -284, 63, 385, -257, -259, -15, 16, -29, -203, 65, 84, 164, 22, -246, -81, -147, 163, 212, 97, -437, 71, 452, 8, 88, -178, 54, -12, -236, 21, -84, -121, -131, 166, 34, 52, -113, -24, 115, -435, 176, -305, 58, -20, 0, 170, -62, -19, -125, 204, 15, 75, 204, 133, 215, -180, -85, 235, -200, -285, 241, -162, -203, -254, 106, 463, -118, -133, -52, -101, -207, -135, 11, -533, -52, 400, -101, -26, -371, -283, -174, -12, -119, -39, 89, 123, -108, 67, -1, -24, -200, 26, 80, -132, -120, -11, 362, -208, -22, 6, 212, 52, -118, 273, 138, 12, -345, 45, 83, -169, -7, 119, -311, -48, -16, -174, 29, -121, -59, 394, -345, 153, 147, 210, -315, -29, 24, 132, -171]
5930a71n2L07opn3l5k2k34M86k7k19q4K07L8k0l23K33K3J3J9J6K13k98m17M79
5955F6L2m29J34J31K65m52J32J14L36m59nL54k44l7J76N8k90j10J89O5k99R3L12
5978A32j08k27k51M56O4k05J73L9L8m74K90J33j56m1L30m7l16K32o8P1N2j97K54
6001A74l5j91J12P0K5m52N37J08k14n38M93k8N5k46R7J76k34j66K88j68L6J9Q1
6024aK53j05j27p4L77k89j94M13j83j92R9p8J72o2N2L30m75qj8K10p8n50P67j34
6048A05n8J40J25m66r7L39k6O1k89R0J07K42k39n5Q0n8m37N78N1K8j44k83L76
6071A70k30Q7N4j42LJ00J49j55r9j94N01l79R4J5k33K22k19K17L26q7n84M32j5
6094C3M8k91P5J00q1J36N63k68m64k77N84r7k57j98M28r5j22Q0J08L8k58M7L45
$$ y = [-171, -223, 84, 78, 71, 18, -17, -39, -273, 213, 186, -33, -117, 90, 128, 108, -215, 18, 41, 54, 73, 89, 302, 4, -413, 66, 98, -331, -197, -66, 199, -253, -121, -7, 329, -130, -135, 219, -25, -62, 114, 172, -118, -228, -39, 26, -273, -180, 132, 24, -203, -454, 2, 66, -139, 34, 73, 111, -363, -73, 60, -96, -137, 193, 146, -170, 62, -6, 65, 117, -80, 174, 139, -52, 60, 130, 155, -297, 240, 348, 134, -404, 89, 61, 116, -130, -33, 143, -91, -257, 31, -137, -101, -82, -1, 252, 147, 20, -54, 323, 34, -160, 253, 70, -122, -23, -101, 71, 9, 61, 391, -84, -92, -110, 100, 22, -528, 239, 105, 47, 187, 312, -154, -251, 88, 62, 123, -166, -76, 31, 273, 34, -21, 59, 1, -436, 142, 193, 221, 77, -206, 170, -60, 27, 81, -61, -58, 42, 191, 36, -63, -257, 244, -135, -41, -26, -259, -37, -256, -39, 287, 200, -384, 48, 33, 81, -210, -135, -35, -116, 20, 583, 315, -149, -426, 158, 61, -196, -394, 34, -61, -183, -103, 5, 43, -215, -168, 177]
6117A77j70j36M5L84l80k0O2O2K0N2j6Q1J61l89M0J27j50j41R3K3n3j52L29M8
6141I7m26K98j6k01L52j39J00K90n20L8J19n8j69Q5M64j60m00J97j53M92k01p6
6163A3L23n46K55k6K95l34q3R6M2m79L70O9n5J74j42K36m28J59l17M55k98J49
6185g2mO4J37n2%k5J8k20J03L26l64n8L70j22l00K08J55j29k40K19J18J7j34n0
6209c5M8O8l37L35K10j52l02L10j81j8jj86L98k84K34j39J01k86L95r7k91j10
6231c20M01k0ojr7J41l11J11r0K60j04J21K11l53k60N3K58O6k10J70L73m6l90
6254d3J03k32K11j55k51L20L6l66L62p5p0O5p5L77j99j84L41m1j17k27J25N14
6276D19l65rp0J8k23Lj9L25j1j88M37l08m8r1K29j90R2n1K64l32K2J48j87J51
$$ y = [177, 7, -129, -84, 300, -80, -100, -38, 24, 44, 96, 80, 161, 322, -67, -27, 100, -50, -191, -98, -75, -128, -280, 49, 97, -329, -31, -47, -248, 104, -35, 65, 355, -165, -127, -8, -66, -235, -150, 314, 154, -246, -49, -202, 290, 89, 13, 336, -210, 45, 19, 314, -20, -103, -7, 35, -444, -74, -5, -60, 114, -28, 208, -220, -61, -378, 77, -221, -72, -76, -12, 125, 73, 73, 48, 66, -154, -51, 275, -89, -147, 223, 101, -199, 9, 164, 35, -205, 14, 132, 149, 15, -35, 13, 81, -256, 79, 289, 137, -165, 145, -36, -54, -55, -241, 157, -127, 107, -32, 69, -217, 178, 81, -210, -320, 81, 61, 55, 54, -43, 98, -213, -102, -192, 68, -36, 85, 296, -57, -317, -264, -6, 60, -150, 20, 393, 347, -43, 60, -172, 39, -116, -367, -47, -11, -377, -15, -90, -160, -95, -170, 207, 8, -176, 165, 124, 7, -220, -95, 419, 54, 45, -25, -7, -230, -227, -246, 79, 68, -120, 317, 9, -39, -130, 99, -91, 1, -50, 214, -118, -96, 52, -135, 16]
6300A6p1j79J68J26l59M6J84j30N0L10K5k81j34K59q8k4M2L54o07J59K95n8l7
6323F6m4P1j60MR4j72L51k75j06N01j3o78K39L70N5m66J7L67k6l15L58j96j35
6346i3M48k19K06k7l61N9L21l04M1l76O15l89J06N0p4k37J6M87k05J66l37K17
6368A10rP6o4N7j27j37J3j24Q1L1J08J94l12l0L55j74p2J03j01j84J57j47J23
6391g3K84k16K1J52jk72m6L10jj86J37J1k33M6K35p0k0j28L4K34j58j23J82J0
6415A29p9j59M1p0O6n2K20n9k37K40L2K0m70L04K21o8p8k87L47l8k07j4K53K50
6439C05n06M46j25j20n4l3K83l09L04k81J96j10k1L2L8k70K94k25j10J34J50J38
6461A56M2k59Q8K03j66m15P07m49L33j71j58L31j53j31K6L32p42N13N2J19l58
$$ y = [16, -55, -234, -66, 60, -299, -253, -69, -199, -149, 161, 186, -95, -229, 30, -58, -82, -40, 314, -293, -134, 161, 103, 66, 22, 93, -67, -63, 31, -141, 210, -65, -171, 330, 317, -361, -122, 248, 303, -163, -146, 221, 195, -120, 238, 42, -93, 355, 136, 342, 315, -46, 13, 334, 30, 71, -305, 310, -79, 27, 77, 3, -234, -218, 269, 64, 230, -107, 110, 101, 177, 113, 170, 43, -94, -81, -205, -124, -93, 15, 209, -103, -133, 222, 48, -24, 79, -22, -206, -49, -196, -73, 211, -5, 16, 168, 167, -105, -151, 159, 158, -28, 109, 120, -113, -67, 168, 98, 78, -50, -16, 218, 60, -63, 119, 129, 50, -109, -68, -138, -72, -124, 96, 37, -200, 40, 72, 92, -378, -74, 147, 79, 1, -286, 61, 23, -184, -198, 55, 305, -201, 245, 120, 0, -54, -87, 196, -113, 191, -90, 106, -4, -25, 7, 45, -225, 69, -156, -266, -132, 18, 156, 198, -61, 27, 230, 64, -351, 356, -93, 240, 69, -89, 242, 89, -42, -16, 316, -426, 87, 139, 258, -100]
6482a00r5K94k39Q6L3k9J56O7j30P7M0k56J79J93k81r0m7K91k66M03K8n37K59
6505C6q6K27O7l19NK63ok3j42M8p2k37K19L44k82oq2j5J33J9M7j27n7K5P5lk83
6532b32K05K53k30k05k9N70k87k50J26K9j00P5q3M16j46nk03N1L21k80j14N23
6554D05l72R4J36m74P8p3K14J64k25J82l8j08j15j42K60M5l99P1K62r2J52m5K11
6577A91k21k63K92k25J98r2J19K25k58l48P27m81k25J69L26R8k07l01K78J35l80
6598b43L74R2o5k60r1J55R6j49K35j74K80m80J74O6k01J52L65k55j03N9K33j56
6620A04m04J75J24P9l20K47k7l3j66L62J7k52J00J08j95K62k51lK42k8j9K82l5
6643C69n95M10r5K0l99K19K94l42J29n6j32M02j34k1Jk20J60k6K06n12J89L31
$$ y = [-100, -195, 99, -140, -54, -21, -50, 106, 173, 43, 120, 160, -96, 83, 276, -5, -95, -142, 149, -117, 286, 314, -223, 36, -50, 177, 244, -75, -70, 193, 187, 164, 22, 70, -2, -239, -20, 324, 42, 36, -46, -61, 72, 91, 138, 11, -46, -21, 54, 51, -232, -27, 226, -4, -209, -238, 332, 45, -205, -79, -50, -150, -75, -158, 258, 112, 107, -96, -45, 276, -4, -118, 405, 33, 127, 263, -211, -133, -206, 8, 172, -53, 129, 91, -17, -132, -274, -14, 31, -368, -297, -35, -127, 25, -20, 191, -30, -293, -1, -226, -28, -120, -1, 224, -34, -382, 345, -136, -361, -192, 134, 232, 25, -276, 2, 137, -243, 131, 223, 158, -102, -193, -38, 58, -91, 144, -30, 250, -230, -56, 10, -191, -39, 326, 71, -32, 27, 260, 104, -300, -125, -1, 78, -242, 5, -22, -55, -221, 141, 158, -94, 6, 114, -81, 181, -70, -73, 169, 141, 122, 404, 369, -226, 184, 89, 109, -290, -71, 223, -119, 10, -46, -178, 224, 90, 69, 70, -150, 10, -16, 190, -322, -133, 198]
6665A98j27k62K77K84k93j09n2J67j17M2J25K94j98l82q2M20R7k67nJ31o0j94
6687a13L66l79Q0j62L80q4j9r6K80l10J10j18J29j48R7J56N5j37k13K18k94K63
6709F1k9j62J53J9l06L27r9M6j66K64k06j02J74oj90K53R4J5K18m10l0J52l49
6732b79K13j09J62K18j30k87K6j65M23K03l99P9j00K17k9j91L69l65M22m47K69
6753A00K4P0k42J50Q5m6k95M07k05K7m13L24J65J34n13J44J73l80K65J58pl04
6775a79J69L64k04l65p3N12k32k31K42O5J9l35J05K01k12m8Q6K28j52j0J01p1
6797b0k05L83J80k40q4k14Nj72J48J97j94K35m9Q5K4P0l83M44M2l12K88Q7j89
6820A26l28p3L21K41m12L8L97k26j62j46N73k42l61J82p5j45J56q8L11M05o18
$$ y = [198, 71, -191, 86, 370, 77, -32, -84, 83, -34, 8, 133, 427, 229, -153, -235, 185, 282, 15, 10, 141, 81, -113, 253, -126, -46, -208, 172, 88, 69, -27, 253, -57, 53, -65, 64, -84, 13, 169, 224, 87, -126, 92, -202, 61, 32, -130, 23, 42, -264, 63, -36, 10, -156, 108, -98, -200, -26, -32, -222, 31, 125, 140, 358, -52, -82, 70, -279, -66, -175, -13, 205, 75, -212, -186, -351, 72, 275, -124, -45, -145, 72, 43, -148, 221, -144, 278, -169, 100, 124, 194, -48, 102, 187, 141, -154, 253, 48, 75, -338, -14, 151, 285, -228, -84, 89, -291, -26, 132, 125, -179, -10, 354, 150, -215, -288, 224, -8, -239, 3, 68, 87, -248, -143, 58, -154, -202, -116, 112, -40, -50, 51, -20, -225, 158, 338, 98, 14, -200, -195, -367, -219, -22, -216, 19, -30, 55, 79, 149, -234, 210, 252, -60, 228, 315, 126, -202, -275, 46, 287, -125, -87, 310, 84, -78, -224, 349, 107, -254, -72, -147, -292, -136, -224, 87, 492, -126]
6841a26J92j10k6K37Q6j7k42N4Q5j36k44K63K41j46O0L3r9l26J27j87M89l88M93
6864C13k83K19j15K3O3L8o36J89L21k02Lj90N61m64L7K03k3k48N15l82O7j49J50
6887A0o0K37k55k13O46l03k49K13l89M47j9j79L43k76R6k05N5O1r5j01L52n0k06
6910a40j60M03k21l18M39J84k94R1j02M60n92p6L32J19j36j67J81J9L5p9J84j16
6932D6r8K03n5L2l62J39J31p2N9n3k1m8m1P9J70k3q0J11k4j40l41nN54k04o4J39
6958C2k5j1K73l86j32K02L7l5K54k43m7J10j13J34j58J81j04m5K84k20L9L9j10
6981d4l0J73k64L73j52l3KO5K4Oj57m7N2k0J18k7J23j43j02p4L2K74j25l17J47
7006a46j00J67R9k06L46m8N4j75K47l89L16k13j49L37j81K5r7K32o8R3k00O6j86
$$ y = [-126, 66, -44, -70, 167, 253, 236, -6, 48, 133, -3, -247, 16, 257, 111, 171, 204, 105, -221, -94, -281, 208, -180, 313, 30, 249, 134, 157, 220, 258, -378, -189, 132, -70, -67, -257, 304, -160, -123, 80, 57, -191, 324, -58, 9, -140, 10, -50, 187, -68, -281, 365, 62, -187, 26, -363, 84, 65, -114, 229, -47, 49, -156, -101, -40, -135, -236, 116, 66, -140, -300, 103, -118, -436, 3, 187, -107, -16, -118, 342, -250, -326, 6, 125, -11, -178, 3, 22, 57, -22, 162, 46, -52, 151, 96, 128, -234, -95, 36, -36, 23, -30, -51, -99, -140, -61, 109, 86, 6, 117, 93, -47, -388, -393, 161, -43, -107, 32, 7, -4, 269, -117, -249, -47, -10, -45, 209, -34, -81, 29, -84, 50, -108, 73, -31, -76, 208, -12, 27, 66, -44, -74, 99, -165, 208, 56, 23, 25, 90, 114, 120, -37, -84, -32, -52, 66, 39, 162, 19, -83, -157, -125, 149, 24, -293, -146, -246, -79, 20, -186, 160, 112, 166, -9, 238, -151, 165, -48, -197, 140, -41, -16, -113, 119, 51, 144, -56, 10, -176]
7029a76K34k76K81m0j95J17j2J73j96L62n02L75m03J88K11l46K83k98M10j82K19
7050B27j11N5p1m04J86R0j10j07M7L37m14j29M71l17M3M79k53Q0l25L17j25o6
7072a00J29j94J04J18k59M6K87k05j0j0P2m53M05k8J53j84L1M4O3m0M34k09l22
7095a28L02j38o0K44k93P7k40J68l9j32L89l16M7K94m5M4j80O9kO5l17L89j23
7118G5j81J36K28k92j01Q8J11j5j88K96K95o15L09j92M0J5l72M01P3J50j99j7
7140D5k2n2l9k3J50KJ70l21L70l14RJR6O5P9l85P3l2N0J18j87L54p7j74M2p7R1
7167A2k55N24k36q6l7J54o0K02k90j25K67J68m36L11J01m22K71k7M7J46l44K19
7189A04J28k77l10K58L41l22q1M06l62L87m16L01j68r6k91N14l9j97J61n1N6j04
$$ y = [-176, 58, -218, 63, 23, -172, -55, -67, 106, -90, 272, -230, 145, -258, -70, 141, -205, 78, -220, 190, 8, 227, 116, 171, 100, -304, -118, -28, -138, -245, -198, 139, -275, -404, 67, -250, -207, 272, 19, 99, -226, 91, -34, -100, 29, -165, -61, 57, -202, -156, 131, -74, -84, -94, -22, -475, -70, -98, 55, -129, -98, -54, 9, -31, 403, 194, -128, 174, 36, -24, 220, -73, 4, -236, -68, -107, -239, 150, -166, -119, 175, 130, 174, -6, 63, 61, 126, -191, 198, 75, -106, 30, 258, -34, -135, -47, 64, 49, -139, 157, 452, -163, 146, -46, -6, 9, -363, 38, 111, 261, 62, 45, 23, -29, -68, -91, 59, 61, 231, -90, 280, -34, -25, -24, 72, 137, 216, -169, -96, -128, -78, 40, -147, 207, 130, -44, -2, -79, 12, -243, 281, 45, -41, -78, 76, 16, 218, -72, -197, 70, 238, -198, 113, 214, -208, 63, 36, 83, 229, -115, 104, 232, -45, -355, -97, 244, -78, -159, 247, -115, 272, -144, 157, -11, -107, -398, 116, 77, -120, 41, -10, 46, -58]
7211e8k2K07R1m53q2L40j46P6J08j8K29m46LM06k07j58K08k25M7l3J40K04j40
7234G1J18r1p3j31J04J21p6m7j59K77k99K40J4K46l48K40k6M0j27l26J07J58J0
7257D3M7j58J81j06j41j86M68j94rL11l09p8J81k1k80K10k32J66j19L77j50J84
7279A85J63l48k24J95P8R5J44m8j82j26K16M7j26jn2J40l85l8J93j27j0K32M9
7302G0j74N0K12P8m30k06K05L07Q1m33K72L64m49L0L02k09o3kr2jJ94j13K42N7
7326B92n16j9J87j39K21j22J95j1L0J91k80L2j23K53j58K6j59J91k35N5L4J48
7348I3r7k44K02K20k9Nn75N21l12k21P33M6n75Q9o0L86k11l4L09l15O7R7R4l69
7372a80J25p3L03j61J3j3l7L99m66rL36m68J11MJ64k34K6J50J16m5l75J95N99
$$ y = [-58, -80, 127, 218, -235, -317, 23, -123, -47, 61, 43, 272, -174, -171, 235, 28, -130, 78, -147, -100, -133, 7, 211, 71, 189, 98, 25, -106, -2, 119, 43, -4, -163, 114, -185, 55, 69, 315, -33, 207, 181, 221, 94, -232, -125, 33, 43, 90, -68, 113, 7, -134, -320, 148, -46, -55, 256, -53, -131, 50, 29, -251, -41, -273, -107, -226, 151, 1, 185, 348, 0, -224, -29, 49, 144, 288, 240, 58, -68, 148, 195, 69, 68, 16, 156, -229, -267, -74, -201, -211, 21, 70, -104, -54, 158, 236, -194, -400, -195, 112, 193, -240, 32, 396, -53, -23, 279, 70, 7, 5, -87, -88, 106, -7, 235, 292, -224, -243, -56, -195, 26, -96, 99, 88, 118, 309, 29, 61, -62, 191, 33, 59, -100, 91, -144, -89, -55, 93, -4, -248, -46, 174, 145, 150, -425, 96, -216, -437, 296, 342, -233, -144, -204, 182, -29, -63, 246, -69, -2, 95, 189, -180, -55, -128, 175, 14, 27, 14, -23, 376, -90, -99, 237, -231, -120, -116, 48, -186, -160, -10, 106, 61, -314, -119, 480]
7395D80l42j90n1L81l45qq1Lq3r7L22J34K9k22M21o46K95j47R6l2j39M11k05m0
7419e6J03K05J09j79J51l41L48j49K7l44K7n4P7j36N5L87l03M71j41m47J39J8
7441c3M8n01K16K39l5l20K61M04n38L29kk68L87l06K5R3p0r9L18r5r7N6L3k1q3
7466e9J44M1j60r2M6K92k42J58k03p5J19J19j64q7m2J42o8J76j66k58L28J72l77
7489b56J9N05l03j18j9K26J89m34N2L30j41l74M21K85l06l16J42Q1j23M7j40K96
7511F3m6j62J74m9J12l5P6M22o98K98Q9j56j78J22J02r5N5k62J11k22M16j98J94
7534A33l77l4J92K60l61j3K08K9K6J10j34j0M08p36K25Q2l7J90l64L26j12J0j73
7557a52J13j64N35n19Q2K04L8j11m15M91l0j64l1m4J21K37l75j81L98j6k1L1K14
$$ y = [480, 138, -52, -103, 278, -67, -75, -156, -153, -236, -333, -11, 123, 152, -70, 351, -295, 0, -147, -51, -83, -222, 189, -16, -56, 47, 252, 361, 182, 333, -8, 340, 191, 218, -126, -99, -153, -76, -212, -157, 230, -73, 398, 257, -190, -51, -33, 15, -486, -270, -31, -66, -386, -125, 279, -259, 70, 68, -200, 187, -119, -94, -1, -71, -170, 148, 53, -44, 12, 45, 24, -59, 85, 126, -34, -126, -80, 212, -30, 128, -75, -150, -31, 88, -76, -163, -205, -63, -131, 45, -121, -379, -51, 121, -256, -237, 268, -35, -153, -172, 54, 243, -191, -139, 191, 50, -324, 97, 382, 76, -240, -98, -17, -140, -93, -233, 63, 17, -145, 29, -20, 92, 57, 133, 555, -143, 155, 244, 88, -90, 32, 134, 39, 94, -168, -57, -279, 137, -61, 133, -244, -278, -86, 174, -187, -200, 8, 37, 63, 173, 39, 29, 437, -299, -74, 8, -29, 161, -203, 123, 11, 21, -152, -39, -203, 332, -187, -105, 99, 137, 26, -389, 102, 72, -92, -123, -167, -46, 191, -184, -365, 33, 17, -4, 27, 241]
7580B41l70j43M48j26M7j97m7J96J51q8k61J9j01K09JJ07O1p3l2N6l5k51J56J09
7604G7j11n2R3j01K62k20J12M4j19J98L4O4n19K38N3J1j10J42k62P8K46j77n2
7627g1j13OK09j72M8OK35m6l89M96j69q8J6j75J44J55k23J93K26l64M4K29k06
7650ij2L0O3M6R7m49K76J15K3j73J76J46n52J4K32j9K2o8j64R9O4nL00l51j79
7675b78M67k78K4R9O9k77J95j48J22M2j07K00n5l12L63j92K0J00j25K24j22J30
7697A61j21K66k19N5j16Q3J91l72J9J70N8L2k03j42J14k07L91j97M5J31k56M26
7719C09m51K68j3J77m55Q1k12N71l41r8J16K68n76K74l6K45k02J75k80L47p6K9
7741A20j15j37j88L79J3l56L74l57O50n8n89M16k46M4j3j26J77k36K02J3M9j83
$$ y = [241, -129, -272, 176, 50, 97, -100, -147, 49, 200, 112, -149, -130, -231, -22, -21, 86, 147, 74, 42, 98, 63, -188, -32, 77, -34, -86, 7, -94, 168, -52, 60, 104, -15, 183, 217, 281, -238, 0, 53, 64, -46, 96, -166, -88, 158, -19, -71, -184, -178, 31, -141, -93, -87, 148, 102, -287, 209, 40, -48, -32, -207, -63, 92, -131, 62, 288, -76, -32, 197, -9, -21, 9, 72, 118, 215, -234, 42, 157, 180, 7, 183, 329, -223, -209, 23, 4, 26, -42, -206, -107, -43, -48, 252, -99, -278, 189, -89, -65, 34, 103, -174, 21, -127, -5, 37, -70, 130, 75, -237, 126, -66, -46, 54, -71, 153, 31, 161, 40, 306, 87, 142, 26, 109, 300, -72, -53, 117, 175, 207, 4, -138, -24, -231, 160, -37, 8, 139, -117, 309, -142, 126, 113, 290, -165, -84, -296, 275, -66, -164, -48, 220, -356, -82, -118, 127, -75, 100, -180, 167, 91, 120, 5, -132, -320, 59, 72, -284, 90, -267, 383, 325, -264, 152, -94, -50, -63, -189, -12, -248, -46, -33, 16, -167]
7763a67K56p8N0m36L83L16k21lj44R2J83l58j27J05l23O36J25l0j86j64L15k36
7785a2Q3k04N1o6j77K69J21r5J0J1k1M1j49J71J73l18n4R0L27j01r1j99k64K98
7809a06j02L54q4J00k08j4m0J17q8j62L80o1j3l05N53m84L1K24J02l11q4K86j10
7832b5k56K46k01L23l92M78j44m80O81j95J7j69J46k62K85j6J2n8p9l32J94M49
7854B22j33J35m76J67L07l54Q4J29m1j17R8l09L54J36k28K84l91M07j21l65K19
7875GJ66n1j47j61L13l24J75k32L21P3k02j74L47j04j5k6j21J52j9J27k29K26
7897A02k76K05J13L32l36J14k44q6J92L3o9N5l29J73q8J22k01K02k2j65M3M88
7919C58r8l72J10q0J91k47J19k06j4L9J40K80l81K91k38L32k90KK31j14j12k47
$$ y = [-167, 89, 11, 61, -375, 8, 324, 103, 100, -44, 48, 231, -127, -254, -149, -472, 164, 289, 259, 73, -91, 224, -12, 71, -133, -82, -148, -325, -56, 65, -30, -20, -9, -30, 11, -138, 33, 206, -112, -166, -76, 251, 150, 59, -140, -404, -106, -208, 146, 62, 162, -46, -60, -100, 17, -71, -233, 147, 86, 73, -232, 321, -163, -132, 92, 194, -117, -201, 85, -25, -281, -35, -236, 87, -305, 173, 29, -451, 230, 35, 52, -117, 29, -233, 52, 36, 48, -10, -89, -421, -227, 222, 89, 224, -252, -85, 222, -132, -48, 81, 40, -77, 21, -288, 66, 202, -26, 258, -133, 274, 153, -212, 7, 173, 122, -25, -186, 127, -197, -22, -254, 67, 140, -62, -236, 111, 7, -8, -34, -155, -3, -22, 105, -124, 102, -174, 31, 144, 476, 140, 254, 10, -76, 116, 149, 80, 135, -194, -21, -109, 13, -188, 14, -8, -173, -130, 358, 260, -112, -2, -82, 109, -138, -19, -225, -239, -200, -60, 220, -161, 130, -108, 224, -66, -64, 167, 53, -59, -306]
7941c06Q29k63m15K12m5J19l05L31k98K29j74K6k23N6J77j2J62k13j13p8O27o00
7963b77K3K40k25L77j74L26m72L22k25o3J47K04k61K02rk50Q8J91J91m62K55j13
7985C5j46j3p2L21j58j15J02J11o2j5j6O8J8Rk3q5k81L51J75l96P0K66l65M21
8009B00l57L2M29k69j02nk4O8K3l27L78O7%j89K0P0J64L57m53j31J5M4l70J12
8033b48J56N9J37j10K22m3l9k34J92k89L76l61J84O3K41p1l21K58k81J38k58L89
8055A60k19Pj2J95k36J72n5M12k00j37k13J30P0j42mM60o07K42J44o8p7mo6J66
8079A18m64K36J81k93J96j11J75j30L01j11j23n4K38p5J29l67L82J72l98J33k10
8100g5J40l20K51r6n9P3J47n4K88j12j09l9K8k97K79r1m33L46j16N24j84j78L
$$ y = [-306, 523, 260, -155, 57, 12, 131, -174, 157, -141, 88, -86, -60, -283, -227, -50, -62, 100, -113, -226, -304, 323, -277, -254, -14, -239, 138, -36, 290, -182, 140, -85, -148, -1, 203, -58, 144, 135, -115, -27, 164, 355, -107, 148, 35, -111, -124, -196, 125, -33, -148, -46, 65, 3, -12, -28, 40, 58, 67, 44, -41, -322, 29, 204, -192, -122, 144, -221, 200, -157, -125, 304, 35, -67, -72, -96, -28, -5, -332, 46, 113, 113, -76, -56, 14, 178, 535, 82, -49, -34, 10, -360, -248, -92, -33, 104, -6, 216, 173, 134, -100, 92, -197, 179, -182, 2, 65, 306, 235, -86, 172, -109, 29, -229, 160, -59, -52, -64, 131, -105, 67, 12, 424, 224, 87, -126, 4, 74, -68, -72, 388, -219, 23, 167, 99, 22, 18, -48, 118, -346, -110, 71, -222, -26, -137, 38, -92, 209, 98, -25, -79, 159, 84, 213, -154, 228, 400, 2, 135, -75, 65, -255, -4, -100, -159, -86, 61, 7, 295, 183, 74, 35, 63, -234, 45, -46, -479, -133, -249, 275, 91, -87, -84]
8123h4L15l47j02P9PJ51l6j05K33j82k71M19QM6j30K58k63j1j14K02k93J35k51
8146c36O50n91M17j41k13j75L61k18K54q2m7J16k05o5J26J62j6N6k85M79k19j1
8168A7o9j24L8K49j13j11L31j87N7M9p9pl6r5K04l39l9K34J94k32L57m29L11
$$ y = [-84, 231, -116, -218, -139, -132, 19, -17, -122, 111, -71, -342, 77, 85, 131, 1, 259, -4, -15, -129, 73, -220, -85, -336, 314, -277, 140, -1, -214, -389, -28, -246, 8, -74, -121, -5, -210, -275, -149, 13, -3, 53, -232, 247, 28, 17, -52, -176, -138, 111, -2, -113, 218, 31, 88, 137, 58, 51, 15, -80, 124, -215, -254, -20, 174, -58, 299, -130, 181]
8191A81
$$ Imaginary data points
##PAGE= N=2
##DATA TABLE= (X++(I..I)), XYDATA
0@%%%%%%%%%%qJ6j6J6j6K4l2L2m0M8n5O4p3Q7j01J15j31J48j67J89k13K41k72
33a44L04l38L76m19M67n16N70o33P02p77Q61r55J061j177J306j460J639j847K097
52A117k402K784l281L957m932O475r304J6177o2606r8518Q1969O8572O123j0311
66d180M7125L1302m566K616K3763k6025o3176l5801j899k3154j8677K2267J6320
79c4085l9376k0617N4599N1195l4213m9458J3633L4102k964Q310M8071K5307j9944
92C4560J0982N6063J7371m5759l1280N002k1556m4728K440L3908r593l6779J1485
105a7884M6553J0704j7182k362o981l3566q225L9230J3266m3192j4311M9510K9198
118D4758l4332k2543K2366q393o2809l2140K9800J5022k8751j0974K9852K5562
$$ y = [0, 0, 0, 0, 0, 0, 0, 0, 0, 0, 0, -8, 8, -8, 8, -8, 16, -16, 16, -24, 24, -31, 33, -40, 47, -54, 61, -70, 78, -89, 100, -113, 128, -144, 160, -178, 198, -221, 246, -270, 300, -333, 369, -408, 453, -502, 559, -618, 688, -772, 867, -980, 1117, -1285, 1499, -1782, 2175, -2757, 3718, -5586, 10591, -52015, -150533, -68564, 8, 6131, -4180, 42945, 74247, 69681, 72297, 96060, 70035, 6859, -28942, -30841, -53995, -72672, -50405, -34085, -73461, -94078, -39479, 11716, -22497, -71955, -58322, -24220, -27184, -18874, 29197, 54504, 34560, 45542, 101605, 118976, 73217, 41937, 46939, 25383, -19345, -16905, 17003, 7410, -29369, -17884, 28669, 39373, 22191, 19829, 12848, -20718, -28943, 10287, 23553, -19639, -33950, 15560, 44758, 10426, -12117, 10249, 1856, -60953, -93093, -63293, -48271, -77022, -87996, -58144, -32582]
130c2582J4189K9112J6599k7058k0526L2742K9586k3850j9744L5409L3183j5065
142E1995n351M1882J6836m9951m3807P211J911l5747k2639Q788o837j8383K3054
155c1038M4418n127l8625j698K5060p397k3666J1307K0077j1006m845M0249L6637
168E4346j2773j8351Q883m844l5800j1509K2520r514m7149l549N4888K8618k4092
181A674j1634J9293N66k2277K30J4654j3197k0495J6545L1933N616K076K2335
194D7319M8l8771j7460K8675N291m9750l2708K8023K9839p349q32K4614K911k5607
208e757j199K4085n582l0982m208J9645K038M32L0468K3986k3312k8367J6494
221A7741J9128k7320l7590l324K856j6362L243L3317Q572k6501k469L2455Q326
$$ y = [-32582, -18393, 10719, 27318, 260, -20266, 12476, 42062, 18212, -1532, 33877, 67060, 51995, 46644, 88526, 105362, 55411, 11604, 18815, 20726, -15021, -37660, -28872, -35709, -54092, -31038, 13380, 8253, -30372, -32070, -7010, -14407, -38073, -26766, -6689, -17695, -22540, 17709, 54346, 41573, 23222, 32105, 27261, -8539, -20048, 2472, -7042, -54191, -57740, -2852, 25766, 1674, -9960, 9333, 9899, -12378, -12148, 2506, -10691, -31186, -14641, 17292, 22908, 24984, 47319, 47367, 8596, -8864, 19811, 25102, -24648, -57356, -29333, 506, -6843, -7675, 16939, 19850, -5757, -6956, 17129, 11547, -19435, -23643, -3998, -1960, -1528, 28940, 52926, 29614, 1247, 17741, 36869, 9549, -28041, -31365, -28509, -44871, -41628, -8311, 261, -26240, -28709, 3746, 12072]
234A2072k6733o789J8149m699j9747K0110M3334O101k1805M008K2325l923j9131
247B3272m042r785l1393j2588K7318J6283k1311q975K7935J2568k2269p500K0088
260I601n546l7382q264L1855J6629j2071J993J9727J537q677J0906P240k8822
273a274k9966R982J8530j1820r998K2799J7096j4653n867K4753R037l0932k2111
286b4424J2394P019j1416O508K4128Q5j5568J4406K9817q021l4447q286J0264
299B459j1694j7191J2136J7661j0814j0853K1475J9537j2286j5280M769n439k2996
312b8516J324L0048N805k3112K111L5955J4552j8700p479Q454j3157k5584L168
325a5131J8074p029j7059R736J9072l173m315J3266j081l1518j6163K3316J4448
$$ y = [12072, -14661, -21450, -3301, -8000, -27747, -7637, 35697, 41798, 19993, 24001, 46326, 42403, 23272, 19230, 9445, -21948, -34536, -7218, 9065, -12246, -21221, 6714, 19282, -2987, -10487, 9601, 4055, -33327, -41591, -9736, 6893, -5178, -3185, 16542, 18079, 9402, 20308, 27548, -1274, -31240, -21258, -2728, -14548, -24546, -1747, 15349, 696, -5171, 19582, 28619, -2313, -24424, -12030, -5011, -16427, -9919, 14209, 14294, -1274, 13132, 42949, 34928, 481, -7805, 2459, -9235, -26426, -14290, 3371, -7443, -18296, 3179, 22716, 10430, -4850, -81, -5520, -28516, -27192, 2856, 8661, -14451, -12340, 23615, 38167, 19467, 11988, 20442, 7285, -18299, -15131, 2943, -4086, -21145, -11409, 7663, 4490, 175, 13441, 12360, -19158, -35321, -12005, 2443]
338B443j9569j0757K2991J8815m184N873J9302m958k8039n196J6350l964j9807
351a0700J437J4071n392p873J9702J6508k1738k8170N229J3591j2752j4188R610
364b0665R377o263Q976L0568J0097k0163p358J5587j580k1166k294J3348p971
377D93j9390J1698K9066j214k2670l072Q307r634j4244O630L582j6520m339K7772
391c535K1024r299m887J7746M136k1122n747J5991l206k6030m299K2936R146r943
405B911J497R718j0087j6029P495R112j8171k0064J2737J9870k910k592K0477
418A3964J2945j5344r563J5208N240k2032j3607R277L295r984O188J8297n120
431H764k0795K675J6401q507k3694m84J2895m420o134J9989K2836l848q046J3994
$$ y = [2443, -17126, -27883, -4892, 13923, 9739, 15612, 34914, 29956, 1917, -3279, 13071, 9107, -10700, -9263, 4808, -584, -8457, 11245, 27753, 6015, -22155, -16926, -3335, -16087, -30275, -20665, -11288, -17551, -8575, 21993, 32090, 11927, 4569, 20156, 18576, -2590, -4884, 8464, 493, -18897, -7199, 21867, 20653, -2017, -5089, 3218, -6416, -20660, -14030, -10448, -26968, -31307, -3535, 17489, 8190, 3303, 21049, 25185, 4063, -1684, 14307, 11101, -14929, -19228, 3708, 12854, 2911, 4408, 14126, 4039, -11990, -4495, 4617, -13554, -33618, -20881, -1011, -3921, -6513, 13964, 26909, 11565, 2002, 17210, 22450, 418, -13189, -3912, -617, -10601, -4413, 13884, 8764, -12031, -9356, 7045, -1462, -25156, -25640, -12745, -17165, -23299, -3310, 19526, 15678, 7632, 21626]
445B1626J1893j2076j1389M787m266k1022j545K1568M247k1014n931J6328P34
458C940j9198n005Q313r403j6317J0230K3483M113n297J3651J6559n116n394J3096
472B7655K439k5197j6285J4893J1854j4034r889J2647L767j4709k190J1817o970
485d202k3890l723J6460L486n928J1655J9145k405o609J6688J6432j4389k2667
498E3K176Q024r869r037R660L594j4069l085J6681K821k0134r613R762Lj2318
513b5351P272K2548K055j0893J0767K5107R77j5562k181L950j1749j2042O833
526A731M982j5584r242J5061R738j2434q669R900k77j8502k744J9060N996j2850
540a3834K796K1949Q497o570M142Q726j0968j7264L935R090j2503j5772Q957J3310
$$ y = [21626, 33519, 21443, 10054, 14841, 10575, -10447, -11992, 9576, 13823, -7191, -13122, 3206, 3940, -15258, -20263, -11950, -21353, -37670, -27440, -3957, 156, -5141, 8510, 25069, 19953, 14559, 27655, 30094, 4897, -11388, 3505, 15359, 1325, -8564, 4083, 7850, -6859, -9049, 2768, -4202, -28092, -31815, -15355, -11869, -17797, -6142, 13003, 10598, 3989, 20677, 37109, 22720, 53, 2229, 10253, 384, -8653, 1007, 4601, -9468, -12553, 4128, 6949, -13185, -22798, -13036, -13033, -25351, -18079, 4469, 6524, -4369, 6398, 31505, 32482, 16920, 14739, 18689, 6940, -5102, 1731, 6713, -8871, -18113, -3052, 6686, -5748, -14417, -4517, -4794, -23296, -26040, -6980, -984, -13834, -11038, 10911, 19408, 12838, 16980, 25706, 14738, -2526, 1409, 10499, -2004, -17776, -8819, 4491]
554D491o419n997J2532O877j6321j0927J1738O362j2807l442J4489N402p042P741
568F677J8291l575k0169j356J1428p652j9062P44J1249n858r334J1997J5276p226
582A430j1418O748N850j1000m730J2612L795j1685K866K3604Q591j3192k818J2060
596B2713k954j8409l475R047p854j6363L459J4778j860r593N541O542j2057r715
610b0200J0459P103j3816p824J6851J5157m360J46J5105L567j2999k062J1755
623A8882l486j8603j961J2163j625j0519O960J2138r594j6134N753J0647j0578
636e957j6203M342J0084l757r21J4972Q069r653k074J4573K668j5538n066R659
650E198k570j4233N045J7379k109j5820K689J4743l403j4355J032O705p659o781
$$ y = [4491, -1928, -7925, 4607, 11484, -4837, -15764, -4026, 2336, -10471, -13913, 576, 5978, -1064, 6677, 24968, 21393, 1224, -132, 11296, 3644, -15418, -14674, -3425, -9283, -18617, -6620, 8656, 1430, -9988, -3240, 2610, -8390, -13120, -508, 3287, -8398, -5532, 18072, 26663, 13471, 10653, 22713, 19759, 1350, -2125, 6922, -932, -17295, -13836, 942, -918, -10511, -4970, 1572, -10485, -20200, -9741, -2638, -16454, -24278, -7427, 7730, 3370, 3516, 18621, 22188, 9189, 7127, 18882, 15396, -3207, -5168, 6995, 5370, -5149, 1811, 13949, 4355, -11779, -6026, 4621, -5957, -22160, -17818, -7734, -11491, -12412, 2560, 10629, 976, -1098, 13475, 16143, 605, -4461, 5198, 2628, -11605, -6560, 10819, 8710, -7110, -4421, 10322, 6919, -7436, -6404, 301, -7358, -14139]
664a4139J2860J3345o995n592J3156P907j1265p887P441k536j8351n117J3522
677c651K319j2761n56J4326K70j0985L975J0336p677j2510Q013J6387k966p380
691b860J1593J3818n446p145Q090L471j5369j2126O051J571j1665l090J1060L91
705a656j1137K943J4256m193j6710J321J4097k374j0743P583J6116j586q040R607
719I484J1424p915j1585L831K825j2257o276J0682L113j1991n50J4970L340j3010
733c915j969J0905k982j3573K307J4078j748j0536O552J3840l439j0273N259O137
747A0643j2098j1615P183P793r657o627J0945Q633o688j164J0946L25j3171j162
761e714J1338q47j1935L190J3504k609j0311P415J2324q682j5483L116J0064p167
$$ y = [-14139, -1279, 12066, 5071, -521, 12635, 20542, 9277, 1390, 8831, 6295, -12056, -17173, -3651, -1332, -14093, -14649, -323, -53, -11038, -7063, 3273, -4404, -16914, -8901, 7486, 4520, -2860, 8733, 22551, 17105, 9960, 18050, 21521, 6152, -5974, 77, 1648, -10017, -13107, -2047, -1656, -12793, -9850, 4406, 213, -16497, -15176, -1079, -3453, -14196, -6613, 9503, 7917, -123, 9484, 20908, 12993, 1408, 5239, 8064, -4193, -10469, 213, 3326, -8665, -9215, 5755, 9095, -3915, -5884, 5021, 2039, -11534, -9227, 4851, 3103, -7433, -881, 12959, 9520, -753, 4506, 10643, -1455, -13070, -5887, 1906, -7751, -14378, -3433, 5200, -1488, -2652, 8294, 8619, -4552, -5714, 5624, 4777, -7158, -3968, 9536, 6927, -3384, 4031, 16355, 7673, -7810, -4694, 5370, -1797]
775a797j1073N808Q123n429k870J0995N699j0760m400R715M18j1753j282J1339
789B733o50j0784M577J5917j152j3554K068J0864n313j2304L323Q239o582p599
803a0217J0131J0515p435p289Q904M326j1142n504Q938J247j1904o60J3782K903
817F595r729J590J1116l031j1956L330R375p602j2715O598J3324n088r214Q224
831H17R318q142q462P037N272r990o091R381M695p842J186J1633L60j0822K113
846D63J0700m822j3817J688J1435m160j1393O047J1360m857r915O089P697q198
860a683q547O467N968q488l030J1575N430q339j245J1205J424j2086r61R408k797
875D301j1526K632J1261l021r790N216R711o526j0218O111P337r899q600Q999
$$ y = [-1797, -12870, -7062, 1061, -4368, -7238, 3757, 9456, -1304, -5704, 4011, 4429, -7324, -8606, 2733, 2083, -8701, -4124, 11793, 10641, -2913, -845, 10019, 4706, -7598, -4275, 3964, -2618, -10217, -86, 10429, 2994, -4295, 4609, 8935, -2207, -7711, 1227, 2474, -9430, -10090, 3692, 6595, -3134, -1544, 9572, 6541, -5415, -2085, 7290, -312, -13027, -6429, 6895, 1807, -7407, 817, 10135, 1993, -6469, 568, 5840, -4150, -10241, -860, 3835, -4007, -2821, 8812, 9172, -1650, 463, 11163, 6341, -7476, -5788, 5647, 1487, -9906, -3859, 7501, 2644, -7271, -1182, 6515, -1683, -10230, -3763, 2205, -6283, -9313, 2262, 7692, -647, -1892, 9313, 10737, -1349, -2310, 7098, 4301, -7225, -4593, 6668, 3647, -6143, -927, 8784, 2258, -7960, -1849, 5488, -4411, -13011, -4012]
889d012Q566p059m971J0339N566q614k890R302J26j0585o29R871j232r595M792
904a025J0106m054j1202N581J0199p521j2821M894R469n821q217Q313P586o559
918a072m533R437M638r414m096Q516J286j0064N92J0960q19j0314K572J1246l141
933E794j1321J986Q436n403q902O301Q497o457o897R462Q106q339o498Q044M767
948G576j0157m394R200K682r408j267R884R23r106R14Q480m075r953M557R487
963E343n687q940P745J0912n646q317P866P499q301p086P060M568q797m950Q497
978A766K664r277q88R393j712j0372J431J0190k913j0392M226J1262k747q114
992e483O442R752n547p574O283O397q505o504P634M704r697m730R283L237j0364
$$ y = [-4012, 4554, -2505, -7476, 2863, 8429, -185, -3075, 6227, 6353, -4232, -4861, 5010, 3778, -5817, -1025, 9081, 5027, -6175, -594, 9605, 2084, -10737, -5843, 3626, -2195, -10412, -2099, 5487, -1072, -5605, 3832, 8470, -944, -5040, 3476, 4762, -5302, -4710, 6250, 5431, -4883, -2311, 8935, 5794, -5527, -3541, 4895, -508, -9410, -3109, 5388, -1069, -7966, 1496, 9602, 1263, -5235, 2809, 7576, -2581, -6975, 2225, 4907, -4501, -5768, 4116, 5039, -4067, -3153, 5327, 1252, -8701, -4144, 5343, -344, -9284, -1539, 9373, 3727, -4590, 3276, 10775, 2474, -4612, 2448, 7016, -1781, -6731, 1766, 4430, -4847, -5735, 3658, 1946, -8426, -6995, 3195, 282, -10110, -5884, 5378, 2631, -5483, 959, 10711, 5164, -2410, 3873, 10270, 1765, -4739, 2895, 7599, -2098, -6828, 2455, 5692, -4672]
1007d672k494Q834L02r994j12R829j105q605M078R889l414p309O190Q267p102
1022B582q051P394P721q224p530Q261O089q157n308Q056K972r151l551Q366R26
1037B395r108K87Q831j518q276L907J0069m075r385N544R250n008q720N675Q297
1052H165o766o656P537N285q450n071Q254L111r492l076R135R37r042L59J0263
1067D493l53r833K251R965k148q542L612P970n308o989O025O430q107p477P421
1082e90N931q837n608Q395M585r224k419R539L146q298k37R411R26p447J690Q452
1098I415l119r048M416P457o743r686M590P079p375q370O373O204p163m963Q485
1113b448N332o769k185R739L571p122L02R730k9q855J572Q780l624j0429J212
$$ y = [-4672, -7166, 1668, 1970, -8024, -8136, 1693, 588, -8017, -3939, 5950, 2536, -4773, 1417, 9684, 2582, -5469, 1925, 9646, 1422, -6108, 2153, 8242, 85, -5223, 2833, 5805, -3346, -6897, 1469, 2395, -6713, -6426, 2405, 887, -7389, -3482, 6587, 2512, -6873, -1329, 7921, 2913, -5807, -132, 8165, 1399, -5257, 2280, 7565, -885, -5956, 2298, 5409, -4083, -7159, 1976, 2913, -6129, -5770, 4493, 4140, -5693, -3442, 6523, 4375, -4167, -555, 7415, 2107, -4882, 1143, 7573, -534, -8011, -590, 5341, -3496, -9104, -709, 3876, -5348, -7767, 1772, 4918, -3380, -3617, 5794, 6720, -727, 963, 9415, 6296, -2752, 1664, 9121, 2378, -7308, -2718, 4361, -3014, -11384, -5011, 1193, -5970, -10933, -2448, 2884, -3885, -6070, 3669, 7240, 118, 420, 10150, 10121, 1266, 2838, 11618, 7994, -2435, -1223]
1128a223O997n641r864L372O237o318o385P207O362o349l694R377N976o984k389
1143c319R904L447q437j118R464L96r927m68O635l076r370J177O445n497p829
1158a1573N424Q285n671o244Q272Q095o394n014Q222N657p277m075Q061K941q643
1173F6k423P463l17r024j113O821k646r340L181Q528l060p132N753R290k932o002
1189b887O084O615o217n283O625M400q076m744P451K203q742k932P235n88r758
1204h614p78Q390p46q169K405R529l51n831N195P728m221o219O241N754p517o443
1220c647O643N136p648m831O907K882r167l565P069R79q691j350Q275K94o169
1235f883L705Q814k196p062N081P661m980p807M870O460n761n933P112N099p499
$$ y = [-1223, 5774, 133, -9731, -6359, -122, -6440, -12825, -5618, 744, -5605, -9299, 78, 6054, -930, -3319, 6585, 10032, 1595, 477, 9941, 10337, 410, -58, 6577, 3501, -5869, -4692, 1753, -3744, -11573, -6149, 2136, -3535, -9779, -1507, 6588, 194, -4820, 3402, 9059, 1782, -2293, 5768, 8709, 66, -2357, 5106, 4789, -4235, -5348, 1473, -1173, -10513, -7332, 1196, -1864, -8996, -3243, 6047, 3115, -2887, 3197, 9812, 3595, -1688, 4937, 9337, 1261, -3483, 3968, 6171, -2571, -5503, 1732, 1144, -8614, -9392, -1002, -1748, -9917, -7512, 2017, 1666, -4165, 1030, 8758, 4537, -1682, 4559, 10313, 2796, -3647, 2996, 8132, 484, -4347, 2560, 5442, -3725, -7290, -221, 758, -7933, -9283, -1008, -714, -6883, -3178, 5636, 3440, -3622, 1459, 9120, 4140, -3667, 1203, 7663, 1902, -4031, 3081, 8180, 681]
1250F81n147O620K480q548m088O811P86p760N68R148N34p367K422R126k140p338
1266c212K464O952l625o721N381O236m941n616O358M993p628n970O505K301r227
1281e750l509P780K702p448j29Q782J282o792Q71P785j755p491K964O889l445
1296B736o655N671O730n860o543N432N050q236o741N805L849p481k485Q430L664
1311C366o198j17Q198J355p852L38O714k143p543K674P838l311p529L901O379
1326F070n401p201M034L578p225m600P936M918n812j734R066M592o695r82P547
1341H091l89q715o91P806j012q238J485O279k237o860K733M369o621o983N323
1356e660N896o142m125Q393O589m561k149Q738K851q441l039P268J293p913j032
$$ y = [681, -4466, 2154, 4634, -3914, -8002, -1191, -405, -8165, -7597, 1551, 2085, -5282, -2860, 6266, 4126, -3212, -748, 6204, 2579, -4142, 1239, 7475, 2534, -3082, 3276, 8269, 641, -5329, 1176, 3477, -5750, -9259, -1479, 1223, -6225, -6354, 2428, 3710, -3082, -2211, 5574, 3819, -3672, -708, 6181, 2736, -3919, 1752, 8482, 2622, -3921, 1511, 6561, -1675, -8416, -2611, 1238, -6243, -8728, -298, 3366, -2832, -2949, 5249, 6604, -1248, -910, 5804, 3661, -3882, -1208, 6630, 3319, -4210, -309, 6070, 669, -6532, -2498, 1080, -6145, -10745, -2809, 2109, -3703, -5437, 3629, 8221, 1526, 544, 8091, 7702, -1013, -1704, 6102, 5090, -3148, -1663, 4616, 2379, -4481, -1748, 2621, -4000, -10983, -5660, 236, -5906, -10031, -1638, 4951, 390, -1759, 6979, 9830, 1389, -1650, 5618, 6911, -1002, -2034]
1371b034O325m37o691K279O232m256q527K244O051m844o237M653O534l816l117
1386e641Q017O259o747m095O145K684p564l013O808P32p201K91Q756J22p837j48
1402b432O383k882p033K009N723m264m978O222P006l889m474O084L893p573m474
1417d679O231K607q866k466Q288L495o591n67P224k13p200p7N929k810o854K526
1433d023O973k308m298N720N884n207n719N182L638p215n592N574L569n841j229
1448d892P771K972p173j898O735l01p991j87N666j300n554L993P974j704o077
1463a966L626N375m922n772L777L046o358l634P723M702o488k831P466J997p539
1478a798k786O302q52q490O47Q190J206n587K129O704j712n456L457L788o021
$$ y = [-2034, 4291, 3854, -2837, -558, 5674, 1418, -7109, -4865, 1186, -3658, -9895, -5242, 1292, -2524, -5641, 2376, 8635, 1888, -2207, 3938, 6622, -942, -3955, 2853, 3585, -3616, -3325, 5431, 5553, -2284, -2432, 3951, 1069, -5964, -3955, 1768, -2496, -7474, -1252, 5754, 1865, -2609, 3475, 7368, -205, -4679, 1552, 4159, -4707, -7173, 1115, 4610, -1981, -2548, 4676, 4463, -2737, -2814, 3115, 305, -6549, -4023, 2950, 642, -3656, 2064, 7948, 2741, -2978, 2204, 5842, -1373, -6965, -1391, 2178, -3663, -4892, 2879, 5851, -1322, -3220, 3515, 3214, -4777, -4964, 702, -598, -6152, -2159, 5815, 4111, -1966, 1660, 7035, 2113, -3659, 118, 3164, -3194, -6828, 895, 5597, -891, -3722, 3744, 5741, -1798, -4584, 1718, 866, -7624, -6977, 1213, 2419, -3168, -1039, 5665, 3953, -1503, 1954, 5742, -279]
1493b79o593N180O108m926l134O328M595o556k844O533O82r296l965O688K320
1508H41n891J02P081O0n516K982O843l542p728J239N866l029m160N339N599m333
1524A753l410P120L867p560n314L963J552p204j204O884Q94o250P45Q190P55p180
1540b399q77N018k245n627K791O146k377l765N308O317l855m112L696J504p600
1555b077m240O429K320p553k191Q315L111n669p40N761j083p306M14O444j409
1570E26n494L193O748j071l542M364M006o121o558M146K029o163m213N509L311
1585F70m810l79P766K167p501j815O067J15o246Q11O176l96m696L851O974k485
1601F269o813J187L239n077n163K967K826n190k227P856M702m960j966N851J077
$$ y = [-279, -6872, -1692, 4416, -510, -3644, 2684, 7279, 723, -2121, 4412, 5094, -4202, -8167, -1479, 841, -5050, -4948, 2133, 2193, -3323, -341, 6502, 2960, -4768, -3529, 2337, -692, -4852, 487, 6086, 1753, -1657, 5463, 9330, 1770, -3544, 419, 1971, -5233, -6437, 447, 1341, -4909, -4164, 4026, 4781, -2399, -3276, 1742, -503, -6130, -3339, 2807, 430, -3335, 1973, 8290, 4435, 323, 4019, 5523, -2077, -6317, 112, 2432, -5121, -7312, 1003, 4114, -1555, -2295, 3466, 2383, -4923, -4509, 1935, 526, -4968, -1775, 4973, 3902, 360, 4724, 8730, 2609, -3949, 197, 2226, -3937, -8150, -2641, 670, -4140, -4519, 3247, 5414, -2087, -3902, 2165, 2280, -3966, -3155, 3021, 2625, -2071, 1780, 8754, 6269, -544, 643, 3882, -1195, -6358, -3391, -565, -5755, -7982, -126, 4576, -384, -2350, 3501, 4578]
1616D578o721r34O064j06o677P80Q310J381n274M84M131l854o528J631L494n771
1632e012n443M830O490k546j675O019L118n655k424O196J549p720k327O948K207
1647D555l919R33N924j846p474N82N045l668q117L78N196k238k385N796N060m292
1663d70l125N655L728n939l567L883J868m648P32P921J618o917o40O545j37p850
1679a343j916L821l266n048L733O462k530m108L681M889l181m026L285J210o383
1694d720k015P143M161m675j524O831J700n294j067M002k282p854j92O298j59
1709C53m800K455N553j533l662L800L445n848n529L477L849l319j954N714L192
1724E193m452j064O217R2q223l123M397p09n280J130O295l86m359L499O965j582
$$ y = [4578, -2143, -3077, 2987, 2881, -3796, -3016, 5294, 6675, 1401, 1885, 6016, 2162, -4366, -2735, 759, -5012, -10455, -5625, 865, -1681, -3356, 2663, 5781, 126, -2298, 3898, 5447, -2273, -4600, 2348, 4555, 636, 1569, 7493, 5647, -1827, -1245, 3800, 132, -7985, -7607, -2411, -4649, -7034, -1238, 3822, -470, -3595, 2060, 5788, -151, -3718, 165, 2033, -2615, -1883, 6038, 7656, 739, 99, 6644, 6507, -1343, -3259, 562, -2704, -7752, -4019, 2443, -87, -4195, -514, 4375, 1194, -2832, 453, 1663, -4720, -6735, 408, 4569, -106, -1630, 5201, 6901, 1607, 540, 4542, 2260, -5594, -5786, 512, 353, -4447, -1992, 3561, 2028, -1634, 2166, 5611, -237, -5766, -2289, 1560, -1759, -3713, 2001, 5193, 741, -323, 5894, 5986, -2237, -5360, -963, -1672, -6952, -5822, 473, 87, -4272, -773, 6192, 4610]
1740D610o290J167L409l401k931M994L799l998k028O122L311o209l604K544j638
1755a43p270j062O041n9n402J222P934J516l844J525L390k932m767L531N820k862
1771B638l842M089N045k704k391L276l73q290m197M341J189o142j412N899J805
1786a069k342K437O063j716o774J361N911j354n228J761M481j166j997M501L490
1801H359o106n537K907J828n062l729L964J157l894K232Q163J394n679j002N295
1816D290m65n086J16L814k569m336M326O096k021m922J237K262m237m056L322
1831b229R10n490j432P355M568l292o39N254N32m951j25M124k269o504O85O119
1847B616J93l657J645L818l701m328K496K850n305n008L691M284j553Q4N523J565
$$ y = [4610, -1680, -513, 2896, -505, -3436, 1558, 5357, 1359, -669, 5453, 8764, 2555, -1049, 1495, -143, -7413, -8475, -2434, -2493, -7895, -6673, 1261, 2777, -1067, 458, 3848, 916, -3851, -320, 5500, 2638, -1204, 2885, 7930, 5226, 2835, 6111, 5738, -2552, -6749, -2408, -1219, -7361, -8773, -2874, -1069, -3411, -974, 5089, 3373, -3401, -2040, 3871, 2517, -2711, -950, 3531, 2365, 368, 4869, 8359, 2253, -3284, -377, 1451, -3611, -7340, -3376, -2219, -6113, -3881, 4282, 5676, -3, -1005, 4290, 3825, -1261, -1145, 2669, 100, -4236, 90, 6186, 4165, -757, 480, 2742, -1495, -5551, -2229, -1319, -6809, -8241, -886, 3682, 390, -249, 5005, 5537, 586, 461, 4585, 2316, -4188, -3503, 2616, 2809, -848, 797, 4615, 914, -3414, -918, 1932, -3373, -8381, -4690, -406, -1959, -1875, 3648, 5213]
1863E213m157j029N335j76p073k211M124J40l664K250N900j040n292J520M488
1878D328k733o418O04K612k651j013N032M320l160k031M876K356m540k967L001
1893A616q40n341Q46O878P57m811J48M921m47m627J55J988m580m394L209N709
1909A187j942k610L571M069k921j579L716K59o377k536N311K808l793k37M736
1924C662L39l702J399M220l513p523k82M683o04l464K432L769j627j633M224L446
1940E826m747m866K263K238l257m27M485R32l847J059O148Q48o201k352K501j367
1956g64m059J430M317j729l456L668O272j567m285Q44J225l957k247L904K097
$$ y = [5213, 1056, 27, 5362, 5186, -1887, -4098, 26, 166, -3498, -1248, 4652, 3612, -1680, -160, 4328, 1595, -4823, -4219, -1607, -4258, -5271, -239, 4081, 921, -1110, 3766, 6122, 1582, -1385, 1616, 776, -4565, -3719, 3159, 3916, -895, -747, 4174, 3727, -900, -745, 1243, -3337, -7731, -4522, 1187, -755, -3365, 206, 4275, 1354, -225, 3491, 3750, -2627, -5163, 148, 2956, -837, -1074, 3662, 4001, 299, 1698, 5918, 2405, -5118, -5400, -717, -1321, -4785, -2353, 1416, -211, -1844, 2380, 5826, 1079, -3787, -1524, 714, -2543, -2970, 1515, 2447, -1400, -341, 5807, 6655, 454, -1898, 603, -764, -4823, -3393, 924, -805, -4261, -593, 5679, 4112, -173, 671, 1896, -2061, -4308, -404, 1693]
$$ [...]
8191d19
##END NTUPLES=NMR FID
##END=
