##TITLE=1H_CA-8417-2
 CDCl3, 8 sc, 
 16.1.2019
##JCAMPDX= 6.0         $$ Bruker NMR JCAMP-DX V2.0
##DATA TYPE= NMR FID
##DATA CLASS= NTUPLES
##ORIGIN= UXNMR, Bruker Analytische Messtechnik GmbH
##OWNER= root
$$ XWIN-NMR		Version 3.5
$$ Wed Jan 16 15:14:30 2019 Russian Standard Time (UT+4h)  she@DPX200
##.OBSERVE FREQUENCY= 200.1313
##.OBSERVE NUCLEUS= ^1H
##.DELAY= (6, 6)
##.ACQUISITION MODE= SIMULTANEOUS
##.ACQUISITION SCHEME= undefined
##.AVERAGES= 8
##.DIGITISER RES= 18
##SPECTROMETER/DATA SYSTEM= spect
##.PULSE SEQUENCE= zg30
##.SOLVENT NAME= CDCl3
##.SHIFT REFERENCE= (INTERNAL, CDCl3, 0, 15.7039)
##AUDIT TRAIL= $$ (NUMBER, WHEN, WHO, WHERE, WHAT)
$$ ##TITLE= Audit trail, XWIN-NMR		Version 3.5
$$ ##JCAMPDX= 5.01
$$ ##ORIGIN= Bruker BioSpin GmbH
$$ ##OWNER= she
$$ F:/spectra/data/she/nmr/H-F/1/audita.txt
$$ ##AUDIT TRAIL=  $$ (NUMBER, WHEN, WHO, WHERE, WHAT)
(   1,<2019-01-16 15:13:40.92 +0400>,<she>,<DPX200>,
      <created by zg, POWCHK disabled, PULCHK disabled
       configuration hash MD5:
       00 E9 B6 7A A2 85 ED C7 34 08 36 98 17 FE 4E 26
       data hash MD5: 16K
       EE 4B 18 AD 76 F3 E7 CA 1E B2 A5 CB E8 E5 31 D0>)
$$ ##END=
$$ 
$$ hash MD5
$$ 13 86 89 57 29 9A 2C 1B 34 4E E9 DA C7 E9 F4 E2
##$RELAX= 
##$RELAX= 
##$RELAX= 
##$RELAX= 
##$RELAX= 
##$RELAX= 
$$ Bruker specific parameters
$$ --------------------------
##$DU= <F:/spectra>
##$EXPNO= 1
##$NAME= <H-F>
##$PROCNO= 1
##$TYPE= <nmr>
##$USER= <she>
##$AMP= (0..31)
100 100 100 100 100 100 100 100 100 100 100 100 100 100 100 100 100 100 
100 100 100 100 100 100 100 100 100 100 100 100 100 100 
##$AQSEQ= 0
##$AQ_mod= 1
##$AUNM= <au_zg>
##$AUTOPOS= <>
##$BF1= 200.13
##$BF2= 200.13
##$BF3= 200.13
##$BF4= 200.13
##$BF5= 200.13
##$BF6= 200.13
##$BF7= 200.13
##$BF8= 200.13
##$BYTORDA= 1
##$CFDGTYP= 0
##$CFRGTYP= 5
##$CHEMSTR= <none>
##$CNST= (0..31)
1 1 145 1 1 1 1 1 1 1 1 1 1 1 1 1 1 1 1 1 1 1 1 1 1 1 1 1 1 1 1 1 
##$CPDPRG= <>
##$CPDPRG1= <>
##$CPDPRG2= <>
##$CPDPRG3= <>
##$CPDPRG4= <mlev>
##$CPDPRG5= <mlev>
##$CPDPRG6= <mlev>
##$CPDPRG7= <mlev>
##$CPDPRG8= <mlev>
##$CPDPRGB= <>
##$CPDPRGT= <>
##$D= (0..31)
0 1.2 0 0 0 0 0 0 0 0 0 0.03 0 0 0 0 0 0 0 0 0 0 0 0 0 0 0 0 0 0 0 0 
##$DATE= 1547637220
##$DBL= (0..7)
120 120 120 120 120 120 120 120 
##$DBP= (0..7)
150 150 150 150 150 150 150 150 
##$DBP07= 0
##$DBPNAM0= <>
##$DBPNAM1= <>
##$DBPNAM2= <>
##$DBPNAM3= <>
##$DBPNAM4= <>
##$DBPNAM5= <>
##$DBPNAM6= <>
##$DBPNAM7= <>
##$DBPOAL= (0..7)
0.5 0.5 0.5 0.5 0.5 0.5 0.5 0.5 
##$DBPOFFS= (0..7)
0 0 0 0 0 0 0 0 
##$DE= 6
##$DECBNUC= <off>
##$DECIM= 32
##$DECNUC= <off>
##$DECSTAT= 4
##$DIGMOD= 1
##$DIGTYP= 9
##$DL= (0..7)
0 120 120 120 120 120 120 120 
##$DP= (0..7)
150 150 150 150 150 150 150 150 
##$DP07= 0
##$DPNAME0= <>
##$DPNAME1= <>
##$DPNAME2= <>
##$DPNAME3= <>
##$DPNAME4= <>
##$DPNAME5= <>
##$DPNAME6= <>
##$DPNAME7= <>
##$DPOAL= (0..7)
0.5 0.5 0.5 0.5 0.5 0.5 0.5 0.5 
##$DPOFFS= (0..7)
0 0 0 0 0 0 0 0 
##$DQDMODE= 0
##$DR= 18
##$DS= 0
##$DSLIST= <SSSSSSSSSSSSSSS>
##$DSPFIRM= 0
$$ [...]
##$SUBNAM2= <"">
##$SUBNAM3= <"">
##$SUBNAM4= <"">
##$SUBNAM5= <"">
##$SUBNAM6= <"">
##$SUBNAM7= <"">
##$SUBNAM8= <"">
##$SUBNAM9= <"">
##$SW= 20.0189088683792
##$SWIBOX= (0..15)
0 0 2 0 0 0 0 0 0 0 0 0 0 0 0 0 
##$SW_h= 4006.41025641026
##$TD= 16384
##$TD0= 1
##$TE= 0
##$TE2= 300
##$TE3= 300
##$TEG= 300
##$TL= (0..7)
0 120 120 120 120 120 120 120 
##$TP= (0..7)
150 150 150 150 150 150 150 150 
##$TP07= 0
##$TPNAME0= <>
##$TPNAME1= <>
##$TPNAME2= <>
##$TPNAME3= <>
##$TPNAME4= <>
##$TPNAME5= <>
##$TPNAME6= <>
##$TPNAME7= <>
##$TPOAL= (0..7)
0.5 0.5 0.5 0.5 0.5 0.5 0.5 0.5 
##$TPOFFS= (0..7)
0 0 0 0 0 0 0 0 
##$TUNHIN= 0
##$TUNHOUT= 0
##$TUNXOUT= 0
##$USERA1= <user>
##$USERA2= <user>
##$USERA3= <user>
##$USERA4= <user>
##$USERA5= <user>
##$V9= 5
##$VALIST= <valist>
##$VCLIST= <CCCCCCCCCCCCCCC>
##$VD= 0
##$VDLIST= <DDDDDDDDDDDDDDD>
##$VPLIST= <PPPPPPPPPPPPPPP>
##$VTLIST= <TTTTTTTTTTTTTTT>
##$WBST= 1024
##$WBSW= 4
##$XGAIN= (0..3)
0 0 0 0 
##$XL= 0
##$YL= 0
##$YMAX_a= 569449
##$YMIN_a= -646184
##$ZGOPTNS= <>
##$ZL1= 120
##$ZL2= 120
##$ZL3= 120
##$ZL4= 120
##$ABSF1= 10
##$ABSF2= 0
##$ABSG= 5
##$ABSL= 3
##$ALPHA= 0
##$AQORDER= 0
##$ASSFAC= 0
##$ASSFACI= 0
##$ASSFACX= 0
##$ASSWID= 0
##$AUNMP= <proc_1d>
##$AZFE= 0.1
##$AZFW= 0.1
##$BCFW= 1
##$BC_mod= 2
##$BYTORDP= 1
##$COROFFS= 0
##$CY= 11.3945322036743
##$DATMOD= 1
##$DC= 2
##$DFILT= <>
##$DTYPP= 0
##$F1P= 18.9103706918063
##$F2P= -1.10871071338519
##$FCOR= 0.5
##$FTSIZE= 0
##$FT_mod= 4
##$GAMMA= 1
##$GB= 0.15
##$INTBC= 1
##$INTSCL= 1
##$ISEN= 128
##$LB= 0.24
##$LEV0= 0
##$LPBIN= 0
##$MAXI= 10000
##$MC2= 0
##$MEAN= 0
##$ME_mod= 0
##$MI= 1.114404
##$NCOEF= 0
##$NC_proc= 0
##$NLEV= 6
##$NOISF1= 3.799351
##$NOISF2= 2.8
##$NSP= 1
##$NTH_PI= 0
##$NZP= 0
##$OFFSET= 15.70392
##$PC= 1
##$PHC0= -9052.419
##$PHC1= 11.60004
##$PH_mod= 1
##$PKNL= yes
##$PPARMOD= 0
##$PSCAL= 0
##$PSIGN= 0
##$REVERSE= no
##$SF= 200.130013532006
##$SI= 16384
##$SIGF1= 3
##$SIGF2= 2
##$SINO= 400
##$SIOLD= 16384
##$SREGLST= <1H.CDCl3>
##$SSB= 0
##$STSI= 0
##$STSR= 0
##$SW_p= 3612.71676300578
##$SYMM= 0
##$S_DEV= 0
##$TDeff= 0
##$TDoff= 0
##$TI= <>
##$TILT= no
##$TM1= 0
##$TM2= 0
##$TOPLEV= 0
##$USERP1= <user>
##$USERP2= <user>
##$USERP3= <user>
##$USERP4= <user>
##$USERP5= <user>
##$WDW= 1
##$XDIM= 8192
##$YMAX_p= 0
##$YMIN_p= 0
$$ End of Bruker specific parameters
$$ ---------------------------------
##NTUPLES= NMR FID
##VAR_NAME=  TIME,          FID/REAL,        FID/IMAG
##SYMBOL=    X,             R,               I
##VAR_TYPE=  INDEPENDENT,   DEPENDENT,       DEPENDENT
##VAR_FORM=  AFFN,          ASDF,            ASDF
##VAR_DIM=   8192,          8192,            8192
##UNITS=     SECONDS,       ARBITRARY UNITS, ARBITRARY UNITS
##FACTOR=    0.0002496,     1,               1
##FIRST=     0,             0,               0
##LAST=      2.0444736,     0,               0
##MIN=       0,             -646184,         0
##MAX=       2.0444736,     569449,          0
$$ Real data points
##PAGE= N=1
##DATA TABLE= (X++(R..R)), XYDATA
$$ [...]
$$ plain form
1929 304 520 635 35 -340 367 -41 -475 294 209 -12 416 -194 -944 -813 -1212 -1494 -351 457 393 999
1949 999 1102 619 857 1143 565 629 42 -1290 -1044 -225 -807 -432 -99 -875 -1413 -586 -154 378 982 940
1969 940 339 864 638 438 1066 371 -578 -876 -591 -814 -36 -83 -845 -442 53 -500 30 601 -702 -1018
1989 -1018 -639 -396 419 2020 2089 1664 1606 492 33 232 -1051 -1739 -1731 -1893 -1741 -564 313 93 144 81
2009 81 -168 959 1870 1840 2041 1635 282 151 344 -384 -1258 -1532 -2417 -2026 -1017 -268 487 1002 651 294
2029 294 1216 1216 820 616 -247 -1237 -454 258 961 1586 1085 -184 -287 -397 -891 -679 -903 -1767 -2153 -1047
2049 -1047 -230 1052 1712 970 319 419 429 794 1811 899 -42 95 -455 -727 -193 -1053 -2230 -2346 -2369
2068 -2369 -1517 563 2008 1912 1884 1538 629 1027 996 327 -816 -1170 -1436 -864 369 451 31 -358 -1256 -1306
$$ packed form
1929C04K16J15o00l75P07m08m34P69q5k21M28o10p50J31l99k82J143Q08o4O06
1949I99J03m83K38K86n78O4n87j332K46Q19n82L75L33p76n38Q27M32N32O04m2
1969I40o01N25k26k00O28o95r49k98K85k23P78m7p62M03M95n53N30N71j303l16
1989a018L79K43Q15J601O9m25n8j114m59J99j283o88Qj62J52J177Q77k20N1o3
2009H1k49J127R11l0K01m06j353j31J93p28q74k74q85L91J009P49P55N15l51l57
2029B94R22%l96k04q63r90P83P12P03O25n01j269j03j10m94K12k24q64l86J106
2049a047Q17J282O60p42o51J00J0L65J017r12r41J37n50k72N34q60j177j16k3
2068b369Q52K080J445r6k8l46r09L98l1o69j143l54k66N72J233Q2m20l89q98n0
$$ plain form
2088 -1306 -113 132 -356 -58 -758 -679 1018 1641 1890 2069 1017 -292 -135 -58 -335 -377 -788 -1791 -1711
2107 -1711 -883 -511 51 -199 -844 -689 539 1635 2513 3016 1659 934 323 75 -823 -727 -1713 -2589 -1740
2126 -1740 -1044 -653 1067 1191 344 152 419 111 587 689 -188 -280 124 17 637 1230 467 -469 -382 -924
2146 -924 -626 428 -406 -829 -872 -1453 -969 37 434 282 693 840 645 1578 1748 1057 871 256 -978
2165 -978 -626 -658 -1535 -1816 -1728 -2311 -997 394 1310 1715 1794 1049 533 805 293 167 136 -538 -665 -460 -301
2186 -301 -535 -392 -803 -1035 -511 21 47 787 748 -352 -65 175 198 579 796 454 380 504 91 221 519
2207 519 -737 -897 -917 -1131 -1369 -602 -424 -293 192 612 1182 1852 1462 802 705 162 -561 -93 175 -401
2227 -401 -555 -595 -1158 -895 -394 -673 -85 297 -88 164 974 551 280 746 139 -336 118 -124 60 289
$$ packed form
2088a306J193K45m88K98p00P9J697O23K49J79j052j309J57P7k77m2m11j003Q0
2107a711Q28L72N62k50o45J55J228J096Q78N03j357p25o11k48q98R6r86q76Q49
2126a740O96L91J720J24q47j92K67l08M76J02q77r2M04j07O20N93p63r36Q7n42
2146i24K98J054q34m23m3n81M84J006L97j52M11J47j95R33J70o91j86o15j234
2165i78L52l2q77k81Q8n83J314J391R16M05P9p45n16K72n12j26l1o74j27K05J59
2186c01k34J43m11k32N24N32K6P40l9j100K87K40K3L81K17l42p4J24m13J30K98
2207E19j256j60k0k14k38P67J78J31M85M20N70O70l90o60r7n43p23M68K68n76
2227d01j54m0n63K63N01k79N88L82l85K52Q10m23k71M66o07m75M54k42J84K29
$$ plain form
2247 289 -33 -218 327 -82 -415 -276 -541 -1263 -1049 -699 -676 206 808 1075 1383 1643 943 853 521 -555
2267 -555 -797 -763 -1205 -1022 -447 -607 -733 -197 -164 -416 213 293 491 1035 935 790 819 714 -326 -17 -270
2288 -270 -1418 -887 -741 -660 -387 219 -4 492 873 -19 181 121 -533 -333 -106 130 116 798 831 287 532
2309 532 118 -631 -486 -930 -1271 -410 -90 -333 379 329 -94 507 498 -57 -95 152 35 241 422 68 15 173
2331 173 -711 -811 -436 -484 -625 -101 -37 -91 644 635 322 548 141 -418 -247 36 -470 -115 302 -244 271 207
2353 207 -80 -371 -432 -705 -305 -26 -410 346 767 359 227 1186 545 146 207 -470 -874 -493 -263 -294 321
2374 321 85 -607 36 -122 -303 136 321 112 211 428 394 592 232 -388 -587 -269 -770 -325 370 -226 -208
2395 -208 205 240 190 621 535 7 -109 -693 -599 184 518 36 327 366 -222 13 -17 -263 -508 -353 -581 -33
$$ packed form
2247B89l22j85N45m09l33J39k65p22K14L50K3Q82O02K67L08K60p00r0l32j076
2267e55k42L4m42J83N75j60j26N36L3k52O29Q0J98N44j00j45K9j05j040L09k53
2288b70j148N31J46Q1K73O06k23M96L81q92K00o0o54K00K27K36j4O82L3n44K45
2309E32m14p49J45m44l41Q61L20k43P12n0m23O01rn55l8K47j17K06J81l54n3J58
2331A73q84j00L75m8j41N24O4n4P35rl13K26m07n59J71K83n06L55M17n46N15o4
2353B07k87k91o1k73M00K79l84P56M21m08j32R59o41l99O1o77m04L81K30l1O15
2374C21k36o92O43j58j81M39J85k09R9K17l4J98l60o20j99L18n01M45O95n96J8
2395b08M13L5n0M31q6n28j16n84R4P83L34m82K91L9n88K35l0k46k45J55k28N48
$$ plain form
2417 -33 605 702 370 750 -451 -640 196 -21 114 222 -376 -293 -87 55 206 429 -415 -836 -89 137 242
2438 242 365 65 -458 -356 -10 353 682 601 -79 -220 -42 -327 420 628 103 -659 -545 -452 -174 -78 -392
2459 -392 -584 -216 214 721 1600 1231 105 -1 -407 -748 304 320 -262 -311 -554 -645 -180 240 -154 16
2479 16 76 61 459 1066 640 262 -80 -533 -523 143 313 -34 28 -841 -735 -5 653 295 441 -175 -570 -325
2501 -325 -60 -196 331 49 -258 250 728 651 459 267 -720 -822 -207 18 454 583 -234 -721 -391 -312 133
2522 133 505 191 -71 -146 -116 171 576 121 -328 -309 -431 -68 432 417 -342 -616 -119 128 586 1216 281
2543 281 -280 -608 -1283 -645 232 337 365 408 225 211 571 159 -441 -454 -848 -559 -75 309 -135 271 -194
2564 -194 -394 182 698 585 450 22 -315 -162 -105 -62 -109 157 -687 -878 -122 60 126 601 170 98 684 535
$$ packed form
2417c3O38R7l32L80j201j89Q36k17J35J08n98Q3K06J42J51K23q44m21P47K26J05
2438B42J23l00n23J02L46L63L29q1o80j41J78k85P47K08n25p62J14R3K78R6l14
2459c92j92L68M30N07Q79l69j126j06m06l41J052J6n82m9k43r1M65M20l94J70
2479A6O0j5L98O07m26l78l42m53J0O66J70l47O2q69J06P30O58l58J46o16l95K45
2501c25K65j36N27k82l07N08M78p7j92j92r87j02O15K25M36J29q17m87L30P9M45
2522A33L72l14k62p5L0K87M05m55m49J9j22L63N00j5p59k74M97K47M58O30r35
2543B81n61l28o75O38Q77J05K8M3j83j4L60m12o00j3l94K89M84L84m44M06m65
2564a94k00N76N16j13j35m28l37J53N7M3m7K66q44j91P56J82O6M75m31p2N86j49
$$ plain form
2586 535 403 341 -307 -1120 -813 -719 -336 86 519 404 496 593 158 227 243 -226 -334 -151 -454 -271 287 18
2608 18 -182 272 -300 423 430 307 -165 147 -311 -210 177 61 -107 -56 -235 -536 63 37 -15 307 372 85
2630 85 366 317 -157 -160 -72 -858 -545 -186 -242 103 469 249 -271 112 106 -139 79 -92 -99 145 48 -375 285 90
2654 90 97 366 217 -100 -317 -296 -357 -121 23 -251 240 327 288 427 371 15 149 409 123 207 155 -88 -397
2677 -397 -365 -587 -613 -216 155 -154 480 303 296 726 593 -36 89 179 -358 -109 -128 -453 -68 -164 -235 -46 223
2700 223 264 321 364 -227 -440 -130 -152 124 228 261 22 472 -25 -94 373 251 41 108 -80 -241 -47 -5 -525
2723 -525 -301 -234 -385 86 302 221 218 265 55 167 371 143 404 110 -271 -390 -225 -174 -343 -22 60 -164
2745 -164 72 110 83 369 139 -206 55 8 84 60 284 -5 -109 -46 -331 -305 147 -160 -333 90 -379 -83
$$ packed form
2586E35j32o2o48q13L07R4L83M22M33j15R2R7m35O9J6m69j08J83l03J83N58k69
2608A8k00M54n72P23Pj23m72L12m58J01L87j16j68N1j79l01N99k6n2L22O5k87
2630H5K81m9m74lQ8p86L13L59n6L45L66k20n20L83ok45K18j71pK44r7m23O60j95
2654I0PK69j49l17k17K1o1K36J44k74M91Q7l9J39n6l56J34K60k86Q4n2k43l09
2677c97L2k22k6L97L71l09O34j77pM30j33o29J25R0n37K49j9l25L85r6p1J89K69
2700B23M1N7M3n91k13L10k2K76J04L3k39M50m97o9M67j22k10O7j88j61J94M2n20
2723e25K24O7j51M71K16q1lM7k10J12K04k28K61k94l81j19J65N1j69L21Q2k24
2745a64K36L8k7K86k30l45K61m7P6k4K24k89j04O3k85K6M52l07j73M23m69K96
$$ plain form
2767 -83 115 -94 -161 284 90 -4 338 237 33 -79 -282 -361 17 -241 -118 -136 -183 -401 155 476 -190 5
2789 5 -55 -140 -112 339 -75 -149 114 124 -4 240 19 -232 -47 -339 -281 50 16 -106 -78 -387 -139 -126 -124 -96 53
2814 53 126 7 282 279 278 325 70 -345 -52 -70 -508 -134 -106 -245 -200 302 245 -55 285 26 213 159 154 93 35
2839 35 -193 -126 -150 16 12 263 52 -376 -164 299 -148 167 178 151 -225 11 -218 206 558 -119 -321 -54
2861 -54 -187 412 205 83 -120 -138 2 -177 205 157 35 281 58 -238 209 394 -210 -243 -346 -358 -186 153
2883 153 73 120 -133 -114 342 432 371 251 152 -414 -328 122 59 14 21 9 -123 159 302 210 129 -36 -203 315 220
2908 220 -219 47 -115 -514 -249 -14 244 319 371 -91 129 356 -26 86 238 -157 -712 -248 -320 104 -167
2929 -167 42 1 13 115 154 508 280 23 81 -26 -356 -47 -119 -93 -318 -14 -45 420 270 528 191 111 -59
$$ packed form
2767h3J98k09o7M45j94r4L42j01k04j12k03p9L78k58J23j8m7k18N56L21o66J95
2789Eo0q5K8M51m14p4K63J0j28K44k21k51J85k92N8L31l4j22K8l09K48J3KK8J49
2814E3P3j19K75ljM7k55m15K93j8m38L74K8j39M5N02n7l00L40k59J87n4no1n8
2839C5k28O7k4J66mK51k11m28K12M63m47L15J1k7l76K36k29M24L52o77k02K67
2861e4j33N99k07j22k03j8J40j79L82m8j22K46k23k96M47J85o04l3j03j2J72L39
2883A53q0M7k53J9M56R0o1j20r9n66Q6M50o3m5Pj2j32K82J43r2q1j65j67N18r5
2908B20m39K66j62l99K65K35K58P5N2m62K20K27l82J12J52l95n55M64p2M24k71
2929a67K09m1J2J02L9L54k28k57N8j07l30L09p2K6k25L04l1M65j50K58l37q0j70
$$ plain form
2952 -59 -162 259 -144 -241 6 -251 -143 207 111 138 39 -187 -262 -79 64 -10 13 -405 -74 67 110 90 61 -176
2976 -176 -21 82 291 424 252 29 -284 -519 -195 115 -186 -21 -81 -43 113 19 267 317 -115 51 40 37
2998 37 -344 -7 26 -507 -14 -54 13 37 168 -18 9 -95 -260 6 -40 -124 -23 33 187 5 248 287 14
3021 14 164 146 62 280 -14 -394 -257 -89 -431 -185 -153 -253 72 -4 246 429 394 118 149 198 -431 -418 -216
3044 -216 -275 -101 -40 -264 -42 -25 120 88 210 -60 -207 141 95 -83 -97 193 -175 -9 15 -66 185 233 -57
3067 -57 -38 194 59 69 300 -11 12 -192 -361 -159 -133 -22 73 219 457 78 267 -112 -14 6 -182 -233 47
3090 47 128 -21 116 240 -188 1 321 -114 360 288 -281 -93 -99 -127 65 297 -52 214 251 -97 85 100 -153
3113 -153 32 243 276 167 207 -104 -158 -74 -220 -557 179 419 86 241 75 -249 -257 -103 -152 54 122 -196 289
$$ packed form
2952e9j03M21m03r7K47k57J08L50r6K7r9k26p5J83J43p4K3m18L31J41M3k0k9k37
2976a76J55J03K09J33j72k23l13k35L24L10l01J65o0L8J56r4K48N0m32J66j1l
2998C7l81L37L3n33M93m0O7K4J31j86K7j04j65K66m6q4J01N6J54j82K43L9k73
3021A4J50j8q4K18k94l80J37J68l42K46L2j00L25p6K50J83l5k76L1M9o29J3K02
3044b16n9J74O1k24K22J7J45l2J22k70j47L48m6j78j4K90l68J66K4q1K51M8k90
3067e7J9K32j35J0K31l11K3k04j69K02K6J11R5J46K38l79J89l79R8K0j88n1K80
3090D7Q1j49J37J24m28J89L20m35M74p2n69J88ok8J92K32l49K66L7l48J82J5k53
3113a53J85K11L3j09M0l11n4Q4j46l37P36K40l33J55j66l24qJ54m9K06O8l18M85
$$ plain form
3136 289 285 -133 242 120 142 283 13 -373 -425 -138 -189 -470 -11 -121 80 358 197 35 -59 3 -119 268
3158 268 329 -23 15 -166 -319 -362 -482 -273 227 629 16 387 299 -44 -191 23 -218 -49 158 -30 253
3179 253 -36 -81 -289 -117 -478 99 593 194 -121 -83 -149 -206 -186 129 -57 71 -210 -59 290 187 8 -73
3201 -73 295 106 55 302 -26 -151 -170 -493 -373 104 419 141 189 -120 -100 75 11 206 184 160 -228 234 208
3224 208 388 138 -142 -686 -346 -8 -160 73 -62 -255 -89 262 502 519 461 -198 -382 -72 -136 6 150
3245 150 191 -32 -356 -26 -206 142 118 -76 -97 -139 -97 200 656 29 -198 -27 -278 219 267 72 -159 -200
3267 -200 -315 -23 484 240 -110 95 37 -9 -102 10 -233 -78 -66 162 79 184 84 92 -178 -418 -153 103
3289 103 158 153 118 -413 -172 81 -151 -192 52 -358 -164 266 148 -120 188 77 11 165 181 -266 -78 -323
$$ packed form
3136B89mm18L75j22K2J41k70l86n2K87n1k81M59j10K01K78j61j62r4O2j22L87
3158B68O1l52L8j81j53m3j20K09N00M02o13L71q8l43j47K14k41J69K07j88K83
3179B53k89m5k08J72l61N77M94l99l15L8o6n7K0L15j86J28k81J51L49j03j79q1
3201g3L68j89n1K47l28j25j9l23J20M77L15k78M8l09K0J75o4J95k2k4l88M62k6
3224B08J80k50k80n44L40L38j52K33j35j93J66L51K40J7n8o59j84L10o4J42J44
3245A50M1k23l24L30j80L48k4j94k1m2M2K97M56o27k27J71k51M97M8j95k31m1
3267b00j15K92N07k44l50K05n8m6r3J12k43J55J2K28q3J05j00Qk70k40K65K56
3289A03N5nl5n31K41K53k32m1K44m10J94M30j18k68L08j11o6J54J6m47J88k45
$$ plain form
3311 -323 -381 -106 -147 14 252 81 -552 -127 133 -48 -19 135 -337 91 406 96 125 136 -373 -399 -195 -136
3333 -136 -263 -79 -178 -332 -52 166 320 430 137 -28 93 -303 -102 355 302 -218 -444 -291 134 290 208
3354 208 18 -411 -119 -321 425 513 238 -27 -190 -373 -306 276 144 42 -11 -15 65 340 265 319 141 -553 -805
3377 -805 -276 11 -277 -4 43 -461 70 246 543 540 409 -195 -75 63 -66 -15 250 -451 -478 -444 -295 -183
3399 -183 207 -260 -442 18 238 207 186 407 -186 -62 -47 80 181 569 244 -61 -299 -306 100 -137 -413 -205
3421 -205 -103 -297 -351 360 41 125 443 -20 31 505 285 45 123 -154 -578 -291 228 -310 219 23 -431
3442 -431 -111 349 119 81 354 -92 72 155 -186 39 224 -248 -343 175 -40 125 364 293 -287 -159 -413
3463 -413 -339 -40 -321 -228 261 131 71 337 758 405 276 491 -94 -176 71 -555 -296 -307 -605 -445 -164 -73
$$ packed form
3311c23n8K75m1J61K38j71o33M25K60j81K9J54m72M28L15l10K9J1n09k6K04N9
3333a36j27J84r9j54K80K18J54J10k93j65J21l96K01M57n3n20k26J53M25J56q2
3354B08j90m29K92k02P46Q8k75k65j63j83O7N82j32j02n3mQ0K75p5N4j78o94k52
3377h05N29K87k88K73M7n04N31J76K97lj31o04J20J38j29N1K65p01k7L4J49J12
3399a83L90m67j82M60K20l1k1K21n93J24J5J27J01L88l25l05k38pM06k37k76K08
3421b05J02j94n4P11l19Q4L18m63N1M74k20k40P8k77m24K87N19n38N29j96m54
3442d31L20M60k30l8K73m46J64Q3l41K25J85m72r5N18k15J65K39p1n80J28k54
3463d13P4K99k81R3M89j30o0K66M21l53j29K15n85q2K47o26K59j1k98J60K81R1
$$ plain form
3485 -73 -345 485 -160 84 303 406 384 571 331 -38 -69 -148 -558 -204 -494 -427 -92 69 -251 78 614 -25
3507 -25 275 80 -21 348 431 70 -23 333 129 -155 296 19 -428 -332 -514 -505 -444 -88 -108 284 6 47 375
3530 375 157 -236 -41 291 -306 -102 189 96 74 41 -295 1 -368 -548 -508 83 72 -74 708 366 -187 341
3552 341 44 183 -69 -95 -259 49 255 67 175 272 -330 -377 94 -124 -114 58 -37 -331 178 83 295 597
3574 597 109 -300 -9 -14 -314 -46 35 -470 -30 -287 -219 212 266 -282 -203 -157 -134 394 696 642 491 136 -256
3597 -256 -234 145 -181 -359 -314 -684 -420 177 422 -13 277 -12 -141 252 279 378 552 59 -389 -132 166
3618 166 29 200 -161 -544 -548 -143 -39 -33 378 -209 -78 443 15 37 498 -1 -353 152 -55 192 430 -37
3640 -37 -450 -168 -457 -171 72 85 -181 7 -242 64 387 406 -184 -81 132 -353 166 147 -259 65 160 -210
$$ packed form
3485g3k72Q30o45K44K19J03k2J87k40l69l1p9m10L54k90O7L35J61l20L29N36o39
3507b5L00j95j01L69Q3l61r3L56k04k84M51k77m47R6j82RO1L56k0L92k78M1L28
3530C75k18l93J95L32n97K04K91r3k2l3l36K96l69j80M0N91j1j46P82l42n53N28
3552C41k97J39k52k6j64L08K06j88J08R7o02m7M71k18J0J72r5k94N09r5K12L02
3574E97m88m09K91nl00K68Q1n05M40k57O8M31N4n48P9M6K3N28L02n4j51l55l92
3597b56K2L79l26j78M5l70K64N97K45m35K90k89j29L93K7R9J74m93m48K57K98
3618A66j37J71l61l83mM05J04OM11n87J31N21m28K2M61m99l52N05k07K47K38m67
3640c7m13K82k89K86K43J3k66J88k49L06L23J9n90J03K13m85N19j9m06L24R5l70
$$ plain form
3662 -210 -105 47 -233 -385 -299 -366 -194 249 655 0 505 51 -2 138 215 -104 -122 -74 -146 -84 234 -341 -250
3685 -250 -99 -569 -147 122 139 13 459 3 143 345 433 424 283 38 -305 146 -252 -68 -26 -19 -290 -74
3707 -74 176 -207 250 -182 -357 145 496 351 427 425 -307 -162 110 -427 -157 -147 -430 -450 -76 -245 -148 201
3729 201 -34 -291 -159 74 -43 223 145 -345 22 11 96 378 298 -521 -510 -221 -408 108 281 420 145 237
3751 237 -160 -24 296 -60 -144 -145 -89 -215 508 545 211 187 -134 -215 -127 -107 -367 -113 -145 -434 91 250 237 301
3775 301 172 -73 92 182 43 90 -346 -243 -214 62 -73 -51 -156 -425 -546 -70 57 404 539 139 150 196
3797 196 -30 -149 80 -274 -694 -267 -82 -115 78 313 36 12 -36 -181 -68 109 -12 12 310 50 68 491
3819 491 158 -83 -158 -304 -462 9 -243 -263 -161 -51 104 103 250 -76 175 10 -104 152 282 70 305
$$ packed form
3662b10J05J52k80j52Q6o7J72M43M06o55N05m54n3J40P7l19j8M8p2O2L18n75R1
3685b50J51m70M22K69J7j26M46m56J40K02Q8rj41k45l43M51l98J84M2Pk71K16
3707g4K50l83M57m32j75N02L51j45P6kp32J45K72n37K70J0k83k0L74j69R7L49
3729B01k35k57J32K33j17K66p8m90L67j1Q5K82q0q19J1K89j87N16J73J39k75R2
3751B37l97J36L20l56q4jN6j26P23L7l34k4l21q1Q8K0k60K54l2k89N25J59j3O4
3775C01j29k45J65R0j39M7m36J03K9K76j35K2j05k69j21M76J27L47J35m00J1M6
3797A96k26j19K29l54m20M27J85l3J93K35k77k4m8j45J13J77j21K4K98k60J8M23
3819D91l33k41p5j46j58M71k52k0J02J10J55jJ47l26K51j65j14K56J30k12K35
$$ plain form
3840 305 267 -299 -174 141 -315 -268 -166 -239 -216 57 7 117 428 -156 -106 -73 -219 -118 266 60 55 241 150
3863 150 24 240 58 -269 -363 -340 -487 -241 -96 -194 26 141 250 225 441 171 -39 333 283 112 87 256
3885 256 -317 -430 -465 -596 -123 24 -301 80 256 33 426 574 267 167 59 -81 -35 195 -82 -222 -139
3906 -139 -205 -368 38 9 -87 -247 -211 -462 134 39 232 459 203 158 88 116 17 42 62 -302 -217 -87 -193 -229
3930 -229 -8 -644 -219 -321 -342 -272 294 -53 178 417 183 112 224 197 -136 245 -352 -473 -33 -253 28
3951 28 -198 -215 -498 -160 85 -324 -119 -73 165 204 717 289 442 78 24 -61 118 -13 -313 76 -44 -532
3973 -532 -290 -159 -264 -180 -51 -207 356 210 53 623 580 247 403 145 -174 -190 -157 -261 -302 -327 -192 -208
3995 -208 -140 15 21 228 149 -42 139 55 -14 302 159 99 -109 -449 -361 -194 68 -212 -330 -265 -160 83 314
$$ packed form
3840C05l8n66J25L15m56M7J02p3K3K73n0J10L11n84N0L3j46J01L84k06nJ86r1
3863A50j26K16j82l27r4K3j47K46J45r8K20J15J09k5K16k70k10L72n0j71k5J69
3885B56n73j13l5j31M73J47l25L81J76k23L93J48l07j00j08j40M6K30k77j40Q3
3906a39o6j63M06k9r6j60L6k51N96r5J93K27k56m5p0K8r9K5K0l64Q5J30j06l6
3930b29K21o36M25j02k1P0N66l47K31K39k34p1J12k7l33L81n97j21M40k20K81
3951B8k26j7k83L38K45m09K05M6K38L9N13m28J53l64n4q5J79j31l00L89j20m88
3973e32K42J31j05Q4J29j56N63j46j57N70m3l33J56k58l19j6L3j04m1k5J35j6
3995b08O8J55OK07p9j91J81q4o9L16j43o0k08l40Q8J67K62k80j18O5J05K43K31
$$ plain form
4018 314 141 86 283 -196 -47 69 30 -52 170 159 -188 299 219 -90 -16 -224 -492 -543 -48 113 201 284 -212
4041 -212 -2 186 202 351 271 41 -202 9 -111 156 223 -152 -242 -172 -131 -102 277 21 -336 54 -182 258
4063 258 690 438 173 -51 -256 -354 47 -98 -184 -190 -372 -494 -174 181 -429 175 195 -376 -143 207 559 506
4085 506 242 -107 -307 100 -59 25 -141 -298 -353 -154 228 -59 195 -70 -27 -53 83 139 159 233 -7 58 125
4108 125 -97 142 421 -108 -554 -521 -370 -307 79 210 300 115 -41 -178 49 236 14 283 -57 -111 -122 -98
4130 -98 124 137 128 6 297 189 -211 -200 8 29 -160 -28 -47 111 207 -256 -17 255 -180 -4 224 241 287
4153 287 99 -76 -287 -321 10 -458 6 15 -271 195 -100 -179 323 240 -9 -95 169 81 -107 -40 -372 -176 -251
4176 -251 -283 -181 120 140 -220 52 -217 97 45 546 366 211 51 -249 -120 -233 -87 118 20 -107 220
$$ packed form
4018C14j73n5J97m79J49J16l9q2K22j1l47M87q0l09P4k08k68n1M95J61Q8Q3m96
4041b12K10J88J6J49q0k30k43K11j20K67O7l75r0P0M1K9L79k56l57L90k36M40
4063B58M32k52k65k24k05r8M01j45q6oj82j22L20L55o10O04K0n71K33L50L52n3
4085E06k64l49k00M07j59Q4j66j57n5J99L82k87K54k65M3k6J36N6K0P4k40O5O7
4108A25k22K39K79n29m46L3J51O3L86J31R0j85j56j37K27J87k22K69l40n4j1K4
4130i8K22J3rj22K91j08m00J1K08K1j89J32j9J58R6m63K39K72m35J76K28J7M6
4153B87j88j75k11l4L31m68M64Rk86M66k95p9N02q3k49q6K64q8j88O7l32J96p5
4176b51l2J02L01K0l60K72k69L14n2N01j80j55j60l00J29j13J46K05r8j27L27
$$ plain form
4197 220 169 73 -179 82 -258 -173 17 146 329 535 146 -185 -124 41 -147 267 258 -149 20 -251 -89 83
4219 83 186 -169 187 -27 -296 36 213 58 -188 -31 -56 235 462 132 -119 -34 -281 -185 -88 287 164 259
4241 259 -29 -152 153 -69 115 -199 -153 -219 26 -135 -44 363 -52 -359 -60 -64 -136 137 -52 -271 -139 -71
4263 -71 -79 62 204 -116 19 110 -5 15 221 -101 -264 -97 -132 46 75 -58 -224 -206 -86 -101 435 202 67
4286 67 18 151 1 -68 63 0 -61 4 -176 -245 163 -152 78 -115 11 -61 101 150 -188 -42 60 -112 371
4309 371 79 88 84 232 -227 -3 114 26 268 160 45 130 18 -205 28 142 25 -353 232 -85 -11 84 -45
4332 -45 -159 -101 -32 233 -216 -8 32 -176 -26 -87 122 179 -168 146 -185 51 -56 194 176 27 -42 93 111
4355 111 -19 41 216 53 47 -122 -30 78 7 105 51 -107 63 -39 -261 134 127 112 217 19 -49 -142 48 -414
$$ packed form
4197B20n1r6k52K61l40Q5J90J29J83K06l89l31O1J65j88M14rm07J69k71J62J72
4219H3J03l55L56k14k69L32J77j55k46J57k5K91K27l30k51Q5k47R6R7L75j23R5
4241B59k88j23L05k22J84l14M6o6K45j61R1M07m15l07K99mp2K73j89k19J32O8
4263g1qJ41J42l20J35R1j15K0K06l22j63J67l5J78K9j33j66J8J20j5N36k33j35
4286F7m9J33j50o9J31o3o1O5j80o9M08l15K30j93J26p2J62M9l38J46J02j72M83
4309C71k92RmJ48m59K24J17q8K42j08j15Q5j12k23K33J14j17l78N85l17P4R5j29
4332d5j14N8O9K65m49K08M0k08J50o1K09N7l47L14l31K36j07K50j8j49o9J35J8
4355A11j30O0J75j63oj69R2J08p1R8n4j58J70j02k22L95pj5J05j98o8r3J90m62
$$ plain form
4379 -414 129 33 -277 -179 90 105 0 198 -237 -263 -53 -6 -199 -121 79 26 88 110 -6 252 57 189 34
4402 34 -45 -120 143 149 38 11 22 -149 149 -17 154 97 -240 -11 -181 -83 21 55 -58 51 65 136 149 -86
4426 -86 -27 -145 -502 -124 44 -69 336 8 -202 40 -160 -10 19 -33 47 -155 162 -324 89 -189 -120 -176
4448 -176 206 -124 172 -103 60 7 18 -60 58 -1 35 -14 -63 138 186 241 -116 -42 59 265 -316 158 -32
4471 -32 -75 98 248 -216 -20 -15 6 86 -57 -73 -5 -8 23 -154 -109 206 -231 163 206 36 50 -124 -204 -58 118
4496 118 -56 -98 -83 -130 369 226 116 -64 307 116 148 -151 8 113 33 -200 -99 -25 150 -176 104 -154
4518 -154 7 -157 110 180 -132 -111 -94 -133 2 -16 -22 -20 -80 88 -60 -103 66 218 101 -43 -105 -135 75 70 -86
4543 -86 1 370 -88 280 193 -19 -182 -70 -10 28 21 -254 125 -184 -146 -264 -99 118 151 162 -44 -139 -67 -95
$$ packed form
4379d14N43r6l10R8K69J5j05J98m35k6K10M7j93P8K00n3O2K2j16K58j95J32j55
4402C4p9p5K63Oj11k7J1j71K98j66J71n7l37K29j70R8J04L4j13J09J4P1J3k35
4426h6N9j18l57L78J68j13M05l28k10K42k00J50K9n2Q0k02L17m86M13k78O9n6
4448a76L82l30K96k75J63n3J1p8J18n9L6m9m9K01M8N5l57P4J01K06n81M74j90
4471c2m3J73J50m64J96NK1Q0j43j6O8lL1j77M5L15m37L94M3j70J4j74q0J46J76
4496A18j74m2J5m7M99j43j10j80L71j91L2k99J59J05q0k33J01P4J75l26K80k58
4518a54J61j64K67P0l12K1J7l9J35j8oKo0J68j48m3J69J52j17j44o2l0K10nj56
4543h6Q7L69m58L68q7k12j63J12O0L8pk75L79l09L8j18J65K17L3J1k06r5P2k8
$$ plain form
4567 -95 179 137 -28 -40 66 -31 -43 127 14 -67 104 -60 -118 -218 -39 -119 8 67 -113 36 -24 -24 149 223
4591 223 11 -199 -139 14 71 69 -375 129 -288 -203 -127 -46 115 94 201 183 -150 -235 -265 -116 -63 60 -22 67 109
4616 109 35 -95 124 -101 306 107 -95 159 46 -162 -249 -114 -162 -259 57 246 -70 -137 147 -28 79 126
4638 126 -29 -55 87 69 76 262 -34 -36 -12 -112 -5 -81 -28 7 88 68 -3 295 80 65 -170 91 165 16 18 208
4664 208 -72 79 4 -120 46 129 24 58 -40 -153 -376 40 -95 -61 -106 -18 227 -89 149 211 -169 40 145
4687 145 -21 -165 -70 147 -142 -89 -26 114 85 84 87 -150 99 -35 81 158 -123 -55 216 58 -52 -89 92 -279
4711 -279 -118 -94 -122 164 -145 59 -31 70 37 53 136 -114 7 144 -85 19 -170 0 -314 -217 -47 -53 126
4734 126 -65 265 -72 26 218 -24 -36 -72 -6 -169 -249 -61 -12 129 -133 -64 -63 71 -158 0 60 -66 -6 -187
$$ packed form
4567i5K74m2j65j2J06r7j2J70j13q1J71j64n8j00J79q0J27N9j80J49o0%J73P4
4591B23k12k10O0J53N7km44N04m17Q5P6Q1J61k1J07j8l33q5l0J49N3J23q2Q9M2
4616A09p4j30K19k25M07j99k02K54j13k08q7J35m8r7L16J89l16o7K84j75J07M7
4638A26j55k6J42j8PJ86k96kK4j00J07p6N3L5Q1k0p1K98k15j5k35K61P4j49KJ90
4664B08k80J51p5j24J66Q3j05L4r8j13k23M16j35L4m5Q8K45l16K38O2l80K09J05
4687A45j66j44R5K17k89N3O3J40k9jLk37K49j34J16P7k81O8K71j58j10l7J81l71
4711b79J61K4k8K86l09K04r0J01l3J6Q3k50J21J37k29J04j89J70l14R7J70oJ79
4734A26j91L30l37R8J92k42j2l6O6j63q0J88M9J41k62O9JJ34k29J58O0j26O0j81
$$ plain form
4758 -187 55 63 51 121 -44 -207 -143 -37 83 206 8 121 133 65 7 -70 -52 -178 -103 -251 142 66 102 6 -55
4783 -55 -345 -30 71 -54 -72 16 -122 -169 91 58 -94 -35 -173 207 17 -157 -91 -32 -198 -78 60 92 -41
4806 -41 -8 90 11 -171 -63 153 -239 -15 -87 61 139 -15 -255 -121 1 237 180 -189 -57 -85 -143 -184 -127 46
4830 46 52 61 -51 109 25 127 57 -40 99 158 -64 67 -32 32 63 54 -216 75 -90 -43 8 -140 132 64 -266 -97
4856 -97 146 12 -267 -26 11 153 -171 -34 -229 -126 -33 -5 31 -97 -162 -225 -44 109 54 48 79 79 -38 -100 -78
4881 -78 145 -85 -141 -89 -26 -122 143 126 -97 72 140 -174 205 19 -53 62 8 -168 38 142 -170 93 212
4904 212 150 -54 229 103 84 93 29 -96 -165 208 15 170 -179 20 -143 -265 204 292 39 -103 273 -114
4926 -114 -64 4 373 -225 -220 6 -95 -116 -39 -17 -150 -39 -107 -29 45 76 -34 197 -118 -37 -248 -47 -125 -42 -30
$$ packed form
4758a87K42Qj2P0j65j63O4J06J20J23j98J13J2o8n8p7J8j26P5j48L93p6L6r6o1
4783e5k90L15J01j25j8Q8j38m7K60l3j52N9j38L80j90j74O6N9j66J20J38L2j33
4806d1L3R8p9j82J08K16l92K24p2J48P8j54k40J34J22K36n7l69J32k8n8m1N7J73
4830D6ORj12J60q4J02p0r7J39N9k22J31r9O4L1rk70K91j65M7N1j48K72o8l30J69
4856i7K43j34k79K41L7J42l24J37j95J03R3K8L6j28o5o3J81J53n5oL1%j17o2K2
4881g8K23k30n6N2O3r6K65j7k23J69O8l14L79j86p2J15n4j76K06J04l12K63J19
4904B12o2k04K83j26j9Ro4j25o9L73j93J55l49J99j63j22M69Q8k53j42L76l87
4926a14N0O8L69n98NK26j01k1P7K2j33J11o8P8P4L1j10K31l15Q1k11K01p8Q3J2
$$ plain form
4951 -30 -250 45 223 -14 34 87 -200 -59 190 92 -29 -75 49 225 -135 83 -29 48 150 -24 243 169
4973 169 -93 -153 50 82 -147 174 -115 -27 -74 78 80 128 84 -137 126 233 303 118 -207 88 -22 -205 -53
4996 -53 -78 -85 -55 -6 -147 -163 113 -167 45 -53 -146 -192 -75 70 -173 -98 66 -49 -54 -333 -99 51 -8 34 -272
5021 -272 65 268 113 55 6 39 -146 62 38 -114 -65 -266 66 -155 -415 140 113 260 238 245 113 232 -34
5044 -34 115 165 60 -13 124 236 -93 -47 -82 -94 -39 264 14 -35 27 97 -42 26 68 -16 147 -201 -46 -62 -95
5069 -95 -34 282 135 -173 149 -22 63 197 5 83 -60 -103 179 32 43 255 -113 184 74 -73 182 50
5091 50 52 -66 100 15 17 -52 -235 115 209 33 257 21 162 38 48 3 -92 45 -249 37 120 19 -223 80
5115 80 235 -130 17 -209 -72 294 -172 -213 39 -49 -314 146 -61 -178 400 -103 -146 72 -92 -16 -92 120
$$ packed form
4951c0k20K95J78k37M8N3k87J41K49r8j21m6J24J76l60K18j12P7J02j74K67p4
4973A69k62o0K03L2k29L21k89Q8m7J52KM8m4k21K63J07P0j85l25K95j10j83J52
4996e3k5pL0M9j41j6K76k80K12r8r3m6J17J45k43P5J64j15nk79K34J50n9M2l06
5021b72L37K03j55n8m9L3j85K08k4j52M9k01L32k21k60N55k7J47k2Pj32J19k66
5044c4J49N0j05p3J37J12l29M6l5j2N5L03k50m9O2P0j39O8M2q4J63l48J55j6l3
5069i5O1L16j47l08L22j71Q5J34j92P8j43m3K82j47J1K12l68K97j10j47K55j32
5091E0Kj18J66q5Ko9j83L50R4j76K24k36J41j24J0m5r5J37k94K86Q3j01k42L03
5115H0J55l65J47k26J37L66m66m1K52q8k65M60k07j17N78n03m3K18j64P6p6K12
$$ plain form
5137 120 -201 98 -13 38 134 53 -188 10 127 72 30 26 -176 -143 -95 -191 -188 183 37 -222 -116 -196 132 296
5161 296 40 165 41 -91 53 71 66 -289 -25 -79 -33 32 75 38 31 -225 -93 7 89 -132 221 132 25 26 313
5186 313 187 242 87 93 210 19 77 -106 207 -133 -115 5 -37 -37 -73 73 -247 36 -64 253 214 160 62 15
5210 15 3 138 23 103 -4 -188 -52 101 -57 85 -27 -33 41 -135 -155 8 297 -31 -58 66 -134 -63 105
5233 105 78 -169 16 -81 -213 104 -357 -104 -89 -121 -232 77 127 165 177 93 -209 41 101 -110 31 -111 -305
5256 -305 171 127 -101 234 251 -43 165 254 30 -133 10 34 -72 170 -95 321 68 -69 -244 19 96 -22
5278 -22 -95 -196 -32 -129 13 59 58 -70 -241 296 -56 4 297 12 -66 126 -23 -13 225 -16 -161 74 -138
5301 -138 55 -453 -3 86 -190 99 240 -47 183 -10 -129 156 143 83 49 -99 -269 -41 -23 -34 -118 27
$$ packed form
5137A20l21K99j11N1R6q1k41J98J17n5m2mk02L3M8r6LL71j46k59J06q0L28J64
5161B96k56J25j24j32J44J8nl55K64n4M6O5M3l7pk56J32J00Q2k21L53q9j07JK87
5186C13j26N5j55OJ17j91N8j83L13l40J8J20m2%l6J46l20K83j00L17l9n4r8m7
5210A5j2J35j15Q0j07j84J36J53j58J42j12oP4j76k0J63K89l28k7J24k00P1J68
5233A05k7k47J85r7j32L17m61K53J5l2j11L09N0L8J2q4l02K50O0k11J41j42j94
5256c05M76m4k28L35J7k94K08Q9k24j63J43K4j06K42k65M16k53j37j75K63P7j18
5278b2p3j01J64r7J42M6jj28j71N37l52O0K93k85p8J92j49J0K38k41j45K35k12
5301a38J93n08M50Q9k76K89J41k87K30j93j19K85j3o0l4j48j70K28J8j1q4J45
$$ plain form
5323 27 -184 -68 130 91 70 25 34 -28 231 -109 77 164 -187 -283 -126 -8 -2 95 204 -49 24 25 2 31 96 31
5349 31 11 181 -236 -21 371 -254 -136 68 -151 -64 -193 51 20 69 17 215 3 76 258 -98 198 -29
5371 -29 59 126 -60 243 28 8 -60 129 -236 -126 95 -58 -181 -189 -54 -10 114 -225 14 268 50 58 228
5394 228 41 141 20 41 -189 -1 109 -314 -250 -133 -118 99 168 31 -66 -130 2 -65 -127 -103 211 153 -99
5417 -99 110 200 -86 -18 35 -165 -190 -72 13 -140 216 -181 68 -43 130 166 103 4 -275 150 -94 -16 188
5440 188 -179 -165 -48 193 -102 -98 1 227 60 351 0 -14 -192 32 -146 75 83 -9 159 285 -80 123 172
5463 172 33 70 -53 223 -66 -49 -276 -134 101 -172 44 210 47 37 120 69 -139 55 -95 165 158 -85
5485 -85 3 10 -65 -20 -102 -101 139 -42 17 -43 28 138 -72 66 92 -187 -221 -106 -212 -102 121 46 -264 253 -28
$$ packed form
5323B7k11J16J98l9k1m5Ro2K59l40J86Q7l51r6J57J18OR7J09k53P3Jk3K9O5o5
5349C1k0J70m17K15L92o25J18K04k19Q7j29K44l1M9n2J98k12P3J82l56K96k27
5371b9Q8O7j86L03k15k0o8J89l65J10K21j53j23qJ35M4J24l39K39K54k18QJ70
5394B28j87J00j21K1k30J88J10m23O4J17J5K17O9j37r7o4J32o7o2K4L14n8k52
5417i9K09R0k86O8N3k00k5J18Q5j53L56l97K49j11J73L6o3r9k79M25k44P8K04
5440A88l67J4J17K41k95MR9K26j67K91l51j4j78K24j78K21Qr2J68J26l65K03M9
5463A72j39L7j23K76k89J7k27J42K35k73K16J66j63j0Q3n1k08J94j50K60pk43
5485h5Q8Pp5M5q2JK40j81N9o0P1J10k10J38K6k79l4J15j06J10K23p5l10N17k81
$$ plain form
5510 -28 -103 176 -148 -22 66 -28 -18 -39 -105 25 58 -85 116 25 -35 -24 -34 -50 145 -178 -76 -196 165 52
5534 52 -311 -105 -101 -100 36 -1 22 -214 -189 -293 -88 50 180 67 378 31 -3 164 163 46 345 70 -286 87
5558 87 -90 77 299 11 -287 66 173 43 128 -10 30 124 22 33 24 113 -78 -155 -130 1 112 36 -70 179
5582 179 82 37 56 156 202 -6 -126 -176 -104 -49 278 58 158 -56 84 211 153 68 32 -88 -134 119 188 235
5606 235 -49 133 -432 -238 -49 64 37 137 -39 78 100 6 -55 -32 67 -75 -49 -122 216 20 -166 -74 35
5629 35 -127 -54 106 373 26 -126 -139 5 130 154 185 -115 -158 -80 -72 -152 37 -50 -121 94 -32 11 27 -27 51
5654 51 35 6 -132 181 -3 -4 10 -7 80 287 171 303 -148 18 -136 -53 83 83 7 55 -27 80 -109 -97 53
5679 53 31 -42 383 -18 -35 75 -196 -98 -435 -252 -181 -195 -185 -81 -77 21 60 129 198 134 -120 187 49 26 -129
$$ packed form
5510b8p5K79l24J26Q8r4J0k1o6J30L3j43K01r1o0J1j0j6J95l23J02j20L61j13
5534E2l63K06MJJ36l7K3k36K5j04K05J38J30j13L11l47l4J67jj17K99k75l56L73
5558H7j77J67K22k88k98L53J07j30Q5j38M0R4j02J1rQ9j91p7K5J31J11p6j06K49
5582A79r7m5J9J00M6k08j20n0P2N5L27k20J00k14J40J27n8q5l6j20m6K53O9M7
5606B35k84J82n65J94J89J13k7J00j76J17K2r4o1K3R9j42K6p3L38j96j86R2J09
5629C5j62P3J60K67l47j52j3J44J25K4L1l00m3P8Qq0J89q7p1K15j26M3J6n4P8
5654E1j6k9j38L13j84jJ4j7Q7K07j16J32m51J66j54Q3J36%p6M8q2J07j89J2J50
5679E3k2p3M25m01j7J10k71R8l37J83P1j4J0J04MR8L9O9O9o4k54L07j38k3j55
$$ plain form
5704 -129 -68 19 -244 -31 -120 181 51 12 -192 -36 -130 -22 134 -252 -193 13 -38 175 200 -87 -56 -58 -3 12
5728 12 122 -52 -41 191 -309 -114 265 98 -80 63 199 -149 127 322 -70 93 43 -145 -129 -89 -42 50
5750 50 45 -88 -114 49 -82 -142 -61 -53 -91 227 72 -121 -26 142 -192 41 61 -183 59 -168 -267 -25 214 -275
5774 -275 -205 117 -147 -115 26 140 -131 160 -172 102 24 154 -125 141 -95 -30 -34 -218 196 184 151 -211 -30
5797 -30 -36 111 -185 206 -337 -155 -46 -103 -13 -177 -37 -55 -1 18 45 30 -115 -2 25 -216 -49 252 -178 -126
5821 -126 39 237 -31 -51 -122 -7 218 -70 -108 -144 34 -89 -145 13 27 190 -145 26 51 323 -91 -111 240
5844 240 -256 -37 -136 11 55 155 3 -57 34 -28 -70 -22 128 -136 -216 15 125 -140 -86 -64 -168 -395 -43
5867 -43 33 288 -94 -89 -96 -77 -350 330 77 -221 55 -214 -149 -26 182 96 -125 188 26 64 177 -57 95
$$ packed form
5704a29O1Q7k63K13q9L01j30l9k04J56r4J08J56l86N9K06n1K13K5k87L1kN5J5
5728A2J10j74J1K32n00J95L79j67j78J43J36l48K76J95l92J63n0j88J6M0M7R2
5750E0nj33k6J63j31o0Q1Ql8L18j55j93R5J68l34K33K0k44K42k27r9K42K39m89
5774b75P0L22k64L2J41J14k71K91l32K74p8J30k79K66k36O5mj84M14j2l3l62J81
5797c0oJ47k96L91n43J82J09n7R0j64J40j8N4J9K7j5j45J13K7k41J67L01m30N2
5821a26J65J98k68k0p1J15K25k88l8l6J78j23n6J58J4J63l35J71K5K72m14k0L51
5844B40m96K19r9J47M4J00j52o0R1o2m2M8J50k64q0K31J10k65N4K2j04k27L52
5867d3P6K55l82NpJ9k73O80k53k98K76k69O5J23K08q6k21L13j62L8J13k34J52
$$ plain form
5890 95 88 39 -93 -163 -153 197 89 23 -119 146 -4 -114 -37 -57 36 79 129 -6 341 18 67 37 -305 -20 -39
5915 -39 -55 155 -132 34 67 87 47 -23 -238 -23 -168 -128 81 -77 -134 23 -31 -76 108 341 29 47 90 37
5939 37 75 -68 32 126 -72 -185 64 -18 127 -38 -203 209 99 3 25 29 162 17 -57 50 -235 65 20
5962 20 -170 -55 36 -56 -108 69 200 56 -35 -158 238 205 -2 -212 45 -132 -124 115 112 -26 -148 208 110 -22
5986 -22 65 -145 226 19 106 307 -21 -43 -98 -98 -483 43 135 -94 -5 41 19 47 27 -78 -86 -70 61 -42 -187
6011 -187 -28 -60 -140 -35 -165 93 28 -12 28 -4 -66 -392 -7 -61 -88 32 -56 -142 0 96 36 -63 -177 62 248
6036 248 13 61 111 9 -56 13 -226 -305 151 222 -254 80 -323 -112 16 260 130 37 89 197 -73 -1 171
6059 171 -107 59 -283 -75 196 91 86 10 -179 -69 66 147 58 18 -56 -45 4 30 -192 203 -18 -52 6 334
$$ packed form
5890I5pm9j32p0J0L50j08o6j42K65j50j10P7k0R3M3N0j35L47l23M9l0l42K85j9
5915c9j6K10k87J66L3K0m0p0k15K15j45M0K09j58n7J57n4m5J84K33l12J8M3n3
5939C7L8j43J00R4j98j13K49q2J45j65j65M12j10r6K2MJ33j45p4J07k85L00m5
5962B0j90J15R1r2n2J77J31j44r1j23L96l3k07k10K57j77QK39lj38j22L56r8j32
5986b2Q7k10L71k07Q7K01l28k2n5%l85N26R2k29Q9M6k2K8k0j05qJ6J31j03j45
6011a87J59l2q0J05j30K58o5m0M0l2o2l26L85n4k7J20q8q6J42R6o0r9j14K39J86
6036B48k35M8N0j02o5O9k39p9M56P1m76L34m03K11J28K44j30r3N2J08k70P2J72
6059A71k78J66l42K08K71j05np6j89J10J35Q1q9m0p4J1M9K6k22L95k21l4N8L28
$$ plain form
6083 334 55 10 123 266 17 134 24 26 85 -29 -22 46 16 -180 -136 -26 142 -64 140 131 16 188 79 111
6107 111 -234 -58 3 37 -86 73 -17 -324 147 167 83 -56 -60 30 -27 197 -43 -112 88 25 -7 86 -11 -79 -116
6132 -116 71 -57 -33 -57 -46 -273 -156 -174 30 -4 50 75 70 -175 -18 127 -92 40 120 -82 138 -270 -175 -173
6156 -173 -161 -97 36 104 79 166 -30 74 -223 122 -87 175 -59 -53 -60 230 -67 -60 305 -3 245 165 146 -146
6180 -146 -16 118 -16 47 332 81 -112 328 127 -263 -33 216 106 170 -164 -118 -226 -258 210 30 92 -79
6202 -79 46 214 176 -57 207 114 21 83 50 -140 87 30 -44 178 -248 -52 -13 -43 217 -7 99 28 114 -84
6226 -84 -233 -39 114 199 68 183 -139 -23 -34 153 47 92 34 -29 118 166 -135 73 -52 -122 -2 -5 18 -6
6250 -6 138 -18 -196 87 -34 -23 90 7 -190 118 -17 -165 96 17 -24 147 -149 20 -99 -141 -53 -80 116
$$ packed form
6083C34k79m5J13J43k49J17j10KN9j14PO8l0j96M4J10J68k06K04rj15J72j09L2
6107A11l45J76O1L4j23J59r0l07M71K0q4j39mR0n7K24k40o9K00o3l2R3r7o8l7
6132a16J87j28K4k4J1k27J17j8K04l4N4K5nk45J57J45k19J32Q0k02K20m08R5K
6156a73J2O4J33O8k5Q7j96J04k97L45k09K62k34OpK90k97PL65l08K48q0j9k92
6180a46J30J34j34O3K85k51j93M40k01l90K30K49j10O4l34M6j08l2M68j80O2j71
6202g9J25J68l8k33K64r3r3O2l3j90K27n7p4K22m26J96L9l0K60k24J06p1Q6j98
6226h4j49J94J53Q5j31J15l22J16j1J87j06M5n8o3J47M8l01K08j25p0J20lK3k4
6250fJ44j56j78K83j21J1J13q3j97L08j35j48K61p9m1J71k96J69j19m2Q8k7J96
$$ plain form
6273 116 55 165 -131 79 142 -95 -75 104 3 -168 -14 -89 1 -57 178 -108 202 -69 199 -16 -108 -21 240
6296 240 -44 -151 -137 -239 -149 -57 -54 89 -240 148 21 -171 294 22 -149 95 -64 -17 -120 -221 127 -84
6318 -84 -158 -51 -79 -179 -161 -58 2 -86 -126 131 -148 -45 -66 30 -17 39 -92 -121 -66 194 -197 -117 -165 -32 12
6343 12 -128 -259 -3 -270 166 207 -44 -22 173 392 -29 94 -23 110 82 -117 -61 -11 -207 155 26 -154
6365 -154 137 -49 -127 10 2 -103 139 -196 202 -56 -64 -45 52 -36 85 209 -18 38 40 62 392 55 -116 2
6389 2 64 -22 165 253 -369 23 -264 -111 -256 66 -226 -200 201 1 -204 -49 138 -58 -77 16 -154 -4 -62
6412 -62 11 60 76 -19 -89 -92 30 -57 31 -31 -53 -17 98 107 47 95 130 54 9 36 95 -126 6 84 -100 -4 110 -217
6440 -217 -19 2 -19 -50 -241 104 -217 108 -347 -176 73 181 77 -191 155 -67 -128 103 -146 251 -186
$$ packed form
6273A16o1J10k96K10O3k37K0J79j01j71J54p5R0n8K35k86L10k71K68k15r2Q7K61
6296B40k84j07J4j02R0R2LJ43l29L88j27j92M65k72j71K44j59M7j03j01L48k11
6318h4p4J07k8j00J8J03O0q8m0K57k79J03k1R6m7N6j31k9N5K60l91Q0m8J33M4
6343A2j40j31K56k67M36M1k51K2J95K19m21J23j17J33k8j99N6N0j96L62j29j80
6365a54K91j86p8J37qj05K42l35L98k58qJ9R7q8J21J24k27N6KK2L30l37j71J18
6389BO2q6J87Q8o22L92k87J53j45L22k92K6M01k00k05J55J87j96j9R3j70J50n8
6412f2P3M9J6r5p0lJ22q7Q8o2k2L6J15Ro0M8L5p6m5K7N9k21J32P8j84R6J14l27
6440b17J98K1k1l1j91L45l21L25m55J71K49J08j04k68L46k22o1K31k49L97m37
$$ plain form
6461 -186 7 23 19 -114 32 9 210 19 -12 -109 -39 90 79 131 -37 -49 -71 -2 68 68 -8 -95 -53 -231 -8 -13 52
6488 52 52 36 141 145 88 -37 12 -71 -35 5 136 174 371 14 -285 -204 -47 77 -188 -133 203 -116 104 261 -30
6513 -30 -183 42 103 -151 -111 -127 32 58 39 50 -94 -231 -51 21 35 167 -77 -239 48 25 -31 138 69 -154
6537 -154 -25 44 -184 223 -29 11 225 -57 -1 -180 25 10 31 132 -124 -22 53 -56 -232 -90 -44 98
6559 98 154 210 -170 189 -65 -131 181 75 -154 -53 -46 -19 225 249 -61 -74 162 -157 -28 -29 84 -2 204 166
6583 166 123 54 9 -95 37 -33 -9 93 -83 65 60 230 262 -30 155 -129 134 -66 114 -59 76 -306 -55
6606 -55 -35 -279 148 38 -330 -215 32 19 -149 142 -30 9 -87 -8 -19 -55 62 -84 28 -245 -256 -147 -21
6629 -21 -98 -208 49 -250 -94 94 90 24 -69 30 39 -78 -158 66 245 -73 -101 -156 346 37 -35 268 -145 185
$$ packed form
6461a86J93J6mj33J46k3K01j91l1r7P0J29j1N2j68j2k2O9P0%p6q7M2j78K23nO5
6488E2%j6J05Mn7j25M9q3L6M0J31L8J97l57k99Q1J57J24k65N5L36l19K20J57k91
6513c0j53K25O1k54M0j6J59K6j9J1j44j37J80P2J4J32k44j62K87k3n6J69o9k23
6537a54J29O9k28M07k52M0K14k82N6j79K05j5K1J01k56J02P5j09j76J42M6J42
6559I8N6N6l80L59k54o6L12j06k29J01PK7K44K4l10j3K36l19J29jJ13q6K06l8
6583A66m3o9m5j04J32p0K4J02j76J48nJ70L2k92J85k84K63k00J80j73J35l82K51
6606e5K0k44M27j10l68J15K47j3j68K91j72L9r6P9j1l6J17j46J12k73j1J09J26
6629b1p7j10K57k99J56J88mo6r3R9Rj17q0K24J79l18k8n5N02l09p2L03m13L30
$$ plain form
6653 185 115 8 157 87 -151 82 -1 144 39 243 -195 277 130 48 347 14 -131 199 -4 16 1 60
6675 60 -186 -75 241 72 50 -70 138 215 206 -160 -165 205 -63 7 -17 -75 -18 -236 123 206 331 47 -55 -21
6699 -21 -16 10 265 48 -91 117 84 -99 -24 159 199 -150 0 -6 -129 -21 -70 -144 -99 90 -48 322 -5 -184
6723 -184 3 22 -42 -197 14 10 192 -40 128 -30 25 37 7 231 -21 34 -67 -104 299 72 271 6 64
6746 64 -61 59 18 88 82 -109 -70 -84 147 38 39 5 -17 -45 240 2 120 11 126 88 -4 -15 62 -91 1 -206
6772 -206 -164 -8 144 -54 -194 -1 -56 -9 84 5 40 78 143 8 167 -49 -26 -188 -17 -41 -111 -123 -167 33
6796 33 -65 10 -22 118 200 210 231 247 249 -227 -5 101 42 -14 67 -71 -14 -57 -4 -100 145 128 -122 182 216 263 31
6823 31 -38 -141 -44 -25 -176 -73 21 -181 176 351 31 -193 -47 -253 -34 71 -37 170 122 3 -97 136
$$ packed form
6653A85p0j07J49p0k38K33q3J45j05K04m38M72j47q2K99l33j45L30k03K0j5N9
6675F0k46J11L16j69k2j20K08P7rl66nL70k68P0k4n8N7k18L59Q3J25k84j02L4
6699b1NK6K55k17j39K08l3j83P5J83M0l49J50oj23J08m9p4M5J89j38L70l27j79
6723a84J87J9o4j55K11mJ82k32J68j58N5J2l0K24k52N5j01l7M03k27J99k65N8
6746F4j25J20m1P0oj91L9j4K31j09Jl4k2k8K85k38J18j09J15l8r2j1P7j53R2k07
6772b06M2J56J52j98j40J93n5M7R3p9L5L8O5j35J59k16K3j62J71k4p0j2m4K00
6796C3r8P5l2J40Q2J0K1J6Km76K22J06n9n6Q1j38N7m3N3r6K45j7k50L04L4M7k32
6823C1o9j03R7J9j51J03R4k02L57J75l20k24J46k06K19J05j08K07m8j19j00K33
$$ plain form
6845 136 72 167 91 -40 -273 -115 85 34 -17 58 -205 -78 -128 98 62 161 -269 -24 65 82 207 -61 107 -12
6869 -12 -152 129 -9 -62 36 -153 164 144 -256 33 -115 -10 151 118 65 -39 18 -86 118 86 -95 57 -181
6892 -181 -66 -167 106 -53 -66 27 -8 -55 13 -78 -6 400 380 27 27 94 183 18 -220 -26 -46 55 61 141 163 128
6918 128 -130 58 -53 -468 135 182 112 161 -102 -106 72 179 -290 -113 -171 114 -9 -9 -40 -110 -17 139 131 -111
6942 -111 -34 81 219 -138 277 341 153 -164 183 -56 70 69 65 -119 -165 -118 36 62 -27 -137 -242 -82 -77 -140
6966 -140 -208 -200 -89 -224 -220 -80 -31 -29 134 -60 -169 75 -102 229 -65 16 -137 -161 133 89 -45 -6 40 184
6990 184 23 14 168 120 -93 -14 8 -30 -4 -25 125 94 45 45 145 72 26 102 149 153 142 -202 9 -120 5 171
7016 171 11 -14 132 -48 -235 95 7 98 -73 9 -61 12 380 63 -44 -113 111 -107 -53 -98 20 -63 93
$$ packed form
6845A36o4R5p6j31k33J58K00n1n1P5k63J27n0K26l6R9m30K45Q9J7J25k68J68j19
6869a2j40K81j38n3R8j89L17k0m00K89j48J05J61l3n3j04N7j04K04l2j81J52k38
6892a81J15j01K73j59j3R3l5m7O8r1P2M06k0l53%O7Q9j65k38J94k0J01OQ0K2l5
6918A28k58J88j11m15O03M7p0M9k63mJ78J07m69J77n8K85j23%l1p0R3J56qk42
6942a11P7J15J38l57M15O4j88l17L47k39J26jmj84m6M7J54K6q9j10j05J60No3
6966a40o8QJ11j35MJ40M9KJ63j94j09K44j77L31k94Q1j53k4K94m4j34L9M6J44
6990A84j61rJ54m8k13P9K2l8K6k1J50l1m9%J00p3m6P6M7Mj1l44K11j29J25J66
7016A71j60k5J46j80j87L30q8R1j71Q2p0P3L68l17j07o9K24k18N4m5J18q3J56
$$ plain form
7039 93 22 -115 74 -131 -62 56 152 -126 130 6 -30 114 -195 78 111 -150 225 41 -78 13 53 76 -76
7062 -76 54 -4 44 176 -107 -319 130 -22 -190 28 -272 -128 71 9 -86 110 -65 -23 -89 -126 -129 -57 42 -72
7086 -72 -56 109 -48 -70 129 -178 -105 -36 99 -44 30 -110 106 93 -54 179 -100 -10 234 -322 168 -151 60
7109 60 31 216 -60 85 -146 -72 50 -41 106 127 -143 -287 104 78 -18 -82 -3 180 115 37 86 127 -133 -18
7133 -18 104 -162 -30 126 5 134 57 -15 -101 -75 -140 -76 -15 -2 9 129 134 -121 180 229 -86 236 -13 -22 -99
7158 -99 -75 -16 176 91 -198 -166 68 -66 70 -206 53 -314 -31 103 102 103 -57 -150 8 -104 70 239 -25
7181 -25 -48 69 98 -67 78 -51 -70 39 18 229 -21 178 -318 -163 343 0 182 107 140 201 -251 47 76
7204 76 -35 145 -140 235 126 178 -169 162 199 26 -28 47 125 -123 -123 -191 153 -75 65 75 210 108 -303
$$ packed form
7039I3p1j37J89k05O9J18R6k78K56j24l6J44l09K73L3k61L75j84j19R1M0K3j52
7062g6J30n8M8J32k83k12M49j52j68K18l00J44J99o2r5J96j75M2o6l7lP2R9j14
7086g2J6J65j57k2J99l07P3O9J35j43P4j40K16j3j47K33k79R0K44n56M90l19K11
7109F0k9J85k76J45k31P4J22r1J47K1k70j44L91k6r6o4P9J83o5p8M9M1k60J15
7133a8J22k66J32J56j21J29p7p2q6K6o5O4O1J3J1J20Nk55L01M9l15L22k49rp7
7158i9K4N9J92q5k89L2K34j34J36k76K59l67K83J34jJj60r3J58j12J74J69k64
7181b5k3J17K9j65J45j29j9J09k1K11k50J99m96J55N06l43J82p5L3O1m52K98K9
7204G6j11J80k85L75j09N2l47L31L7j73n4P5P8k48%o8L44k28J40J0J35j02m11
$$ plain form
7227 -303 -113 181 30 -2 -199 91 258 -162 76 -276 170 -21 -86 109 -171 122 -26 69 18 -25 -91 71
7249 71 177 124 -89 118 75 137 53 51 40 -29 -109 -49 78 -37 12 -65 -5 6 -72 -42 252 -134 34 70 93 -83
7275 -83 201 226 -155 264 -104 -7 -151 90 374 -199 -165 142 76 -223 -113 143 157 -50 -96 -25 204 -34 20
7298 20 121 -252 70 68 -135 -108 221 40 -208 -88 1 -62 -146 -117 -23 80 53 -149 -98 154 120 52 -5 -35 39
7323 39 124 76 96 -108 59 -27 94 -44 -241 -167 -152 -104 -79 -119 80 -208 -211 71 -110 59 -66 66 1 -75 6
7348 6 75 127 36 -66 2 -55 277 -119 -3 -197 12 -69 90 52 169 106 -34 -13 -94 67 -81 -22 -183 60
7372 60 223 112 -79 127 67 260 -191 -65 161 -211 -130 -72 161 147 -135 -193 -99 -49 -60 -249 -26 101 -111
7395 -111 -97 -58 -189 186 86 -67 -58 -64 167 -161 50 -201 80 -126 -203 -409 65 -48 100 22 72 -173 -5
$$ packed form
7227c03J90K94j51l2j97K90J67m20K38l52M46j91o5J95k80K93j48R5n1m3o6J62
7249G1J06n3k13K07m3O2q4kj1o9q0O0J27j15M9p7O0J1p8L0K94l86J68L6K3j76
7275h3K84K5l81M19l68R7j44K41K84n73L4L07o6k99J10K56J4k07m6P1K29k38N4
7298B0J01l73L22kk03K7L29j81k48J20Q9o3q4K9R4J03k7k02N1K52l4o8n7l0P4
7323C9Q5m8K0k04J67q6J21j38j97P4J5M8K5m0J99k88lK82j81J69j25J32o5p6Q1
7348FO9N2r1j02O8n7L32l96J16j94K09q1J59l8J17o3j40K1q1J61j48N9j61K43
7372F0J63j11j91K06o0J93m51J26K26l72Q1N8K33j4k82n8R4N0j1j89K23J27k12
7395a11J4L9j31L75j00j53RoK31l28K11k51K81k06p7k06M74j13J48p8N0k45J68
$$ plain form
7418 -5 -69 -66 116 -7 18 -28 168 197 -17 -22 20 -175 -128 -113 -109 -85 81 129 -18 -118 146 -245 -188 72 69 79 -60
7445 -60 -90 158 -181 -54 86 -201 126 -110 -16 -39 154 -115 11 -41 -69 22 80 -126 241 149 -42 126 167
7468 167 -155 -54 224 -76 -93 121 -224 13 -75 47 168 192 -104 -122 49 -15 -115 -51 3 90 104 -15 -79
7491 -79 13 -203 -74 11 -47 -98 -59 146 -5 63 -40 92 277 123 -155 -86 242 -148 163 39 -140 -280 -56
7514 -56 78 -72 32 148 -229 86 -20 -91 -73 -64 -154 69 81 5 -267 -95 34 -19 34 285 81 1 -292 -218
7538 -218 102 -159 66 -26 51 -71 106 -51 170 -64 48 74 54 -60 -34 -117 219 -82 -55 -164 -185 190 -7
7561 -7 238 -28 -3 -18 -33 183 -123 110 241 -62 94 27 -57 -169 236 -79 81 56 -38 156 -150 -10 59
7584 59 37 -137 -18 45 -15 -18 170 250 18 -126 41 49 -121 -88 -15 -115 124 206 47 -34 -26 -111 73 19 -16 -139
$$ packed form
7418eo4LJ82j23K5m6J96K9k14nM2j95M7J5MK4J66M8j47j00K64l91N7K60lJ0j39
7445f0l0K48l39J27J40k87L27k36R4k3J93k69J26n2k8R1N8k06L67r2j91J68M1
7468A67l22J01K78l00j7K14l45K37q8J22J21K4k96j8J71o4j00O4N4Q7J4j19o4
7491g9R2k16J29Q5n8n1L9K05j51O8j03J32J85j54k78O9L28l90L11j24j79j40K24
7514e6J34j50J04J16l77L15j06p1J8Rr0K23J2p6k72J72J29n3N3K51k04q0k93P4
7538b18L20k61K25r2P7j22J77j57K21k34J12K6k0j14K6q3L36l01K7j09k1L75j97
7561gK45k66K5j5j5K16l06K33J31l03J56o7q4j12M05l15J60k5r4J94l06J40O9
7584E9k2j74J19O3o0lJ88Q0k32j44J67Qj70L3P3j00K39Q2j59q1Qq5J84n4l5j23
$$ plain form
7610 -139 268 21 -45 80 20 -262 41 65 -67 61 -108 249 -90 -52 226 256 59 -127 59 -78 -223 -122
7632 -122 119 -105 119 126 40 178 -13 -12 -27 148 -5 -11 109 -126 183 45 -125 109 -13 91 10 8 47 47 -50
7657 -50 80 -170 181 167 -99 -42 -10 146 -176 35 166 -95 -71 54 81 -25 62 -14 -174 70 14 -98 76
7680 76 17 156 -36 -6 -115 -203 49 149 13 -146 -14 215 -236 -283 89 -5 24 -243 -281 119 -84 -268 18
7703 18 57 26 -163 -42 326 115 141 -17 20 41 21 -179 97 149 272 183 39 59 89 68 141 -66 -68 44 -44
7728 -44 44 39 83 150 -113 186 14 10 3 -99 74 79 -432 -199 231 105 -88 129 -191 -2 -175 -224 103 147 69
7753 69 91 -15 67 -67 89 -164 -114 -28 75 -160 201 4 47 7 -50 -219 -4 -87 -39 116 -227 -151 -65 -156
7777 -156 -101 57 -87 -31 119 -36 -107 46 -24 143 -203 -22 -17 7 87 27 11 66 -160 50 -50 27 -82 181
$$ packed form
7610a39M07k47o6J25o0k82L03K4j32J28j69L57l39L8K78L0j97j86J86j37j45J01
7632a22K41k24K24Pq6J38j91Jj5J75j53oJ20k35L09j38j70K34j22J04q1kL9%r7
7657e0J30k50L51j4k66N7L2J56l22K11J31k61K4J25K7j06Q7p6j60K44n6j12J74
7680G6n9J39j92L0j09q8K52J00j36j59J32K29m51m7L72r4K9k67l8M00k03j84K86
7703A8L9l1j89J21L68k11K6j58L7K1k0k00K76N2J23q9j44K0L0k1P3k07kJ12q8
7728d4Q8nM4O7k63K99j72mpj02J73Nn11K33M30j26j93K17l20J89j73m9L27M4p8
7753F9K2j06Q2j34J56k53N0Q6J03k35L61j97M3m0n7j69K15q3M8J55l43P6Q6r1
7777a56N5J58j44N6J50j55p1J53p0J67l46J81NK4Q0o0j6N5k26K10j00P7j09K63
$$ plain form
7801 181 54 -157 -20 -59 -49 206 -223 -227 -34 155 -45 -8 97 -143 -36 -76 8 -43 -101 -104 139 -57 43 -170
7825 -170 180 282 69 92 -227 94 104 267 167 -34 -40 99 68 5 -85 -27 -4 23 201 92 -132 76 93 -21
7849 -21 -117 38 33 18 -80 131 173 44 93 120 57 -59 -64 -97 35 112 -2 -174 283 -72 27 63 5 138 -85 148
7875 148 -3 -56 56 181 -64 133 188 135 119 -125 93 -78 -136 -219 -23 -99 -271 -42 -100 115 -77 183 5
7898 5 113 -44 -224 103 198 279 128 -130 96 -55 60 187 -70 -219 -90 -99 141 -49 -349 31 -223 -67
7920 -67 28 65 -234 26 -62 -38 188 88 -66 20 -279 115 -77 -112 119 70 68 -146 118 172 -47 -248 -3 71
7944 71 -116 -120 -128 -32 -21 -244 -38 53 100 -22 59 66 -60 274 -73 -113 -98 -73 76 2 112 79 126 118 43 170 32
7971 32 -47 -52 258 -256 169 -134 -28 98 -113 39 -40 8 152 -103 -142 243 -186 149 -72 149 47 -30 38
$$ packed form
7801A81j27k11J37l9J0K55m29mJ93J89k00L7J05k40J07m0Q4n1n8lK43j96J00k13
7825a70L50J02k13K3l19L21J0J63j00k01oJ39l1o3r0N8K3K7J78j09k24K08J7j14
7849b1r6J55nj5r8K11M2j29M9K7o3j16nl3J32P7j14j72M57l55R9L6n8J33k23K33
7875A48j51n3J12J25k45J97N5n3j6k44K18j71n8q3J96p6j72K29n8K15j92K60j78
7898EJ08j57j80L27R5Q1j51k58K26j51J15J27k57j49J29rK40j90l00L80k54J56
7920f7R5L7k99K60q8K4K26j00j54Q6k99L94j92l5K31m9kk14K64N4k19k01K45P4
7944G1j87mqR6J1k23K06R1M7j22Q1Pj26L34l47m0J5K5J49p4J10l3M7qp5J27j38
7971C2p9nL10n14M25l03J06J26k11J52p9M8J44k55l9L85m29L35k21K21j02p7O8
$$ plain form
7994 38 -81 65 6 268 -6 -109 20 -34 -156 296 -117 11 -54 55 85 -69 -53 -10 -18 73 -237 132 -84
8017 -84 -127 -156 -44 -79 -151 183 -100 185 -13 -70 148 43 -16 -124 -63 57 -142 -138 -79 -4 87 -3 302 50 70
8042 70 -323 114 -38 -13 182 116 -102 -104 65 -54 9 -113 -93 0 -70 -62 63 -97 -126 178 100 180 143 -78 -69 -40
8068 -40 -205 -232 232 44 -133 124 72 7 -42 -129 -120 -29 14 147 88 158 93 -209 -44 119 263 -96 276 84
8092 84 -252 4 -21 -215 -138 158 320 -120 75 143 -35 57 113 117 -23 -111 5 142 225 -219 46 70 -44 86
8116 86 -90 66 -1 171 0 -152 4 -49 -279 125 109 -160 -50 148 -105 -91 56 52 -245 100 -45 15 203
8139 203 -54 -21 31 8 91 10 -63 -151 -45 -132 -277 -113 -324 135 67 78 1 89 13 173 18 118 86 164 120
8164 120 205 1 -55 32 -59 -24 -42 -158 -55 -24 -213 -51 80 136 29 -5 -285 174 87 -4 164 -202 -144 -28
$$ packed form
7994C8j19J46n9K62k74j03J29n4j22M52m13J28o5J09L0j54J6M3qR1l10L69k16
8017h4m3k9J12l5p2L34k83K85j98n7K18j05n9j08O1J20j99MN9P5R1r0L05k52K0
8042G0l93M37j52K5J95o6k18kJ69j19O3j22K0R3p0QJ25j60k9L04p8Q0l7k21RK9
8068d0j65k7M64j88j77K57n2o5m9q7RR1M3J33n9P0o5l02J65J63J44l59L72j92
8092H4l36K56k5j94P7K96J62m40J95O8j78R2N6Mj40q8J16J37Q3m44K65K4j14J30
8116H6j76J56o7J72j71j52J56n3k30M04j6k69J10J98k53J4J47mk97L45j45O0J88
8139B03k57L3N2k3Q3q1p3q8J06q7j45J64k11M59o8J1p7Q8p6J60j55J00l2P8m4
8164A20Q5k04n6Q7r1L5j8j16J03L1j89J62J31N6j07l4k80M59q7r1J68l66N8J16
$$ plain form
8188 -28 -137 -79 -148
$$ packed form
8188b8j09N8o9
8191a48
$$ Imaginary data points
##PAGE= N=2
##DATA TABLE= (X++(I..I)), XYDATA
$$ plain form
0 0 0 0 0 0 0 0 0 0 0 -8 8 -8 8 -16 16 -24 24 -32 40 -46 56 -64 78 -89 106 -123 145 -166 192 -220 251 -285
32 -285 325 -366 414 -468 525 -590 655 -733 816 -905 1005 -1111 1230 -1356 1498 -1652 1821
49 1821 -2004 2210 -2433 2684 -2963 3275 -3627 4028 -4490 5027 -5663 6431 -7374 8571
63 8571 -10145 12318 -15517 20731 -30703 56837 -280590 -646184 -266442 44653 395766
74 395766 569449 558002 374062 246133 128493 91619 27590 -118918 -254231 -229168 -189104
85 -189104 -126704 -33387 -35025 -162650 -205748 -142534 -8523 148703 207647 119705 21872 -64354
97 -64354 -85973 61596 250744 281259 228695 150219 18608 -74165 -87653 -123919 -176886 -225265
109 -225265 -277588 -233535 -91173 -20734 -12355 16764 5412 7874 147372 315517 387390 372876
$$ packed form
0@%%%%%%%%%qJ6j6J6k4L2m0M8n6P2q6J02j20J42j67J95k29K68l11L58m12M71n36
32b85O10o91P80q82R93j115J245j388J549j721J910k116K341k586K854l150L473
49A821l825M214m643N117n647O238o902P655q518R517j0690J2094j3805J5945
63H571j8716K2463k7835L6248n1434Q7540l37427l65594L79742L11095L51113
74C95766J73683j1447j83940j27929j17640l6874o4029j46508j35313K5063M0064
85a89104O2400R3317j638j27625m3098O3214J34011J57226N8944q7942r7833q6226
97f4354k1619J47569J89148L0515n2564p8476j31611r2773j3488l6266n2967m8379
109b25265n2323M4053J42362P0439Q379K9119j1352K462J39498J68145P1873j4514
$$ plain form
121 372876 245950 53447 -75068 -158076 -223679 -221915 -231603 -292979 -263998 -144429 -43516
132 -43516 70136 174696 178833 148872 134656 93169 75466 81635 21249 -36618 -23087 -27182
144 -27182 -30466 21797 28417 -25987 -52491 -81776 -113447 -83798 -58522 -66797 -36370 -17314 -39551
157 -39551 -2427 64731 87742 132018 184195 168248 139390 110303 29347 -36139 -66359 -131759
169 -131759 -178875 -173265 -190616 -187783 -109916 -43286 9724 97199 150877 168386 209335 205858
181 205858 140243 86690 7754 -99315 -129391 -110212 -104753 -67437 -34445 -59060 -61407 -32750
193 -32750 -28878 4484 56218 44542 29891 49436 34025 20488 44351 27866 -5379 4539
205 4539 6647 13695 60811 61081 7971 -23338 -71694 -131239 -117412 -81190 -77377 -44903 -3514
$$ packed form
121C72876j26926j92503j28515q3008o5603J764r688o1376K8981J19569J00913
132d3516J13652J04560M137k9961j4216m1487j7703O169o0386n7867J3531m095
144b7182l284N2263O620n4404k6504k9285l1671K9649K5276q275L0427J9056k2237
157c9551L7124O7158K3011M4276N2177j5947k8858k9087q0956o5486l0220o5400
169a31759m7116N610j7351K833P7867O6630N3010Q7475N3678J7509M0949l477
181B05858o5615n3553p8936j07069l0076J9179N459L7316L2992k4615k347K8657
193c2750L872L3362N1734j1676j4651J9545j5411j3537K3863j6485l3245R918
205D539K108P048M7116K70n3110l1309m8356n9545J3827L6222L813L2474M1389
$$ plain form
218 -3514 12106 64969 125040 126144 119598 100919 29233 -10454 -674 -25273 -53916 -57011 -90004
231 -90004 -111019 -74768 -44989 -17179 32095 37429 22414 51587 63474 45090 56643 47245
243 47245 -2655 -15006 -10950 -28337 -19747 -13567 -43384 -40651 -15381 -13653 18853 62339 39330
256 39330 3043 -11435 -51964 -73254 -41441 -20605 3520 55832 74658 76582 97718 69700
268 69700 3151 -29390 -64888 -105149 -83492 -46614 -37164 -9136 8162 -5430 12922 39934
280 39934 31115 41890 58925 31291 19771 34511 13629 -6596 -4897 -33133 -56564 -44297
292 -44297 -50453 -53562 -25253 -21862 -23270 22224 54805 61099 84330 75422 22409 -8156 -31991
305 -31991 -62051 -47153 -19315 -16475 10820 38745 23133 16022 14599 -26956 -54227 -44302 -43879
$$ packed form
218c514J5620N2863O0071J104o546j8679p1686l9687R780k4599k8643l095l2993
231i0004k1015L6251K9779K7810M9274N334j5015K9173J1887j8384J1553r398
243D7245m9900j2351M056j7387Q590O180k9817K733K5270J728L2506M3486k3009
256C9330l6287j4478m0529k1290L1813K0836K4125N2312J8826J924K1136k8018
268F9700o6549l2541l5498m0261K1657L6878R450K8028J7298j3592J8352K7012
280C9934q819J0775J7035k7634j1520J4740k0882k0225J699k8236k3431J2267
292d4297o156l109K8309L391j408M5494L2581O294K3231q908n3013l0565k3835
305c1991l0060J4898K7838K840K7295K7925j5612p111j423m1555k7271R925M23
$$ plain form
318 -43879 -23448 23932 37834 39774 55958 37181 10207 16170 1685 -24933 -16419 -16998 -32854
331 -32854 -14849 -2228 -12234 3027 12191 -7686 -3803 1423 -22215 -17865 5617 5073 22849
344 22849 53515 44646 32856 30245 -7371 -40379 -42489 -57756 -58905 -20109 2819 15606 45496
357 45496 39984 6710 -240 -9892 -24471 -1578 17451 9454 19554 26107 7069 9780 13391
370 13391 -17814 -34791 -34078 -46493 -29987 7917 9936 6225 15945 4875 6906 38480 39604
383 39604 18678 7969 -21031 -40215 -11073 11837 11977 21298 6717 -28129 -24323 -10805 -18818
396 -18818 -15999 -19570 -39838 -19134 25915 47056 65378 65350 16931 -16731 -10412 -9240 -52 14658
410 14658 -11795 -43764 -39471 -31433 -15257 14437 3900 -26690 -20575 -2667 19603 65131 77906
$$ packed form
318d3879K0431M7380J3902J940J6184j8777k6974N963j4485k6618Q514n79j5856
331c2854J8005J2621j0006J5261R164j9877L883N226k3638M350K3482n44J7776
344B2849L0666q869j1790k611l7616l3008k110j5267j149L8796K2928J2787K9890
357D5496n512l3274o950r652j4579K2893J9029p997J0100O553j9038K711L611
370A3391l1205j6977P13j2415J6506L7904K019l711R720j1070K031L1574J124
383C9604k0926j0709k9000j9184K9142K2910J40R321j4581l4846L806J3518q013
396a8818K819l571k0268K0704M5049K1141J8322k8m8419l3662O319J172R188J4710
410A4658k6453l1969M293Q038J6176K9694j0537l0590O115J7908K2270M5528J2775
$$ plain form
423 77906 37457 4301 -16591 -30930 -8998 8929 -14205 -32832 -38650 -45102 -12223 36097
435 36097 34997 12658 -739 -21714 -15467 22585 33032 19015 3937 -27383 -36744 2375 28558
448 28558 24572 21798 -1040 -30320 -14705 11972 11263 4386 -19885 -53652 -43332 -8534 8724
461 8724 28458 33045 2337 -3428 27757 43982 49142 42473 -3453 -44563 -46210 -42243 -30654
474 -30654 -10760 -25628 -46221 -22818 8640 33345 63997 59062 16149 -5944 -9224 -5169 21248
487 21248 29331 -380 -16701 -18926 -27361 -13511 2504 -18990 -38710 -29136 -14819 16577 52121
500 52121 42923 10687 -11509 -34290 -29833 13311 35341 29592 30492 20165 5120 15736 14073
513 14073 -17614 -41658 -60697 -71374 -39739 -605 5922 8042 7001 -4711 17234 62370 77035
$$ packed form
423G7906m0449l3156k0892j4339K1932J7927k3134j8627n818o452L2879M8320
435C6097j100k2339j3397k0975O247L8052J0447j4017j5078l1320r361L9119K6183
448B8558l986k774k2838k9280J5615K6677p09o877k4271l3767J0320L4798J7258
461H724J9734M587l0708n765L1185J6225N160o669m5926m1110j647L967J1589
474c0654J9894j4868k0593K3403L1458K4705L0652m935m2913k2093l280M055K6417
487B1248Q083k9711j6321k225q435J3850J6015k1494j9720R574J4317L1396L5544
500E2121r198l2236k2196k2781M457M3144K2030n749R00j0327j5045J0616j663
513A4073l1687k4044j9039j0677L1635L9134O527K120j041j1712K1945M5136J4665
$$ plain form
526 77035 68801 43614 -9546 -42848 -36278 -32114 -27267 -14025 -23735 -33089 -9782 7501 7948 9385
540 9385 -9393 -31504 -12515 21431 44051 65211 54306 4765 -25602 -31309 -31661 -9185 14533
553 14533 8381 5377 12244 3219 460 -112 -31712 -60160 -55433 -41093 -11946 34430 52524 44883
567 44883 41259 30052 23477 39748 37694 8546 -10213 -34537 -63547 -60118 -41870 -39152 -28077
580 -28077 -12054 -3486 21396 46429 43528 37677 29615 2356 -5986 15924 22404 18172 16971 -5881
594 -5881 -34368 -41996 -45360 -40277 -17146 -8178 -5451 17934 28350 16224 15546 10115 -13511 -17460
608 -17460 -2620 10557 32815 47033 35397 25433 11115 -22083 -36543 -30557 -41830 -47991 -30249
621 -30249 -21813 -16872 1057 11310 18180 32142 33217 33578 47932 40854 16379 8624 -5766 -35028
$$ packed form
526G7035q234k5187n3160l3302O570M164M847J3242r710r354K3307J7283M47J437
540I385j8778k2111J8989L3946K2620K1160j0905m9541l0367n707l52K2476K3718
553A4533o152l004O867r025k759n72l1600k8448M727J4340K9147M6376J8094p641
567D4883l624j1207o575J6271k054k9148j8759k4324k9010L429J8248K718J1075
580b8077J6023Q568K4882K5033k901n851q062k7259q342K1910O480m232j201k2852
594e881k8487p628l364N083K3131Q968K727K3385J0416j2126o78n431k3626l949
608a7460J4840J3177K2258J4218j1636r964j4318l3198j4460N986j1273o161J7742
621c0249Q436M941J7929J0253O870J3962J075L61J4354p078k4475p755j4390k9262
$$ plain form
635 -35028 -39242 -27722 -24830 -16107 -9349 -14453 -11250 -9011 -15104 -820 21466 18692 19859 34074
649 34074 26569 11654 9717 380 -10511 -8426 -8108 -2224 14017 7331 -9796 -11014 -23470 -43203
663 -43203 -34138 -16218 -12505 -331 14417 19088 29987 38069 32390 34454 29969 4246 -6488
676 -6488 -2469 -16886 -28669 -24483 -31486 -38875 -28584 -18424 -4924 14069 15659 14889 29194 30076
690 30076 21369 28403 23312 -1779 -11619 -13114 -18567 -11237 -4596 -11314 -11793 -12422 -20422 -8689 9547
705 9547 4903 2138 8922 1583 -1319 11346 14461 11968 12586 3093 -1093 10511 8835 -943 -1615
720 -1615 -15097 -34006 -26860 -10933 -4907 5490 6577 -5479 -4340 3943 7857 22396 31084 15502
734 15502 6104 8042 577 -1753 1961 -13530 -29725 -28736 -25726 -11300 14047 17869 7454 4809
$$ packed form
635c5028m214J1520K892Q723O758n104L203K239o093J4284K2286k774J167J4215
649C4074p505j4915j937r337j0891K085L18N884J6241o686j7127j218j2456j9733
663d3203R065J7920L713J2174J4748M671J0899Q082n679K064m485k5723j0734
676f488M019j4417j1783M186p003p389J0291J0160J3500J8993J590p70J4305Q82
690C0076q707P034n091k5091r840j495n453P330O641o718m79o29q000J1733J8236
705I547m644k765O784p339k902J2665L115k493O18r493m186J1604j676r778o72
720a615j3482j8909P146J5927O026J0397J087j2056J139Q283L914J4539Q688j5582
734A5502r398J938p465k330L714j5491j6195R89L010J4426K5347L822j0415k645
$$ plain form
748 4809 -3996 -9546 6554 16436 9294 6791 1747 -4825 7439 18186 9974 2314 -9113 -27458
762 -27458 -23497 -4665 328 1194 -291 -15409 -18441 -1425 9902 19336 26179 11791 -3292 1816
776 1816 6467 7710 14292 5233 -13972 -16846 -13974 -12374 -1674 -2090 -17365 -17542 -7784 84 19675
791 19675 34532 23181 8528 134 -11023 -8577 2121 -2103 -5681 -1934 -6446 -5134 8472
804 8472 7007 -3755 -5404 -10306 -12799 774 8883 6245 8819 3793 -5901 231 6261 123 2263
819 2263 3792 -6104 -5905 928 -2568 -822 4436 -813 -128 4948 -2771 -7590 -2126 -5353 -6108 5510
835 5510 7553 2691 6143 4712 462 5194 1429 -9808 -8201 -6286 -6604 7212 16239 6100 -2553
850 -2553 -7783 -15511 -7610 6986 7421 5367 2812 -7205 -4205 11235 12281 6030 1496 -12537
$$ packed form
748D809q805n550J6100R882p142k503n044o572J2264J0747q212p660j1427j8345
762b7458L961J8832M993Q66j485j5118l032J7016J1327R434O843j4388j5083N108
776A816M651J243O582r059j9205k874K872J600J0700m16j5275j77R758P868J9591
791A9675J4857j1351j4653q394j1157K446J0698m224l578L747m512J312J3606
804H472j465j0762j649m902k493J3573Q109k638K574n026r694O132O030o138K140
819B263J529r896J99O833l496J746N258n249O85N076p719m819N464l227p55J1618
835E510K043m862L452j431m250M732l765j1237J607J915l18J3816R027j0139q653
850b553n230p728P901J4596M35k054k555j0017L000J5440J046o251m534j4033
$$ plain form
864 -12537 -19026 -4801 6326 7098 5590 -7568 -18527 -6499 9494 16449 21574 9842 -14532
877 -14532 -19290 -8143 1807 13708 13869 -4479 -14464 -9500 -3052 9619 16769 -23 -16457 -13803
891 -13803 -5655 10436 27813 18920 -5317 -19419 -24567 -14231 11826 21543 9542 -2042 -12514
904 -12514 -15795 2623 18133 12048 1464 -9618 -18023 -4605 14956 15823 7880 -5247 -22519
917 -22519 -19169 3262 15694 15946 8862 -12284 -23424 -10683 4530 14097 19050 5971 -10181
930 -10181 -6706 1958 6813 12457 3857 -15483 -18429 -8854 1 12900 14403 -3659 -14392 -12012
944 -12012 -6628 8805 21493 12622 -696 -5593 -10124 -4191 9174 7364 -2758 -5521 -9822 -7636
958 -7636 6911 12469 5337 910 -6694 -12759 -2772 5831 2834 1510 -2226 -10744 -5526 5303 6737
$$ packed form
864a2537o489J4225J1127P72j508j3158j0959J2028J5993O955N125j1732k4374
877a4532m758J1147R950J1901J61j8348r985M964O448J2671P150j6792j6434K654
891a3803Q148J6091J7377q893k4237j4102n148J0336K6057R717j2001j1584j0472
904a2514l281J8418J5510o085j0584j1082q405J3418J9561Q67p943j3127j7272
917b2519L350K2431J2432K52p084k1146j1140J2741J5213R567M953j3079j6152
930a0181L475Q664M855N644q600j9340k946R575Q855J2899J503j8062j0733K380
944a2012N384J5433J2688q871j3318m897m531N933J3365j810j0122k763m301K186
958g636J4547N558p132m427p604o065R987Q603k997j324l736q518N218J0829J434
$$ plain form
973 6737 8621 8145 -1508 -3001 4032 3677 3413 4841 -5268 -12757 -8681 -7327 -5952 2326 1660 -2326
989 -2326 2607 4400 2858 8431 7400 -1197 343 2030 -1788 2462 5136 -2448 -5879 -5672 -9663
1004 -9663 -5640 2387 1691 3123 6594 -556 -4473 136 -1696 -2673 4308 4820 2557 6329 4192 -1264
1020 -1264 -95 -3557 -8975 -3093 417 -1510 3578 5836 -2938 -6160 -5160 -7621 -2149 6354 7186
1035 7186 9349 10560 1214 -3641 -1216 -6358 -7500 528 1996 1415 6333 3498 -3241 -4258 -8573
1050 -8573 -10784 -1620 4365 4526 9654 8801 -892 -2696 -1508 -4151 92 5637 3734 5463 5694 -2269
1066 -2269 -5583 -5742 -12673 -12427 -2387 1010 3770 9574 5273 -1010 -584 -1837 -378 8616 10648
1081 10648 6320 6728 1479 -8736 -8667 -7327 -11272 -7209 -1464 -1202 3689 6797 1447 -545 355 -3925
$$ packed form
973F737J884m76r653j493P033l55k64J428j0109p489M076J354J375Q278o66l986
989b326M933J793j542N573j031q597J540J687l818M250K674p584l431K07l991
1004i663M023Q027o96J432L471p150l917M609j832r77O981N12k263L772k137n456
1020a264J169l462n418N882L510j927N088K258q774l222J000k461N472Q503Q32
1035G186K163J211r346m855K425n142j142Q028J468n81M918k835o739j017m315
1050h573k211R164N985J61N128q53r693j804J188k643M243N545j903J729K31p963
1066b269l314j59o931K46J0040L397K760N804m301o283M26j253J459Q994K032
1081A0648m328M08n249j0215O9J340l945M063N745K62M891L108n350j992R00m280
$$ plain form
1097 -3925 -681 9085 9345 7836 8556 714 -6400 -5202 -6973 -7461 -1927 -1573 -3812 1135 1497 -2514
1113 -2514 -240 -725 -4895 -86 5385 5601 8753 8888 308 -2707 -1597 -4368 -1444 4044 15 -2766
1129 -2766 -1174 -4998 -5382 -133 -2289 -4704 -411 -112 207 7340 7119 1827 1816 -498 -2742 3201
1145 3201 6388 2867 3013 -218 -7979 -6894 -3435 -6558 -5415 -1664 -3358 -442 5911 5779 5857 6637
1161 6637 527 -1105 4835 3999 1802 4086 -1209 -8482 -7015 -5805 -5944 -1812 -1794 -3837 1172 3617
1177 3617 2345 6503 7278 46 81 3872 2148 1755 2903 -2222 -4260 -2871 -4616 -2649 826 -4465
1193 -4465 -7220 -1915 -1010 -304 5744 5916 1248 1333 1382 2190 6312 4630 -932 49 -561 -4742 -1213
1210 -1213 1104 -6073 -9609 -6549 -5037 265 5974 4391 2919 1889 -1942 1344 9614 7069 1725
$$ packed form
1097c925L244R766K60j509P20p842p114J198j771m88N534L54k239M947L62m011
1113b514K274m85m170M809N471K16L152J35q580l015J110k771K924N488m029k781
1129b766J592l824l84N249k156k415M293K99L19P133k21n292j1k314k244N943
1145C201L187l521J46l231p761J085L459l123J143L751j694K916O353j32P8P80
1161F637o110j632N940q36k197K284n295p273J467J210j39M132J8k043N009K445
1177C617j272M158P75p232L5L791j724l93J148n125k038J389j745J967L475n291
1193d465k755N305R05P06O048J72m668Q5M9Q08M122j682n562R81o10m181L529
1210a213K317p177l536L060J512N302N709j583j472j030l831L286Q270k545n344
$$ plain form
1225 1725 1632 -2426 -5989 -1612 471 -1762 -2881 -5167 -5144 2602 4672 352 -326 -3315 -9644 -3922
1241 -3922 6439 8469 8476 6187 -77 -1084 1833 928 2139 1543 -6677 -9114 -2284 134 -736 288
1257 288 -4351 -9728 -5781 368 6763 12501 9069 1489 2135 2461 764 4573 3695 -6153 -10441 -8392
1273 -8392 -6508 -1240 2021 -1376 -2430 -464 542 6043 12084 6188 -1926 -2865 -4707 -2953 4240
1288 4240 5633 1499 -1104 -4828 -5821 245 1299 -3031 -2536 -2913 -3714 2523 8435 5444 1895 -1369
1304 -1369 -5924 -2564 3732 3972 4037 3025 -3037 -3986 1566 1369 -1491 -2168 -6313 -8056 -2513 1552
1320 1552 2860 5318 2194 -1770 2731 5889 4249 4040 239 -6836 -6948 -2370 -713 3377 3625 -2539
1336 -2539 -3533 -1051 -1357 473 2519 -1991 -4353 -550 1719 4419 7585 3516 -2269 -2594 -2707 -1786
$$ packed form
1225A725r3m058l563M377K083k233j119k286K3P746K070m320o78k989o329N722
1241c922J0361K030Pk289o264j007K917r05J211n96q220k437O830K418q70J024
1257B88m639n377L947O149O395N738l432p580O46L26j697L809q78r848m288K049
1273h392J884N268L261l397j054J966J006N501O041n896q114r39j842J754P193
1288D240J393m134k603l724r93O066J054m330M95l77q01O237N912k991l549l264
1304a369m555L360O296K40O5j012o062r49N552j97k860o77m145j743N543M065
1320A552J308K458l124l964M501L158j640k09l801p075j12M578J657M090K48o164
1336b539r94K482l06J830K046m510k362L803K269K700L166m069n785l25j13R21
$$ plain form
1352 -1786 3838 3201 -1746 -2636 -2743 -3128 686 2189 -2030 -2927 -2627 -3257 1849 6765 4149 2196 2047
1369 2047 -800 369 3578 1101 -2670 -3888 -7216 -6300 281 2554 2237 4171 1737 -835 1947
1384 1947 3350 800 644 -1526 -4672 -1891 1121 162 1180 202 -4339 -4062 225 830 3163 5189
1400 5189 2283 526 1629 -92 -99 1209 -2289 -4943 -2202 -1649 -1235 2102 1665 -1135 -645 -310 -628
1417 -628 2684 2822 68 373 289 -2087 116 2610 442 33 1188 -1286 -964 777 -1161 -1681 -855
1434 -855 -2571 -2418 1198 687 -384 1297 356 -1218 1699 3094 2234 3616 2475 -813 -411 -1034 -3512
1451 -3512 -2366 -1027 -3600 -2404 18 -778 784 2248 378 365 1855 640 844 3674 2124 430
1467 430 1994 255 -1959 -515 -1788 -4129 -2943 -2911 -3067 365 1973 1058 2016 1600 -1412 -509 1357
$$ packed form
1352a786N624o37m947q90j07l85L814J503m219q97L00o30N106M916k616j953j49
1369B047k847J169L209k477l771j218l328R16O581K273l17J934k434k572K782
1384A947J403k550j56k170l146K781L012r59J018r78m541K77M287O05K333K026
1400E189k906j757J103j721pJ308l498k654K741N53M14L337m37k800M90L35l18
1417f28L312J38k754L05q4k376K203K494k168m09J155k474L22J741j938n20Q26
1434h55j716J53L616n11j071J681r41j574K917J395q60J382j141l288M02o23k478
1451c512J146J339k573J196K422p96J562J464j870j3J490j215K04K830j550j694
1467D30J564j739k214J444j273k341J186L2j56L432J608r15R58m16l012R03J866
$$ plain form
1484 1357 493 2280 3924 2420 1996 2143 -894 -2230 -2321 -5168 -5437 -2192 -2314 -1735 1145 864 42
1501 42 2691 3240 3386 5181 4109 629 211 -919 -3255 -1806 -739 -2346 -1415 -845 -2878 -2604 -1290
1518 -1290 -2787 -1376 1415 1941 4085 6878 5083 2032 463 -3048 -4598 -2139 -858 -141 2575
1533 2575 1618 -673 -338 -857 -2633 -1436 -2264 -4286 -2657 -249 717 3768 5447 3193 2600 2663 1216
1550 1216 1128 2334 -899 -3046 -3151 -4462 -3828 -503 -886 -2205 -1661 -2645 -1954 2093 4207 3803 4519
1567 4519 2849 1020 2947 3125 1045 -517 -3020 -6945 -6399 -3047 -1740 855 2200 572 752 2180
1583 2180 1359 1179 776 -2555 -3725 -256 2956 5294 7099 3740 -1656 -3939 -4972 -4023 -573 379
1599 379 -1340 -1651 -1778 -2156 848 2801 1056 69 854 950 3510 5309 2656 -132 -2360 -4694 -3183
$$ packed form
1484A357q64J787J644j504m24J47l037j336r1k847k69L245j22N79K880k81q22
1501D2K649N49J46J795j072l480m18j130k336J449J067j607R31N70k033K74J314
1518a290j497J411K791N26K144K793j795l051j569l511j550K459J281P17K716
1533B575r57k291L35n19j776J197q28k022J629K408R66L051J679k254n93O3j447
1550A216q8J206l233k147j05j311O34L325l83j319N44r84O91M047K114m04P16
1567D519j670j829J927J78k080j562k503l925N46L352J307K595J345j628J80J428
1583B180q21j80m03l331j170L469L212K338J805l359n396k283j033R49L450R52
1599C79j719l11j27l78L004J953j745r87P85R6K560J799k653k788k228k334J511
$$ plain form
1616 -3183 1192 1609 -660 -2053 -4564 -5145 -1226 2066 4233 5440 3502 670 692 287 -1596 -1248
1632 -1248 -1755 -3325 -766 2770 3335 2887 678 -3277 -4419 -2902 -1672 972 2621 -99 -1549 -6
1648 -6 157 1259 3557 3331 1424 1340 813 -233 474 -1463 -3546 -2960 -2547 -2534 -843 -164 -1944 -1215 723
1667 723 1681 4253 5828 4039 2489 1038 -1861 -1975 -1502 -2416 -2892 -1515 -1235 -749 621 -329 -1439
1684 -1439 -240 227 1322 3342 3113 455 -238 -1080 -1724 468 2038 593 256 -208 -1685 -673 255
1701 255 -869 -1224 -1178 -1586 -518 1258 410 -718 -472 -814 643 4353 5094 3798 1798 -1796 -4304
1718 -4304 -3119 -1536 -992 136 -592 -1841 -587 1092 499 812 477 -1266 -245 2423 3406 3423 1897
1735 1897 -1645 -3329 -2126 -972 787 1672 -528 -2785 -2316 -1030 188 2233 1705 232 -711 -420
$$ packed form
1616c183M375M17k269j393k511n81L919L292K167J207j938k832K2m05j883L48
1632a248n07j570K559L536N65m48k209l955j142J517J230K644J649k720j450J543
1648fJ63J102K298k26j907q4n27j046P07j937k083N86M13J3J691O79j780P29J938
1667G23R58K572J575j789j550j451k899j14M73r14m76J377K80M86J370r50j110
1684a439J199M67J095K020k29k658o93q42o44K192J570j445l37m64j477J012R28
1701B55j124l55M6m08J068J776q48j128K46l42J457L710P41j296k000l594k508
1718d304J185J583N44J128p28j249J254J679n93L13l35j743J021K668R83J7j526
1735A897l542j684J203J154J759Q85k200k257M69J286J218K045n28j473r43K91
$$ plain form
1751 -420 -354 1529 1852 92 250 960 726 2068 2583 -693 -3481 -4544 -5051 -2775 342 814 1373 1675
1769 1675 575 939 2868 2768 1177 809 -690 -1269 27 349 261 -202 -1892 -3231 -1691 -652 -1066
1786 -1066 -43 424 -322 871 2546 3076 3037 1987 -460 -1275 -1499 -1805 -699 915 -342 -976 633
1803 633 377 -144 126 -825 -1615 -1658 -1519 -673 1248 1708 1301 2043 1971 375 530 550 -815 -1344 -1247 -1396
1823 -1396 -403 115 -338 -206 99 -1217 -1275 136 -328 -203 1248 1442 1530 2232 1778 753 217 -1190 -2521
1842 -2521 -1782 -1827 -1890 -102 697 184 755 997 574 480 327 -414 422 886 157 677 1451 223 -654 -63
1862 -63 -1033 -1698 -871 -1217 -1051 -119 64 615 1553 1240 642 993 420 -651 -536 183 -290 -83 652 21
1882 21 -63 -344 -1352 -1068 -770 -1462 -1032 568 645 915 1862 1306 842 1193 207 -71 167 -295 -1039 -82
$$ packed form
1751d20O6J883L23j760J58P10k34J342N15l276k788j063n07K276L117M72N59L02
1769A675j100L64J929j00j591l68j499n79J296L22q8m63j690j339J540J039m14
1786a066J023M67p46J193J675N30l9j050k447q15k24l06J106J614j257o34J609
1803F33k56n21K70r51p90m3J39Q46J921M60m07P42p2j596J55K0j365n29R7j49
1823a396R93N18m53J32L05j316n8J411m64J25J451J94Q8P02m54j025n36j407j331
1842b521P39m5o3J788P99n13N71K42m23r4j53p41Q36M64p29N20P74j228q77N91
1862f3r70o65Q27l46J66R32J83N51R38l13n98L51n73j071J15P19m73K07P35o31
1882B1q4k81j008K84K98o92M30J600P7K70R47n56m64L51r86k78K38m62p44R57
$$ plain form
1902 -82 -479 -862 -159 14 -456 -269 -178 -617 224 656 215 794 1322 535 564 1065 -16 -537 -230 -843 -856
1923 -856 46 98 -68 438 -101 -657 -287 -600 -791 -159 350 43 1072 1081 802 1292 881 -248 -270 -273 -1115
1944 -1115 -415 -194 -1014 -1279 -1040 -1088 -618 214 204 826 1310 1163 1293 2085 1613 415 81 -1201 -2104 -1274
1964 -1274 -1328 -1132 -631 -506 -872 212 1192 779 779 1207 104 194 538 243 657 409 -432 -337 -85 -204 -297
1985 -297 11 -970 -1525 -878 -301 156 869 384 -162 -56 -184 -176 950 1120 658 1028 1400 652 1069 705
2005 705 -1265 -2054 -2602 -2683 -1308 -169 170 644 847 764 1124 1867 1404 452 372 -191 -517 378 380 -108 -212
2026 -212 -1172 -1621 -553 -427 -618 -736 -792 -1139 387 1264 1400 1387 984 -177 -160 893 651 704 707 -502
2046 -502 -913 207 -40 -487 -761 -2262 -2885 -1848 -801 362 1758 1918 1655 2156 2420 1752 1524 166
$$ packed form
1902h2l97l83P03J73m70J87R1m39Q41M32m41N79N28p87K9N01j081n21L07o13j3
1923h56R02N2j66N06n39n56L70l13j91O32N09l07J029Rk79M90m11j129k2lq42
1944a115P00K21q20k65K39m8M70Q32j0O22M84j47J30P92m72j198l34j282r03Q30
1964a274n4J96N01J25l66J084R80m13%M28j103R0L44k95M14k48q41R5K52j19r3
1985b97L08r81n55O47N77M57P13m85n46J06j28QJ126J70m62L70L72p48M17l64
2005G05j970p89n48q1J375J139L39M74K03q3L60P43m63r52q0n63l26Q95Km88j04
2026b12r60m49J068J26j91j18n6l47J526Q77J36j3m03j161J7J053k42N3Lj209
2046e02m11J120k47m47k74j501o23J037J047J163J396J60k63N01K64o68k28j358
$$ plain form
2064 166 -1825 -2164 -1966 -1920 -360 341 -553 -922 -605 -366 326 1560 766 228 697 605 1074 1485 783 -427
2084 -427 -732 -1111 -911 228 642 -307 -464 -541 -716 472 743 -124 -660 -1231 -1580 -278 1106 1413 1844
2103 1844 2034 881 761 1088 52 -817 -1693 -3066 -3036 -1291 -604 -264 470 416 29 1366 1425 1704 1872
2122 1872 908 -71 378 434 63 22 -639 -1927 -2030 -1211 -1150 10 570 96 243 793 635 814 1108 82
2142 82 -444 -180 187 673 1464 775 154 -103 -662 -904 -478 -877 -1671 -1524 -978 -909 303 1141 1100 1439 1386
2163 1386 1157 1627 1501 366 -484 -1020 -1397 -1231 -601 -547 -951 -670 -1392 -863 451 962 1002 1407 1115 522
2183 522 418 613 -142 -607 -665 -924 -173 591 156 194 375 -873 -610 -436 -465 -501 -89 -648 -335 324 472
2204 472 1003 1544 836 401 1171 347 -183 43 -730 -1406 -1444 -1192 -1430 -518 -297 -388 207 925 773 1868
$$ packed form
2064A66j991l39J98M6J560P01q94l69L17K39O92J234p94n38M69r2M69M11p02j210
2084d27l05l79K00J139M14r49j57p7j75J188K71q67n36n71l49J302J384L07M31
2103A844J90j153j20L27j036q69q76j373L0J745O87L40P34n4l87J337N9K79J68
2122A872r64r79M49N6l71m1o61j288j03Q19O1J160N60m74J47N50j58J79K94j026
2142H2n26K64L67M86P91o89o21k57n59k42M26l99p94J47N46O9J212Q38m1L39n3
2163A386k29M70j26j135q50n36l77J66O30N4m04K81p22N29J314N11M0M05k92n93
2183E22j04J95p55m65n8k59P51P64m35L8J81j248K63J74k9l6M12n59L13O59J48
2204D72N31N41p08m35P70q24n30K26p73o76l8K52k38R12K21r1N95P18j52J095
$$ plain form
2224 1868 2212 1426 753 372 -337 -923 -496 -1398 -1307 -794 -1030 -521 422 303 112 369 336 -254 415 369 338
2245 338 694 585 206 573 539 -33 -65 -328 -690 -805 -469 -625 -470 -272 -391 -491 -115 -191 -90 363 417
2266 417 429 1147 1106 885 1059 389 -642 -438 -935 -1388 -950 -490 -614 185 614 171 561 623 -92 112 268
2287 268 -214 -298 236 274 259 808 330 54 85 -489 -680 -310 -960 -703 -40 -23 -98 640 378 138 387 193
2309 193 -52 271 547 56 706 723 -254 -206 -129 -1302 -1159 -682 -828 -175 317 581 1010 1149 947 742 601
2330 601 -108 -696 -278 -671 -1013 -656 -31 -388 204 156 -35 261 -229 -367 2 328 144 141 484 156 -10
2351 -10 306 -146 -298 -167 -615 -554 5 -225 62 440 61 -218 144 230 -491 -168 18 -274 510 711 516
2372 516 672 360 -477 -221 -354 -923 -189 350 -218 -28 317 242 240 237 -250 -271 192 -184 15 659 93 -172
$$ packed form
2224A868L44p86o73l81p09n86M27r02R1N13k36N09R43j19j91K57l3n90O69m6l1
2245C38L56j09l79L67l4n72l2k63l62j15L36j56J55J98j19j00L76p6J01M53N4
2266D17J2P18m1k21J74o70j031K04m97m53M38M60j24P99M29m43L90O2p15K04J56
2287B68m82q4N34L8j5N49m78k76L1n74j91L70o50K57O63J7p5P38k62k40K49j94
2309A93k45L23K76m91O50J7r77M8P7j173J43M77j46O53M92K64M29J39k02k05j41
2330F01p09n88M18l93l42L57O25l57N92m8j91K96m90j38L69L26j84lL43l28j66
2351a0L16m52j52J31m48O1N59k30K87L78l79k79L62Q6p21L23J86k92P84K01j95
2372E16J56l12q37K56j33n69P34N39n68J90L45p5klm87k1M63l76J99O44n66k65
$$ plain form
2394 -172 106 175 -184 320 32 -703 -581 -618 -677 533 624 -10 216 216 -134 299 853 -111 -251 -107 -309 122
2416 122 255 137 -734 -567 -984 -568 583 898 477 642 230 178 611 504 85 31 -526 -757 -93 69
2436 69 17 56 -112 -537 -361 450 362 417 162 -442 -461 288 348 511 745 176 -628 -106 -208 -301 179 -112 -651
2459 -651 -371 -2 405 633 169 -655 -656 -131 395 1118 1009 390 -219 -140 -563 -165 127 -327 -596 -9 -433
2480 -433 -95 606 414 -352 -158 -522 -163 540 543 -123 -287 -292 -359 412 690 488 194 -116 -521 -308 -67 -269
2502 -269 -337 -183 -543 -348 381 127 -342 -77 -333 136 692 903 568 535 -210 -1120 -589 -414 -441 -80 -288
2523 -288 -324 367 486 550 720 560 -226 -99 284 -218 16 131 -886 -673 141 265 501 753 -77 -511
2543 -511 -243 -505 197 1034 216 -85 -168 -77 -449 58 -30 -844 -178 204 349 884 929 -74 -519 -564 -680
$$ packed form
2394a72K78O9l59N04k88p35J22l7n9J210R1o34K26%l50M33N54r64j40J44k02M31
2416A22J33j18q71J67m17M16J151L15m21J65m12n2M33j07m19n4n57k31O64J62
2436F9n2L9j68m25J76Q11q8N5k55o04j9P49O0J63K34n69q04N22j02r3M80k91n39
2459f51K80L69M07K28m64q24jN25N26P23j09o19o09P9m23L98K92m54k69N87m24
2480d33L38P01j92p66J94l64L59P03Lo66j64no7P71K78k02k94l10m05K13K41k02
2502b69o8J54l60J95P29k54m69K65k56M69N56K11l35l3p45r10N31J75k7L61k08
2523b88l6O91J19O4J70j60p86J27L83n02K34J15j017K13Q14J24K36K52q30m34
2543e11K68k62P02Q37q18l01q3R1l72N07q8q14O66L82J45N35M5j003m45m5j16
$$ plain form
2564 -680 -517 364 44 49 -10 -73 295 767 444 406 424 -295 -434 -94 -141 -214 -48 -205 -256 376 642 319 368
2587 368 -449 -649 -325 -37 175 306 362 -349 -349 -14 -67 -77 401 -97 171 320 100 -92 369 -454 -331 -400
2609 -400 -362 -57 403 37 -37 372 239 211 635 410 -165 -240 -600 -850 -614 -147 -152 219 565 336 365 886
2631 886 22 79 101 -396 -497 -47 -228 -329 18 -511 -352 -39 -89 25 349 409 283 565 191 -220 12
2652 12 -145 -217 -129 1 -282 -188 75 233 201 433 -253 -38 22 -290 -189 -133 -147 -138 136 109 391 853 402 239
2676 239 8 3 -506 102 -89 -179 -416 -53 -575 -141 -88 -315 125 407 326 137 498 50 6 270 -89 -67
2698 -67 401 1 -327 -66 -79 -377 13 57 -277 159 -26 68 -63 149 -298 237 158 85 400 356 12 59 335
2721 335 -537 -199 -327 -406 -343 187 -138 -44 89 38 -83 415 166 195 329 -143 -95 48 -178 -82 24 -20 -633
$$ packed form
2564f80J63Q81l20Nn9o3L68M72l23l8J8p19j39L40m7p3J66j57n1O32K66l23M9
2587C68q17k00L24K88K12J31N6p11%L35n3j0M78m98K68J49k20j92M61q23J23o9
2609d00L8L05M60l66p4M09j33k8M24k25n75p5l60k50K36M67nL71L46k29K9N21
2631H86q64N7K2m97j01M50j81j01L47n29J59L13n0J14L24O0j26K82l74m11K32
2652A2j57p2Q8J30k83R4K63J58l2K32o86K15O0l12J01N6j4RK74k7K82M62m51j63
2676B39k31nn09O08j91r0k37L63n22M34N3k27M40K82q1j89L61m48m4K64l59K2
2698f7M68m00l28K61j3k98L90M4l34M36j85R4j31K12m47N35p9p3L15m4l44M7K76
2721C35q72L38j28p9O3N30l25R4J33n1j21M98k49K9J34m72M8J43k26R6J06m4o13
$$ plain form
2744 -633 37 251 69 -131 65 10 144 51 112 108 -125 -278 -124 222 102 417 406 133 -3 91 11 -55 32
2767 32 -171 -380 -36 -88 -198 88 78 -67 -103 57 75 187 408 165 -47 -24 -154 -189 193 -411 -595 74
2789 74 -17 -275 378 169 -91 81 -266 75 415 372 -154 -135 217 16 143 307 -5 12 -69 -220 -101 87
2811 87 -325 -99 48 -66 275 458 190 88 115 -107 -131 87 -43 -50 -217 -318 -263 -111 141 -162 192 31
2833 31 -114 195 141 -64 165 53 -425 15 -58 127 -41 91 -350 -3 357 268 -57 285 -303 -358 53 -266
2855 -266 -264 -20 -181 -194 -54 143 356 457 46 -95 -16 -155 58 34 220 -128 -247 17 -98 280 208 -65
2877 -65 -300 134 67 146 191 -11 -420 -402 -293 -139 36 -71 -309 -537 -7 79 494 468 123 -20 -92 -17 -15 59
2901 59 -31 -112 -207 -143 115 212 98 -9 6 -470 -337 150 246 174 -143 -80 153 6 247 173 404 -62 -210 54
$$ packed form
2744f33O70K14j82k00J96n5J34r3O1mk33j53J54L46j20L15j1k73j36R4q0o6Q7
2767C2k03k09L44n2j10K86j0j45l6J60J8J12K21k43k12K3j30l5L82o04j84O69
2789G4r1k58O53k09k60J72l47L41L40m3n26J9L52k01J27J64l12J7q1j51J19J88
2811H7m12K26J47j14L41J83k68j02K7k22k4K18j30pj67j01N5J52K52l03L54j61
2833C1j45L09n4k05K29j12m78M40p3J85j68J32m41L47L60q9l25L42n88n5M11l19
2855b66KK44j61j3J40J97K13J01m11j41P9j39K13k4J86l48j19K64j15L78p2k73
2877f5k35M34o7P9M5k02m09J8J09J54J75j07k38k28N30Q6M15k6l45j43p2P5KP4
2901E9r0q1r5O4K58R7j14j07J5m76J33M87R6p2l17O3K33j47K41p4K31m66j48K64
$$ plain form
2925 54 -208 -112 -119 -218 -598 -26 28 61 424 138 -26 209 201 273 444 70 -249 -311 -238 -233 2 -33 36 -293 205
2950 205 114 276 508 28 -118 -112 -245 -251 -151 151 -249 -184 88 32 217 230 -246 355 87 40 -20 -115 -230 -212
2974 -212 -396 -333 149 385 278 435 102 -19 94 300 192 -190 -335 -155 -460 -183 -147 -196 -23 97 -64
2995 -64 72 293 -77 361 289 -370 11 73 -71 -186 -256 -463 -182 140 -33 178 320 162 -193 63 11 -247
3017 -247 32 -46 -272 5 -39 -157 596 376 -30 100 112 -9 -40 -212 -262 -364 -333 -296 -151 189 -42 147
3039 147 154 -2 -80 138 355 -240 7 34 -26 -183 110 -111 -38 385 -382 252 183 73 -120 93 -317 -335 -190
3062 -190 -246 -37 -184 -9 72 143 296 125 212 -123 -384 48 -219 -38 70 -141 -5 145 68 56 402 158
3084 158 -208 220 58 -135 190 -110 -399 -221 -111 -130 2 70 148 152 290 130 138 326 363 241 117 -400 -518
$$ packed form
2925E4k62R6pr9l80N72N4L3L63k86j64K35qP2J71l74l19o2P3NK35l5O9l29M98
2950B05r1J62K32m80j46Oj33oJ00L02m00O5K72n6J85J3m76O01k68m7o0r5j15J8
2974b12j84O3M82K36j07J57l33j21J13K06j08l82j45J80l05K77L6m9J73J20j61
2995f4J36K21l70M38p2o59L81O2j44j15p0k07K81L22j73K11J42j58l55K56n2k58
3017b47K79p8k26K77m4j18P53k20m06J30J2j21l1j72n0j02L1L7J45L40k31J89
3039A47Pj56p8K18K17n95K47K7o0j57K93k21P3M23p67O34o9j10j93K13m10j8J45
3062a90n6K09j47J75Q1P1J53j71Q7l35k61M32k67J81J08k11J36J50p7j2L46k44
3084A58l66M28j62j93L25l00k89J78J10j9J32O8P8MJ38j60QJ88L7j22j24n17j18
$$ plain form
3107 -518 -282 -535 -506 -79 -129 54 481 555 119 -3 -60 -170 31 -216 -184 -35 76 -356 -75 -63 -306 -4
3129 -4 46 -134 296 55 -173 -94 -164 -189 -52 26 -12 -34 173 4 -108 84 -92 -13 185 -58 9 106 39 -399
3153 -399 -61 126 -146 -58 304 -202 -165 87 -126 -14 306 -21 -141 118 -249 -92 -135 52 188 11 -164
3174 -164 31 308 170 73 -123 -5 -377 41 290 49 528 124 -264 5 -110 -61 -128 109 -215 -1 53
3195 53 -285 94 482 58 -34 197 359 395 388 -2 -451 -145 -434 -227 420 272 -234 -8 -490 -276 53 242
3217 242 90 74 172 -165 154 450 54 -273 -177 -325 -257 205 23 -111 -126 -369 -112 150 300 90 35 -244
3239 -244 -564 71 182 148 465 140 -145 -109 56 214 3 -34 -139 -237 95 185 257 180 -43 -356 -461 -199
3261 -199 -140 302 -81 -224 30 -68 224 585 285 -166 94 -502 -288 -6 184 -386 -303 -30 -129 297 266 -324
$$ packed form
3107e18K36k53K9M27n0J83M27P4m36j22n7j10K01k47L2J49J11m32K81J2k43L02
3129dN0j80M30k41k28P9p0k5J37P8l8k2K07j69j12J92j76P9J98k43O7R7o7m38
3153c99L38J87k72Q8L62n06L7K52k13J12L20l27j20K59l67J57m3J87J36j77j75
3174a64J95K77j38r7j96J18l72M18K49k41M79m04l88K69j15M9o7K37l24K14N4
3195E3l38L79L88m24r2K31J62L6pl90m49L06k89K07O47j48n06K26m82K14L29J89
3217B42j52j6R8l37L19K96l96l27R6j48O8M62j82j34j5k43K57K62J50k10n5k79
3239b44l20O35J11l4L17l25k85L6J65J58k11l7j05r8L32R0P2p7k23l13j05K62
3261a99N9M42l83j43K54r8K92L61l00m51K60n96K14K82J90n70Q3K73r9M26l1n90
$$ plain form
3283 -324 -161 -62 -212 96 201 -71 -10 -126 -306 -434 129 -20 -314 82 -274 41 270 334 143 37 295
3304 295 253 31 -205 -284 -536 -167 -265 -4 639 166 183 8 -470 26 210 -243 126 -88 -72 -132 276 113
3326 113 32 31 -293 -232 269 257 133 282 -24 -261 -68 319 -38 60 -364 -368 -234 257 185 536 538 -283 -176 464
3350 464 152 -61 165 -175 -416 5 -127 176 745 121 -569 -245 -407 -344 150 334 -150 -144 77 17 564
3371 564 546 126 246 -38 -214 53 370 -114 -405 -322 -713 -449 247 37 33 66 -247 -157 527 549 300 337 -35
3394 -35 -365 -24 218 -370 -52 -173 -267 161 194 128 395 269 -461 -537 -212 -334 136 309 85 -200 25 143
3416 143 284 505 245 -90 301 6 -154 126 -411 -812 -524 -556 -413 197 558 311 120 225 -185 273
3436 273 470 28 4 -251 -436 -528 -102 -380 -192 174 15 -251 436 296 199 387 -176 -172 128 164 501 285
$$ packed form
3283c24J63R9j50L08J05k72O1j16j80j28N63j49k94L96l56L15K29O4j91j06K58
3304B95m2k22k36p9k52L69r8K61O43m73J7j75m78M96J84m53L69k14J6o0M08j63
3326A13q1jl24O1N01j2j24J49l06k37J93L87l57R8m24mJ34M91p2L51Kq21J07O40
3350D64l12k13K26l40k41M21j32L03N69o24o90L24j62O3M94J84m84OK21o0N47
3371E64j8m20J20k84j76K67L17m84k91Q3l91K64O96k10mL3l13R0O84K2k49L7l72
3394c5l30L41K42n88L18j21r4M28L3o6K67j26p30p6L25j22M70J73k24k85K25J18
3416A43J41K21k60l35L91k95j60K80n37m01K88l2J43O10L61k47j91J05m10M58
3436B73J97m42k4k55j85r2M26k78J88L66j59k66O87j40r7J88n63ML00L6L37k16
$$ plain form
3458 285 -86 -335 -260 -195 -269 -60 20 -6 -212 97 -395 -356 73 -81 -223 84 272 271 505 331 104 338 -314
3481 -314 -248 33 -178 -573 -392 -335 -492 80 164 316 191 347 27 147 -84 132 94 186 -123 135 306 -42
3503 -42 -307 -170 -151 -469 -181 -404 112 -25 -48 -150 101 -6 -297 510 601 41 187 575 -61 48 288
3524 288 20 36 -162 -720 -548 -414 -720 -167 -31 -93 328 674 638 589 518 31 -298 -122 -196 -467 150 85
3546 85 -535 -284 -228 -564 -290 290 -34 61 196 80 340 486 250 161 -13 -472 -543 -112 -190 -396 124 -77
3568 -77 -204 275 94 130 265 -112 -461 -43 240 173 400 314 -79 17 104 -117 171 -144 -534 -459 -212 -255 160
3591 160 653 23 -200 254 36 -67 413 211 -14 -17 -176 -100 369 68 -471 -119 -432 -428 -145 32 -195 89
3613 89 21 -196 483 632 219 156 161 -319 -46 214 175 69 19 -294 -326 -259 -279 -343 31 -355 -151 91 316 -66
$$ packed form
3458B85l71k49P5O5p4K09Q0k6k06L09m92L9M29j54j42L07J88jK34j74k27K34o52
3481c14O6K81k11l95J81N7j57N72Q4J52j25J56l20J20k31K16l8R2l09K58J71l48
3503d2k65J37J9l18K88k23N16j37k3j02K51j07k91Q07R1n60J46L88o36J09K40
3524B88k68J6j98n58J72J34l06N53J36o2M21L46l6m9p1m87l29J76p4k71O17o5
3546H5o20K51N6l36K74N80l24R5J35j16K60J46k36q9j74m59p1M31p8k06N20k01
3568g7j27M79j81L6J35l77l49M18K83o7K27q6l93R6Q7k21K88l15l90P5K47m3M15
3591A60M93o30k23M54k18j03M80k02k25lj59P6M69l01n39L52l13MK83J77k27K84
3613H9o8k17O79J49m13o3Nm80K73K60l9j06n0l13l2O7k0o4L74l86K04K42K25l82
$$ plain form
3637 -66 315 135 -143 263 104 -18 336 377 -376 -517 53 -366 -265 -36 32 -264 74 243 435 475 282
3658 282 128 275 174 238 323 88 -557 -405 -410 -176 26 -124 -256 -211 110 -165 333 510 -21 -119 -127 328 47
3681 47 295 -417 -386 -93 -534 63 53 -84 -208 -9 -119 -153 258 233 43 17 -239 -391 444 187 154 -60
3703 -60 79 -137 -212 197 -43 -228 -248 -388 -255 14 11 136 232 -223 -304 335 327 319 586 303 59 637 23 -72
3727 -72 -99 -290 -698 -309 -89 -252 261 -111 -128 57 498 309 288 157 -133 -426 225 -403 94 172 -119 -217
3749 -217 -322 -233 -485 -129 -206 -182 -77 199 128 510 299 28 -9 25 -291 359 158 -256 -107 28 -95 205
3771 205 217 50 -68 -145 -104 -296 367 412 172 289 39 70 115 136 -134 -103 -375 -495 164 449 172 250 103
3794 103 -180 -92 167 -84 104 81 -165 -1 295 372 86 278 -258 -356 146 -39 -83 105 -349 -297 -209 55
$$ packed form
3637f6L81j80k78M06j59j22L54M1p53j41N70m19J01K29O8k96L38J69J92M0j93
3658B82j54J47j01O4Q5k35o45J52nK34K02j50j32M5L21k75M98J77n31r8qM55k81
3681D7K48p12L1K93m41N97j0j37j24J99j10l4M11k5j90k6k56j52Q35k57l3k14
3703f0J39k16p5M09k40j85k0j40J33K69lJ25R6m55q1O39qqK67k83k44N78o14r5
3727g2k7j91m08L89K20j63N13l72j7J85M41j89k1j31k90k93O51o28M97P8k91r8
3749b17j05Q9k52L56p7K4J05K76p1L82k11k71l7L4l16O50k01m14J49J35j23L00
3771B05J2j67j18p7M1j92O63M5k40J17k50L1M5K1k70L1k72j20O59K85k77P8j47
3794A03k83Q8K59k51J88k3k46J64K96P7k86J92n36r8N02j85m4J88m54N2Q8K64
$$ plain form
3816 55 25 273 -23 -142 -180 308 326 400 334 309 212 35 -50 -133 -294 -370 -336 -331 -347 -224 9 21 -66 253 170 77
3842 77 229 191 37 -48 -149 -128 66 187 -281 56 95 -540 18 -57 -80 -31 311 149 144 158 41 56 211 -299
3866 -299 -170 211 -328 -109 153 -77 -370 -183 71 -446 -187 105 -256 183 114 190 482 328 -114 113 14
3887 14 -15 42 201 -207 -270 -29 -276 17 173 -334 -31 36 -21 422 195 171 64 317 256 143 35 182 -166
3910 -166 -35 38 -338 -97 -86 -387 -286 77 -253 -123 102 -96 203 360 13 297 657 107 194 272 -139
3931 -139 -209 -177 6 -389 -227 -607 -363 -43 -24 -150 224 54 -25 199 512 290 443 451 -100 -102 -171 -517 -311
3954 -311 -99 -451 -328 44 -152 74 288 103 106 46 56 69 215 320 171 289 132 -95 96 158 -276 -23
3976 -23 87 -285 -237 -160 -160 225 247 -26 144 457 193 12 335 173 242 322 156 -115 92 -115 -506 -83 -420
$$ packed form
3816E5l0K48k96j19l8M88J8P4o6k5r7j77q5q3j61p6L4Nj6J23K33J2q7L19q3r3
3842G7J52l8j54q5j01K1J94J21m68L37L9o35N58p5k3M9L42j62nJ4j17J5J55n10
3866b99J29L81n39K19K62k30k93J87K54n17K59K92l61M39o9P6K92j54m42K27r9
3887A4k9N7J59m08o3K41k47K93J56n07L03O7n7M43k27k4j07K53o1j13j08J47l48
3910a66J31P3l76K41J1l01J01L63l30J30K25j98K99J57l47K84L60n50Q7P8m11
3931a39p0L2J83l95J62l80K44L20J9j26L74j70p9K24L13k22J53Qn51ko9l46K06
3954c11K12l52J23L72j96K26K14j85Lo0J0J3J46J05j49J18j57k27J91O2m34K53
3976b3J10l72M8P7%L85K2k73J70L13k64j81L23j62O9Q0j66k71K07k07l91M23l37
$$ plain form
3999 -420 -511 -294 127 -27 138 183 -1 -5 15 271 381 271 21 -133 -12 -262 -160 64 -210 -291 -217 -443
4021 -443 -35 10 -49 104 67 228 110 556 205 -152 -56 -329 -204 91 194 67 31 -193 -639 -345 -183 -111
4043 -111 76 53 -11 199 287 271 375 215 173 -196 -149 -46 -43 -154 -443 -733 -27 -183 169 346 259 -275 -363
4066 -363 -157 -91 486 495 295 74 45 -223 -34 -83 -110 -271 -229 -197 77 470 40 -78 -161 -355 -221 156 302
4089 302 -1 383 -88 -177 102 246 135 252 31 -181 -201 -245 -279 -21 9 -260 34 262 26 295 383 -33
4111 -33 -251 358 79 183 319 17 -352 -193 -373 -269 -19 -89 -101 47 51 -102 195 606 275 255 399 63
4133 63 -244 -193 -192 -88 23 -203 -91 191 199 -70 31 -82 -10 43 104 182 364 96 266 -57 -163 -310 -219 70
4157 70 -133 90 -140 -394 -104 -242 -232 79 69 -181 28 224 183 -95 218 8 -27 55 81 96 73 -51 -334
$$ packed form
3999d20r1K17M21j54J65M5j84mK0K56J10j10k50j54J21k50J02K24k74q1P4k26
4021d43M08M5n9J53l7J61j18M46l51l57R6k73J25K95J03j27l6k24m46K94J62P2
4043a11J87k3o4K10Q8j6J04j60m2l69M7J03Lj11k89k90P06j56L52J77q7n34q8
4066c63K06O6N77Rk00k21k9k68J89m9k7j61M2L2K74L93m30j18q3j94J34L77J46
4089C02l03L84m71q9K79J44j11J17k21k12k0m4l4K58L0k69K94K28k36K69Q8m16
4111c3k18O09k79J04J36l02l69J59j80J04K50p0j2J48Mj53K97M11l31k0J44l36
4133F3l07N1JJ04J11k26J12K82Qk69J01j13P2N3O1P8J82k68J70l23j06j47R1K89
4157G0k03K23k30k54K90j38J0L11j0k50K09J96m1k78L13k10l5Q2K6J5k3j24k83
$$ plain form
4180 -334 -87 -143 -118 218 87 122 64 134 -256 -104 404 -109 70 147 105 30 60 110 -83 -49 -151 -405 156 -38
4204 -38 -68 26 -124 -256 -84 177 -153 230 136 92 209 18 165 169 143 7 -477 142 -184 -461 -72 -182 32
4227 32 -65 146 124 102 98 -229 -84 25 -91 -10 8 -214 138 -330 -328 90 39 -210 -130 -14 6 11 151 -212 -67
4252 -67 -175 -32 -106 -133 -44 -222 -71 -6 -119 72 102 72 65 -198 -169 206 -96 -94 344 11 -178 -105 91 94 191
4277 191 263 -150 -51 181 65 71 141 -97 72 -235 -412 193 -30 64 -231 71 196 58 153 -3 -259 -130
4299 -130 -231 -247 239 131 -60 73 4 82 206 -21 -39 253 -115 -238 35 54 38 166 76 54 -131 18 -52
4322 -52 -37 55 -314 -138 -58 106 76 84 -71 -39 -141 34 -220 173 -31 -16 -36 -70 1 274 101 26 111 25 -142
4347 -142 0 -131 168 42 34 166 -323 184 18 -284 -166 -121 181 53 -43 181 27 -95 -43 76 -35 -77
$$ packed form
4180c34K47n6K5L36j31L5n8P0l90J52N08n13J79P7m2p5L0N0j93L4j02k54N61j94
4204c8l0R4j50j32J72K61l30L83r4m4J17j91J47Mk6j36m84O19l26k77L89j10K14
4227C2r7K11k2k2ml27J45J09j16Q1J8k22L52m68KM18n1k49Q0J16K0NJ40l63J45
4252f7j08J43p4k7Q9j78J51O5j13J91L0l0pk63K9L75l02KM38l33j89P3J96LR7
4277A91P2m13R9K32j16OP0k38J69l07j77O05k23R4k95L02J25j38R5j56k56J29
4299a30j01j6M86j08j91J33o9P8J24k27j8K92l68j23K73J9j6J28r0k2j85J49p0
4322e2J5R2l69J76Q0J64l0Qj55L2j02J75k54L93k04J5k0l4P1K73j73p5Q5q6j67
4347a42J42j31K99j26qJ32m89N07j66l02J18M5L02j28r6K24j54j22N2J19j11m2
$$ plain form
4369 -77 -125 -20 128 380 35 -128 124 55 -58 -137 108 -331 48 233 78 102 316 -42 -54 102 45 -32 7
4392 7 -55 -36 149 107 -134 -247 77 146 215 -11 -174 252 16 -329 145 162 -153 254 77 24 39 -55 -51 -160
4416 -160 137 461 -63 -66 -77 -287 -220 -15 -104 36 -116 171 102 56 241 91 20 -162 -48 -68 95 177 214 -3
4440 -3 -25 94 164 178 55 44 -149 118 92 -44 -89 -55 84 55 -34 -187 -36 -42 -170 151 -3 91 173 -60 -107
4465 -107 -22 -87 152 -33 166 -32 110 63 75 15 47 173 114 -7 -98 48 16 81 125 -74 -10 -108 121 -29
4489 -29 56 -49 -105 30 -83 78 -175 163 122 -3 23 -72 -197 103 -5 31 -67 -60 48 98 -31 -112 27 -125
4513 -125 42 98 242 50 80 -41 -286 -68 -253 -82 98 -55 1 -92 -118 59 -140 34 42 87 -102 -74 185
4536 185 -67 -84 -193 -68 -25 122 -239 45 -42 -26 -95 13 -93 -228 -95 -38 205 -176 -23 141 -96 41
$$ packed form
4369g7m8J05J48K52l45j63K52o9j13p9K45m39L79J85j55K4K14l58j2J56n7p7L9
4392Go2J9J85m2k41j13L24O9O9k26j63M26k36l45M74J7l15M07j77n3J5r4Mj09
4416a60K97L24n24lj1k10O7K05q9J40j52K87o9m6J85j50p1j82J14k0J63Q2L7k17
4440ck2J19P0J4j23j1j93K67k6j36m5L4J39k9q9j53J51oj28L21j54R4Q2k33m7
4465a07Q5o5K39j85J99j98J42m7J2o0L2J26n9j21r1J46l2O5M4j99O4r8K29j50
4489b9Q5j05n6J35j13J61k53L38m1j25K6r5j25L00j08L6r8PJ08N0j29q1J39j52
4513a25J67N6J44j92L0j21k45K18j85J71J80j53N6r3k6J77j99J74QM5j89K8K59
4536A85k52j7j09J25M3J47l61K84q7J6o9J08j06j35J33N7K43l81J53J64k37J37
$$ plain form
4558 41 -262 -161 249 45 -168 -81 293 218 -90 -134 -189 198 -92 -87 -197 -60 -102 -25 -10 -27 -49 25 182 -62
4582 -62 -94 39 63 -11 -93 -108 85 -50 61 30 -23 -77 46 20 -65 -124 80 19 -332 -161 55 91 78 211 3
4607 3 36 186 -234 -289 199 82 -227 250 87 18 23 -103 5 24 152 -77 -49 -5 134 142 -123 -68 -65 16 198
4632 198 197 124 130 131 -120 -130 10 59 -61 -93 124 -39 43 56 217 162 83 -78 -6 -96 -74 -150 32 136 -254 10
4658 10 46 -185 140 329 -69 86 69 154 -11 168 -17 39 80 77 16 43 -202 64 50 -4 -13 214 -60 232 85
4683 85 -34 59 -47 -276 251 9 -57 -91 -116 -27 -52 192 36 121 20 -58 21 102 237 -61 89 34 -206 -111
4707 -111 -67 -25 -190 -40 -221 -163 186 329 91 124 95 -11 31 -25 -159 97 -3 -206 119 78 -102 275 -178
4730 -178 73 99 173 -64 -83 -6 102 -32 113 -124 54 35 -155 15 -122 -27 37 200 110 112 201 181 -66 53
$$ packed form
4558D1l03J01M10k04k13Q7L74p5l08m4n5L87k90Nj10J37m2P7J5j7k2P4J57k44
4582f2l2J33K4p4q2j5J93j35J11l1n3n4J23k6q5n9K04o1l51J71K16L6j3J33k08
4607CL3J50m20n5M88j17l09M77j63o9Nj26J08J9J28k29K8M4J39Qk65N5LQ1J82
4632A98jp3OJk51j0J40M9j20l2K17j63Q2J3J61n5p9j61P2r0K2p6J82J04l90K64
4658A0L6k31L25J89l98J55j7Q5j65J79j85N6M1lo1K7k45K66j4n4rK27k74K92j47
4683H5j19R3j06k29N27k42o6l4k5Q9k5K44j56Q5j01p8P9Q1J35k98J50n5k40R5
4707a11M4M2j65J50j81N8L49J43k38L3k9j06M2n6j34K56j00k03L25m1j80L77m53
4730a78K51K6P4k37j9P7J08j34J45k37J78j9j90J70j37R5O4J63r0KQ9k0k47J19
$$ plain form
4754 53 -173 41 23 200 54 -48 -133 -103 -8 -33 16 43 178 49 113 46 121 171 63 -122 23 -110 56 190
4778 190 -11 -89 69 217 109 -64 223 220 -42 -83 -282 -108 -151 -28 -61 -140 -75 -147 -19 194 238 -129 86
4801 86 -18 115 99 -2 66 -9 -179 5 84 -62 -123 -67 21 -345 89 107 -86 36 -107 -10 -280 120 34 -210
4825 -210 39 -232 -50 205 -56 46 6 -75 -178 55 4 -225 101 -91 -74 102 118 -71 -145 189 21 20 89
4848 89 101 1 188 79 -30 138 -241 116 67 20 23 -163 -265 -200 -93 165 -178 -126 187 174 -51 62 32
4871 32 -182 -278 71 149 172 -146 -194 420 160 4 72 -70 86 -58 190 -16 284 186 -289 38 -87 -14 231
4894 231 -47 -100 22 -194 -88 57 130 2 54 -13 -152 111 -114 -65 -94 -45 -232 26 -135 337 121 47 74
4917 74 140 15 159 84 82 -82 -124 -66 -1 27 97 -77 -115 60 222 20 97 -350 -274 -4 -292 -331 147 90 95 -131
$$ packed form
4754E3k26K14j8J77j46j02q5L0R5k5M9K7J35j29O4o7P5N0j08j85J45j33J66J34
4778A90k01p8J58J48j08j73K87lk62m1j99J74m3J23l3p9O5p2J28K13M4l67K15
4801H6j04J33j6j01O8p5j70J84P9j46o1N6Q8l66M34J8j93J22j43R7k70M00q6k44
4825b10K49k71J82K55k61J02m0q1j03K33n1k29L26j92J7J76J6j89p4L34j68jO9
4848H9J2j00J87j09j09J68l79L57m9m7Lj86j02O5J07K58l43N2L13j3k25J13l0
4871C2k14r6L49P8K3l18m8O14k60j56O8j42J56j44K48k06L00r8m75L27j25P3K45
4894B31k78n3J22k16J06J45P3j28N2o7j39K63k25M9k9M9j87K58j61M72k16p4K7
4917G4O6j25J44p5kj64m2N8O5K8P0j74l8J75J62k02P7m47P6K70k88l9M78n7Nk26
$$ plain form
4943 -131 226 116 -39 250 -42 -100 -352 -47 -167 243 223 57 41 -142 -125 56 -104 128 137 5 -360 -62
4965 -62 216 -129 -57 91 91 82 68 69 -148 -257 -151 -89 -45 67 -66 6 -95 127 228 -143 333 368 -23 264
4989 264 192 -1 -156 -74 -100 -143 109 -165 -193 99 -93 -46 260 138 -21 -42 -237 -105 8 1 11 47 32 -39
5013 -39 18 89 -13 158 42 -171 -78 -216 -89 -9 34 -153 -60 163 13 44 177 108 -126 146 44 111 -131
5036 -131 26 -6 71 -45 169 213 88 -21 -86 268 152 73 199 -95 -159 13 113 72 28 132 100 -77 -192
5059 -192 23 103 -126 52 -160 -80 -69 -33 145 28 28 -60 -61 186 80 -73 -91 134 -347 81 -194 -242 -153 -38
5083 -38 14 173 46 -143 79 190 -1 -230 -53 280 -172 24 19 -262 -102 58 89 -234 150 -132 -165 136
5105 136 -67 -77 416 -439 -98 -68 168 -81 -252 -213 -145 -137 -37 31 33 -123 -129 -41 -7 -151 -5 30 123 -104 104
$$ packed form
4943a31L57j10j55K89k92n8k52L05j20M10k0j66j6j83J7J81j60K32Rj32l65K98
4965f2K78l45P2J48%rj4Jk17j09J06O2M4J12j33P2j01K22J01l71M76L5l91K87
4989B64p2j93j55Q2k6m3K52k74k8K92j92M7L06j22j59k1j95J32J13pJ0L6j5p1
5013c9N7P1j02J71j16k13R3j38J27Q0M3j87R3K23j50L1J33o9k34K72j02O7k42
5036a31J57l2P7j16K14M4j25j09o5L54j16p9J26k94o4J72J00m1m4J04l2j77j15
5059a92K15Q0k29J78k12Q0J1L6J78j17%q8jK47j06j53j8K25m81M28k75m8Q9J15
5083c8N2J59j27j89K22J11j91k29J77L33m52J96nk81J60J60L1l23L84k82l3L01
5105A36k03j0M93q55L41L0K36k49j71L9O8QJ00O8Kj56oQ8L4j44J46L5R3k27K08
$$ plain form
5130 104 -237 11 81 -160 68 -23 -221 26 133 -97 -177 -285 -329 -138 -79 62 32 97 -138 -62 -44 157 64
5153 64 49 44 -155 -194 -124 -40 -83 -141 -272 -260 223 -13 -71 127 -149 51 -49 236 -19 106 -109 11 -117 154
5177 154 -32 36 67 -321 -189 -41 -243 -218 -75 -191 -11 287 -155 25 177 86 -77 -174 50 188 303 83
5199 83 193 21 124 -55 -1 40 140 97 162 100 -22 -161 145 176 135 -106 233 26 -289 -46 -73 -92 -129 -19
5223 -19 66 -129 244 -251 -263 223 -270 -23 282 -157 210 -45 -153 -76 213 -24 -156 158 98 100 135 40 -189
5246 -189 162 84 -74 -139 6 -178 166 220 -61 -5 41 -152 -222 154 -79 -96 34 -262 -47 -183 102 82 168
5269 168 69 20 -21 45 111 81 141 -118 67 -173 -173 137 80 -422 -77 -221 -114 79 67 124 -74 200 -165 -58
5293 -58 289 259 -43 361 53 -153 -87 -50 -65 126 24 -56 -100 40 -8 -17 -43 37 140 236 -65 78 108 -195 201
$$ packed form
5130A04l41K48P0k41K28r1j98K47J07k30q0j08m4J91N9J41l0O5k35P6J8K01r3
5153F4j5nj99l9P0Q4m3n8j31J2M83k36n8J98k76K00j00K85k55J25k15J20j28K71
5177A54j86O8L1l88J32J48k02K5J43j16J80K98m42J80J52r1j63r7K24J38J15k20
5199H3J10j72J03j79N4M1J00m3O5o2j22j39L06L1m1k41L39k07l15K43k7j9l7J10
5223a9Q5j95L73m95j2M86m93K47L05m39L67k55j08P7K89k37j32L14o0KL5r5k29
5246a89L51p8j58o5J45j84L44N4k81N6M6j93p0L76k33j7J30k96K15j36K85k0Q6
5269A68r9m9m1O6O6l0O0k59J85k40%L10n7n02L45j44J07J93j2N7j98K74l65J07
5293e8L47l0l02M04l08k06O6L7j5J91j02q0m4J40m8rk6Q0J03R6l01J43L0l03L96
$$ plain form
5318 201 148 -80 -191 7 -318 42 112 224 244 -132 -131 -167 -314 21 28 307 171 -28 -128 125 58 -88 167
5341 167 123 108 62 -110 -111 373 -38 -144 30 67 -43 -23 -45 95 323 -30 141 212 207 -233 63 -172 -109 9
5365 9 -94 -298 121 -113 -43 40 8 -102 76 1 -156 273 154 278 -71 -184 -231 157 -102 -37 -161 -172 -79
5388 -79 -43 -157 156 86 46 -82 -205 -24 62 60 26 65 -122 204 149 -117 51 40 -150 -180 -138 -32 -27 283 21
5413 21 170 265 31 -157 -13 66 -206 -17 -21 -140 277 2 53 66 -21 -138 -80 -313 -220 75 131 57 -67 220
5437 220 -178 50 156 18 128 199 -125 -68 17 120 -17 84 225 -195 -168 -70 -103 13 124 379 -47 75
$$ packed form
5318B01n3k28j11J98l25L60P0J12K0l76Jl6j47L35PK79j36j99j00K53o7j46K55
5341A67m4j5m6j72jM84m11j06J74L7j10K0k2J40K28l53J71P1nm40K96k35O3J18
5365Ij03k04M19k34P0Q3l2j10J78p5j57M29j19J24l49j13m7L88k59O5j24j1R3
5388g9L6j14L13p0m0j28j23J81Q6kl4L9j87L26n5k66J68j1j90l0M2J06NL10k62
5413B1J49R5k34j88J44P9k72J89mj19M17k75N1J3q7j17N8k33R3K95N6p4j24K87
5437B20l98K28J06j38J10P1l24N7Q5J03j37J01J41m20K7R8l3J16J11K55m26J22
$$ [...]
8191A26
##END NTUPLES=NMR FID
##END=
