##TITLE=1H_CA-8417-14-1
 CDCl3, 8 sc, 
 14.2.2019
##JCAMPDX= 6.0         $$ Bruker NMR JCAMP-DX V2.0
##DATA TYPE= NMR FID
##DATA CLASS= NTUPLES
##ORIGIN= UXNMR, Bruker Analytische Messtechnik GmbH
##OWNER= root
$$ XWIN-NMR		Version 3.5
$$ Thu Feb 14 13:48:27 2019 Russian Standard Time (UT+4h)  she@DPX200
##.OBSERVE FREQUENCY= 200.1313
##.OBSERVE NUCLEUS= ^1H
##.DELAY= (6, 6)
##.ACQUISITION MODE= SIMULTANEOUS
##.ACQUISITION SCHEME= undefined
##.AVERAGES= 8
##.DIGITISER RES= 18
##SPECTROMETER/DATA SYSTEM= spect
##.PULSE SEQUENCE= zg30
##.SOLVENT NAME= CDCl3
##.SHIFT REFERENCE= (INTERNAL, CDCl3, 0, 15.7039)
##AUDIT TRAIL= $$ (NUMBER, WHEN, WHO, WHERE, WHAT)
$$ ##TITLE= Audit trail, XWIN-NMR		Version 3.5
$$ ##JCAMPDX= 5.01
$$ ##ORIGIN= Bruker BioSpin GmbH
$$ ##OWNER= she
$$ F:/spectra/data/she/nmr/H-F/1/audita.txt
$$ ##AUDIT TRAIL=  $$ (NUMBER, WHEN, WHO, WHERE, WHAT)
(   1,<2019-02-14 13:47:21.59 +0400>,<she>,<DPX200>,
      <created by zg, POWCHK disabled, PULCHK disabled
       configuration hash MD5:
       00 E9 B6 7A A2 85 ED C7 34 08 36 98 17 FE 4E 26
       data hash MD5: 16K
       29 D5 52 19 BE 5C DD D5 9C 65 84 4C C6 42 91 45>)
$$ ##END=
$$ 
$$ hash MD5
$$ 38 83 6A 00 20 09 30 E5 34 BF 8E 53 42 D2 E1 23
##$RELAX= 
##$RELAX= 
##$RELAX= 
##$RELAX= 
##$RELAX= 
##$RELAX= 
$$ Bruker specific parameters
$$ --------------------------
##$DU= <F:/spectra>
##$EXPNO= 1
##$NAME= <H-F>
##$PROCNO= 1
##$TYPE= <nmr>
##$USER= <she>
##$AMP= (0..31)
100 100 100 100 100 100 100 100 100 100 100 100 100 100 100 100 100 100 
100 100 100 100 100 100 100 100 100 100 100 100 100 100 
##$AQSEQ= 0
##$AQ_mod= 1
##$AUNM= <au_zg>
##$AUTOPOS= <>
##$BF1= 200.13
##$BF2= 200.13
##$BF3= 200.13
##$BF4= 200.13
##$BF5= 200.13
##$BF6= 200.13
##$BF7= 200.13
##$BF8= 200.13
##$BYTORDA= 1
##$CFDGTYP= 0
##$CFRGTYP= 5
##$CHEMSTR= <none>
##$CNST= (0..31)
1 1 145 1 1 1 1 1 1 1 1 1 1 1 1 1 1 1 1 1 1 1 1 1 1 1 1 1 1 1 1 1 
##$CPDPRG= <>
##$CPDPRG1= <>
##$CPDPRG2= <>
##$CPDPRG3= <>
##$CPDPRG4= <mlev>
##$CPDPRG5= <mlev>
##$CPDPRG6= <mlev>
##$CPDPRG7= <mlev>
##$CPDPRG8= <mlev>
##$CPDPRGB= <>
##$CPDPRGT= <>
##$D= (0..31)
0 1.2 0 0 0 0 0 0 0 0 0 0.03 0 0 0 0 0 0 0 0 0 0 0 0 0 0 0 0 0 0 0 0 
##$DATE= 1550137641
##$DBL= (0..7)
120 120 120 120 120 120 120 120 
##$DBP= (0..7)
150 150 150 150 150 150 150 150 
##$DBP07= 0
##$DBPNAM0= <>
##$DBPNAM1= <>
##$DBPNAM2= <>
##$DBPNAM3= <>
##$DBPNAM4= <>
##$DBPNAM5= <>
##$DBPNAM6= <>
##$DBPNAM7= <>
##$DBPOAL= (0..7)
0.5 0.5 0.5 0.5 0.5 0.5 0.5 0.5 
##$DBPOFFS= (0..7)
0 0 0 0 0 0 0 0 
##$DE= 6
##$DECBNUC= <off>
##$DECIM= 32
##$DECNUC= <off>
##$DECSTAT= 4
##$DIGMOD= 1
##$DIGTYP= 9
##$DL= (0..7)
0 120 120 120 120 120 120 120 
##$DP= (0..7)
150 150 150 150 150 150 150 150 
##$DP07= 0
##$DPNAME0= <>
##$DPNAME1= <>
##$DPNAME2= <>
##$DPNAME3= <>
##$DPNAME4= <>
##$DPNAME5= <>
##$DPNAME6= <>
##$DPNAME7= <>
##$DPOAL= (0..7)
0.5 0.5 0.5 0.5 0.5 0.5 0.5 0.5 
##$DPOFFS= (0..7)
0 0 0 0 0 0 0 0 
##$DQDMODE= 0
##$DR= 18
##$DS= 0
##$DSLIST= <SSSSSSSSSSSSSSS>
##$DSPFIRM= 0
$$ [...]
##$SUBNAM2= <"">
##$SUBNAM3= <"">
##$SUBNAM4= <"">
##$SUBNAM5= <"">
##$SUBNAM6= <"">
##$SUBNAM7= <"">
##$SUBNAM8= <"">
##$SUBNAM9= <"">
##$SW= 20.0189088683792
##$SWIBOX= (0..15)
0 0 2 0 0 0 0 0 0 0 0 0 0 0 0 0 
##$SW_h= 4006.41025641026
##$TD= 16384
##$TD0= 1
##$TE= 0
##$TE2= 300
##$TE3= 300
##$TEG= 300
##$TL= (0..7)
0 120 120 120 120 120 120 120 
##$TP= (0..7)
150 150 150 150 150 150 150 150 
##$TP07= 0
##$TPNAME0= <>
##$TPNAME1= <>
##$TPNAME2= <>
##$TPNAME3= <>
##$TPNAME4= <>
##$TPNAME5= <>
##$TPNAME6= <>
##$TPNAME7= <>
##$TPOAL= (0..7)
0.5 0.5 0.5 0.5 0.5 0.5 0.5 0.5 
##$TPOFFS= (0..7)
0 0 0 0 0 0 0 0 
##$TUNHIN= 0
##$TUNHOUT= 0
##$TUNXOUT= 0
##$USERA1= <user>
##$USERA2= <user>
##$USERA3= <user>
##$USERA4= <user>
##$USERA5= <user>
##$V9= 5
##$VALIST= <valist>
##$VCLIST= <CCCCCCCCCCCCCCC>
##$VD= 0
##$VDLIST= <DDDDDDDDDDDDDDD>
##$VPLIST= <PPPPPPPPPPPPPPP>
##$VTLIST= <TTTTTTTTTTTTTTT>
##$WBST= 1024
##$WBSW= 4
##$XGAIN= (0..3)
0 0 0 0 
##$XL= 0
##$YL= 0
##$YMAX_a= 535176
##$YMIN_a= -511514
##$ZGOPTNS= <>
##$ZL1= 120
##$ZL2= 120
##$ZL3= 120
##$ZL4= 120
##$ABSF1= 10
##$ABSF2= 0
##$ABSG= 5
##$ABSL= 3
##$ALPHA= 0
##$AQORDER= 0
##$ASSFAC= 0
##$ASSFACI= 0
##$ASSFACX= 0
##$ASSWID= 0
##$AUNMP= <proc_1d>
##$AZFE= 0.1
##$AZFW= 0.1
##$BCFW= 1
##$BC_mod= 2
##$BYTORDP= 1
##$COROFFS= 0
##$CY= 11.3945322036743
##$DATMOD= 1
##$DC= 2
##$DFILT= <>
##$DTYPP= 0
##$F1P= 18.9103706918063
##$F2P= -1.10871071338519
##$FCOR= 0.5
##$FTSIZE= 0
##$FT_mod= 4
##$GAMMA= 1
##$GB= 0.15
##$INTBC= 1
##$INTSCL= 1
##$ISEN= 128
##$LB= 0.24
##$LEV0= 0
##$LPBIN= 0
##$MAXI= 10000
##$MC2= 0
##$MEAN= 0
##$ME_mod= 0
##$MI= 1.114404
##$NCOEF= 0
##$NC_proc= 0
##$NLEV= 6
##$NOISF1= 3.799351
##$NOISF2= 2.8
##$NSP= 1
##$NTH_PI= 0
##$NZP= 0
##$OFFSET= 15.70392
##$PC= 1
##$PHC0= -9045.242
##$PHC1= 8.400141
##$PH_mod= 1
##$PKNL= yes
##$PPARMOD= 0
##$PSCAL= 0
##$PSIGN= 0
##$REVERSE= no
##$SF= 200.130013532006
##$SI= 16384
##$SIGF1= 3
##$SIGF2= 2
##$SINO= 400
##$SIOLD= 16384
##$SREGLST= <1H.CDCl3>
##$SSB= 0
##$STSI= 0
##$STSR= 0
##$SW_p= 3612.71676300578
##$SYMM= 0
##$S_DEV= 0
##$TDeff= 0
##$TDoff= 0
##$TI= <>
##$TILT= no
##$TM1= 0
##$TM2= 0
##$TOPLEV= 0
##$USERP1= <user>
##$USERP2= <user>
##$USERP3= <user>
##$USERP4= <user>
##$USERP5= <user>
##$WDW= 1
##$XDIM= 8192
##$YMAX_p= 0
##$YMIN_p= 0
$$ End of Bruker specific parameters
$$ ---------------------------------
##NTUPLES= NMR FID
##VAR_NAME=  TIME,          FID/REAL,        FID/IMAG
##SYMBOL=    X,             R,               I
##VAR_TYPE=  INDEPENDENT,   DEPENDENT,       DEPENDENT
##VAR_FORM=  AFFN,          ASDF,            ASDF
##VAR_DIM=   8192,          8192,            8192
##UNITS=     SECONDS,       ARBITRARY UNITS, ARBITRARY UNITS
##FACTOR=    0.0002496,     1,               1
##FIRST=     0,             0,               0
##LAST=      2.0444736,     0,               0
##MIN=       0,             -511514,         0
##MAX=       2.0444736,     535176,          0
$$ Real data points
##PAGE= N=1
##DATA TABLE= (X++(R..R)), XYDATA
$$ [...]
$$ plain form
2599 -1059 -35 333 643 1992 3391 4885 4918 3403 2038 1274 265 -3 -1035 -4044 -7007 -7981 -5942
2616 -5942 -1427 3785 6637 6720 4435 560 -2884 -3773 -4743 -4950 -3229 -614 2125 5205 6335 5391
2632 5391 4913 3131 1529 774 -608 -3182 -4896 -5666 -6231 -5519 -4278 -2156 750 2640 3672 3838
2648 3838 3017 1701 1330 2884 3100 2639 1600 -263 -2255 -3701 -4058 -3895 -1655 271 2073 2840 2422
2665 2422 383 -1321 -2374 -4183 -4333 -3174 -1260 2016 4587 5419 5098 3746 1787 1201 1571 90
2681 90 -2101 -3704 -5961 -5943 -4303 -2119 97 2399 3369 3662 4065 3402 1551 351 -786 -1428 -1496 -1497
2699 -1497 -1386 -1445 -1620 -2695 -2792 -1872 -49 2613 5205 5359 3236 831 -934 -1425 -848 -417 -818 -826 -639
2718 -639 220 982 460 -1333 -2968 -3380 -3492 -1461 -23 557 210 668 955 2834 4809 5699 5561 4386
$$ packed form
2599a059J024L68L10J349J399J494L3j515j365p64j009k68j032l009k963r74K039
2616e942M515N212K852Q3k285l875l444q89r70k07J721K615K739L080J130r44
2632E391m78j782j602p55j382k574j714p70n65P12J241K122K906J890J032J66
2648C838q21j316l71J554K16m61j039j863j992j446l57J63K240J926J802P67m18
2665B422k039j704j053j809j50J159J914L276K571Q32l21j352j959n86L70j481
2681I0k191j603k257J8J640K184K216K302R70K93M03o63j851j200j137o42o8j
2699a497J11n9j75j075r7R20J823K662K592J54k123k405j765m91N77M31m01qJ87
2718f39Q59P62n22j793j635m12j12K031J438N80l47M58K87J879J975Q90j38j175
$$ plain form
2736 4386 1764 -869 -2210 -3307 -3993 -4395 -5051 -5472 -4523 -2686 -494 916 978 860 2355 4444 5702
2753 5702 6439 4802 1328 -1274 -1781 -1444 -581 60 -1250 -1745 -1629 -1621 -1656 -2108 -3624 -4526 -3457 -1629
2771 -1629 553 2669 3542 3025 3270 3153 3585 4029 3203 1598 -528 -2092 -3227 -2779 -2032 -2183 -2796 -3269
2789 -3269 -2971 -1631 97 1004 537 224 596 2360 4494 4157 2159 131 -1469 -1578 77 1613 1021
2806 1021 218 -907 -409 164 113 -1690 -3350 -4722 -4690 -1411 2201 3570 3050 2213 1362 1592 1953 1870
2824 1870 512 -1966 -4690 -4751 -1591 868 2083 2599 1223 -382 805 2954 3437 1818 -1921 -4768
2840 -4768 -4294 -1999 676 2121 316 -3504 -4544 -1540 2507 4827 4261 2010 -136 1 1875 3981
2856 3981 3262 -1365 -5596 -5751 -3431 746 3899 3701 225 -2775 -3358 -1113 1855 1312 -1550 -4030
$$ packed form
2736D386k622k633j341j097o86m02o56m21R49J837K192J410O2j18J495K089J258
2753E702P37j637l474k602n07L37Q63O41j310m95J16Ql5m52j516r02J069J828
2771a629K182K116Q73n17K45j17M32M44q26j605k126j564j135M48P47j51o13m73
2789c269K98J340J728R07m67l13L72J764K134l37j998k028j600j09J655J536n92
2806A021q03j125M98N73n1j803j660j372L2L279L612J369n20q37q51K30L61q3
2824A870j358k478k724o1L160K459J215N16j376j605J187K149M83j619l739k847
2840d768M74K295K675J445j805l820j040L004M047K320n66k251k146J37J874K106
2856C981p19m627m231j55K320M177L153j98l476l000n83K245K968n43k862k480
$$ plain form
2872 -4030 -4822 -2590 2822 7587 6684 3192 37 -813 1010 2900 1388 -2286 -6994 -9092 -5421 980
2888 980 4781 4148 1222 -1716 -1854 1437 4873 4697 1347 -3594 -5500 -3139 134 1674 1163 -1525
2904 -1525 -3929 -2704 2382 6597 7186 3874 -600 -3676 -3182 -1409 835 265 -3863 -6731 -4911 -218
2920 -218 4054 6208 4638 606 -2355 -1873 809 2350 42 -3811 -5119 -3619 717 5986 8510
2935 8510 5752 1435 -1046 -1046 -203 -224 -2940 -6221 -8023 -8115 -4145 769 2704 2300 2326 2793 4930 7218
2953 7218 8046 5843 1050 -3379 -5162 -3460 -1609 -1108 -2000 -3663 -4954 -3210 567 2673 2024 103
2969 103 -1701 -1641 341 1750 2118 705 -1345 -523 2543 5710 6646 5465 1976 -1958 -3501 -3786 -3984
2986 -3984 -4084 -5744 -6872 -5763 -2992 455 3837 5911 5683 5251 5198 4517 3930 1538 -2165 -5110 -5972
$$ packed form
2872d030p92K232N412M765r03l492l155q50J823J890j512l674m708k098L671O401
2888I80L801o33k926k938j38L291L436j76l350m941j906K361L273J540n11k688
2904a525k404J225N086M215N89l312m474l076M94J773K244n70m128k868J820M693
2920b18M272K154j570m032k961M82K682J541k308l853j308J500M336N269K524
2935H510k758m317k481%Q43k1k716l281j802r2L970M914J935m04K6M67K137K288
2953G218Q28k203m793m429j783J702J851N01q92j663j291J744L777K106o49j921
2969A03j804O0J982J409L68j413k050Q22L066L167R36j181l489l934j543k85j98
2986c984j00j660j128J109K771L447L382K074k28m32n3o81n87k392l703k945q62
$$ plain form
3003 -5972 -5017 -2356 286 1135 456 240 220 993 2253 1643 220 -1569 -2419 -2129 -1009 61 -432 -1103
3021 -1103 -639 852 2762 3449 2706 1400 -205 -1691 -1565 -1031 -1528 -1710 -1941 -1601 -776 1049 2814
3038 2814 3447 3594 2087 555 -380 -1617 -2875 -3395 -4250 -4716 -3378 -483 2442 4352 5021 4604 4054
3055 4054 3044 1761 958 -1068 -3510 -4438 -3718 -2895 -1686 -545 -288 -326 -205 223 1107 1782 1840 1435
3073 1435 1011 452 -381 -99 525 870 835 933 627 625 533 111 -446 -1132 -2221 -1912 -1237 -1297 -1990 -2420 -2351 -1308
3095 -1308 936 3373 4901 5316 3777 2055 256 -1576 -3098 -2975 -2252 -1677 -792 381 650 563 296
3112 296 521 763 1013 685 689 321 -1224 -2703 -3012 -2839 -1484 882 2581 3402 3016 1144 348 85 305
3131 305 517 1583 1772 589 -502 -2349 -3492 -4026 -2985 -1471 419 1205 851 1145 681 -380 -656
$$ packed form
3003e972R55K661K642Q49o79k16k0P73J260o10j423j789q50K90J120J070m93o71
3021a103M64J491J910O87p43j306j605j486J26N34m97j82k31L40Q25J825J765
3038B814O33J47j507j532r35j237j258n20q55m66J338K895K925J910O69m17n50
3055D054j010j283q03k026k442r28P20Q23J209J141K57l8J21M28Q84O75N8m05
3073A435m24n59q33K82O24L45l5R8l06kr2m22n57o86j089L09O75o0o93m30O9J043
3095a308K244K437J528M15j539j722j799j832j522J23P23N75Q85J173K69q7k67
3112B96K25K42K50l28Ml68j545j479l09J73J355K366J699Q21l86j872p96k63K20
3131C05K12J066J89j183j091j847j143n34J041J514J890P86l54K94m64j061k76
$$ plain form
3148 -656 -489 208 1161 2923 3917 2854 1238 -1216 -1756 -585 625 1128 929 -1339 -4112 -5286 -4680
3165 -4680 -3225 -1077 556 1604 2831 3133 3246 3371 2717 633 -298 -13 261 1442 1657 -692 -3391
3182 -3391 -5073 -4339 -1327 2296 2757 1312 -1354 -3271 -2960 -314 2176 2491 1647 475 578 1357 2049
3199 2049 1234 -231 -2174 -2616 -372 2543 3023 1473 -1296 -4154 -4593 -2001 1071 2988 2261 -286
3215 -286 -2110 -1780 285 2469 3338 1510 -1501 -2251 -1449 84 1331 423 -1434 -1561 166 2792 4582
3232 4582 3248 -859 -4224 -4634 -2715 851 3320 2633 158 -1458 -2499 -1120 270 283 -660 -1348
3248 -1348 -1631 -107 2301 3623 2517 1615 287 30 966 1569 216 -1945 -3772 -3977 -2035 870
3264 870 2152 1466 -574 -2617 -2564 -1347 61 1176 1247 918 1784 3017 3146 2416 528 -1475 -1862 -772
$$ packed form
3148f56J67O97R53J762R94j063j616k454n40J171J210N03j99k268k773j174O06
3165d680J455K148J633J048J227L02J13J25o54k084r31K85K74J181K15k349k699
3182c391j682P34L012L623M61j445k666j917L11K646K490L15q44j172J03P79O92
3199B049q15j465j943m42K244K915M80j550k769k858m39K592L072J917p27k547
3215b86j824L30K065K184Q69j828l011p50Q02J533J247r08j857j27J727K626J790
3232D582j334m107l365m10J919L566K469o87k475j616j041J379J390J3r43o88
3248a348k83J524K408J322j106r02j328k57R36O03j353k161j827k05J942K905
3264H70J282o86k040k043N3J217J408J115P1l29Q66J233J29p30j888k003l87J090
$$ plain form
3282 -772 713 596 -218 -1631 -2438 -1682 -437 -393 -909 -2381 -3241 -1795 555 2346 3807 3732 2908 2568
3300 2568 2777 2314 849 -1450 -4214 -4657 -2654 -348 1982 1875 -593 -2678 -2424 -1039 731 1430
3316 1430 269 -1629 -2207 -98 2695 4407 3776 1052 -923 -1096 461 2514 2542 -521 -3570 -3985
3332 -3985 -2310 578 2114 644 -2323 -4413 -4271 -1063 3626 5192 3827 1701 -57 -274 1164
3347 1164 1949 558 -2145 -4543 -4126 -272 2875 4082 2616 -755 -2951 -2038 1295 2905 1938 -942
3363 -942 -3800 -3759 -1101 2119 3684 2662 -720 -2625 -1765 641 1927 1699 -640 -3176 -3276 -749
3379 -749 2291 3710 2583 -200 -1859 -1636 774 3377 3631 1210 -2252 -4172 -4464 -2981 -945 -771
3395 -771 -1601 -1814 -593 2037 5193 5530 3820 1399 -536 -219 1587 2394 748 -1665 -4191 -5094 -3980
$$ packed form
3282g72J485j17q14j413q07P56J245M4n16j472q60J446K350J791J461p5q24l40
3300B568K09m63j465k299k764m43K003K306K330j07k468k085K54J385J770O99
3316A430j161j898n78K109K793J712o31k724j975j73J557K053K8l063l049m15
3332c985J675K888J536j470k967k090J42L208M689J566j365k126j758k17J438
3347A164P85j391k703k398M17L854L147J207j466l371k196R13L333J610r67k880
3363i42k858M1K658L220J565j022l382j905Q60K406J286k28k339k536j00K527
3379g49L040J419j127k783j659K23K410K603K54k421l462j920k92J483K036J74
3395g71q30k13J221K630L156L37j710k421j935L17J806Q07j646k413k526r03J114
$$ plain form
3412 -3980 -1482 -214 -185 -928 -1880 -1048 575 1766 2355 1801 848 724 1705 2874 3160 2509 435 -896
3430 -896 -1364 -602 81 78 -2011 -4721 -5983 -5355 -3462 -313 2271 3173 3024 3304 3443 4041 3807 2263
3448 2263 831 -360 -981 -1189 -332 -1387 -2746 -3450 -3689 -3072 -1329 391 1487 1127 389 200 1162
3465 1162 1982 2600 2586 1613 -170 -1243 -1254 -652 -10 353 188 247 -319 -835 -1042 -2017 -3150 -3127 -1584 363
3485 363 2579 4059 4808 3543 1666 -232 -1368 -1477 -1892 -2138 -1872 -2484 -2722 -1886 -110 1401 1894
3502 1894 2207 2008 1893 2089 1517 1816 1202 -305 -684 -336 -569 -1609 -2455 -3485 -4511 -4158 -2265 757
3520 757 3368 4109 3958 3118 1019 -269 -9 874 670 484 736 720 965 269 3 -1649 -3702 -5473
3538 -5473 -5211 -3246 -1482 -139 1264 1342 1589 3238 5341 6166 5150 2180 -138 -1685 -2260 -1941 -625
$$ packed form
3412c980K498J268K9p43r52Q32J623J191N89n54r53j24R81J169K86o51k074j331
3430h96m68P62O83lk089k710j262O28J893L149K584R02j49K80J39N98k34j544
3448B263j432j191o21k08Q57j055j359p04k39O17J743J720J096l60p38j89R62
3465A162Q20O18j4r73j783j073j1O02O42L63j65N9n66n16k07r75j133K3J543J947
3485C63K216J480P49j265j877j898j136j09m15k46K66o12k38Q36J776J511M93
3502A894L13j99j15J96n72K99o14j507l79L48k33j040q46j030j026L53J893L022
3520G57K611P41j51q40k099j288K60Q83k04j86K52j6K45o96k66j652k053j771
3538e473K62J965J764J343J403P8K47J649K103Q25j016k970k318j547n75L19J316
$$ plain form
3555 -625 -844 -2679 -3481 -3487 -3019 -1710 -863 -529 -235 252 1769 4553 5894 4828 2256 -30 -2368 -2465
3573 -2465 -726 418 -308 -1291 -2258 -1591 43 644 436 -511 -2360 -3164 -1005 1779 3272 3183 2077
3590 2077 523 132 663 1246 644 -1115 -3398 -3792 -2528 -444 1272 2071 1128 -226 -503 672 2167
3607 2167 2538 1091 -817 -1289 -1165 25 1173 466 -2062 -4018 -3900 -2661 -186 1477 1621 1579 1135
3624 1135 1744 3020 3680 2325 427 -946 -1273 -982 -99 -191 -951 -2497 -3435 -2839 -1119 -462 -760 -685
3642 -685 -483 304 2373 4343 4123 3325 1477 209 121 85 -178 -624 -1255 -2445 -2041 -1037 -845 -1847
3660 -1847 -2300 -2965 -2088 255 1715 2857 2530 1529 1090 1840 2600 1958 1384 -206 -1578 -1563 -879 -521
3678 -521 -742 -1779 -2853 -2407 -746 -257 519 323 -768 -299 1648 2993 3792 2977 267 -1707 -2210
$$ packed form
3555f25k19j835q02oM68J309Q47L34K94M87J517K784J341j066k572k286k338r7
3573b465J739J144p26r83r67O67J634O01k08r47j849q04K159K784J493q9j106
3590B077j554l91N31N83o02j759k283l94J264K084J716P99r43j354k77J175J495
3607B167L71j447j908m72J24J190J148p07k528j956J18J239K475J663J44m2m44
3624A135O09J276O60j355j898j373l27K91Q83r2p60j546r38N96J720O57k98P5
3642f85K02P87K069J970k20p98j848j268q8l6k63m46o31j190M04J004J92j002
3660a847m53o65Q77K343J460J142l27j001m39P50P60o42n74j590j372J5O84L58
3678e21k21j037j074M46J661M89P76j96j091M69J947J345P99q15k710j974n03
$$ plain form
3695 -2210 -1970 -748 559 56 -772 -659 28 1378 1508 680 -1410 -2423 -1444 449 2505 2631 864
3712 864 -920 -1207 -840 348 992 -29 -1732 -2685 -2060 106 2258 2545 1206 130 -773 -457 1272
3729 1272 1628 716 -211 -978 -368 961 1744 172 -1941 -4264 -5473 -3287 -382 1961 2361 1794 1192
3746 1192 1739 3303 3739 3209 849 -1971 -2567 -1606 -511 -119 -230 -1789 -2911 -2092 -498 504 15
3763 15 -1408 -2247 -999 1106 3483 5021 4012 1451 -403 -1088 -551 147 506 -608 -1159 -1212 -955 280
3781 280 351 -1352 -3147 -3786 -2923 -463 2367 3298 2587 1907 1189 1886 2602 2180 175 -1778 -3383 -3953
3799 -3953 -2104 -86 639 599 -7 -117 253 1014 838 65 -529 -1328 -553 1090 2129 1992 606 -1114
3817 -1114 -2512 -2003 -1220 -67 450 585 228 446 1039 1352 1124 262 -934 -1657 -801 289 1033 1163
$$ packed form
3695b210K40J222J307n03q28J13O87J350J30q28k090j013R79J893K056J26j767
3712H64j784k87L67J188O44j021j703r53O25K166K152K87j339j076r03L16J729
3729A272L56r12r27p67O10J329P83j572k113k323j209K186K905K343M00n67o02
3746A192N47J564M36n30k360k820n96R61J095L92j11j559j122Q19J594J002m89
3763A5j423q39J248K105K377J538j009k561j854o85N37O98L59j114n51n3K57J235
3781B80P1j703j795o39Q63K460K830R31p11o80p18O97P16m22k005j953j605n70
3799c953J849K018P25m0o06j10L70P61j76p73n94p99P75J643J039j37j386j720
3817a114j398N09P83J153N17J35l57K18N93L13k28q62j196p23Q56J090P44J30
$$ plain form
3835 1163 703 44 -291 -520 -764 -1198 -2351 -2847 -2120 -1000 822 2284 3418 3308 2906 2307 1265 1163
3853 1163 101 -1089 -1462 -1949 -1952 -1728 -1114 -1623 -1839 -2051 -1733 -598 427 1380 2202 2398 2432 2807 2679
3872 2679 2046 1084 -144 -1053 -1276 -1024 -887 -935 -1200 -1763 -2031 -1892 -1598 -1480 -1407 -958 -467 998 2687
3891 2687 3322 3964 3789 2542 1699 747 11 -649 -1505 -2719 -3121 -2634 -2090 -1541 -1075 -711 -986 -675 419
3910 419 1442 2900 3017 2611 2067 1279 776 537 2 -1049 -2091 -2490 -1864 -1403 73 340 -227 -567
3928 -567 -1089 -371 276 674 618 1259 1138 1183 1621 2062 1187 -229 -1500 -2294 -2227 -1900 -1231 -443 -379 -845 -311
3949 -311 607 1085 1504 1741 1528 1254 1315 1015 1279 791 -289 -1264 -2139 -2879 -2926 -2620 -2242 -1681 -798 781
3969 781 1751 2347 2876 2788 2455 1554 514 -12 -218 -102 421 198 -711 -2036 -2846 -3265 -2971 -1954 -1492
$$ packed form
3835A163m60o59l35k29k44m34j153m96P27J120J822J462J134j10m02n99j042j02
3853A163j062j190l73m87lK24O14n09k16k12L18J135J025R53Q22J96L4L75j28
3872B679o33r62j228r09k23K52J37m8k65n63k68J39K94J18P3M49M91J465J689
3891B687O35O42j75j247q43r52p36o60q56j214m02M87N44N49M66L64k75L11J094
3910D19J023J458J17m06n44p88n03k39n35j051j042l99O26M61J476K67n67l40
3928e67n22P18O47L98n6O41j21M5M38M41q75j416j271p94O7L27O69P88O4m66N34
3949c11R18M78M19K37k13k74O1l00K64m88j080r75q75p40m7L06L78N61Q83J579
3969G81R70N96N29q8l33r01j040n26k06J16N23k23r09j325q10m19K94J017M62
$$ plain form
3988 -1492 -686 -237 361 1544 2691 3683 3401 2703 1582 447 595 1156 606 -107 -1541 -2889 -2487 -1704
4006 -1704 -1528 -1589 -2793 -3909 -3508 -1137 1976 4640 5519 4349 2080 1185 903 1418 1419 -404 -2100 -2847
4024 -2847 -2531 -1225 -184 -218 -2019 -3032 -2938 -939 1783 3138 2222 714 -433 -45 2076 3941 3889
4041 3889 1263 -1681 -4184 -3714 -1629 505 1317 358 -1118 -1796 -454 834 826 121 -1402 -1562 602
4058 602 3345 4929 4212 759 -2721 -4102 -3043 -853 1106 499 -1131 -2416 -1718 -298 2163 3296
4074 3296 2281 1119 294 111 989 1365 468 -1060 -2321 -2196 -829 206 -196 -1749 -3397 -3585 -2150
4091 -2150 1176 3995 4878 3900 2009 450 297 372 396 -136 -281 -743 -763 -588 -976 -1593 -2413 -2664 -2199
4110 -2199 -987 236 895 1048 677 603 1620 2440 2902 2905 2110 407 -861 -1640 -2374 -2087 -1785 -1131 -297
$$ packed form
3988a492Q06M49N98J183J147R92k82o98j121j135J48N61n50p13j434j348M02P83
4006a704J76o1j204j116M01K371L113K664Q79j170k269q95k82N15Jj823j696p47
4024b847L16J306J041l4j801j013R4J999K722J355r16j508j147L88K121J865n2
4041C889k626k944k503M70K085K134Q12r59j476o78J342J288qp05j523j60K164
4058F02K743J584p17l453l480j381J059K190J959o07j630j285O98J420K461J133
4074C296j015j162q25j83Q78L76q97j528j261J25J367J035m02j553j648j88J435
4091b150L326K819Q83r78j891j559j53P5K4n32j45m62k0J75l88o17q20k51M65
4110b199J212J223O59J53l71p4J017Q20M62Lp95j703j268p79p34K87L02O54Q34
$$ plain form
4129 -297 -478 -1246 -1616 -1806 -1715 37 1960 3231 3256 3070 1880 990 212 -286 -652 -1221 -1701 -1382 -352
4148 -352 -79 -490 -1029 -1136 -1329 -22 1612 2110 1197 -422 -1703 -1239 40 1329 2254 2184 -7 -1319
4166 -1319 -1475 -1250 -360 72 -430 -274 279 845 1487 1019 -281 -1853 -1737 -371 1560 3082 2670 676
4184 676 -1723 -3021 -2680 -1136 -184 114 -435 -778 -900 1006 2365 2348 1599 955 418 781 1007 837 -257
4203 -257 -2037 -3117 -2574 -730 1084 1026 59 -1322 -2453 -1618 -36 2044 2410 1995 942 602 474
4220 474 637 785 397 -582 -1182 -124 733 1085 -157 -1655 -2848 -3013 -2261 -319 907 852 -31 -36 797
4239 797 1614 2935 2832 1810 289 -728 -1190 -650 -502 -897 -1084 -979 -694 -50 733 517 -963 -1557
4257 -1557 -1514 -471 1069 1885 1619 874 -745 -1365 -318 318 422 841 832 327 490 480 745 234 -1121
$$ packed form
4129b97j81p68l70j90R1J752J923J271K5j86j190q90p78m98l66n69m80L19J030
4148c52K73m11n39j07j93J307J634M98r13j619j281M64J279J289R25p0k191j312
4166a319j56K25Q90M32n02J56N53N66O42m68j300j572J16J366J931J522m12j994
4184F76k399j298L41J544R52K98n49l43j22J906J359j7p49o44n37L63K26j70j094
4203b57j780j080N43J844J814n8r67j381j131Q35J582K080L66m15j053l40j28
4220D74J63J48l88r79o00J058Q57L52j242j498j193j65P52J942J226n5q83nQ33
4239G97Q17J321j03j022j521j017m62N40J48l95j87J05K85O44P83k16j480n94
4257a557M3J043J540Q16k66p45j619o20J047O36J04M19rn05J63j0K65n11j355
$$ plain form
4276 -1121 -2023 -1936 -1208 -535 151 327 -103 -264 227 767 1790 1405 177 -563 -1062 -1193 -284 1177 1337
4295 1337 931 420 339 91 62 -161 -730 -850 -1354 -911 159 667 523 -108 -907 -1421 -672 756 1401 1386
4315 1386 1429 1023 633 833 358 52 -381 -1337 -1631 -1300 -592 -320 294 489 91 42 114 411 192 -97 -802
4336 -802 -427 -494 210 764 1273 1322 808 -139 -531 -735 -365 -652 -165 108 203 -81 351 108 -254 -395 -497
4357 -497 -688 -651 -23 543 1136 1036 323 -102 -429 -660 -83 253 528 297 -41 -33 477 954 879 697 -129
4378 -129 -1234 -1756 -1211 -756 -350 -262 -354 -609 8 540 1292 1163 387 -684 -516 261 918 1714 1591 426
4398 426 -629 -948 -1038 -92 -318 -786 -1207 -1192 -887 305 1353 716 -145 -970 -1018 305 1126 2010 1329 542
4418 542 -418 22 1014 1519 1031 -451 -1589 -2332 -1714 -319 84 -170 -879 -1418 -709 469 1305 1392 648
$$ packed form
4276a121r02Q7P28O73O86J76m30j61M91N40J023l85j228p40m99j31R09J461J60
4295A337m06n11q1k48k9k23n69j20n04M43J070N08j44o31p99n14P49J428O45j5
4315A386M3m06l90K00m75l06m33r56k94L31P08K72O14J95l98m9P2K97k19k89p05
4336h02L75o7P04N54N09M9n14r47l92k04L70k87M87K73R5k84M32k43l62j41j02
4357d97j91L7O28N66N93j00p13m25l27k31N77L36K75k31l38QN10M77p5j82q26
4378a29j105n22N45M55M06Q8r2k55O17N32P52j29p76j071J68P77O57P96j23j165
4398D26j055l19r0R46k26m68m21J5L05J192J048o37q61q25m8J323Q21Q84o81p87
4418E42r60M40R92N05m88j482j138p43O18J395M03k54p09n39P09J178Q36Q7p44
$$ plain form
4437 648 -304 -351 459 1969 2308 1447 -185 -1726 -1439 -715 69 311 -428 -1362 -1211 -339 432 989 309
4456 309 -661 -1431 -1033 -43 1226 1210 627 -24 -418 380 1358 1800 894 -481 -1333 -1290 -477 635 361 -529
4476 -529 -808 -1270 -632 659 889 339 -547 -488 -234 885 1427 1100 38 -933 -1126 -278 1006 1006 852 312
4496 312 -296 45 546 545 -18 -736 -1894 -1591 -839 128 389 642 61 -273 464 984 1068 843 145 -628 -762
4517 -762 -143 546 416 196 -734 -547 -206 27 237 581 87 -624 -523 53 167 -74 -734 -1093 -992 -533
4537 -533 649 1424 1423 1033 938 934 827 620 -59 -721 -1504 -1249 -674 -51 265 -180 -302 -92 -74 196 521 427
4559 427 -386 -371 -241 108 833 485 315 92 147 184 906 627 -338 -636 -759 -541 -116 6 -461 -1046 -1504
4580 -1504 -1474 -468 588 985 1038 1106 764 697 1122 601 -13 -893 -1177 -1009 117 666 953 490 -293 -310
$$ packed form
4437F48r52m7Q10J510L39q61j632j541K87P24P84K42p39r34J51Q72P71N57o80
4456C09r70p70L98R90J269j6n83o51l94P98R78M42r06j375q52M3Q13J112k74q90
4476e29k79m62O38J291K30n50q86N9K54J119N42l27j062r71j93Q48J284%j54n40
4496C12o08L41N01jn63p18j158L03P52R67K61K53n81l34P37N20Q4k25o98p73j34
4517g62O19O89j30k20r30J87L41K33K10L44m94p11J01N76J14k41o60l59J01M59
4537e33J182P75jl90r5mj07k07o79o62p83K55N75O23L16m45j22K10J8K70L25r4
4559D27q13J5J30L49P25l48j70k23N5L7P22k79r65k98j23K18M25J22m67n85m58
4580a504L0J006J056L97N3O8l42o7M25n21o14q80k84J68J126N49K87m63p83j7
$$ plain form
4600 -310 -347 338 214 -357 -942 -1280 -935 -392 506 973 651 -40 -40 541 781 1033 1065 -114 -743 -551 -52
4621 -52 325 658 -458 -1170 -1354 -1148 -184 773 786 143 -199 -143 -109 108 267 -432 -790 -859 -448 674 1559
4642 1559 1447 1090 403 -218 -165 -53 -61 -619 -1135 -1326 -842 -398 165 57 194 -166 -418 300 760 778 470
4663 470 172 -13 149 658 614 525 -155 -418 -370 -395 -333 -203 -182 -555 -990 -669 -187 39 81 -345 -285 148 358
4686 358 814 1650 1316 490 142 78 -31 -258 -486 -623 -852 -760 -340 159 66 -372 -317 -368 95 439 599 352
4708 352 -140 -374 -394 304 884 1020 427 415 5 -375 375 393 94 -338 -474 -794 -404 116 -200 -745 -829
4729 -829 -1174 -167 601 998 955 459 -594 -547 195 1013 992 1077 104 -282 -418 -447 393 164 -332 -816 -888
4750 -888 -207 235 197 -174 -945 -1032 -433 637 1141 1399 624 -300 -607 -175 148 978 774 141 -447 -984
$$ packed form
4600c10l7O85j24n71n85l38L45N43Q98M67l22o91%N81K40K52L2j179o29J92M99
4621e2L77L33j116p12j84K06R64R57J3o43l42N6L4K17J59o99l58o9M11J122Q85
4642A559j12l57o87o21N3J12qn58n16j91M84M44N63j08J37l60k52P18M60J8l08
4663D70k98j85J62N09m4q9o80k63M8k5O2J30K1l73m35L21M82K26M2m26O0M33K10
4686C58M56Q36l34q26l48o4j09k27k28j37k29R2M20M99r3m38N5n1M63L44J60k47
4708C52m92k34k0O98N80J36n93j2m10l80P50J8k99m32j36l20L90N20l16n45q4
4729h29l45J007P68L97m3m96j053M7P42Q18k1Q5r73l86j36k9Q40k29m96m84p2
4750h88O81M42l8l71p71q7N99J070N04K58p75r24l07M32L23Q30k04o33n88n37
$$ plain form
4770 -984 -782 -190 156 -85 -214 -323 -499 116 515 290 -525 -967 -759 362 1002 1061 948 436 -403 -836
4790 -836 -415 -166 491 664 141 -166 -321 -195 90 306 -258 -457 -219 -215 -352 -268 -277 -235 22 60 277 653
4812 653 467 438 245 54 -302 -194 -90 321 736 539 231 -638 -1019 -967 -818 -239 -39 -35 -232 -741 -515
4833 -515 227 797 595 42 -183 -245 823 1426 1435 1075 -253 -745 -611 156 167 -341 -755 -2027 -2094 -1428 171
4854 171 1153 1513 437 -309 -376 454 1118 1762 818 -406 -1183 -634 550 1205 937 -123 -1357 -1873 -995
4873 -995 239 1028 522 -838 -1342 -1398 -203 1233 1626 907 -96 -833 -248 928 1713 1404 375 -1220
4891 -1220 -1811 -701 372 576 122 -866 -1732 -730 114 1228 1581 549 -697 -1282 -707 147 755 314
4909 314 -379 -738 -597 564 1323 1759 808 -422 -730 -628 106 388 183 -923 -1586 -1568 -629 408 519
$$ packed form
4770i84K02N92L46k41j29j09j76O15L99k25q15m42K08J121O40N9j13n12q39m33
4790h36M21K49O57J73n23l07j55J26K85K16n64j99K38Mj37Q4rM2K57L8K17L76
4812F53j86k9j93j91l56J08J04M11M15j97l08q69l81N2J49N79K00Mj97n09K26
4833e15P42N70k02n53k25o2J068O03Rl60j328m92J34P67J1n08m14j272o7O66J599
4854A71R82L60j076p46o7Q30O64O44r44j224p77N49J184O55k68j060j234n16Q78
4873i95J234P89n06j360n04n6J195J436L93p19j003p37N85J176P85l09j029j595
4891a220n91J110J073K04m54r88q66J002Q44J114L53j032j246n85N75Q54O08m41
4909C14o93l59J41J161P59M36r51j230l08J02P34K82k05j106o63J8R39J037J11
$$ plain form
4928 519 357 103 -558 -484 235 789 910 345 120 -108 30 486 683 795 132 249 -126 -164 130 162 -268
4949 -268 -1023 -1108 -803 -710 -184 34 46 331 910 802 729 903 929 511 646 285 -270 -467 -746 -831 -493 -410
4971 -410 -233 -130 -185 -65 -76 141 104 -169 -279 -289 109 704 843 611 433 275 83 417 414 223 -165 -728
4993 -728 -1422 -872 -399 -46 130 -219 -171 -177 236 796 701 726 -24 -242 -201 163 345 311 -473 -948 -717 -262
5015 -262 290 641 491 -34 20 259 649 831 555 -793 -997 -1250 -949 -400 502 372 -6 -234 -52 171
5035 171 807 375 85 -47 -71 352 443 675 260 30 -507 -294 -128 247 159 -683 -1061 -1265 -820 -35 81
5056 81 395 128 129 -19 414 898 814 939 809 614 746 389 106 -636 -1394 -1828 -1288 -976 68 47 -27 -332
5078 -332 -465 114 386 998 1198 424 485 321 266 582 671 331 -59 -324 -196 -276 -300 -1057 -1245 -1517 -1331 -486
$$ packed form
4928E19j62k54o61P4P19N54J21n65k25k28J38M56J97J12o63J17l75l8K94L2m30
4949b68p55q5L05R3N26K18J2K85N79j08p3J74K6m18J35l61n55j97k79q5L38Q3
4971d10J77J03n5J20j1K17l7k73j10j0L98N95J39k32j78j58j92L34lj91l88n63
4993g28o94N50M73L53J76l49M8oM13N60r5K5p50k18M1L64J82l4p84m75K31M55
5015b62N52L51j50n25N4K39L90J82k76j348k04k53L01N49R02j30l78k28J82K23
5035A71O36m32k90j32k4M23R1K32m15k30n37K13J66L75q8q42l78k04M45P85J16
5056H1L14k67Jj48M33M84q4J25j30j95J32l57k83p42p58m34N40L12J044k1p4l05
5078c32j33N79K72O12K00p74O1j64n5L16Q9l40l90k65J28q0k4p57j88k72J86Q45
$$ plain form
5100 -486 387 895 498 70 70 307 724 1346 1248 847 295 -213 -294 -279 -794 -1075 -1093 -1171 -443 125 674 470
5122 470 111 -242 -6 100 540 835 568 -186 -1001 -675 -518 -32 595 560 188 11 227 -20 345 -117
5142 -117 -214 -301 -158 110 321 455 -34 -446 -631 -462 219 203 430 -121 -407 -795 -628 19 387 422 619
5163 619 438 601 731 325 133 -303 -456 -392 -276 -239 -358 -299 -693 -997 -566 59 657 690 739 222 328 506
5185 506 464 336 186 103 -34 -33 4 -194 -465 -554 -813 -357 34 87 -181 -138 -675 -544 -347 -106 570 501 462
5208 462 614 991 867 406 40 -442 -453 -679 -281 -93 -129 -367 -586 -394 10 276 347 307 -60 -177 -14
5229 -14 106 538 92 84 -103 -17 276 543 515 -136 -725 -665 -27 414 585 320 -114 -479 -732 -424 216 161
5251 161 -311 -172 89 134 321 729 174 -688 -675 -212 -88 538 823 220 41 -159 143 805 436 75 -695
$$ packed form
5100d86Q73N08l97m28%K37M17O22r8m01n52n08q1J5n15k81j8p8P28N68N49k04
5122D70l59l53K36J06M40K95k67p54q15L26J57M86O27l5l72j77K16k47L65m62
5142a17r7q7J43K68K11J34m89m12j85J69O81j6K27n51k86l88J67O47L68L5J97
5163F19j81J63J30m06j92m36j53O4J16L7j19N9l94l04M31O25N98L3M9n17J06J78
5185E06m2j28j50q3j37JL7j98k71q9k59M56L91N3k68M3n37J31J97K41O76o9l9
5208D62J52L77j24m61l66m82j1k26L98J88l6k38k19J92M04K66P1m0l67j17J63
5229a4J20M32m46qj87Q6K93K67k8o51n89O0O38M41J71k65m34l65k53L08O40n5
5251A61m72J39K61M5J87M08n55q62J3M63J24O26K85o03j79k00L02O62l69l61p70
$$ plain form
5272 -695 -1068 -988 -750 -536 -163 -28 -394 -199 231 749 526 761 157 -185 243 797 969 718 177 -509
5292 -509 -816 -601 -396 -373 -449 -667 -918 -291 39 439 296 -163 -229 -1 519 1225 1345 633 -82 -197 197
5313 197 481 304 -5 -746 -1506 -1349 -862 -454 -138 -422 -280 -260 227 691 1035 570 110 -243 154 795
5333 795 1009 1020 255 -152 -1077 -811 -159 11 -350 -579 -735 -626 -159 488 619 439 220 -55 167 967
5353 967 1029 668 353 -169 -634 65 150 -78 -285 -824 -1033 -411 97 445 614 252 181 76 441 266 247
5374 247 141 -576 -447 -333 -264 -251 77 -375 -306 -45 152 512 580 272 238 129 240 110 -8 -80 -220 -166
5396 -166 -119 -318 -178 -148 -472 -555 -309 -225 243 121 -4 206 546 430 952 856 589 456 237 347 -148 -281
5418 -281 -898 -997 -997 -788 -274 -167 -142 -201 -246 -4 142 757 712 389 525 98 5 205 200 5 -29 -164 -619 -207
$$ packed form
5272f95l73Q0K38K14L73J35l66J95M30N18k23K35o04l42M28N54J72k51n41o86
5292e09l07K15K05K3p6k18k51O27L30M00j43m59o6K28N20P06J20p12p15j15L94
5313A97K84j77l09p41p60J57M87M08L16k84J42K0M87M64L44m65m60l53L97O41
5333G95K14J1p65m07r25K66O52J70l61k29j56J09M67O47J31j80k19k75K22Q00
5353I67O2l61l15n22m65O99Q5k28k07n39k09O22N08L48J69l62p1j05L65j75j9
5374B47j06p17J29J14O9J3L28m52O9K61J97L60O8l08l4j09J11j30j18p2j40N4
5396a66M7j99J40L0l24q3K46Q4M68j22j25K10L40j16N22r6k67j33k19J10m95j33
5418b81o17r9%K09N14J07K5n9m5K42J46O15m5l23J36m27r3K00nj95l4j35m55M12
$$ plain form
5442 -207 183 36 -234 -480 -690 -575 -154 175 119 268 -104 -118 533 960 914 470 336 -148 -182 -368 -333 -479
5464 -479 -422 -537 -327 -101 -107 505 206 80 -654 -159 -120 119 396 79 98 45 198 288 642 401 274 -205
5486 -205 62 108 -26 76 -115 -355 -714 -131 -236 -345 -471 -282 86 93 406 543 493 279 -286 -24 -156
5507 -156 222 345 237 84 180 107 129 90 -137 -167 -624 -999 -609 -490 -199 -57 -23 -85 212 734 1093 609
5529 609 166 -400 -284 198 674 480 155 -192 -726 -627 -550 -96 26 -392 -501 -345 138 386 475 167 -217
5550 -217 -275 -295 336 550 613 -174 -411 -204 -161 468 746 280 -436 -806 -870 -516 271 339 442 108 -28 17
5572 17 241 167 10 -287 -727 -517 139 659 855 311 -242 -814 -403 115 553 891 304 -204 -587 -406 -66
5593 -66 440 307 -1 -611 -602 -380 3 42 -105 -317 -680 -39 710 633 429 -44 -431 -558 315 997 1253 840
$$ packed form
5442b07L90j47k70k46k10J15M21L29n6J49l72j4O51M27m6m44j34m84l4j86L5j46
5464d79N7j15K10K26oO12k99j26p34M95L9K39K77l17J9n3J53R0L54k41j27m79
5486b05K67M6j34J02j91k40l59N83j05j09j26J89L68PL13J37n0k14n65K62j32
5507a56L78J23j08j53R6p3K2l9k27l0m57l75L90J19K91J42L4o2K97N22L59m84
5529F09m43n66J16M82M76j94l25l47n34R9P7M54J22m18j09J56M83K48Q9l08l84
5550b17n8k0O31K14O3p87k37K07M3O29K78m66p16l70o4L54P87O8J03l34j36M5
5572A7K24p4j57k97m40K10O56N20J96n44n53n72M11N18M38L38n87n08l83J81L40
5593f6N06j33l08o10RK22L83L9j47k12l63O41P49p7k04m73l87j27Q73O82K56m13
$$ plain form
5615 840 67 -730 -1256 -670 -571 -153 -215 -371 -389 -229 -61 86 240 220 176 446 705 865 859 405 -143 -208 -112
5638 -112 122 62 -186 -322 -872 -1087 -1092 -783 -90 187 436 481 330 34 87 69 439 902 824 702 223 -127
5660 -127 -630 -789 -584 -541 -542 -382 -452 98 186 236 6 -262 -457 -2 565 650 595 368 -139 -458 -188 560 1026
5683 1026 636 60 -668 -621 -615 -253 6 199 -145 -355 -114 363 487 400 -401 -624 -313 573 797 828 570
5704 570 -519 -892 -976 -313 579 798 600 -296 -510 -411 152 809 887 185 -414 -512 -514 131 -109 -299 -711 -434
5726 -434 -191 427 779 643 89 -826 -846 -121 577 1037 863 545 -468 -650 -460 -426 -10 -247 -496 -528 -170
5747 -170 -66 113 80 -181 -311 92 427 869 1012 835 331 15 199 146 380 33 -406 -670 -933 -927 -515
5768 -515 -303 51 -117 309 520 164 210 266 99 73 363 400 547 401 359 -153 -284 -311 -460 -243 -432 -383
$$ packed form
5615H40p73p97n26N86R9M18o2j56j8J60J68J47J54k0m4K70K59J60om54n48o5R6
5638a12K34o0k48j36n50k15nL09O93K77K49M5j51k96N3j8L70M63p8j22m79l50
5660a27n03j59K05M3jJ60p0N50Q8N0k30k68j95M55N67Q5n5k27n07l19K70P48M66
5683A026l90n76p28M7OL62K59J93l44k10K41M77J24q7q01k23L11Q86K24L1k58
5704E70j089l73q4O63Q92K19j98q96k14R9N63O57P8p02n99r8kO45k40j90m12K77
5726d34K43O18L52j36n54r15k0P25O98M60j74l18j013j82J90L4M16k37k49l2L58
5747a70J04J79l3k61j30M03L35M42J43j77n04l16J84n3K34l47m39k64k63OM12
5768e15K12L54j68M26K11l56M6N6j67k6K90L7J47j46m2n12j31k7j49K17j89M9
$$ plain form
5790 -383 -92 -418 -325 -168 -286 -233 222 102 438 500 154 183 84 321 639 459 354 -337 -400 -404 -585 -184 -358
5813 -358 -223 -247 188 284 535 373 -38 -185 -379 -113 28 318 132 -5 88 -166 4 583 408 362 10
5834 10 -367 -215 57 138 39 -7 -340 -98 -85 -203 141 54 -237 -542 -162 -9 281 534 257 -242 -714 -111
5856 -111 435 437 587 489 467 139 354 -88 117 -288 -746 -870 -639 -265 -29 25 -155 -129 305 162 405 648
5878 648 380 316 169 96 340 43 125 124 -457 -473 -103 -107 -230 -245 -357 -331 -333 140 69 146 -60 -93 -222 415 610
5903 610 710 814 272 120 -76 28 -113 -448 -438 -639 -515 11 78 37 -138 -27 127 151 131 266 433 139
5925 139 -151 -132 143 66 251 18 -120 -334 70 -99 111 136 -161 -288 -235 33 -92 -85 -136 -319 -478 -382 192
5948 192 520 193 332 121 41 86 -29 19 -72 -138 -65 -247 304 130 303 -322 -478 -365 -289 2 216 -169
$$ packed form
5790c83K91l26R3J57j18N3M55j20L36O2l46K9r9K37L18j80j05o91o3mj81M01j74
5813c58J35k4M35R6K51j62m11j47j94K66J41K90j86j37R3k54J70N79j75m6l52
5834A0l77J52K72Q1r9m6l33K42J3j18L44q7k91l05L80J53K90K53k77m99m72O03
5856a11N46KJ50r8k2l28K15m42K05m05m58j24K31L74K36N4j80K6M34j43K43K43
5878F48k68o4j47p3K44k97Q2jn81j6L70mj23j5j12K6kM73p1P7k06l3j29O37J95
5903F10J00J04n42j52j96J04j41l35J0k01J24N26O7m1j75J11J54K4k0J35J67k94
5925A39k90J9K75p7J85k33j38k14M04j69K10K5k97j27N3K68j25Pn1j83j59R6N74
5948A92L28l27J39k11q0M5j15M8r1o6P3j82N51j74J73o25j56J13P6K91K14l85
$$ plain form
5970 -169 -187 -454 -176 196 287 330 194 27 122 61 532 549 218 88 -57 -24 -45 -39 -52 -673 -479 -345 46 363
5994 363 321 258 -163 -216 -171 288 355 251 402 334 175 204 382 490 -15 -170 -295 -359 -39 76 -36 -439 -685
6017 -685 -604 -136 197 326 24 -41 -32 -137 460 869 740 356 169 -161 -5 154 -3 -250 -222 -482 10 382
6039 382 412 -41 -449 -776 -575 -339 -69 83 217 -202 12 149 335 510 590 218 -332 -159 -60 21 180
6060 180 -223 -432 -392 -28 21 143 261 -236 -245 -394 -115 428 447 524 479 344 5 131 242 48 188 -214
6082 -214 47 78 154 240 -53 -604 -805 -594 -290 -82 38 -93 15 -68 160 399 102 289 149 119 125 -195
6104 -195 -4 296 99 9 -37 82 49 51 -259 -395 -181 -17 126 -104 128 268 -186 -89 35 -346 -33 -321
6126 -321 56 253 397 428 85 -277 -341 26 166 52 262 -66 -318 -559 83 -63 240 -79 -251 -371 -49
$$ packed form
5970a69j8k67K78L72R1M3j36j67R5o1M71J7l31j30j45L3k1Oj3o21J94J34L91L17
5994C63m2o3m21n3M5M59O7j04J51o8j59K9J78J08n05j55j25o4L20J15j12m03k46
6017f85Q1M68L33J29l02o5Rj05N97M09j29l84j87l30J56J59j57k47K8k60M92L72
6039C82L0m53m08l27K01K36K70J52J34m19K14J37J86J75Q0l72n50J73R9Q1J59
6060A80m03k09M0L64M9J22J18m97rj49K79N43J9P7m5j35l39J26J11j94J40m02
6082b14K61L1P6Q6k93n51k01K11L04K08J20j31J08q3K28K39k97J87j40l0Ol20
6104a95J91L00j97r0m6J19l3Kl10j36K14J64J43k30K32J40m54R7J24l81L13k88
6126c21L77J97J44L1l43l62o4L67J40j14K10l28k52k41O42j46L03l19j72j20L22
$$ plain form
6147 -49 204 -1 260 -22 -11 -137 423 400 415 163 -319 -152 130 242 267 264 -222 -356 -491 -323 -199 -204 -184
6170 -184 -213 -27 -28 470 549 717 264 287 253 298 557 423 27 -232 -364 -459 -614 -163 -218 -156 -341 -736 -616
6193 -616 127 169 176 293 141 126 590 547 538 77 -105 20 117 234 -121 38 -351 -838 -550 -350 -305 -198 68
6216 68 9 102 278 245 584 368 444 56 203 -39 270 -43 -73 -305 -385 -266 23 -78 -74 -209 -117 -334 196
6239 196 214 192 223 -45 274 188 121 244 -68 100 -94 -193 -153 -18 50 -309 -275 -132 -332 311 561 -44 136
6262 136 198 192 332 337 -179 18 -109 -237 -417 -129 -83 11 -278 -9 249 107 318 381 295 103 172 322 330 169
6286 169 149 -122 -467 -429 -323 -312 -285 -574 -395 -58 96 108 352 138 4 195 410 397 481 482 293 129 -47
6309 -47 -43 -320 -337 -1068 -647 -664 -621 -343 -261 -116 27 319 358 649 605 668 62 142 70 306 138 187 -135 -457
$$ packed form
6147d9K53k05K61k82J1j26N60k3J5k52m82J67K82J12K5lm86j34j35J68J24nK0
6170a84k9J86jM98P9J68m53K3l4M5K59j34l96k59j32r5j55M51n5O2j85l95J20
6193f16P43M2PJ17j52j5M64m3rm61j82J25R7J17l55J59l89m87K88K00M5J07K66
6216F8n9R3J76l3L39k16P6l88J47k42L09l13l0k32q0J19K89j01Mj35R2k17N30
6239A96J8k2L1k68L19q6o7J23l12J68j94r9M0J35O8l59L4J43k00O43K50o05J80
6262A36O2oJ40Nn16J97j27j28j80K88M6R4k89K69K58j42K11O3q6j92O9J50Qj61
6286A69k0k71l45L8J06J1K7k89J79L37J54J2K44k14j34J91K15j3Q4Jj89j64j76
6309d7Mk77j7p31M21j7M3K78Q2J45J43K92L9K91m4O3o06Q0p2K36j68M9l22l22
$$ plain form
6333 -457 -202 -586 -510 -505 -332 -648 -128 -93 272 376 363 334 231 306 498 293 259 118 -125 -167 -213 -69 194
6356 194 -343 -562 -633 -551 -149 -213 48 61 -93 81 97 613 543 402 2 -299 -289 -41 178 305 79 -133
6378 -133 -356 -326 -168 272 214 81 -207 -228 129 299 634 228 -320 -350 -160 -82 42 -50 -299 -156 -379 -168
6400 -168 160 507 445 155 -295 -347 48 233 453 253 -150 -440 -316 -131 242 -95 -254 -273 -645 -102 379
6421 379 770 495 140 15 119 444 556 574 666 -174 -507 -191 -123 -64 -159 -358 -704 -661 -249 151 316 218
6443 218 132 367 195 344 658 631 127 -193 -352 -123 80 223 -108 -243 -213 -496 -317 -204 -197 -46 -81 -191
6465 -191 -34 168 296 194 223 118 548 6 -40 87 97 5 -110 -272 -221 -6 19 -172 112 329 269 54
6487 54 133 46 -33 143 140 183 -125 -121 -174 -135 71 -141 -38 76 -184 342 142 257 232 259 8 -8 357 63 87
$$ packed form
6333d57K55l84P6NJ73l16N20L5L65J04j3k9j03P5J92k05l4j41k43m2m6J44K63
6356A94n37k19p1Q2M02o4K61J3j54J74J6N16p0j41m00l01J0K48K19J27k26k12
6378a33k23L0J58M40n8j33k88k1L57J70L35m06n48l0J90P8J24r2k49J43k23K11
6400a68L28L47o2k90m50n2L95J85K20k00m03k90J24J85L73l37j59j9l72N43M81
6421C79L91k75l55j25J04L25J12J8R2q40l33L16O8N9r5j99l46M3M12M00J65r8
6443B18q6K35j72J49L14k7n04l20j59K29K03J43l31j35L0k83J79J13PJ51l5j10
6465a91J57K02J28j02K9j05M30n42m6J27J0r2j15j62N1K15K5j91K84K17o0k15
6487E4P9q7p9J76lM3l08Mn3L9K06k12J03J14k60N26k00J15k5K7k51j6L65k94K4
$$ plain form
6512 87 -364 -377 -445 -515 49 -9 -57 -23 -141 86 262 269 119 102 253 11 390 509 246 54 -75 -432 -614
6535 -614 -409 -161 -17 -290 -433 -539 -155 109 698 775 519 516 152 429 291 453 269 -265 -348 -183 -362
6556 -362 -241 -186 -428 -478 -621 -294 237 341 72 229 7 66 470 463 515 319 49 -83 -195 -111 -194 -64 -93
6579 -93 -325 -516 -353 -86 93 250 -76 -243 -57 353 291 300 187 -28 -105 -116 -222 12 -12 -147 -114 135 7
6602 7 95 120 -69 178 -102 106 -118 110 -18 -35 27 -49 -196 -248 -347 -196 -230 28 84 -3 3 19 337 199 304
6627 304 83 252 -128 135 -95 -199 -320 -420 -295 -374 -300 -265 -369 -274 -449 -112 24 57 538 576 522 208
6649 208 173 366 166 465 284 -165 -454 -475 -512 -369 -370 -469 -406 -253 -144 -30 383 330 81 113 154 510 510 281
6673 281 379 157 -472 -150 -284 26 -62 -136 -249 -170 -290 -212 160 282 -4 68 140 -49 202 364 -160 -415
$$ packed form
6512H7m51j3o8p0N64n8m8L4j18K27J76Pj50j7J51k42L79J19k63j92j29l57j82
6535f14K05K48J44k73j43j06L84K64N89P7k56ll64K77j38J62j84n34q3J65j79
6556c62J21N5k42n0j43L27N31J04k69J57k22N9M04pN2j96k70j32j12Q4q3J30k9
6579i3k32j91J63K67J79J57l26j67J86M10o2Rj13k15p7j1j06K34k4j35L3K49j28
6602GQ8K5j89K47k80K08k24K28j28j7O2p6j47n2r9J51l4K58N6q7OJ6L18j38J05
6627C04k21J69l80K63k30j04j21j00J25p9P4L5j04R5j75L37J36L3M81L8n4l14
6649B08l5J93k00K99j81m49k89k1l7J43jr9O3J53J09J14M13n3k49L2M1L56%k29
6673B81R8k22o29L22j34L10q8p4j13P9j20P8L72J22k86P2P2j89K51J62n24k55
$$ plain form
6695 -415 -210 29 -28 179 -181 -17 -350 -234 -49 -123 375 497 150 -6 82 194 390 163 -189 7 -524
6716 -524 -54 -218 335 -89 -92 16 -249 -127 353 613 215 379 13 -152 390 227 220 -108 -136 -389 -371 -282
6738 -282 -546 -107 -447 -475 -93 -21 494 491 158 102 198 412 466 777 223 57 11 27 -234 -95 -379 -300 -624
6761 -624 -482 -312 -87 -70 10 217 415 438 650 652 568 240 362 217 55 11 55 -102 -522 -621 -724 -689 -502
6784 -502 -338 -406 -131 71 237 351 401 215 425 394 303 367 295 3 -8 -244 -385 -246 -192 -317 -461 -243 -380
6807 -380 -176 303 159 316 243 244 276 488 522 289 44 -79 -205 -199 -189 -56 -271 -416 -290 67 8 -15 196
6830 196 91 34 213 315 79 120 59 -197 -87 -204 -33 65 -77 -513 -232 -260 29 288 55 24 5 117
6852 117 222 101 314 193 1 -311 -156 -61 3 -14 -387 -470 -582 -458 -158 246 238 135 210 33 312 464
$$ packed form
6695d15K05K39n7K07l60J64l33J16J85p4M98J22l47j56Q8J12J96k27l52J96n31
6716e24M70j64N53m24lJ08k65J22M80K60l98J64l66j65N42j63pl28k8k53J8Q9
6738b82k64M39l40k8L82P2N15ll33n6R6K14N4L11n54j66m6J6k61J39k84P9l24
6761f24J42J70K25J7Q0K07J98K3K12Kq4l28J22j45j62m4M4j57m20r9j03L5J87
6784e02J64o8K75K02J66J14N0j86K10l1r1O4p2k92j1k36j41J39N4j25j44K18j37
6807c80K04M79j44J57p3JL2K12L4k33k45j23j26OJ0J33k15j45J26L57n9k3K11
6830A96j05n7J79J02k36M1o1k56J10j17J71R8j42m36K81k8K89K59k33l1j9J12
6852A17J05j21K13j21j92l12J55R5O4j7l73q3j12J24L00M04qj03P5j77K79J52
$$ plain form
6874 464 640 349 -30 -303 -237 70 -183 37 -478 -455 -543 -500 27 154 113 -170 -291 114 456 366 309 463
6896 463 11 -5 177 -46 120 212 -362 -343 -184 -266 -383 -182 -491 -351 -438 -128 204 459 463 -32 287 63
6918 63 351 252 489 200 -122 -197 -219 -43 -149 -24 -71 -456 -302 -80 118 87 245 128 -68 44 -97 43
6940 43 279 208 93 189 37 483 88 125 119 -51 -158 -150 -20 -161 -12 -101 -229 -147 -348 -161 83 -1 42 -172
6964 -172 -303 -170 45 83 130 353 75 6 -2 220 131 312 -6 148 -45 35 -255 -360 -379 -367 -438 -226 161
6987 161 73 238 122 264 286 132 487 176 280 268 207 -96 -311 -64 -157 -65 -239 -171 -237 -114 -170 -85 -191
7010 -191 -326 -140 -187 57 147 183 345 233 -89 17 172 25 189 -299 -50 -455 -396 -70 -17 59 -130 110
7032 110 168 137 102 267 -195 -287 8 134 260 25 -109 -116 -354 27 293 292 431 -54 -151 -230 182 274 294 -16
$$ packed form
6874D64J76k91l79k73O6L07k53K20n15K3q8M3N27J27m1k83j21M05L42r0n7J54
6896D63m52j6J82k23J66R2n74J9J59q2j17K01l09J40q7L10L32K55Mm95L19k24
6918F3K88r9K37k89l22p5k2J76j06J25m7l85J54K22J98l1J58j17j96J12j41J40
6940D3K36p1j15R6j52M46l95L7oj70j07QJ30j41J49q9j28Q2k01J87K44q4M3k14
6964a72j31J33K15L8M7K23k78o9qK22q9J81l18J54j93Q0k90j05j9J2p1K12L87
6987A61q8J65j16J42K2j54L55l11J04j2o1l03k15K47r3R2j74O8o6J23n6Q5j06
7010a91j35J86m7K44R0L6J62j12l22J06J55j47J64m88K49m05N9L26N3P6j89K40
7032A10N8l1l5J65m62r2K95J26J26k35j34pk38L81K66jJ39m85r7p9M12R2K0l10
$$ plain form
7056 -16 151 -70 -65 -7 -151 -27 -301 -162 -212 -48 135 393 291 209 -7 70 434 477 462 216 29 -100 -241
7079 -241 -56 -100 -118 -430 -337 -303 -385 -192 -134 -161 -183 -55 61 510 442 503 366 74 -58 123 -27 127 -108
7102 -108 -200 -498 -566 -548 -164 -279 -315 -59 -112 -39 282 547 257 633 211 266 384 445 8 12 -99 -267 -359 -173
7126 -173 -235 -135 -176 -519 -238 -37 115 178 428 334 85 419 221 39 196 6 -305 215 -261 -203 -57 -525
7148 -525 -359 -10 -1 153 299 244 86 -159 -20 330 101 283 30 21 -62 -198 -13 -329 -212 -50 281 166
7170 166 58 170 -107 24 -115 -182 350 164 108 321 -73 -196 -333 -93 -196 -379 -172 -175 -31 -22 242 -152
7192 -152 92 -113 257 496 556 315 200 19 -143 1 26 -31 -161 -209 -818 -640 -498 -316 -394 -53 168 127
7214 127 312 546 580 364 234 96 464 217 258 116 -77 -771 -702 -477 -583 -202 183 38 -684 -299 6
$$ packed form
7056a6J67k21NN8j44J24k74J39n0J64J83K58j02q2k16P7L64M3j5k46j87j29j41
7079b41J85m4j8l12R3L4q2J93N8k7k2J28J16M49o8O1j37k92j32J81j50J54k35
7102a08r2k98o8J8L84j15l6K56n3P3L21K65k90L76m22N5J18O1m37Mj11j68r2J86
7126a73o2J00m1l43K81K01J52O3K50r4k49L34j98j82J57j90l11N20m76N8J46m68
7148e25J66L49RJ54J46n5j58k45J39L50k29J82k53rq3j36J85l16J17J62L31j15
7170A66j08J12k77J31j39o7N32j86n6K13l94j23j37K40j03j83K07lJ44RK64l94
7192a52K44k05L70K39O0k41j15j81j62J44K5n7j30m8o09J78J42J82p8L41K21m1
7214A27J85K34L4k16j30j38L68k47M1j42j93o94O9K25j06L81L85j45p22L85L05
$$ plain form
7235 6 271 600 434 410 455 174 310 97 132 -184 -438 -384 -592 16 -148 -453 -405 -382 -514 -29 409 346 346 381
7259 381 -50 46 203 216 185 -4 202 -243 -121 -122 -88 -369 -266 -231 240 69 205 212 109 -86 17 -207 121
7282 121 250 208 -175 -382 -357 -267 -117 151 33 -17 158 186 40 459 -8 6 15 -111 34 234 126 96 88 -303
7306 -303 -178 -490 -21 -102 5 -141 -210 -163 -64 163 341 373 220 516 379 85 78 359 -103 76 -159 -166 -405
7329 -405 -627 -601 -372 -210 -250 51 18 310 192 244 338 317 195 528 429 388 190 113 -174 -588 -341 -395 -438 -265
7353 -265 -309 -424 -411 -210 -12 45 -42 382 325 332 308 183 158 252 26 -269 -181 -251 -38 -172 10 -263 -319 -98
7377 -98 -43 -39 103 -111 1 71 202 304 267 117 -184 -106 122 119 250 -2 -120 11 -406 78 65 -71 54
7400 54 -78 -14 169 45 113 362 -23 -213 -197 -324 40 -58 -173 -303 -178 11 35 189 116 32 -4 190 -71
$$ packed form
7235FK65L29j66k4M5k81J36k13L5l16k54N4k08O08j64l05M8K3j32M85M38o3%L5
7259C81m31R6J57J3l1j89K06m45J22jL4k81J03L5M71j71J36Pj03j95J03k24L28
7282A21J29m2l83k07K5R0J50K68j18n0J75K8j46M19m67J4Rj26J45K00j08l0ql91
7306c03J25l12M69q1J07j46o9M7R9K27J78L2j53K96j37k94pK81m62J79k35pk39
7329d05k22K6K29J62m0L01l3K92j18N2R4k1j22L33r9m1j98p7k87m14K47n4m3J73
7353b65m4j15J3K01J98N7q7M24n7Pk4j25k5R4k26k95Q8p0K13j34J82k73n6K21
7377i8N5MJ42k14J12P0J31J02l7j50l01P8K28lJ31k52j18J31m17M84j3j36J25
7400E4j32O4J83j24O8K49l85j90J6j27L64r8j15j30J25J89K4J54p3q4l6J94k61
$$ plain form
7423 -71 45 133 151 -97 -32 -257 -113 -288 -255 -259 -105 -354 -20 -178 36 240 95 79 71 132 198 159 171 188 17
7448 17 73 -99 -447 -196 -231 -512 -218 -413 -150 -233 -121 280 108 222 294 348 77 289 251 157 -26 72 -155
7471 -155 -19 -141 -58 -343 -249 -377 -340 -128 -264 49 -81 -32 166 53 360 96 33 183 52 -91 206 177
7493 177 -6 -74 -370 -266 -150 -239 8 -15 -83 57 4 -243 54 99 134 -172 -133 -135 165 206 273 38 78 -163
7517 -163 -47 232 67 98 4 -66 -334 148 -113 221 152 -32 -245 -240 -7 324 50 40 -191 -121 -49 -142 72
7540 72 471 108 -173 -50 81 158 169 4 -81 -149 -423 -86 -5 31 -239 -278 -206 -189 -1 43 172 155 -210 -172
7564 -172 226 375 203 224 -61 -298 -116 4 202 -162 -5 -242 -294 -72 60 -49 116 -152 -131 -49 158
7585 158 158 350 57 -138 -240 -23 344 251 265 -231 -282 -65 -334 -24 -73 108 -27 80 -127 -36 241 -25
$$ packed form
7423g1J16Q8J8k48O5k25J44j75L3mJ54k49L34j58K14K04j45j6qO1O6l9J2J7j71
7448A7N6j72l48K51l5k81K94j95K63q3J12M01j72J14P2N4k71K12l8r4j83R8k27
7471a55J36j22Q3k85R4j28L7K12j36L13j30M9J98j13L07k64o3J50j31j43K97k9
7493A77j83o8k96J04J16q9K47k3o8J40n3k47K97M5L5l06L9kL00M1O7k35M0k41
7517a63J16K79j65L1r4p0k68M82k61L34o9j84k13NK33L31k74j0k31P0P2r3K14
7540G2L99l63k81J23J31P7J1j65q5o8k74L37Q1L6k70l9P2J7J88M4J29j7l65L8
7564a72L98J49j72K1k85k37J82J20J98l64J57k37n2K22J32j09J65k68K1Q2K07
7585A58%J92k93j95j02K17L67r3J4m96n1K17k69L10m9J81j35J07k07R1K77k66
$$ plain form
7607 -25 110 -118 59 109 148 205 320 -44 66 -123 115 321 235 -268 56 -418 -139 -211 -86 -171 -122 109 -207
7630 -207 127 -44 -29 -242 124 109 60 268 139 296 -95 56 -65 -30 -7 160 129 -69 -212 -343 25 -221
7652 -221 -177 -149 85 -88 169 -46 227 343 -2 369 346 213 264 35 -32 -148 -49 -240 -40 -69 16 -265 -90
7675 -90 -318 -100 110 -67 130 26 229 361 71 66 177 -9 66 13 401 45 -22 -21 -65 -100 -46 67 -24 83
7699 83 -265 201 18 -138 -141 -119 97 8 204 278 2 87 13 -326 -72 294 65 213 -44 52 -5 -6 -8 141 59
7724 59 8 -402 104 -122 19 -65 -303 -297 -251 27 3 60 18 -46 -128 126 212 484 271 43 80 -119 55 -22 -244
7749 -244 122 -211 -204 -68 -359 -205 -165 -136 -282 -320 202 223 162 278 287 315 32 426 292 255 248 76 -82 -417
7773 -417 -363 -293 -203 -521 -108 -412 -50 65 286 6 103 199 332 325 375 461 42 220 169 31 -130 -9 53 -304
$$ packed form
7607b5J35k28J77N0L9N7J15l64J10j89K38K06q6n03L24m74K79p2J25q5M9K31l16
7630b07L34j71J5k13L66j5m9K08j29J57l91J51j21L5K3J67l1j98j43j31L68k46
7652b21M4K8K34j73K57k15K73J16l45L71k3j33N1k29o7j16R9j91K00k9Q5k81J75
7675i0k28K18K10j77J97j04K03J32k90nJ11j86P5n3L88l56o7Jm4l5N4J13r1J07
7699H3l48M66j83j56lK2K16q9J96P4k76Q5p4l39K54L66k29J48k57R6n7jkJ49q2
7724E9n1m10N06k26J41q4k38OM6K78k4N7m2o4q2K54Q6K72k13k28L7j99J74p7k22
7749b44L66l33PJ36k91J54M0K9j46l8N22K1o1J16RK8k83L94j34l7pj72j58l35
7773d17N4P0R0l18M13l04L62J15K21k80R7R6J33pN0Q6m19J78n1j38j61J21O2l57
$$ plain form
7797 -304 -425 -146 -152 -183 -229 38 -37 132 251 259 384 623 89 75 227 9 198 -65 -142 85 -218 -192 -215 16
7821 16 -194 -187 -54 -340 -288 -67 146 7 -34 191 92 65 87 240 132 11 -69 -16 -161 -128 -32 89 -170 -136
7845 -136 -122 -41 265 26 370 -158 -55 -146 141 79 149 15 -278 -91 -107 93 30 4 101 46 -196 -102 204 152
7869 152 315 40 -97 -361 25 -36 2 -35 -294 -300 -300 168 29 83 -4 84 59 20 358 454 331 376 110 22 85
7894 85 244 -237 -158 -155 -271 -335 -213 -373 -145 -192 -37 -372 -122 321 535 221 37 187 253 253 163 184 14 -53
7918 -53 -352 -185 34 -41 54 -65 -101 -276 -86 210 0 -31 142 157 386 339 402 226 98 238 -156 -264 -64
7941 -64 -108 22 -237 -108 -354 -122 -9 48 15 162 110 -189 65 107 180 152 159 90 91 149 262 74 -46 -203 -156
7966 -156 -137 -12 329 -109 -141 -78 -24 -139 3 350 22 -244 -201 -87 -55 -106 131 -78 -198 200 12 284
$$ packed form
7797c04j21K79ol1m6K67p5J69J19QJ25K39n34j4J52k18J89k63p7K27l03K6k3K31
7821A6k10PJ33k86N2K21K13j39m1K25r9k7K2J53j08j21q0N3j45L3R6J21k59L4
7845a36J4Q1L06k39L44n28J03r1K87o2P0j34k93J87j6K00o3k6R7n5k42R4L06n2
7869A52J63k75j37k64L86o1L8l7k59o%M68j39N4q7Q8k5l9L38R6j23M5k66q8O3
7894H5J59m81P9Lj16o4J22j60K28m7J55l35K50M43K14l14j84J50O6%r0K1j70o7
7918e3k99J67K19p5R5j19l6j75J90K96k10l1J73J5K29m7O3j76j28J40l94j08K00
7941f4m4J30k59J29k46K32J13N7l3J47n2k99K54M2P3k8Po9JN8J13j88j20j57M7
7966a56J9J25L41m38l2O3N4j15J42L47l28k66M3J14L2n1K37k09j20L98j88K72
$$ plain form
7988 284 115 127 70 -8 -29 98 -80 -134 -206 -25 12 -271 -160 19 -134 -147 -57 112 -167 62 -258 28 -63
8011 -63 228 304 107 214 -25 4 -87 -121 -4 67 -153 -184 -338 -92 -111 -210 -73 -114 -210 169 108 377 -38 102
8035 102 -92 173 103 -113 -149 419 -288 -154 -263 -261 -195 -80 -101 0 -102 -103 206 40 -33 -368 402 318 345 477
8059 477 360 213 37 -79 135 -5 -40 -49 -434 -229 -81 -378 12 16 -161 -148 40 20 48 252 -41 -192 -60
8082 -60 76 199 156 -38 1 -21 -286 2 248 223 69 -151 -109 113 -29 -42 39 -78 268 52 58 40 -107 -86
8106 -86 -66 38 13 14 59 334 58 -98 58 66 169 -137 -20 10 191 -43 -125 -274 -153 -284 -213 -42 -145 -144
8130 -144 105 37 178 -59 -54 220 159 147 159 117 -76 -90 218 -25 -264 -47 -146 -173 -259 -296 -264 -53 -15 -91 243
8155 243 152 109 -191 -67 271 218 72 137 -79 29 332 0 -42 -158 -179 -296 -79 -136 16 -57 5 -522 -26
$$ packed form
7988B84j69J2n7p8k1J27j78n4p2J81L7k83J11J79j53j3R0J69k79K29l20K86r1
8011f3K91P6j97J07k39K9r1l4J17P1k20l1j54K46j9r9J37m1r6L79o1K69m15J40
8035A02j94K65p0k16l6N68p07J34j09KO6J15k1J01j02jL09j66p3l35P70q4K7J32
8059D77j17j47j76j16K14j40l5rl85K05J48k97L90Mj77J3J88k0K8K04k93j51J32
8082f0J36J23m3j94L9k2k65K88K46k5j54k20M2K22j42j3Q1j17L46k16Oj8j47K1
8106h6K0J04k5JM5K75k76j56J56QJ03l06J17L0J81k34q2j49J21j31P1J71j03J
8130a44K49o8J41k37NK74o1j2J2m2j93j4L08k43k39K17r9k7q6l7L2K11L8p6L34
8155B43r1m3l00J24L38n3j46O5k16J08L03l32m2j16k1j17K17n7J52p3O2n27M96
$$ plain form
8178 -26 -129 7 425 302 176 182 -79 161 211 479 50 14 73
$$ packed form
8178b6j03J36M18j23j26Ok61K40N0K68m29l6N9
8191G3
$$ Imaginary data points
##PAGE= N=2
##DATA TABLE= (X++(I..I)), XYDATA
$$ plain form
0 0 0 0 0 0 0 0 0 0 0 -8 0 -8 8 -8 14 -16 17 -24 32 -32 42 -49 59 -72 82 -96 113 -130 149 -171 195 -224 254
33 254 -287 324 -366 409 -460 514 -572 637 -707 785 -868 963 -1061 1172 -1292 1424 -1569
50 -1569 1727 -1903 2098 -2316 2558 -2837 3149 -3509 3929 -4425 5024 -5758 6694 -7916 9606
65 9606 -12096 16151 -23902 44245 -219348 -511514 -223729 71776 392294 529818 535176
76 535176 383668 236035 118972 65051 -25853 -140992 -248960 -266132 -219873 -117386 -28904
87 -28904 -10640 -88222 -156111 -134380 -7893 131683 198925 146807 24817 -87496 -90972 31917
99 31917 192847 265366 227973 125312 15933 -60579 -94879 -122552 -171337 -232202 -254597 -197099
111 -197099 -84606 11529 55401 55593 35550 41258 117875 235847 316457 303494 195914 38651
$$ packed form
0@%%%%%%%%%qQqJ6j6K2l0L3m1N6o4P4r1J08j31J54j78K09k43K79l20L66m19M78
33B54n41O11o90P75q69R74j086J209j344J492j653J831k024K233k464K716k993
50a569L296l630M001m414M874n395N986o658P438q354R449j0782J2452j4610J7522
65I606k1702K8247m0053O8147k63593k92166K87785K95505L20518J37524N358
76E35176j51508j47633j17063n3921r0904j15139j07968j7172M6259J02487Q8482
87b8904J8264p7582o7889K1731J26487J39576O7242n2118j21990j12313l476J22889
99C1917J60930P2519l7393j02661j09379p6512l4300k7673m8785o0865k2395N7498
111a97099J12493R6135M3872J92k0043N708P6617J17972Q0610j2963j07580j57263
$$ plain form
123 38651 -104170 -193272 -220516 -209840 -203598 -211295 -190188 -113057 -778 109344 181256 191003
135 191003 154338 106827 71722 53365 31112 -12542 -55242 -66440 -49602 -18405 14621 24826
147 24826 1057 -38281 -71684 -86394 -79760 -63845 -43493 -17466 2011 9751 26720 61942
159 61942 100663 133947 151266 137606 95055 36305 -23367 -70474 -107373 -142326 -163104 -159943
171 -159943 -142896 -112022 -60185 908 58833 111367 151835 173862 175592 152846 108503 49260
183 49260 -25476 -102173 -144443 -139073 -101447 -52444 -16549 -12392 -26405 -33054 -19228 11450 36792
196 36792 37378 27053 23677 28305 38651 50048 43606 19687 1814 2187 18133 35531 33203 5807
210 5807 -35324 -80438 -113058 -113700 -89974 -60626 -28623 4142 35177 71446 109472 132018 127088
$$ packed form
123C8651j42821q9102k7244J0676O242p697K1107P7131J12279J10122P1912R747
135A91003l6665m7511l5105j8357k2253m3654m2700j1198J6838L1197L3026J0205
147B4826k3769l9338l3403j4710O634J5915K0352K6027J9477P740J6969L5222
159F1942L8721L3284J7319j3660m2551n8750n9672m7107l6899l4953k0778L161
171a59943J7047L0874N1837O1093N7925N2534M0468K2027J730k2746m4343n9243
183D9260p4736p6697m2270N370L7626M9003L5895M157j4013o649J3826L0678K5342
196C6792N86j0325l376M628J0346J1397o442k3919j7873L73J5946J7398k328k7396
210E807m1131m5114l2620o42K3726K9348L2003L2765L1035L6269L8026K2546m930
$$ plain form
223 127088 88992 29395 -19707 -41360 -47581 -51847 -60999 -78851 -89769 -72962 -33325 10248
235 10248 39185 43986 36899 37226 42324 43939 40874 26311 1680 -14804 -17808 -16432 -17027 -23046
249 -23046 -35209 -41469 -36656 -20509 10135 42728 54007 41428 14330 -20437 -44403 -42975 -22674
262 -22674 3725 28393 45679 59164 67336 54357 15988 -33243 -78904 -104775 -93495 -56807
274 -56807 -19845 7052 22849 32789 45399 56994 58835 52299 38845 18506 1986 -6496 -16601
287 -16601 -26452 -30886 -34014 -37023 -36495 -35484 -31730 -23825 -16955 -8508 9815 34122 59517 82187
301 82187 84917 57402 13471 -28162 -54149 -56412 -43251 -26821 -8348 9863 21740 26706 19428
314 19428 -7405 -38583 -54952 -51755 -30084 2360 29312 46750 56063 54509 44459 30312 9903
$$ packed form
223A27088l8096n9597m9102k1653o221m266r152j7852j0918J6807L9637M3573
235A0248K8937M801p087L27N098J615l065j4563k4631j6484l004J376n95o019
249b3046j2163o260M813J6147L0644L2593J1279j2579k7098l4767k3966J428K0301
262b2674K6399K4668J7286J3485Q172j2979l8369m9231m5661k5871J1280L6688
274e6807L6962K6897J5797R940J2610J1595J841o536j3454k0339j6520q482j0105
287a6601r851m434l128l009N28J011L754P905O870Q447J8323K4307K5395K2670
301H2187K730k7515m3931m1633k5987k263J3161J6430J8473J8211J1877M966p278
314A9428k6833l1178j6369L197K1671L2444K6952J7438R313j554j0050j4147k0409
$$ plain form
327 9903 -12036 -25414 -33321 -39100 -38350 -30910 -19126 -1851 12912 16989 13770 6236 -3659 -7908
341 -7908 -5040 -950 9612 26607 39404 42450 32265 6204 -24998 -48496 -62248 -61884 -44601
354 -44601 -17556 15414 47055 61024 50335 26241 1304 -13036 -9801 -1469 -889 -6001 -10405
367 -10405 -9939 -611 6635 -2207 -20617 -35227 -36453 -18639 7930 23356 23382 17162 12628 18849
381 18849 34320 41263 30084 4122 -28105 -49206 -44342 -22398 1052 15167 10274 -7239 -17085
394 -17085 -12464 -3440 -406 -11379 -29576 -31096 -2678 42514 80151 84404 48585 538 -25883
407 -25883 -24868 -9132 -1672 -19543 -50479 -64084 -48462 -13034 19299 23149 2860 -13766 -8971
420 -8971 19603 57848 75736 55912 14269 -22631 -37248 -25736 -7219 -4413 -20403 -40693
$$ packed form
327I903k1939j3378p907n779P50P440J1784J7275J4763M077l219p534r895m249
341g908K868M090J0562J6995J2797L046j0185k6061l1202k3498j3752L64J7283
354d4601K7045L2970L1641J3969j0689k4094k4937j4340L235Q332N80n112m404
367a0405M66R328P246q842j8410j4610j226J7814K6569J5426K6o220m534O221
381A8849J5471O943j1179k5962l2227k1101M864K1944K3450J4115m893j7513r846
394a7085M621R024L034j0973j8197j520K8418M5192L7637M253l5819m8047k6421
407b5883J015J5736P460j7871l0936j3605J5622L5428L2333L850k0289j6626M795
420h971K8574L8245J7888j9824m1643l6900j4617J1512J8517K806j5990k0290
$$ plain form
432 -40693 -46189 -20721 22875 49272 41326 9137 -24650 -31627 -5878 26578 34759 11773 -24324
445 -24324 -39718 -16409 23176 46317 37740 3337 -31391 -35263 -10757 11430 9989 -15123 -42366
458 -42366 -43189 -14185 25420 52510 49977 21487 -2129 -545 16132 30271 24894 -6530 -47592
471 -47592 -70891 -64820 -35977 -6729 1083 -6118 -4397 17162 53804 87513 88884 46265 -11705
484 -11705 -49492 -50436 -25295 -2716 -3634 -18830 -29643 -22494 2953 22283 10670 -22437 -44358
497 -44358 -36240 984 45287 64506 47179 8966 -22082 -24253 1369 26978 34388 24708 6056
510 6056 -9882 -11688 -7536 -16059 -40110 -66486 -75567 -53136 -9760 29725 46764 38140 18066
523 18066 17742 47618 82586 92276 62295 1211 -58554 -86276 -79612 -55404 -35717 -31074 -27235
$$ packed form
432d0693n496K5468M3596K6397p946l2189l3787o977K5749L2456Q181k2986l6097
445b4324j5394K3309L9585K3141q577l4403l4728l872K4506K2187j441k5112k7243
458d2366q23K9004L9605K7090k533k8490k3616J584J6677J4139n377l1424m1062
471d7592k3299O071K8843K9248P812p201J721K1559L6642L3709J371m2619n7970
484a1705l7787r44K5141K2579r18j5196j0813P149K5447J9330j1613l3107k1921
497d4358Q118L7224M4303J9219j7327l8213l1048k171K5622K5609P410r680j8652
510F056j5938j806M152q523k4051k6376r081K2431M3376L9485J7039q624k0074
523A8066l24K9876L4968R690k9981o1084n9765k7722O664K4208J9687M643L839
$$ plain form
536 -27235 -5483 27034 48210 44322 13229 -25911 -41015 -18127 27774 68704 76885 49250
548 49250 7107 -25968 -40673 -33551 -17859 -12206 -16328 -18069 -13143 -2960 4668 -1519 -20090
561 -20090 -36901 -36468 -8261 37677 71814 74590 53356 24270 4884 4717 10955 2804 -24752
574 -24752 -60311 -83907 -81034 -57929 -32532 -8417 13141 32925 57812 82172 89000 69815
586 69815 32725 -8969 -37427 -43808 -33287 -15506 -2024 -4706 -20259 -34992 -43308 -41512 -27238
599 -27238 -7440 8736 24251 39968 52469 57067 46416 21502 -5638 -20144 -19032 -2454
611 -2454 15219 17408 4445 -14790 -34125 -47143 -50731 -49560 -43243 -27976 -8623 11808 31500
624 31500 45600 53836 60234 61490 56260 45389 26681 1649 -24029 -49860 -74288 -85364 -76637
$$ packed form
536b7235K1752L2517K1176l888l1093l9140j5104K2888M5901M0930Q181k7635
548D9250m2143l3075j4705P122J5692N653m122j741M926J0183P628o187j8571
561b0090j6811M33K8207M5938L4137K776k1234k9086j9386j67O238q151k7556
574b4752l5559k3596K873K3105K5397K4115K1558J9784K4887K4360O828j9185
586F9815l7090m1694k8458o381J0521J7781J3482k682j5553j4733q316J796J4274
599b7238J9798J6176J5515J5717J2501M598j0651k4914k7140j4506J112J6578
611b454J7673K189j2963j9235j9335j3018l588J171O317J5267J9353K0431J9692
624C1500J4100Q236O398J256n230j0871j8708k5032k5678k5831k4428j1076Q727
$$ plain form
637 -76637 -52808 -20428 8730 23607 25713 22334 19421 23035 29438 30311 28140 28437 25224 16615
651 16615 5770 -9307 -26100 -36310 -35354 -25761 -12791 -4293 -1363 -1431 -9079 -21111 -23420 -14662
665 -14662 -2045 13286 28781 36717 37788 38372 39779 36916 21346 -6058 -29793 -42193 -46313
678 -46313 -43270 -34759 -31089 -31715 -22183 -251 23670 39811 44692 41177 34533 24811 16950 12902
692 12902 3556 -14567 -29587 -35269 -36078 -29952 -14452 621 5745 1246 -4743 -2182 7972 16692
706 16692 22489 21221 8339 -3868 -302 12115 17946 12466 -13 -11021 -13514 -9202 -4269 -6572
720 -6572 -24336 -44660 -46398 -27078 -492 25054 42298 42413 32169 22856 20813 23827 21661 8714
734 8714 -7273 -21868 -32082 -30946 -19825 -15855 -26684 -39857 -40196 -21782 12522 43933 57049
$$ packed form
637g6637K3829L2380K9158J4877K106l379k913L614O403Q73k171K97l213q609
651A6615j0845j5077j6793j0210R56R593J2970Q498K930o8p648j2032k309Q758
665a4662J2617J5331J5495P936J071N84J407k863j5570k7404k3735j2400m120
678d6313L043Q511L670o26R532K1932K3921J6141M881l515o644r722p861m048
692A2902r346j8123j5020n682q09O126J5500J5073N124m499n989K561J0154Q720
706A6692N797j268j2882j2207L566J2417N831n480j2479j1008k493M312M933k303
720f572j7764k0324j738J9320K6586K5546J7244J15j0244r313k043L014k166j2947
734H714j5987j4595j0214J136J1121L970j0829j3173l39J8414L4304L1411J3116
$$ plain form
747 57049 46841 21080 1592 4021 15988 17364 5466 -12356 -26304 -24216 -7361 9050 9297
760 9297 -8083 -29630 -35848 -23582 -5658 9506 14530 4727 -8291 -5107 13776 36149 47968
773 47968 40097 17099 -7523 -22915 -21111 -8173 -3739 -15820 -28098 -28422 -15799 4247 17690
786 17690 12849 -5849 -20599 -15249 9781 35570 42035 29530 9145 -9878 -17656 -12116 -6323
799 -6323 -9033 -14232 -14850 -7067 4942 12710 13769 8359 -2395 -11999 -10575 -1958 3931 7096 7088 2338
815 2338 -1841 -737 4211 8832 6821 -2734 -10434 -12931 -13527 -10295 -2276 3954 8915 15655 18799
830 18799 14169 3225 -8807 -13647 -7795 -1069 101 -1879 -5017 -4999 2785 10175 5309 -9343 -22798
845 -22798 -22840 -5037 18816 30182 24148 5615 -12755 -14855 295 15590 16267 3124 -14706
$$ packed form
747E7049j0208k5761j9488K429J1967J376j1898j7822j3948K088J6855J6411K47
760I297j7380k1547o218J2266J7924J5164N024r803j3018L184J8883K2373J1819
773D7968p871k2998k4622j5392J804J2938M434j2081j2278l24J2623K0046J3443
786A7690m841j8698j4750N350K5030K5789O465j2505k0385j9023p778N540N793
799f323k710n199o18P783J2009P768J059n410j0754r604J424Q617N889L165qm750
815B338m179J104M948M621k011r555p700k497n96L232Q019O230M961O740L144
830A8799m630j0944j2032m840N852O726J170j980l138J8P784P390m866j4652j3455
845b2798m2J7803K3853J1366o034j8533j8370k100J5150J5295O77j3143j7830
$$ plain form
858 -14706 -23579 -14595 3481 16621 14595 -4197 -23553 -24374 -7295 13614 23803 12678 -12406
871 -12406 -27179 -15346 15957 44284 44552 13289 -25234 -42351 -28988 3669 28072 21551 -6568
884 -6568 -27288 -22865 3858 28785 26352 -2679 -34314 -43489 -19481 21812 46494 35315 567
897 567 -30691 -36408 -9790 26508 42674 28223 -4737 -30768 -28060 -2606 20295 21684 -701
910 -701 -29912 -37886 -14485 19598 36471 21821 -14026 -39761 -31280 3731 38247 46278 18688
923 18688 -20556 -38277 -23741 7800 32501 30619 6002 -16356 -18669 -3168 15454 17086 -4232
936 -4232 -30412 -40401 -27692 1661 27202 29519 10353 -12604 -21452 -7697 19028 35801 29670
949 29670 7901 -14719 -21819 -8013 8740 11700 -1241 -19909 -27653 -15114 6647 19253 14657
$$ packed form
858a4706q873Q984J8076J3140k026j8792j9356q21J7079K0909J0189j1125k5084
871a2406j4773J1833L1303K8327K68l1263l8523j7117J3363L2657K4403o521k8119
884f568k0720M423K6723K4927k433k9031l1635r175K4008M1293K4682j1179l4748
897E67l1258n717K6618L6298J6166j4451l2960k6031K708K5454K2901J389k2385
910g01k9211p974K3401L4083J6873j4650l5847k5735Q481L5011L4516Q031k7590
923A8688l9244j7721J4536L1541K4701j882k4617k2358k313J5501J8622J632k1318
936d232k6180r989J2709K9353K5541K317j9166k2957q848J3755K6725J6773o131
949B9670k1769k2620p100J3806J6753K960j2941j8668p744J2539K1761J2606m596
$$ plain form
962 14657 -2300 -18597 -18784 -4181 10948 16651 11241 -519 -5795 -290 9059 15548 14864 4853
976 4853 -6233 -11202 -9933 -5002 270 -869 -7911 -14323 -16078 -10419 2140 12123 13619 10316 5989
991 5989 3686 5577 7601 2918 -4659 -9899 -9877 -3297 5420 7306 3481 -2689 -8121 -9201 -4335 635
1007 635 4579 7887 7270 2261 -3470 -9565 -12127 -5957 3358 10032 13244 11698 6109 1137 -3930
1022 -3930 -11105 -15751 -15096 -9175 3371 15125 16632 9453 305 -8060 -9468 -2537 5828 12755 14363
1037 14363 9775 662 -9275 -19697 -25518 -20754 -10744 -364 10314 17256 16989 12221 4632 -4116
1051 -4116 -8169 -4853 4535 17447 23032 14328 -1266 -14587 -22290 -21632 -13366 -5270 -851 2565
1065 2565 3865 2932 -855 -9385 -14193 -8817 2976 17535 30490 33763 23107 7321 -6802 -15372
$$ packed form
962A4657j6957j6297j87J4603J5129N703n410j1760n276N505R349O489o84j0011
976D853j1086m969J269M931N272j139p042o412j755N659J2559R983J496l303m327
991E989k303J891K024m683p577n240K2O580Q717J886l825o170n432j080M866M970
1007F35L944L308o17n009n731o095k562O170R315O674L212j546n589m972n067
1022c930p175m646O55N921J2546J1754J507p179r148q365j408O931Q365O927J608
1037A4363m588r113r937j0422n821M764J0010J0380J0678O942k67m768p589q748
1051d116m053L316R388J2912N585q704j5594j3321p703O58Q266Q096M419L416
1065B565J300r33l787q530m808N376J1793J4559J2955L273j0656j5786j4123q570
$$ plain form
1079 -15372 -16652 -11771 -4042 2929 1869 -7213 -15103 -19272 -21280 -16662 -5683 4493 13729 22823
1093 22823 28943 27078 15811 145 -10207 -9315 -1690 7031 12760 6751 -7517 -18342 -21567 -20271
1107 -20271 -16431 -11517 -5462 2149 8993 13056 15704 13121 5599 1437 3934 7026 9421 11606 8708
1122 8708 -1001 -12949 -21849 -21594 -13657 -4966 1469 4694 2232 -1078 2551 8601 8623 4000 -844
1137 -844 -1481 4570 11387 12686 7375 -4982 -17739 -18972 -10455 -3010 411 1829 354 -1055 408
1152 408 3717 6126 5904 3026 3611 8055 10385 9600 7773 1073 -11137 -19847 -19926 -14260 -6918 -2127
1168 -2127 -1552 -1978 -2176 1240 10459 17120 13705 8084 7507 9091 10472 9784 2650 -8757 -17733 -18852
1184 -18852 -11114 -3882 -5872 -10932 -11146 -6986 -1194 6955 10091 5136 -242 1089 8449 16957 19660
$$ packed form
1079a5372j280M881P729O971j060r082p890m169k008M618J0979J0176R236R094
1093B2823O120j865j1267j5666j0352Q92P625Q721N729o009j4268j0825l225J296
1107b0271L840M914O055P611O844M063K648k583p522m162K497L092K395K185k898
1122H708r709j1948q900K55P937Q691O435L225k462l310L629O050K2m623m844
1137h44o37O051O817J299n311j2357j2757j233Q517P445L421J418j475j409J463
1152D08L309K409k22k878N85M444K330p85j827o700j2210q710p9N666P342M791
1168b127N75m26j98L416R219O661l415n621n77J584J381o88p134j1407q976j119
1184a8852P738P232j990n060k14M160N792Q149L136m955n378J331P360Q508K703
$$ plain form
1199 19660 15513 8969 1134 -4883 -3675 -1653 -5968 -14142 -20501 -22620 -19142 -9859 -1443 1541 -717
1214 -717 -2570 4807 21072 31693 31354 20366 2677 -10538 -9308 330 4983 -1042 -14346 -24367
1228 -24367 -22364 -11772 -2467 -7 -4837 -10446 -4211 13284 27962 30227 18492 -1813 -15932
1241 -15932 -15002 -3524 9595 14449 6779 -6032 -11928 -10039 -3624 1598 -3070 -14353 -19570 -12766
1255 -12766 3415 21026 25930 14520 -1303 -8258 -1747 12840 20923 11178 -9247 -26160 -28810
1268 -28810 -14792 2372 7220 -55 -8584 -9256 899 16500 23295 15225 1225 -6774 -2202 11381
1282 11381 19612 13507 -3394 -23244 -34382 -27792 -10913 2385 7221 4330 -135 1616 9820
1295 9820 16813 15576 4474 -9971 -13220 -1716 13420 21898 17475 1563 -14035 -16082 -6982
$$ packed form
1199A9660m147o544p835o017J208K022m315q174o359k119L478R283Q416K984k258
1214g17j853P377J6265J0621l39j0988j7689j3215J230R638M653o025j3304j0021
1228b4367K003J0592R305K460m830n609O235J7495J4678K265j1735k0305j4119
1241a5932R30J1478J3119M854p670j2811n896J889O415N222m668j1283n217O804
1255a2766J6181J7611M904j1410j5823o955O511J4587Q083r745k0425j6913k650
1268b8810J4018J7164M848p275q529o72J0155J5601O795q070j4000p999M572J3583
1282A1381Q231o105j6901j9850j1138O590J6879J3298M836k891m465J751Q204
1295I820O993j237j1102j4445l249J1504J5136Q478m423j5912j5598k047R100
$$ plain form
1308 -6982 1716 86 -12709 -25255 -25067 -12425 5287 17277 16340 6482 2247 8842 18488 22307
1322 22307 15812 1139 -10746 -12515 -5511 4115 5842 -5444 -20353 -27254 -24173 -11527 4466
1335 4466 12733 11009 6880 5784 11347 18043 16511 4986 -9301 -17920 -15326 -524 13393 13837
1349 13837 3159 -8387 -11838 -4727 4970 7055 -555 -12565 -19109 -12083 3409 13761 13167 6036
1363 6036 -1486 -2996 3145 9258 8669 675 -9575 -13514 -6768 3590 9669 10632 3525 -8070 -12780
1378 -12780 -7718 1781 8966 9262 3391 -2458 -3835 -1451 2326 744 -8747 -17355 -15553 -4992 8895
1393 8895 18898 18184 9639 1342 -883 2846 7189 4225 -3451 -9354 -11306 -9613 -4629 -944 -2686
1408 -2686 -5355 -5284 -2583 2315 6581 6828 5701 2508 -1247 -558 4641 8131 8440 5199 -1095 -6881
$$ packed form
1308f982Q698j630j2795j2546J88J2642J7712J1990r37r858m235O595R646L819
1322B2307o495j4673j1885j769P004R626J727j1286j4909o901L081J2646J5993
1335D466Q267j724m129j096N563O696j532j1525j4287q619K594J4802J3917M44
1349A3837j0678j1546l451P111R697K085p610j2010o544P026J5492J0352n94p131
1363F036p522j510O141O113n89p994j0250l939O746J0358O079R63p107j1595m710
1378a2780N062R499P185K96n871n849j377K384L777j582r491q608J802J0561J3887
1393H895J0003p14q545q297k225L729M343k964p676n903j952J693M984L685j742
1408b686k669P1K701M898M266K47j127l193l755O89N199L490L09l241o294n786
$$ plain form
1424 -6881 -6765 -3540 -300 624 -2912 -6707 -6201 -3936 -2915 -2330 -3041 -4253 -183 7584 13864 15404
1440 15404 11911 5470 109 -3164 -5946 -6426 -5842 -6872 -7002 -5154 -4560 -3879 -1299 1866 4167 5813
1456 5813 6057 6235 9244 10127 7827 3734 -3358 -10541 -13135 -11312 -10192 -8516 -6604 -3282 3852 10721
1472 10721 13335 12071 7352 584 -2376 -539 1499 3003 4630 3381 816 -2633 -6765 -9637 -9354
1487 -9354 -8897 -7834 -5354 -3944 -2497 1179 4887 6451 7284 8449 9821 13015 13652 8960 1217 -5382
1503 -5382 -9007 -5887 -315 652 -4453 -12074 -20337 -23794 -20328 -13039 -3077 8838 19264 26438 29852
1518 29852 26590 16917 5719 -5037 -12725 -14215 -9966 -3829 2160 2339 -4068 -12419 -16898 -15903 -8224
1533 -8224 11 2977 1727 995 3214 9580 16639 17990 12828 6113 686 -575 1540 1189 -3187
$$ packed form
1424f881J16L225L240R24l536l795N06K265J021N85p11j212M070P767O280J540
1440A5404l493o441n361l273k782m80N84j030j30J848N94O81K580L165K301J646
1456E813K44J78L009Q83k300m093p092p183k594J823J120J676J912L322P134O869
1472A0721K614j264m719o768k960J837K038J504J627j249k565l449m132k872K83
1487i354M57J063K480J410J447L676L708J564Q33J165J372L194O37m692p743o599
1503e382l625L120N572R67n105p621q263l457L466P289R962J1915J0426P174L414
1518B9852l262r673j1198j0756p688j490M249O137N989J79o407q351m479R95P679
1533h224Q235K966j250p32K219O366P059J351n162o715n427j261K115l51m376
$$ plain form
1548 -3187 -8763 -12799 -12816 -7340 -2568 -2239 -5475 -11201 -15208 -10555 1601 15199 25406 27206 20162
1563 20162 11734 6432 4109 1361 -6813 -20915 -31857 -30206 -17303 1490 16411 18528 9646
1576 9646 575 -2953 808 6325 6540 1077 -2478 -922 5616 13344 13074 756 -15467 -26073 -24155
1591 -24155 -9781 7409 16968 14400 2682 -9620 -11165 -2220 8440 12952 10133 1673 -3938
1604 -3938 -55 7724 11267 6298 -5011 -13184 -11703 -4846 -964 -5725 -18737 -30062 -25240 -2942
1618 -2942 23901 42122 42633 27402 7644 -6018 -10223 -7158 -4174 -6566 -9772 -9445 -7921 -5793
1632 -5793 -5150 -9323 -14823 -14657 -5695 8982 22338 25265 16701 3633 -6497 -6964 2229 12085 12605
1647 12605 4995 -4669 -10744 -9456 -4692 -2511 -3869 -7842 -9895 -7763 -4030 -4397 -7101 -7013 -1087
$$ packed form
1548c187n576m036j7N476M772L29l236n726m007M653J2156J3598J0207J800p044
1563B0162q428n302k323k748q174j4102j0942J651J2903J8793J4921K117q882
1576I646r071l528L761N517K15n463l555J556O538P728k70j2318j6223j0606J918
1591b4155J4374J7190R559k568j1718j2302j545Q945J0660M512k819q460n611
1604c938L883P779L543m969j1309q173J481O857L882m761j3012j1325M822K2298
1618b942K6843J8221N11j5231j9758j3662m205L065K984k392l206L27J524K128
1632e793O43m173n500J66Q962J4677J3356K927q564j3068j0130m67R193R856N20
1647A2605p610r664o075J288M764K181j358l973k053K132L733l67k704Q8N926
$$ plain form
1662 -1087 11241 25214 31166 25593 12954 -844 -9796 -11224 -10365 -10269 -11141 -12367 -12623 -9274 -4752
1677 -4752 -1807 1191 4097 8329 14791 19334 17153 8122 -3113 -12414 -13548 -5631 2115 4867 -462
1692 -462 -10091 -14941 -8350 3140 11917 13652 6470 -2762 -5683 -2376 528 3 -5096 -7630 -754
1707 -754 11997 21701 20849 6276 -15171 -28448 -25271 -11161 4514 11075 6284 -3551 -9219 -5846
1721 -5846 4580 15025 16218 10844 6478 5532 7654 9495 3851 -10107 -24884 -29852 -21581 -5333
1735 -5333 6609 6098 -2252 -9520 -7021 8287 26648 32468 22319 4095 -10790 -13831 -7648 -411
1749 -411 1910 -895 -5628 -4613 2777 6486 714 -10405 -22302 -26152 -17140 421 16798 23191
1763 23191 18081 8384 3713 5220 9079 12618 9985 -787 -11305 -13476 -8341 -2922 -2284 -8353
$$ packed form
1662a087J2328J3973N952n573j2639j3798q952j428Q59R6q72j226k56L349M522
1677d752K945K998K906M232O462M543k181r031j1235r301j134P917P746K752n329
1692d62r629m850O591J1490Q777J735p182r232k921L307K904n25n099k534O876
1707g54J2751R704q52j4573k1447j3277L177J4110J5675O561m791r835n668L373
1721e846J0426J0445J193n374m366r46K122J841n644j3958j4777m968Q271J6248
1735e333J1942n11q350p268K499J5308J8361N820j0149j8224j4885l041O183P237
1749d11K321k805m733J015P390L709n772j1119j1897l850R012J7561J6377O393
1763B3191n110r697m671J507L859L539k633j0772j0518k171N135N419O38o069
$$ plain form
1777 -8353 -15241 -18576 -14573 -2838 8336 10950 8303 8356 13175 18046 20338 15507 2659 -12304
1791 -12304 -21701 -20800 -12531 -4826 -684 2883 4823 3320 3114 4406 2204 -3029 -6602 -6322 -2742
1806 -2742 3346 8837 13166 12464 4600 -2283 -4382 -5763 -8077 -8781 -8391 -8071 -4560 2263 9280 11082
1822 11082 7035 1609 -406 -1244 -1553 859 3308 3031 3039 4478 4160 -342 -6970 -12564 -14938 -14415 -11911
1839 -11911 -5111 4350 10761 14826 17384 15779 9543 3817 -184 -3554 -5886 -7952 -7242 -4114 -1779
1854 -1779 -1325 -1562 -3569 -7267 -8308 -5737 -3196 -1161 2076 5771 10607 13917 14011 11926 7600 917
1870 917 -4997 -7549 -9011 -9144 -6441 -2831 -857 -239 -1922 -3820 -4088 -3773 -4059 -1629 1097 3697
1886 3697 8385 13064 13568 10095 5024 -191 -3549 -5179 -7184 -8045 -7957 -7922 -6139 -1694 826 1270 1625
$$ packed form
1777h353o888l335M003J1735J1174K614k647N3M819M871K292m831j2848j4963
1791a2304r397R01Q269P705M142L567J940j503k06J292k202n233l573K80L580
1806b742O088N491M329p02p864o883k099j381k314p04L90L20L511O823P017J802
1822A1082m047n426k015q38l09K412K449k77QJ439l18m502o628n594k374N23K504
1839a1911O800R461O411M065K558j605o236n726m001l370k332k066P10L128K335
1854a779M54k37k007l698j041K571K541K035L237L695M836L310R4k085m326o683
1870I17n914k552j462j33K703L610J974O18j683j898k68L15k86K430K726K600
1886C697M688M679N04l473n071n215l358j630k005q61Q8L5J783M445K520M44L55
$$ plain form
1903 1625 2157 2651 3289 4144 4958 6251 6005 4083 2185 -925 -5614 -8144 -8950 -9545 -8889 -5590 -420
1920 -420 5953 10445 11370 9139 5175 593 -858 -60 -774 -3060 -4270 -4600 -3619 -2073 -1630 -2515 -3914
1937 -3914 -4869 -3929 176 3844 5227 6452 5917 3308 1536 1988 3481 5331 5044 2215 -579 -2241
1953 -2241 -3494 -4039 -4958 -9863 -14794 -15335 -11475 -4198 3473 7770 9254 10814 13393 16774 19113 14800
1969 14800 5125 -4388 -11288 -14259 -12851 -10207 -8990 -8296 -7325 -4729 -522 2522 2548 1621 1533 1967 5533
1986 5533 12006 15251 12920 5910 -2683 -8190 -7722 -3833 -60 1356 -1324 -4638 -3822 -1373 -2734
2001 -2734 -6849 -12383 -15489 -11121 199 11668 19090 18993 14673 11555 11231 9705 4863 -3758 -15309
2016 -15309 -23829 -23835 -17349 -8170 -456 2899 4539 6595 9616 12431 13654 9439 1341 -3936 -4383 -71
$$ packed form
1903A625N32M94O38Q55Q14J293k46j922j898l110m689k530q06n95O56L299N170
1920d20O373M492R25k231l964m582j451P98p14k286j210l30R81J546M43q85j399
1937c914r55R40M105L668J383J225n35k609j772M52J493J850k87k829k794j662
1953b241j253n45r19m905m931n41L860P277P671M297J484J560K579L381K339m313
1969A4800r675r513o900k971J408K644J217O94R71K596M207L044K6r27q8M34L566
1986E533O473L245k331p010q593n507M68L889L773J416k680l314Q16K449j361
2001b734m115n534l106M368J1320J1469P422r7m320l118l24j526m842q621j1551
2016a5309q520oO486R179P714L355J640K056L021K815J223m215q098n277m47M312
$$ plain form
2032 -71 5308 5700 -280 -9174 -15254 -14344 -6900 256 2200 203 -789 1964 8130 13145 10960 1733
2048 1733 -7946 -11341 -5142 5929 13393 13332 7965 727 -3896 -4358 -6562 -12581 -21359 -25861 -22543
2063 -22543 -9637 7082 19598 24789 21910 16106 13143 13828 13000 7279 -3608 -16049 -22938 -20147
2077 -20147 -12394 -5141 -3476 -8168 -11445 -8152 524 9182 13999 10774 5350 5082 10218 16653 17625
2092 17625 8961 -4713 -14526 -16031 -9570 -1047 3083 -533 -6032 -8053 -7127 -4810 -4272 -7796 -11339
2107 -11339 -9316 -628 12601 25114 29045 24430 15149 5550 -492 -3004 -6924 -14619 -23056 -27022
2121 -27022 -23264 -12065 542 7433 7625 5136 4138 8536 15132 16833 12890 5026 -1747 -3730 -1305
2136 -1305 -313 -4570 -10689 -15588 -14156 -6758 1437 5706 5479 2034 -517 1788 5404 6648 5247
$$ packed form
2032g1N379L92n980q894o080R10P444P156J944j997r92K753O166N015k185r227
2048A733r679l395O199J1071P464o1n367p238m623m62k204o019q778m502L318
2063b2543J2906J6719J2516N191k879n804k963O85q28n721j0887j2441o889K791
2077b0147P753P253J665m692l277L293Q676Q658M817l225n424k68N136O435R72
2092A7625q664j3674r813j505O461Q523M130l616n499k021R26K317N38l524l543
2107a1339K023Q688J3229J2513L931m615r281r599o042k512l920p695q437l966
2121b7022L758J1199J2607O891J92k489r98M398O596J701l943p864o773j983K425
2136a305R92m257o119m899J432P398Q195M269k27l445k551K305L616J244j401
$$ plain form
2151 5247 674 -3892 -3963 1022 6491 10328 8620 1694 -4981 -8345 -9926 -10678 -11688 -13468 -13146 -6162
2167 -6162 5107 15960 21604 18867 11386 5936 3595 4598 5509 1555 -7041 -14049 -17068 -15891 -13005
2182 -13005 -10124 -8752 -5888 -581 7183 15038 18741 16622 11119 5881 2236 777 1812 291 -3632
2197 -3632 -8042 -10223 -8838 -4602 -987 645 -855 -5169 -8452 -6838 -3366 -610 1826 3960 6160
2212 6160 9887 14706 16401 12964 5831 -1103 -4680 -5322 -5933 -6605 -8458 -12252 -14270 -12011 -8417 -3864
2228 -3864 440 4522 8305 12000 13777 14610 13776 9596 3013 -2473 -6871 -10724 -10769 -8380 -5967 -4083
2244 -4083 -1637 732 3921 4399 2012 -1093 -3979 -5658 -4217 1044 4870 6553 7436 7378 6295 4128
2260 4128 1074 -2261 -5034 -7371 -7675 -5609 -4208 -4000 -2284 -11 490 1657 2193 3459 4964 6616
$$ packed form
2151E247m573m566p1M985N469L837j708o926o675l364j581p52j010j780L22O984
2167f162J1269J0853N644k737p481n450k341J003R11l954q596p008l019J177K886
2182a3005K881J372K864N307P764P855L703k119n503n238l645j459J035j521l923
2197c632m410k181J385M236L615J632j500m314l283J614L472K756K436K134K200
2212F160L727M819J695l437p133o934l577o42o11o72j853l794k018K259L594M553
2228c864M304M082L783L695J777Q33q34m180o583n486m398l853m5K389K413J884
2244d083K446K369L189M78k387l105k886j679J441N261L826J683Q83n8j083k167
2260D128l054l335k773k337l04K066J401K08J716K273N01J167N36J266J505J652
$$ plain form
2276 6616 7070 7349 5567 2517 -602 -3308 -7542 -11828 -13182 -12152 -8767 -2419 3024 7707 11362
2291 11362 11988 11115 8962 3778 -2119 -4812 -5553 -4745 -2875 -874 261 575 -256 -2188 -3948 -6083
2307 -6083 -7983 -6122 -2444 980 3993 7468 9251 9095 8115 5715 2349 -866 -3167 -3450 -2744 -2864
2323 -2864 -3529 -3212 -3559 -4774 -5410 -5638 -5751 -4241 -1002 2860 6793 9251 10022 10932 9408 4879 -394
2340 -394 -4183 -8007 -8720 -6784 -4928 -3018 -607 1847 3503 3953 1661 -2094 -4180 -4513 -2952 644
2356 644 3524 3970 4415 4593 3908 2861 186 -3175 -5074 -5233 -3734 -338 2536 3208 2599 1085 -1247
2373 -1247 -1906 -1261 -930 -1321 -1144 -1578 -834 1533 3649 3686 1463 -1990 -4704 -3603 -1174 918 2288
2390 2288 1520 321 2397 6510 7757 5557 -7 -6563 -9773 -7671 -3463 440 1522 -618 -2741
$$ packed form
2276F616M54K79j782l050l119k706m234m286j354J030L385O348N443M683L655
2291A1362O26q73k153n184n897k693p41Q08J870K001J135L14q31j932j760k135
2307f083j900J861L678L424L013L475J783j56r80k400l366l215k301k83P06j20
2323b864o65L17l47j215o36k28j13J510L239L862L933K458P71R10j524m529n273
2340c94l789l824p13J936J856J910K411K454J656M50k292l755k086l33J561L596
2356F44K880M46M45J78o85j047k675l361j899j59J499L396K874O72o09j514k332
2373a247o59O45L31l91J77m34P44K367K116L7k223l453k714J101K429K092J370
2390B288p68j199K076M113J247k200n564o556l210K102M208L903J082k140k123
$$ plain form
2405 -2741 -1215 -152 926 1522 -367 -2486 -1120 3161 8554 10770 8291 2366 -2601 -5762 -5206
2420 -5206 -1344 485 -2900 -6996 -8655 -6772 -1548 3327 4619 2275 -1026 -1407 3113 7912 7910 4001
2436 4001 -160 -2278 -1097 3489 5312 760 -6399 -11694 -10583 -4323 2403 5359 5269 1155 -3078
2451 -3078 -2561 503 2046 1702 -162 -639 485 4212 7025 6245 752 -6872 -9294 -6159 -300 3912
2467 3912 4684 521 -4788 -5715 -1199 4671 6899 4011 -375 -2225 -1512 1019 2910 874 -4566 -7190
2483 -7190 -4250 173 3262 2939 -1386 -4434 -3721 1483 8898 12698 9317 1390 -4846 -7964 -7367 -4044
2499 -4044 -1842 -1950 -3163 -1951 1744 5554 5397 1117 -3454 -5961 -4375 1553 7096 6942 1701 -3393
2515 -3393 -4806 -441 5776 8121 5152 -794 -6839 -7142 -2439 880 802 -2514 -5030 -5504 -2226 1471
$$ packed form
2405b741J526J063J078N96j889k119J366M281N393K216k479n925m967l161N56
2420e206L862J829l385m096j659J883N224M875J292k344l301l81M520M799kl909
2436D001m161k118J181M586J823m552p159n295J111O260O726K956r0m114m233
2451c078N17L064J543l44j864m77J124L727K813p80n493p624k422L135N859M212
2467C912P72m163n309r27M516N870K228k888m386j850P13K531J891k036n440k624
2483g190K940M423L089l23m325l048P13N204P415L800l381p927o236l118N97L323
2499d044K202j08j213J212L695L810j57m280m571k507J586N928N543j54n241n094
2515c393j413M365O217K345k969n946o045l03M703L319p8l316k516m74L278L697
$$ plain form
2531 1471 2566 891 -1775 -1171 4984 11497 13432 9822 1135 -8264 -12791 -10383 -4067 1219 2535
2546 2535 448 -965 -356 1769 4103 3557 -1028 -6049 -6329 -3013 1363 3857 2495 -869 -1631 1044
2562 1044 6618 11455 8968 832 -5962 -8953 -7587 -2527 1800 1971 -614 -3422 -4226 -2249 266
2577 266 790 1079 1880 3075 4963 7291 5545 346 -5835 -9647 -9229 -3998 2028 6545 7349 4566
2593 4566 1231 1102 1783 1537 -395 -3693 -7297 -8439 -6335 -3311 15 1557 2173 4098 6683 7256
2609 7256 5723 2825 -1829 -4941 -4770 -2730 508 2274 2429 1072 -332 -2225 -2948 -1693 -360 175
2625 175 1011 668 -877 -2005 -2589 -3131 -2719 -1390 426 3635 6425 7143 6326 4772 1999 143 -1293
2642 -1293 -2819 -4833 -6238 -7657 -6822 -4696 -2005 934 3949 6155 6332 5128 2359 -873 -2807
$$ packed form
2531A471J095j675k666O04O155O513J935l610q687r399m527K408O316N286J316
2546B535k087j413O09K125K334n46m585n021k80L316M376K494j362l364p62K675
2562A044N574M837k487q136o794k991J366N060M327J71k585k808q04J977K515
2577B66N24K89Q01J195J888K328j746n199o181l812M18N231O026M517Q04k783
2593D566l335j29O81k46j932l298l604j142K104L024L326J542O16J925K585N73
2609G256j533k898m654l112J71K040L238J766J55j357j404j893p23J255J333N35
2625A75Q36l43j545j128n84n42M12J329J816L209K790P18q17j554k773j856j436
2642a293j526k014j405j419Q35K126K691K939L015K206J77j204k769l232j934
$$ plain form
2657 -2807 -2670 -1591 203 1428 1767 1961 2271 1217 44 -1249 -2402 -2629 -1823 -1196 -1313 -1281 -2515
2674 -2515 -2884 -1248 194 2182 4411 5097 4507 3614 1714 20 -854 -1239 -2051 -2786 -4023 -4791 -3949
2691 -3949 -1615 104 2100 3810 4155 4720 5046 3455 611 -2666 -5174 -5648 -3564 -1564 291 1506
2707 1506 687 -120 -92 69 628 1598 1674 1584 1578 1310 714 1029 853 -114 -535 -571 -505 345 559 -1125 -3392
2728 -3392 -5163 -5607 -3635 -491 937 1510 1887 2011 3236 5665 6617 5363 3808 1357 -776 -1479
2744 -1479 -2878 -4608 -6098 -6182 -5760 -3239 -428 1009 1692 1432 359 353 1547 2906 3981 4175 3074
2761 3074 1845 1389 421 467 249 -1526 -2979 -2689 -2047 -1417 -1263 -2747 -4378 -4556 -2635 -90 1977
2778 1977 2873 2393 2820 3934 4381 5130 4406 1451 -1126 -2105 -2556 -2518 -2797 -3655 -3235 -2205 -884 772
$$ packed form
2657b807J37J079J794J225L39J94L10j054j173j293j153k27Q06O27j17L2j234
2674b515l69J636J442J988K229O86n90q93j900j694q74l85q12p35j237p68Q42
2691c949K334J719J996J710L45N65L26j591k844l277k508m74K084K000J855J215
2707A506q19q07K8J61N59R70P6r0ok68n96L15j76r67m21l6O6Q50K14j684k267
2728c392j771m44J972L144J428N73L77J24J225K429R52j254j555k451k133p03
2744a479j399j730j490q4M22K521K811J437O83k60j073oJ194J359J075J94j101
2761C074j229m56r68M6k18j775j453K90O42O30J54j484j631j78J921K545K067
2778A977Q96m80M27J114M47P49p24k955k577r79m51L8k79q58M20J030J321J656
$$ plain form
2796 772 2019 891 -1036 -1773 -1474 -866 1000 2844 2680 2339 1619 1950 2634 1958 -361 -1911 -3166
2813 -3166 -3044 -1158 855 507 -1713 -2918 -2335 -564 2000 2976 1923 98 -1405 112 2751 2904
2829 2904 175 -2142 -4184 -4211 -1632 1476 2348 1030 31 574 3378 5334 4477 2073 -2086 -6687
2845 -6687 -7048 -4059 -925 124 -210 -1195 -919 1355 3936 5509 3537 -1056 -4240 -3021 712 3743
2861 3743 4563 1767 -2197 -3727 -1659 2284 3986 1652 -3091 -5162 -4559 -1595 1711 2476 -657 -4230
2877 -4230 -3795 29 4203 6227 4601 1130 -1221 -1223 1607 4247 2505 -2617 -7038 -8017 -5407 -160
2893 -160 4096 4664 2446 80 228 3231 4862 2780 -1731 -6081 -8619 -5808 271 4054 3529 463
2909 463 -1445 26 3537 6699 5905 1761 -3916 -6578 -4125 -374 1546 753 -1543 -3196 -2152 1389
$$ packed form
2796G72J247j128j927p37K99O08J866J844j64l41p20L31O84o76k319j550j255
2813c166J22J886K013l48k220j205N83J771K564R76j053j825j503J517K639J53
2829B904k729k317k042k7K579L108Q72j318r99N43K804J956q57k404m159m601
2845f687l61K989L134J049l34r85K76K274K581J573j972m593l184J219L733L031
2861C743Q20k796l964j530K068L943J702k334m743k071O03K964L306P65l133l573
2877d230M35L824M174K024j626l471k351kK830K640j742n122m421r79K610N247
2893a60M256N68k218k366J48L003J631k082m511m350k538K811O079L783n25l066
2909D63j908J471L511L162p94m144n677k662K453L751J920p93k296j653J044L541
$$ plain form
2925 1389 4369 4544 649 -3392 -4299 -2600 -416 1772 1661 -1289 -3817 -1897 2419 6453 8128 5715
2941 5715 2317 -745 -1886 -1376 -866 -4159 -8291 -9764 -7271 -3181 1905 4302 3580 2417 2452 4425
2957 4425 7334 6893 3523 -581 -3541 -4759 -3186 -349 166 -806 -1777 -1354 -87 1005 576 -937
2973 -937 -3483 -5433 -4615 -997 1799 2891 3077 2299 2372 4000 6202 6666 4926 758 -3567 -5204 -4882
2990 -4882 -4714 -4500 -4881 -5618 -3570 -261 2886 4670 4951 3101 2227 2943 3387 2970 1313 -1926 -4189
3007 -4189 -4948 -3856 -1845 214 1217 1548 2226 2355 1889 1532 445 -1857 -3404 -3855 -2954 -1151 592
3024 592 1226 1669 1945 1894 3184 3342 2035 -816 -2820 -4149 -3813 -2147 -392 345 1065 1150 2057 3594
3042 3594 3338 2147 685 -841 -2378 -2663 -2349 -2764 -2857 -2715 -2339 -1333 335 1724 3063 4230 3642
$$ packed form
2925A389K980J75l895m041r07J699K184K188j11k950k528J920M316M034J675k413
2941E715l398l062j141N10N10l293m132j473K493M090N086K397p22j163L5J973
2957D425K909m41l370m104k960j218J573K837N15r72r71M23J267J092m29j513
2973i37k546j950Q18L618K796J092J86p78P3J628K202M64j740m168m325j637L22
2990d882J68K14l81p37K048L309L147J784K81j850q74P16M44m17j657l239k263
3007d189p59J092K011K059J003L31O78J29m66l57j087k302j547m51R01J803J743
3024E92O34M43K76n1J290J58j307k851k004j329L36J666J755P37P20Q5R07J537
3042C594k56j191j462j526j537k85L14m15r3J42L76J006J668J389J339J167n88
$$ plain form
3059 3642 3184 3162 2339 754 -546 -2525 -4319 -4618 -3645 -1898 -21 677 683 748 832 651 601 517 -905 -1137
3079 -1137 -1136 -523 264 845 1606 2480 3037 2887 2535 1451 -561 -2906 -3763 -4260 -3892 -2353 -861 574
3097 574 1454 691 102 604 1055 1530 2756 2786 1388 558 -419 -1659 -2020 -2484 -2382 -810 954 1916 2258
3116 2258 1918 397 -682 -345 -365 -370 -586 -999 -2063 -2724 -3284 -2742 -839 1286 3354 4860 4548 2681
3134 2681 656 -688 -1359 -1107 -421 5 206 -24 -889 -1187 -1776 -2648 -2232 -1258 -20 531 1206 611 -578
3153 -578 -1167 -1278 216 3120 4535 5164 3826 1015 -1616 -2486 -1686 -686 -683 -1182 -2601 -3080 -2769 -2133
3171 -2133 -1389 -1190 -954 200 2839 4635 4996 3645 430 -2061 -1825 -127 1973 2909 918 -2152
3187 -2152 -3847 -3975 -2266 663 2019 1499 -77 -1243 -1470 -546 153 -310 -881 -911 28 2792 5237
$$ packed form
3059C642m58k2q23j585j300j979j794k99R73J747J877O98OO5Q4j81n0q4j422k32
3079a137JO13P87N81P61Q74N57j50l52j084k012k345q57m97L68J539J492J435
3097E74Q80p63n89N02M51M75J226L0j398q30r77j240l61m64J02J572J764R62L42
3116B258l40j521j079L37k0nk16m13j064o61n60N42J903K125K068J506l12j867
3134B681k025j344o71K52O86M26K01k30q65k98n89q72M16R74J238N51O75n95j189
3153e78n89j11J494K904J415O29j338k811k631q70Q00J000Lm99j419m79L11O36
3171b133P44J99K36J154K639J796L61j351l215k491K36J698K100R36j991l070
3187b152j695j28J709K929J356n20j576j166k27R24O99m63n71l0R39K764K445
$$ plain form
3204 5237 4374 811 -2474 -4120 -2509 675 2855 2281 -532 -3539 -3834 -894 1683 3025 2193 -399
3220 -399 -2289 -1944 -20 965 1020 -72 -1361 -448 1286 2643 2274 146 -3306 -4019 -1846 992 4056
3237 4056 4771 2170 -1118 -2517 -2184 -425 830 241 -1871 -2372 -1798 -54 1674 1543 -352 -1837
3253 -1837 -1547 -69 1917 2843 1275 -168 -12 881 2992 3876 1925 -734 -3437 -4518 -3490 -1725
3269 -1725 -420 -113 -55 164 600 849 436 -439 -1321 -1462 -708 1467 3078 3036 2437 1514 945 1194 1627
3288 1627 292 -1544 -3802 -4783 -3578 -1317 -169 -138 -245 -1026 -205 1422 2148 1503 112 -149 969
3305 969 3256 4596 3506 938 -2558 -4364 -2997 -560 122 231 -1142 -2514 -1569 653 2005 1605
3321 1605 -487 -3002 -3289 -1350 1414 3366 3377 1646 -37 979 3062 4188 3098 -946 -5133 -6624
$$ packed form
3204E237q63l563l285j646J611L184K180n74k813l007k95K940K577J342q32k592
3220c99j890L45J924R85N5j092j289R13J734J357l69k128l452p13K173K838L064
3237D056P15k601l288j399L33J759J255n89k112n01N74J744J728j31j895j485
3253a837K90J478J986R26j568j443J56Q93K111Q84j951k659k703j081J028J765
3269a725J305L07N8K19M36K49m13q75q82j41P54K175J611m2n99r23n69K49M33
3288A627j335j836k258r81J205K261J148L1j07p81Q21J627P26o45j391k61J118
3305I69K287J340j090k568l496j806J367K437O82J09j373j372R45K222J352m00
3321A605k092k515k87J939K764J952J1j731j683J016K083J126j090m044m187j491
$$ plain form
3337 -6624 -4503 -817 2349 2186 -283 -2077 -1556 512 2885 3454 1055 -1476 -2364 -430 2573 3499
3353 3499 1637 -1542 -3822 -3682 -881 2921 3314 1403 -1062 -2603 -1540 1318 2763 1856 -706 -3463
3369 -3463 -3651 -947 1835 2975 1773 -372 -2313 -1396 996 2428 1198 -1463 -4442 -4282 -1272 2625
3385 2625 5114 4663 1898 -513 -421 1082 1843 1680 -800 -3428 -4428 -3445 -1677 -456 -942 -2313 -2205
3402 -2205 -894 2184 4921 5974 4221 1420 -266 -782 430 1653 997 -1000 -3115 -3938 -2794 -1060
3418 -1060 -129 -889 -1599 -2654 -2098 -137 1294 1487 782 370 754 2611 4465 4980 3682 1109 -1377
3435 -1377 -2144 -1954 -1339 -1132 -1566 -3451 -4281 -4170 -3258 -1445 -89 1292 2197 3569 3937 4892 5005 3333
3453 3333 232 -1284 -2318 -2125 -1391 -986 -1564 -2363 -2577 -2102 -163 1146 857 663 -385 -1311 -1075 354
$$ packed form
3337f624K121L686L166j63k469j794N21K068K373N69k399k531q88J934L003R26
3353C499j862l179k280J40K801L802L93j911k465j541J063K858J445r07k562k757
3369c463j88K704K782J140j202k145j941R17K392J432j230k661k979J60L010L897
3385B625K489m51k765k411R2J503P61j63k480k628j000R83J768J221m86j371J08
3402b205J311L078K737J053j753k801j686n16J212J223o56j997k115q23J144J734
3418a060R31p60p10j055N56J961J431J93p05m12L84J857J854N15j298k573k486
3435a377p67J90O15K07m34j885q30J11R12J813J356J381R05J372L68R55J13j672
3453C333l101j516j034J93P34M05n78p99k14M75J939J309k89j94j048r26K36J429
$$ plain form
3471 354 1424 2188 2921 2509 1985 1045 -170 -920 -1425 -2647 -2915 -1607 -603 480 878 61 -762 -1412
3489 -1412 -1093 805 2710 3358 2799 2417 1078 -566 -828 -1664 -2309 -3277 -3789 -3240 -2236 -795 806
3506 806 2659 3586 3574 3790 3624 2716 469 -926 -2457 -3281 -3302 -1610 696 1421 189 -1471 -2338 -3215
3524 -3215 -2932 -838 1318 1672 1984 2630 3365 3354 2979 2064 887 -523 -1414 -843 102 -569 -1912 -2618
3542 -2618 -3823 -4324 -3223 -1083 171 142 -373 93 2247 4342 6203 6875 5159 1752 -1088 -2065 -2459
3559 -2459 -3067 -3631 -3980 -3886 -2665 -719 1667 2341 332 -1372 -1188 -727 991 3187 3854 2518 1043
3576 1043 289 682 1290 715 -1025 -2497 -3687 -3364 -1301 1159 1538 569 -527 -1407 -517 1141 2237
3593 2237 2039 191 -1218 -745 1035 2256 1629 -153 -2432 -3985 -2998 -1119 716 934 216 -192 1189
$$ packed form
3471C54J070P64P33m12n24r40j215p50n05j222k68J308J004J083L98q17q23o50
3489a412L19J898J905O48n59l82j339j644k62q36o45r68n12N49J004J441J601
3506H06J853R27j2K16j66r08k247j395j531q24k1J692K306P25j232j660q67q77
3524c215K83K094K156L54L12O46P35j1l75r15j177j410q91N71R45o71j343p06
3542b618j205n01J101K140J254k9n15M66K154K095J861O72j716l407k840r77l94
3559b459o08n64l49R4J221J946K386O74k009j704J84M61J718K196O67j336j475
3576A043p54L93O08n75j740j472j190L23K063K460L79r69j096q80Q90J658J096
3593B237j98j848j409M73J780J221o27j782k279j553R87J879J835K18p18m08J381
$$ plain form
3610 1189 2737 3655 3519 1630 -1445 -2925 -2381 -1342 41 -141 -1317 -2625 -2222 -1741 -70 755 537
3627 537 -145 392 1505 2903 3932 3426 1614 71 -998 -868 -383 -1170 -2476 -3429 -3164 -2381 -583
3644 -583 506 4 -946 -1018 -136 1350 2960 2930 2577 2074 1815 1532 1716 523 -1431 -2357 -2798 -2038 -1054
3663 -1054 -600 -1025 -1752 -2347 -2072 -407 1053 1269 1017 934 1225 2078 3271 2910 1555 155 -1395 -1523
3681 -1523 -794 -916 -1614 -2374 -2827 -2096 246 2026 1944 556 -1119 -1567 -154 1241 2372 2483 915
3698 915 -516 -635 127 -113 -281 -1396 -2478 -1809 -134 1959 2713 1882 -468 -1581 -1008 -61 950
3715 950 807 -466 -1540 -1705 -221 1542 2161 1012 -1450 -2911 -2778 -1289 625 1307 757 193 1087
3732 1087 2643 3953 3474 778 -1674 -3030 -2899 -873 740 364 -1523 -2628 -3147 -2133 -115 870
$$ packed form
3610A189J548R18j36j889l075j480N44J039J383j82j176j308M03M81J671Q25k18
3627E37o82N37J113J398J029n06j812j543j069J30M85p87j306r53K65P83J798
3644e83J089n02r50p2Q82J486J610l0l53n03k59k83J84j193j954r26m41P60R84
3663a054M54m25p27n95K75J665J460K16k52q3K91Q53J193l61j355j400j550j28
3681a523P29j22o98p60m53P31K342J780q2j388j675m48J413J395J131J11j568
3698I15j431j19P62k40j68j115j082O69J675K093P54q31k350j113N73R47J011
3715I50j43j273j074j65J484J763O19j149k462j461J33J489J914O82n50n64Q94
3732A087J556J310m79k696k452j356J31K026J613l76j887j105n19J014K018R85
$$ plain form
3748 870 593 -206 -8 1058 3758 4418 3966 1994 -345 -1450 -1561 -701 -1157 -1875 -3319 -3688 -1568 876
3766 876 2406 2402 72 -2064 -3083 -1386 616 2284 2702 2126 1648 2235 2725 2497 1103 -1971 -3513
3783 -3513 -3810 -2331 -831 199 -204 -1187 -1813 -1146 409 1933 1951 878 154 421 809 2052 3025 1827
3801 1827 -199 -1887 -2648 -2228 -1478 -1011 -832 -894 -211 1548 3152 3131 1362 -626 -2029 -2547 -1384 -116
3819 -116 686 542 237 -74 476 877 203 -347 -1093 -1953 -1422 282 1030 1487 1670 1226 683 805 699 356
3839 356 8 -1117 -1922 -1630 -1058 -730 -432 -937 -1700 -1706 -1097 -75 1498 1938 2342 2825 3224 3057 2565 1670
3859 1670 -570 -2178 -3071 -3043 -2711 -1805 -1608 -1309 -768 -175 -141 978 653 217 503 1056 1823 2464 2688
3878 2688 2334 1808 955 -22 -322 -848 -1828 -2641 -2748 -3031 -2280 -1075 -762 -688 -498 -578 489 1712 2843
$$ packed form
3748H70k77p99J98J066K700O60m52j972k339j105j11Q60m56p18j444l69K120K444
3766H76J530mk330k136j019J697K002J668M18n76m78N87M90k28j394l074j542
3783c513k97J479J500J030m03r83o26O67J555J524J8j073p24K67L88J243R73j198
3801A827k026j688p61M20P50M67J79o2O83J759J604k1j769j988j403n18J163J268
3819a16Q02j44l05l11N50M01o74n50p46q60N31J704P48M57J83m44n43J22j06l43
3839C56l48j125q05K92N72L28K98n05p63oO09J022J573M40M04M83L99j67m92q95
3859A670k240j608q93K8L32R06J97K99N41N93L4J119l25m36K86N53P67O41K24
3878B688l54n26q53r77l00n26r80q13j07k83P51J205L13P4J90q0J067J223J131
$$ plain form
3897 2843 3554 3424 2775 2131 1657 1030 -234 -1628 -2951 -4034 -3580 -2803 -1507 -436 -257 -201 321 1092
3915 1092 1236 1711 1802 890 688 589 1033 1258 1078 233 -914 -1790 -2352 -1683 -1062 -810 -1011 -679 0 191
3935 191 1313 1683 824 283 -50 340 1101 1503 1521 974 -478 -1823 -1934 -1919 -2370 -2089 -1582 -865 -348 802
3955 802 2042 2770 3126 2313 1633 1156 469 -328 -260 -1032 -1604 -1716 -1848 -1579 -1920 -1441 -1498 -1298 -1170 -191
3975 -191 1410 2632 3218 3799 3757 2103 682 -383 -966 -931 -702 -1086 -1453 -2109 -2529 -2024 -1179 -1107 -1358
3994 -1358 -1328 -1333 -261 1704 3566 3786 3189 2371 2188 2151 2025 938 -581 -2681 -4499 -4098 -2507 -561
4012 -561 -71 -791 -2071 -2726 -1828 399 2609 3590 2695 1924 2424 2383 2737 2200 313 -2748 -4007 -3200
4030 -3200 -1273 13 -20 -1698 -2668 -2566 -470 2383 4014 2217 -274 -1952 -1854 533 3161 3988 2539
$$ packed form
3897B843P11j30o49o44m74o27j264j394j323j083M54P77J296J071J79N6N22P71
3915A092J44M75R1r12k02r9M44K25j80q45j147q76n62O69O21K52k01L32O79J91
3935A91J122L70q59n41l33L90P61M02J8n47j452j345j11J5m51K81N07P17N17J150
3955H02J240P28L56q13o80m77o87p97O8p72n72j12j32K69l41M79n7K00J28R79
3975a91J601J222N86N81m2j654j421j065n83L5K29l84l67o56m20N05Q45P2k51
3994a358L0nJ072J965J862K20n97q18j83l7j26j087j519k100j818M01J591J946
4012e61M90p20j280o55Q98K227K210R81q95p71N00m1L54n37j887l061j259Q07
4030c200J927J286l3j678r70J02K096K853J631j797k491j678R8K387K628Q27j449
$$ plain form
4047 2539 433 -1622 -2130 -991 -566 -1356 -2263 -2819 -1681 853 3235 3528 1597 -1330 -2612 -1345
4063 -1345 1145 3188 3309 1223 -1910 -2950 -2472 -894 439 -230 -1715 -2276 -1778 -6 1946 2821
4079 2821 2342 1571 1499 1939 2224 1932 -44 -2813 -4135 -3710 -1685 488 1587 335 -1424 -2276 -2461
4096 -2461 -759 1071 2365 2636 2487 2179 2304 2338 1123 -102 -846 -1739 -1371 -905 -742 -1373 -1981 -2320
4114 -2320 -2112 -691 14 769 1019 834 359 774 1585 2152 2617 2856 2233 1387 -28 -2291 -3697 -3554
4132 -3554 -3107 -1444 -30 490 -220 -170 -701 -150 520 1080 1427 1658 1455 1632 1730 744 -606 -1565 -1771
4151 -1771 -1382 -247 627 422 -787 -1735 -1927 -302 1256 2307 1994 624 -1202 -2106 -1232 386 1154
4168 1154 966 706 147 291 239 -4 -1087 -2280 -2826 -1293 1085 2615 3168 1819 -260 -1393 -1016
$$ packed form
4047B539k106k055n08J139M25p90r07n56J138K534K382K93j931k927j282J267
4063a345K490K043J21k086l133j040M78J578J333o69j485n61M98J772J952Q75
4079B821m79p71p2M40K85k92j976k769j322M25K025K173J099j252j759q52j85
4096b461J702J830J294K71j49l08J25L4j215j225p44q93L68M66J63o31o08l39
4114b320K08J421P05P55K50j85m75M15Q11N67M65K39o23q46j415k263j406J43
4132c554M47J663J414N20p10N0n31N51O70N60L47K31k03J77R8r86j350r59k06
4151a771L89J135Q74k05j209r48j92J625J558J051l13j370j826r04Q74J618P68
4168A154j88k60n59J44n2k43j083j193n46J533K378J530N53j349k079j133L77
$$ plain form
4185 -1016 305 1789 1791 48 -1320 -2360 -2090 -1410 -64 -377 -1207 -945 -120 1379 2204 2268 1299 429
4203 429 115 1058 2118 1857 87 -2092 -3322 -3316 -1795 369 1461 1112 -317 -1297 -1025 -397 3 217
4221 217 441 101 788 2128 2775 2137 1125 -797 -1377 -863 -54 702 218 -1075 -2815 -2650 -1690 -429
4239 -429 737 873 43 -254 -42 1194 2055 2320 1589 667 284 72 -262 -155 -1230 -2187 -2070 -1049 591
4258 591 1552 1657 672 -778 -1708 -2015 -869 361 372 262 307 51 767 1371 1244 939 -83 -821 -530
4277 -530 510 437 -18 -355 -1198 -1589 -715 -47 584 82 -810 -1145 -664 87 888 1490 999 31 -566 -651
4297 -651 -450 32 480 84 156 562 1268 1418 993 -628 -1563 -2179 -2437 -1589 -327 277 213 387 22 193
4317 193 861 1000 672 523 -65 -315 120 628 427 13 -219 -488 -507 -668 -344 -311 -560 -533 -503 -75 248
$$ packed form
4185a016J321J484Kj743j368j040K70O80J346l13q30K62Q25J499Q25O4r69q70
4203D29l14R43J060k61j770k179j230OJ521K164J092l49j429r80K72O28M00K14
4221B17K24l40O87J340O47o38j012j922n80N14Q09P56m84j293j740J65R60J261
4239d29J166J36q30k97K12J236Q61K65p31r22l83k12l34J07j075r57J17J021J640
4258E91R61J05r85j450r30l07J146J230J1j10M5k56P16O04j27l05j022p38K91
4277e30J040p3m55l37q43l91Q74O68O31n02q92l35M81P51Q01O02m91r68n97q5
4297f51K01M82M48l96P2M06P06J50m25j621r35o16k58Q48J262O04o4J74l65J71
4317A93O68J39l28j49n88k50M35N08k01m14k32k69j9j61L24L3k49K7L0M28L23
$$ plain form
4338 248 560 524 210 -871 -819 -479 -389 278 363 871 1174 867 305 -144 -130 -710 -587 -888 -541 -173 167
4359 167 719 932 355 -463 -1011 -954 -620 -371 246 18 26 -74 174 600 1215 783 446 -63 -515 -457 745
4380 745 708 465 172 -639 -1123 -633 -302 -613 -715 -1238 -1608 -824 866 1731 1810 1150 -4 -445 -292 540
4400 540 847 672 110 -473 -210 184 535 370 -658 -1600 -2139 -1688 -189 513 498 -431 -898 -423 273 1803
4420 1803 2207 1072 -159 -389 56 1201 1780 1550 119 -1299 -1806 -1127 -314 -595 -865 -1472 -1804 -892
4438 -892 748 1914 2068 744 -400 -711 -56 801 1597 1010 -97 -749 -522 296 903 150 -672 -1622
4456 -1622 -1671 -480 599 963 311 -842 -1379 -836 329 986 896 282 -433 -301 469 1534 1714 1052 -168
$$ packed form
4338B48L12l6l14j081N2L40R0O67Q5N08L03l07n62m49J4n80J23l01L47L68L40
4359A67N52K13n77q18n48N7L34K49O17k28Qj00K48M26O15m32l37n09m52N8J202
4380G45l7k43k93q11m84M90L31l11j02n23l70P84J690Q65P9o60j154m41J53Q32
4400E40L07j75n62n83K63L94L51j65j028r42n39M51J499P02j5r29m67M75O96J530
4420A803M04j135j231k30M45J145N79k30j431j418n07O79Q13k81k70o07l32R12
4438h92J640J166J54j324j144l11O55Q57P96n87j107o52K27Q18O07p53q22r50
4456a622m9J191J079L64o52j153n37N43J165O57r0o14p15J32P70J065J80o62j220
$$ [...]
8191C30
##END NTUPLES=NMR FID
##END=
