##TITLE=1H_CA-8417-13-1
 CDcl3, 8 sc, 
 11.2.2019
##JCAMPDX= 6.0         $$ Bruker NMR JCAMP-DX V2.0
##DATA TYPE= NMR FID
##DATA CLASS= NTUPLES
##ORIGIN= UXNMR, Bruker Analytische Messtechnik GmbH
##OWNER= root
$$ XWIN-NMR		Version 3.5
$$ Mon Feb 11 16:11:35 2019 Russian Standard Time (UT+4h)  she@DPX200
##.OBSERVE FREQUENCY= 200.1313
##.OBSERVE NUCLEUS= ^1H
##.DELAY= (6, 6)
##.ACQUISITION MODE= SIMULTANEOUS
##.ACQUISITION SCHEME= undefined
##.AVERAGES= 8
##.DIGITISER RES= 18
##SPECTROMETER/DATA SYSTEM= spect
##.PULSE SEQUENCE= zg30
##.SOLVENT NAME= DMSO
##.SHIFT REFERENCE= (INTERNAL, DMSO, 0, 15.7039)
##AUDIT TRAIL= $$ (NUMBER, WHEN, WHO, WHERE, WHAT)
$$ ##TITLE= Audit trail, XWIN-NMR		Version 3.5
$$ ##JCAMPDX= 5.01
$$ ##ORIGIN= Bruker BioSpin GmbH
$$ ##OWNER= she
$$ F:/spectra/data/she/nmr/H-F/1/audita.txt
$$ ##AUDIT TRAIL=  $$ (NUMBER, WHEN, WHO, WHERE, WHAT)
(   1,<2019-02-11 16:09:47.56 +0400>,<she>,<DPX200>,
      <created by zg, POWCHK disabled, PULCHK disabled
       configuration hash MD5:
       00 E9 B6 7A A2 85 ED C7 34 08 36 98 17 FE 4E 26
       data hash MD5: 16K
       21 02 8E 93 D2 D5 66 7A D3 13 ED C6 20 98 19 36>)
$$ ##END=
$$ 
$$ hash MD5
$$ 6C 3D AA B7 64 CE AE C9 12 E8 A9 77 19 4D 85 B5
##$RELAX= 
##$RELAX= 
##$RELAX= 
##$RELAX= 
##$RELAX= 
##$RELAX= 
$$ Bruker specific parameters
$$ --------------------------
##$DU= <F:/spectra>
##$EXPNO= 1
##$NAME= <H-F>
##$PROCNO= 1
##$TYPE= <nmr>
##$USER= <she>
##$AMP= (0..31)
100 100 100 100 100 100 100 100 100 100 100 100 100 100 100 100 100 100 
100 100 100 100 100 100 100 100 100 100 100 100 100 100 
##$AQSEQ= 0
##$AQ_mod= 1
##$AUNM= <au_zg>
##$AUTOPOS= <>
##$BF1= 200.13
##$BF2= 200.13
##$BF3= 200.13
##$BF4= 200.13
##$BF5= 200.13
##$BF6= 200.13
##$BF7= 200.13
##$BF8= 200.13
##$BYTORDA= 1
##$CFDGTYP= 0
##$CFRGTYP= 5
##$CHEMSTR= <none>
##$CNST= (0..31)
1 1 145 1 1 1 1 1 1 1 1 1 1 1 1 1 1 1 1 1 1 1 1 1 1 1 1 1 1 1 1 1 
##$CPDPRG= <>
##$CPDPRG1= <>
##$CPDPRG2= <>
##$CPDPRG3= <>
##$CPDPRG4= <mlev>
##$CPDPRG5= <mlev>
##$CPDPRG6= <mlev>
##$CPDPRG7= <mlev>
##$CPDPRG8= <mlev>
##$CPDPRGB= <>
##$CPDPRGT= <>
##$D= (0..31)
0 1.2 0 0 0 0 0 0 0 0 0 0.03 0 0 0 0 0 0 0 0 0 0 0 0 0 0 0 0 0 0 0 0 
##$DATE= 1549886987
##$DBL= (0..7)
120 120 120 120 120 120 120 120 
##$DBP= (0..7)
150 150 150 150 150 150 150 150 
##$DBP07= 0
##$DBPNAM0= <>
##$DBPNAM1= <>
##$DBPNAM2= <>
##$DBPNAM3= <>
##$DBPNAM4= <>
##$DBPNAM5= <>
##$DBPNAM6= <>
##$DBPNAM7= <>
##$DBPOAL= (0..7)
0.5 0.5 0.5 0.5 0.5 0.5 0.5 0.5 
##$DBPOFFS= (0..7)
0 0 0 0 0 0 0 0 
##$DE= 6
##$DECBNUC= <off>
##$DECIM= 32
##$DECNUC= <off>
##$DECSTAT= 4
##$DIGMOD= 1
##$DIGTYP= 9
##$DL= (0..7)
0 120 120 120 120 120 120 120 
##$DP= (0..7)
150 150 150 150 150 150 150 150 
##$DP07= 0
##$DPNAME0= <>
##$DPNAME1= <>
##$DPNAME2= <>
##$DPNAME3= <>
##$DPNAME4= <>
##$DPNAME5= <>
##$DPNAME6= <>
##$DPNAME7= <>
##$DPOAL= (0..7)
0.5 0.5 0.5 0.5 0.5 0.5 0.5 0.5 
##$DPOFFS= (0..7)
0 0 0 0 0 0 0 0 
##$DQDMODE= 0
##$DR= 18
##$DS= 0
##$DSLIST= <SSSSSSSSSSSSSSS>
##$DSPFIRM= 0
$$ [...]
##$SUBNAM2= <"">
##$SUBNAM3= <"">
##$SUBNAM4= <"">
##$SUBNAM5= <"">
##$SUBNAM6= <"">
##$SUBNAM7= <"">
##$SUBNAM8= <"">
##$SUBNAM9= <"">
##$SW= 20.0189088683792
##$SWIBOX= (0..15)
0 0 2 0 0 0 0 0 0 0 0 0 0 0 0 0 
##$SW_h= 4006.41025641026
##$TD= 16384
##$TD0= 1
##$TE= 0
##$TE2= 300
##$TE3= 300
##$TEG= 300
##$TL= (0..7)
0 120 120 120 120 120 120 120 
##$TP= (0..7)
150 150 150 150 150 150 150 150 
##$TP07= 0
##$TPNAME0= <>
##$TPNAME1= <>
##$TPNAME2= <>
##$TPNAME3= <>
##$TPNAME4= <>
##$TPNAME5= <>
##$TPNAME6= <>
##$TPNAME7= <>
##$TPOAL= (0..7)
0.5 0.5 0.5 0.5 0.5 0.5 0.5 0.5 
##$TPOFFS= (0..7)
0 0 0 0 0 0 0 0 
##$TUNHIN= 0
##$TUNHOUT= 0
##$TUNXOUT= 0
##$USERA1= <user>
##$USERA2= <user>
##$USERA3= <user>
##$USERA4= <user>
##$USERA5= <user>
##$V9= 5
##$VALIST= <valist>
##$VCLIST= <CCCCCCCCCCCCCCC>
##$VD= 0
##$VDLIST= <DDDDDDDDDDDDDDD>
##$VPLIST= <PPPPPPPPPPPPPPP>
##$VTLIST= <TTTTTTTTTTTTTTT>
##$WBST= 1024
##$WBSW= 4
##$XGAIN= (0..3)
0 0 0 0 
##$XL= 0
##$YL= 0
##$YMAX_a= 588840
##$YMIN_a= -473807
##$ZGOPTNS= <>
##$ZL1= 120
##$ZL2= 120
##$ZL3= 120
##$ZL4= 120
##$ABSF1= 10
##$ABSF2= 0
##$ABSG= 5
##$ABSL= 3
##$ALPHA= 0
##$AQORDER= 0
##$ASSFAC= 0
##$ASSFACI= 0
##$ASSFACX= 0
##$ASSWID= 0
##$AUNMP= <proc_1d>
##$AZFE= 0.1
##$AZFW= 0.1
##$BCFW= 1
##$BC_mod= 2
##$BYTORDP= 1
##$COROFFS= 0
##$CY= 11.3945322036743
##$DATMOD= 1
##$DC= 2
##$DFILT= <>
##$DTYPP= 0
##$F1P= 18.9103706918063
##$F2P= -1.10871071338519
##$FCOR= 0.5
##$FTSIZE= 0
##$FT_mod= 4
##$GAMMA= 1
##$GB= 0.15
##$INTBC= 1
##$INTSCL= 1
##$ISEN= 128
##$LB= 0.24
##$LEV0= 0
##$LPBIN= 0
##$MAXI= 10000
##$MC2= 0
##$MEAN= 0
##$ME_mod= 0
##$MI= 1.114404
##$NCOEF= 0
##$NC_proc= 0
##$NLEV= 6
##$NOISF1= 3.799351
##$NOISF2= 2.8
##$NSP= 1
##$NTH_PI= 0
##$NZP= 0
##$OFFSET= 15.70392
##$PC= 1
##$PHC0= -8677.501
##$PHC1= 8.600181
##$PH_mod= 1
##$PKNL= yes
##$PPARMOD= 0
##$PSCAL= 0
##$PSIGN= 0
##$REVERSE= no
##$SF= 200.130013532006
##$SI= 16384
##$SIGF1= 3
##$SIGF2= 2
##$SINO= 400
##$SIOLD= 16384
##$SREGLST= <1H.CDCl3>
##$SSB= 0
##$STSI= 0
##$STSR= 0
##$SW_p= 3612.71676300578
##$SYMM= 0
##$S_DEV= 0
##$TDeff= 0
##$TDoff= 0
##$TI= <>
##$TILT= no
##$TM1= 0
##$TM2= 0
##$TOPLEV= 0
##$USERP1= <user>
##$USERP2= <user>
##$USERP3= <user>
##$USERP4= <user>
##$USERP5= <user>
##$WDW= 1
##$XDIM= 8192
##$YMAX_p= 0
##$YMIN_p= 0
$$ End of Bruker specific parameters
$$ ---------------------------------
##NTUPLES= NMR FID
##VAR_NAME=  TIME,          FID/REAL,        FID/IMAG
##SYMBOL=    X,             R,               I
##VAR_TYPE=  INDEPENDENT,   DEPENDENT,       DEPENDENT
##VAR_FORM=  AFFN,          ASDF,            ASDF
##VAR_DIM=   8192,          8192,            8192
##UNITS=     SECONDS,       ARBITRARY UNITS, ARBITRARY UNITS
##FACTOR=    0.0002496,     1,               1
##FIRST=     0,             0,               0
##LAST=      2.0444736,     0,               0
##MIN=       0,             -473807,         0
##MAX=       2.0444736,     588840,          0
$$ Real data points
##PAGE= N=1
##DATA TABLE= (X++(R..R)), XYDATA
$$ [...]
$$ plain form
2468 -698 4350 4748 1907 -1046 -2007 289 2385 2452 324 -2605 -5106 -3550 1001 2495 609 -1937
2484 -1937 -2517 366 5754 9709 8615 2884 -5327 -9256 -6080 -824 2018 1977 -1297 -5535 -5923 -2164
2500 -2164 1255 1980 998 -10 2576 6721 8902 7893 2915 -5236 -10046 -7151 -972 3169 4650
2515 4650 2326 -2100 -3717 -1842 1812 3769 1220 -4873 -7729 -6952 -3377 1546 4736 3769 2213
2530 2213 3475 6871 9608 7906 1224 -6364 -9997 -9508 -3139 3672 3964 -492 -5481 -7025 -4680
2545 -4680 269 3920 4344 2596 950 980 3942 4265 1422 -2377 -5027 -5210 -1592 3990 6449 4829
2561 4829 411 -2931 -2461 633 2645 2010 -1704 -7666 -11329 -7933 -2103 3438 6744 7095 5684 5131
2577 5131 4348 2734 99 -4612 -8352 -6570 -1682 2595 5593 4816 877 -2416 -3262 -1447 1324 2910
$$ packed form
2468f98N048L98k841k953r61K296K096O7k128k929k501J556M551J494j886k546
2484a937n80K883N388L955j094n731q211l929L176N256K842m1l274m238l88L759
2500b164L419P25r82j008K586M145K181j009m978q151m810K895O179M141J481
2515D650k324m426j617J875L654J957k549o093k856P77L575M923L190r67j556
2530B213J262L396K737j702o682p588l633M89O369O811K92m456m989j544K345
2545d680M949L651M24j748j646L0K962L23k843l799k650j83L618N582K459j620
2561D829m418l342M70L094K012o35l714n962l663L396N830N541L306L51j411n53
2577E131p83j614k635m711l740J782M888M277K998p77l939l293q46J815K771J586
$$ plain form
2593 2910 1271 -907 -2452 -4237 -3762 -1846 -947 -1307 -151 1107 2606 4552 5396 4347 3117 1394
2609 1394 162 941 216 -2715 -5471 -7210 -7640 -4682 -111 3453 5331 5283 3015 1246 -1020 -3493
2625 -3493 -4478 -3840 -2090 526 3870 4895 5079 4389 2965 1629 560 -962 -2495 -2556 -3516 -4982 -4582
2642 -4582 -4236 -3714 -1613 817 2563 3619 3807 3204 3255 3429 2610 2357 2069 534 -1422 -2505 -4519
2659 -4519 -4804 -3371 -1284 699 2280 2496 1921 1428 -162 -2091 -2777 -3320 -2911 -516 2235 3335 4052
2676 4052 3479 1796 1075 1054 270 -797 -1649 -3621 -4126 -3567 -2562 -1208 954 2512 2889 3444 2855 1617
2694 1617 1131 322 -1136 -1869 -2066 -2244 -1202 -1380 -2049 -2052 -2033 -1101 1622 4834 5520 4534 3096 1020 -233
2713 -233 -944 -2122 -2145 -2386 -2493 -1539 17 39 -970 -1127 -1868 -2510 -1072 475 1695 1933 1502 1236 1596
$$ packed form
2593B910j639k178j545j785M75J916Q99l60J156J258J499J946Q44j049j230j723
2609A394j232P79p25k931k756j739m30K958M571L564J878m8k268j769k266k473
2625c493r85O38J750K616L344J025J84o90j424j336j069j522j533o1r60j466M00
2642d582L46N22K101K430J746J056J88o03N1J74q19k53k88j535j956j083k014
2659d519k85J433K087J983J581K16n75m93j590j929o86n43M09K395K751J100P17
2676D052n73j683p21k1p84j067q52j972n05N59J005J354K162J558L77N55n89j238
2694A617m86q09j458p33j97j78J042j78o69lJ9R32K723L212O86r86j438k076j253
2713b33p11j178k3k41j07R54J556K2j009j57p41o42J438J547J220K38m31k66L60
$$ plain form
2732 1596 2502 2581 4357 4141 1827 -747 -1785 -2791 -3490 -3861 -4786 -4900 -4367 -3166 -655 1488 1115
2749 1115 766 2471 3705 4755 6007 5453 2636 27 -1602 -2225 -1560 -1956 -2172 -1422 -1320 -1633 -1112
2766 -1112 -479 -1842 -2939 -2750 -1577 -225 1603 2812 3752 3124 1910 2452 3721 2879 1226 719 -1083
2783 -1083 -2891 -2868 -1935 -2170 -2864 -3411 -2944 -1021 170 273 1146 926 181 2157 4072 3685 1885 -23
2801 -23 -1512 -1666 -1080 -34 941 175 -586 -215 1483 1392 -319 -1230 -2820 -4106 -2813 -317 1627 2234
2819 2234 1420 741 1370 1606 1618 1787 -271 -3858 -4424 -2215 347 2272 3018 1707 44 -82 1044
2836 1044 3409 2598 -798 -3647 -4290 -3090 -1185 1113 534 -2439 -3928 -2274 1514 4202 4558 2898
2852 2898 1432 98 710 3325 4199 31 -4258 -6137 -5470 -2566 1960 3776 2543 -470 -2567 -913
$$ packed form
2732A596R06P9J776k16k314k574j038j006o99l71r25j14N33J201K511K143l73
2749A115l49J705J234J050J252n54k817k609j629o23O65l96k16P50J02l13N21
2766a112O33j363j097J89J173J352J828J209R40o28j214N42J269q42j653n07j802
2783a083j808K3R33k35o94n47M67J923J191J03Q73k20p45J976J915l87j800j908
2801b3j489j54N86J046R75p66p61L71J698r1j711r11j590j286J293K496J944O07
2819B234q14o79O29K36J2J69k058l587n66K209K562J925P46j311j663j26J126
2836A044K365q11l396k849o43J200J905K298n79k973j489J654L788K688L56j660
2852B898j466j334O12K615Q74m168m289j879O67K904M526J816j233l013k097J654
$$ plain form
2868 -913 1553 1790 56 -2307 -4735 -4852 2 4768 5923 3363 572 -795 665 2618 3335 1142
2884 1142 -3659 -8066 -6450 -1272 2080 3297 2084 -861 -2730 -775 3306 4962 2917 -1437 -3401
2899 -3401 -2869 -1749 669 2406 392 -3545 -3524 414 4282 6281 5454 2308 -1426 -3583 -2142 1337
2915 1337 865 -3231 -5819 -5781 -3456 600 4879 5576 2178 -1053 -1012 1565 3048 1505 -524 -2827
2931 -2827 -4257 -2866 2949 5808 4368 1512 -304 -1152 -955 -314 -675 -2847 -6758 -7506 -4152 -164
2947 -164 1299 2433 2983 1937 2340 5115 7750 7422 3506 -1410 -3544 -3957 -3934 -2253 -1517 -3757 -5765
2964 -5765 -3715 -72 1938 2186 1769 628 227 739 2392 3720 1364 -1887 -1855 73 1488 3315
2980 3315 4444 3049 -168 -2416 -2362 -1849 -2422 -3989 -4123 -4150 -3707 -1645 2070 4169 3467 3564 4379 4585
$$ packed form
2868i13K466K37j734k363k428j17M854M766J155k560k791j367J460J953P17k193
2884A142m801m407J616N178L352J217j213k945j869J955M081J656k045m354j964
2899c401N32J120K418J737k014l937K1L938L868J999q27l146l734k157J441L479
2915A337m72m096k588L8K325M056M279O97l398l231M1K577J483j543k029k303
2931b827j430J391N815K859j440k856j816q48J97O41l61k172l911p48L354L988
2947a64J463J134N50j046M03K775K635l28l916m916k134m13K3J681P36k240k008
2964e765K050L643K010K48m17j141m01N12J653J328k356l251L2J928J415J827
2980C315J129j395l217k248N4N13n73j567j34k7M43K062L715K099p02R7Q15K06
$$ plain form
2998 4585 3863 2484 368 -2307 -5137 -5802 -2775 -297 -332 -333 396 39 611 2053 2916 1755 262 -1133
3016 -1133 -770 -766 -1566 -1593 -1016 -1509 -1518 663 2522 2483 1940 1233 785 526 30 -1 225 -1019 -2950 -2305 -671
3037 -671 2 1299 2594 2143 691 -20 -221 -292 -1434 -2965 -3401 -2699 -1836 -25 2914 3897 3680 3314
3055 3314 3531 2969 1855 573 -1795 -2874 -3930 -3991 -2916 -1627 -1588 -879 -346 -322 837 1750 2714 3211
3073 3211 2441 1389 733 639 -250 -608 -394 -499 -1321 -516 210 484 653 140 -612 -567 -531 -881 -624 -1341
3093 -1341 -2896 -2032 -933 618 2409 3602 3728 3203 1910 -159 -1195 -1868 -2431 -2018 -866 -314 -429
3110 -429 362 364 316 262 166 426 846 689 -266 -960 -2360 -3499 -2755 -938 658 2090 3002 2864 2183 1479
3130 1479 634 734 1420 907 933 130 -2107 -3878 -4627 -4060 -3116 -1508 200 1611 2105 2462 1965 1222
$$ packed form
2998D585p22j379k116k675k830o65L027K478l5jP29l57N72J442Q63j161j493j395
3016a133L63Mq00k7N77m93rK181J859l9n43p07m48k59m96l1K26j244j931O45J634
3037f71O73J297J295m51j452p11k01p1j142j531m36P02Q63J811K939R83k17l66
3055C314K17n62j114j282k368j079j056o1J075J289L9P09N33K4J159R13R64M97
3073C211p70j052o56r4q89l58K14j05q22Q05P26K74J69n13p52M5L6l50K57p17
3093a341j555Q64J099J551J791J193J26n25j293k069j036o73n63M13J152N52j15
3110d29P91Km8n4r6K60M20j57r55o94j400j139P44J817J596J432R12j38o81p04
3130A479q45J00O86n13K6q03k237j771p49N67R44J608J708J411M94L57m97p43
$$ plain form
3148 1222 209 -642 218 1930 2399 2844 1360 -251 -1765 -2068 -1068 453 1471 184 -1486 -3235
3164 -3235 -3949 -3840 -1945 -360 632 1344 2612 3109 3971 3387 1469 181 -1254 -969 1181 1816 866
3181 866 -1754 -3983 -5181 -3258 -69 2098 2911 1018 -1536 -2016 -709 831 1412 1849 838 174
3197 174 828 1765 1643 513 -1505 -2840 -1653 725 2386 3151 1239 -2113 -4030 -3607 -1332 1310
3213 1310 2764 1244 -506 -1630 -856 1214 2609 1337 -384 -1280 -1563 -327 989 1139 -438 -1206
3229 -1206 -813 1660 4020 3855 1262 -1341 -4113 -4165 -1727 1206 2035 1291 -420 -1300 -1013 -460 -276
3246 -276 57 -508 -1466 -316 1942 2882 2763 2003 260 -307 400 1014 1026 -440 -2883 -3399 -2542 -1226
3264 -1226 -94 977 260 -1510 -1699 -845 47 636 631 1018 2123 2987 3186 2687 986 -1356 -2261 -1076
$$ packed form
3148A222j013q51Q60J712M69M45j484j611j514l03J000J521J018j287j670j749
3164c235p14J09J895J585R92P12J268M97Q62n84j918j288j435K85K150O35r50
3181H66k620k229j198J923L189K167Q13j893k554m80J307J540N81M37j011o64
3197A74O54R37j22j130k018j335J187K378J661P65j912l352j917M23K275K642
3213A310J454j520j750j124P74K070J395j272j721q96k83J236J316J50j577p68
3229a206L93K473K360j65k593k603k772n2K438K933Q29p44j711q80K87N53J84
3246b76L33n65r58J150K258R40j19p60j743n67P07O14J2j466k443n16Q57J316
3264a226J132J071p17j770j89Q54Q92N89nL87J105Q64J99m99j701k342r05J185
$$ plain form
3282 -1076 -332 -163 62 -1252 -1605 -1370 -891 -52 -207 -1619 -2776 -1845 -353 1238 3079 3495 2057
3299 2057 1892 2506 2710 2233 62 -2636 -3999 -3965 -2096 1024 1946 216 -1866 -2297 -1606 5 1736
3316 1736 1424 -552 -1924 -1103 1466 3713 3503 1307 -588 -1696 -1304 1237 2930 1330 -1403 -3270
3332 -3270 -2619 -654 1133 1332 15 -3016 -4787 -2757 1227 3598 3889 2851 453 -790 245 2123
3348 2123 2131 -640 -3618 -4605 -2448 338 2913 3669 1485 -1842 -2382 221 2377 2616 1028 -1863 -3146
3365 -3146 -3038 -853 2172 2363 -63 -1801 -1736 -320 1116 3470 2361 -544 -2338 -1539 1096 2951
3381 2951 2521 1128 -807 -2914 -2440 1087 3313 1901 -350 -2587 -3339 -2902 -1406 -226 -347 -1605
3397 -1605 -1656 1299 3632 4637 3918 2941 859 -826 275 1554 1247 -859 -3189 -4462 -4738 -3640
$$ packed form
3282a076P44J69K25j314l53K35M79Q39j55j412j157R31J492J591J841M16j438
3299B057j65O14K04m77k171k698j363L4J869L120R22j730k082m31O91J611J731
3316A736l12j976j372Q21K569K247k10k196j895j108L92K541J693j600k733j867
3332c270O51J965J787J99j317l031j771K030L984K371K91j038k398j243J035J878
3348B123Qk771k978r87K157K786K575P56k184l327n40K603K156K39j588k891j283
3365c146J08K185L025J91k426j738O5J416J436K354j109k905j794P99K635J855
3381B951m30j393j935k107M74L527K226j412k251k237p52M37J496J180j21j258
3397a605n1K955K333J005p19r77k082j685J101J279l07k106k330j273k76J098
$$ plain form
3413 -3640 -1840 120 186 -1027 -17 1182 1830 2646 2864 1942 676 -71 777 2306 1882 240 -806
3430 -806 -828 -1617 -861 697 94 -2558 -4292 -4272 -3381 -1978 -108 1952 2963 2326 2641 3788 3504 2030
3448 2030 1758 821 -664 -1258 -1304 -1181 -2064 -2996 -3711 -2648 -1784 -977 914 2437 1969 1088 1301 1959 1829
3467 1829 1792 1476 -130 -1318 -2278 -1765 -479 -329 -22 877 1052 435 58 -48 -843 -2023 -2049 -1042 411
3486 411 1787 2805 3449 2487 33 -1390 -1617 -1882 -1954 -1370 -1141 -1129 -1397 -502 456 1639 1619 1906 2398
3505 2398 1798 1392 1780 1578 30 -1022 -1665 -1897 -2076 -2103 -2951 -3226 -3493 -3111 -695 2298 4350 5117
3523 5117 4743 2971 820 -129 -516 -178 -32 -219 -284 -161 -264 -623 -796 -2245 -3917 -3720 -2778 -1400
3541 -1400 736 1700 1589 1400 1574 2758 4279 4456 2987 976 -1017 -2574 -2731 -1071 -864 -1121 -2245
$$ packed form
3413c640J800J960O6j213J010J199O48Q16K18r22j266p47Q48J529m24j642j046
3430h06k2p89P56J558o03k652j734K0Q91J403J870K060J011o37L15J147k84j474
3448B030k72r37j485n94m6J23q83r32p15J063Q64Q07J891J523m68q81K13O58j30
3467A829l7l16j606j188r60N13J286J50L07Q99J75o17l77j06p95j180k6J007J453
3486D11J376J018O44r62k454j423k27k65p2N84K29J2k68Q95R58J183k0K87M92
3505B398o00m06L88k02j548j052o43k32j79k7q48k75k67L82K416K993K052P67
3523E117l74j772k151r49l87L38J46j87o5J23j03l59j73j449j672J97R42J378
3541a400K136R64j11j89J74J184J521J77j469k011j993j557j57J660K07k57j124
$$ plain form
3558 -2245 -2475 -2836 -1724 -693 -2 89 -37 911 3268 4844 4658 3507 906 -2478 -3365 -2052 -661
3575 -661 -519 -447 -1448 -1473 -586 658 1590 1160 -621 -1960 -1077 178 1350 2460 1772 490 -784 -887
3593 -887 112 646 -126 -1764 -2368 -2436 -1089 1209 2382 2072 775 117 24 734 1419 1161 -70 -1534
3611 -1534 -1819 -885 721 163 -967 -2014 -3030 -2926 -1109 898 2195 1833 1530 2000 2573 2240 1853
3628 1853 1400 -138 -1629 -1651 -689 -951 -1090 -1937 -2686 -2378 -1481 -623 216 34 -151 322 1867 2954 3140
3647 3140 3095 1640 674 -195 -172 47 -514 -1922 -2029 -1538 -842 -860 -670 -1151 -2256 -2056 -436 1526 2518
3666 2518 2141 1224 1328 922 1186 1832 1283 -272 -1091 -902 -743 -386 -411 -1318 -2182 -2139 -1653 -144 1098
3685 1098 620 -380 -426 263 1297 3006 3097 924 -705 -2362 -1892 -854 -243 -252 -318 -436 -239 1109 2212
$$ packed form
3558b245k30l61J112J031O91R1j26R48K357J576j86j151k601l384q87J313J391
3575f61J42P2j001k5Q87J244R32m30j781j339Q83J255J172J110o88j282j274j03
3593h87R99N34p72j638o04o8J347K298J173l10j297o58r3P10O85k58j231j464
3611a534k85R34J606n58j130j047j016J04J817K007J297l62l03M70N73l33l87
3628A853m53j538j491k2R62k62j39q47p49L08Q97Q58Q39j82j85M73J545J087J86
3647C140m5j455r66q69K3K19n61j408j07M91O96j8J90m81j105K00J620J962R92
3666B518l77r17J04m06K64O46n49j555q19J89J59L57k5r07q64M3M86J509J242
3685A098m78j000m6O89J034J709R1k173j629j657M70J038O11ro6j18J97J348J103
$$ plain form
3704 2212 1537 -289 -1325 -1594 -272 1420 1740 1086 -312 -1828 -2119 -611 334 158 -765 -1235 -1272 -44
3722 -44 2120 2950 2522 1160 -380 -513 408 779 557 -111 -1435 -1991 -6 1255 1455 -539 -2734 -4150
3740 -4150 -3983 -1491 681 2375 1962 1321 1669 2442 3305 3107 2023 -467 -2374 -1938 -1206 -120 -182 -1824
3758 -1824 -2514 -2414 -1835 -102 934 164 -776 -703 206 2206 3765 3977 2234 350 -1201 -1726 -403
3775 -403 86 -500 -720 -1010 -749 411 945 281 -1402 -2832 -3053 -1774 817 1856 2295 1993 808 984
3793 984 1715 1881 1162 -126 -1979 -2734 -2178 -1019 -134 806 85 -409 63 664 923 689 -29 -752 -545
3812 -545 393 899 1425 1093 -847 -2094 -2553 -1668 -597 577 729 913 1540 1361 1877 1714 828 -462
3830 -462 -1452 -1528 -1059 99 165 -106 -262 -308 -756 -321 -588 -1284 -1415 -1087 -899 2 1493 2365 2693 2435
$$ packed form
3704B212o75j826j036k69J322J692L20o54j398j516k91J508R45j76r23m70l7J228
3722d4K164Q30m28j362j540j33R21L71k22o68j324n56J985J261K00j994k195j416
3740d150J67K492K172J694m13o41L48P73Q63j98j084k490j907M36P32J086o2j642
3758a824o90J00N79J733J036p70r40P3R09K000J559K12j743j884j551n25J323
3775d03M89n86k20k90K61J160N34o64j683j430k21J279K591J039M39l02j185J76
3793I84P31J66p19j288j853p55N56J159Q85R40p21m94M72O01K59k34p18p23K07
3812e45R38N06N26l32j940j247m59Q85J071J174J52J84O27j79N16j63q86j290
3830d62r90p6M69J158O6k71j56m6m48M35k67o96j31L28J88R01J491Q72L28k58
$$ plain form
3850 2435 1996 1683 1362 425 -192 -900 -1825 -1882 -1647 -1513 -1586 -2050 -2067 -1794 -1029 16 1115 2263 2301 2195
3870 2195 2843 2788 2042 1181 251 -893 -1592 -1816 -1255 -1206 -1354 -1585 -1462 -891 -1227 -930 -393 -487 -596 575
3890 575 1458 2127 2982 2452 2125 1493 210 40 152 -795 -2015 -2147 -1939 -2030 -1440 -630 -610 -783 -905 14
3910 14 1298 2160 2328 2595 2156 726 429 770 304 -1310 -1727 -2174 -2313 -1220 -759 569 992 396 -298
3929 -298 213 618 484 880 584 350 -48 405 870 624 -125 -940 -1271 -1678 -1963 -1232 224 208 -23 403
3949 403 726 884 920 1241 1174 1079 685 767 1016 254 -434 -1032 -1203 -2400 -2638 -2558 -2106 -1707 -514 418 1614
3970 1614 2029 2351 2848 3407 2031 1125 340 -736 -1062 -649 128 -459 -1450 -2070 -2938 -2825 -2235 -1400 136
3989 136 509 494 1515 2571 2578 3138 2715 1205 -27 -97 444 915 208 -1135 -2215 -2645 -2609 -1488 -176
$$ packed form
3850B435m39l13l21r37o17p08r25n7K35J34p3m64j7K73P65J045J099J148L8j06
3870B195O48n5p46q61r30j144o99k24N61M9j48k31J23N71l36K97N37r4j09J171
3890E75Q83O69Q55n30l27o32j283j70J12r47j220j32K08r1N90Q10K0j73j22R19
3910A4J284Q62J68K67m39j430k97L41m66j614m17m47j39J093M61J328M23n96o94
3929b98N11M05j34L96k96k34l98M53M65k46p49q15l31m07k85P31J456j6k31M26
3949D03L23J58L6L21o7r5l94Q2K49p62o88n98j71j197k38Q0M52L99J193R32J196
3970A614M15L22M97N59j376r06p85j076l26M13P77n87r91o20q68J13N90Q35J536
3989A36L73j5J021J056PN60m23j510j232p0N41M71p07j343j080m30L6J121J312
$$ plain form
4008 -176 -658 -2472 -2642 -1881 -34 2672 4434 4554 3060 1076 413 659 812 -15 -1185 -1873 -2542 -1723
4026 -1723 -106 335 -869 -2131 -2780 -1587 312 2145 3044 2323 66 -637 456 1799 2558 1723 79
4043 79 -2692 -3726 -2717 -592 1271 765 -37 -110 -22 357 1402 1399 -731 -1942 -824 822 2615 2913
4061 2913 1433 -676 -2761 -3745 -2076 256 1025 243 -125 -962 -584 1082 2298 2241 1031 41 -131
4078 -131 778 685 156 -25 -1443 -2591 -1773 -317 115 -591 -1654 -2242 -2138 -575 1567 3755 4036 2854
4096 2854 1996 1155 339 -662 -622 -753 -862 -975 -636 -522 -1212 -2123 -2171 -1429 -1117 -466 740 1741 1139
4115 1139 1031 957 1577 1207 1039 1245 904 545 -666 -785 -1509 -2076 -1712 -535 275 87 -761 -1356 -1663
4134 -1663 -1215 287 1612 2689 2501 1739 1836 1223 -32 -724 -1294 -2002 -1983 -661 308 675 143 -956
$$ packed form
4008a76m82j814j70P61J847K706J762J20j494j984o63K46J53q27j170o88o69Q19
4026a723J617M41j204j262o49J193J899J833Q99p21k257p03J093J343P59q35j644
4043G9k771j034J009K125J863n06q02p3Q8L79J045lk130j211J118J646J793K98
4061B913j480k109k085r84J669K332P69p82l68q37L78J666J216n7j210r90j72
4078a31R09r3n29j81j418j148Q18J456M32p06j063n88J04J563K142K188K81j182
4096B854q58q41q16j001M0j31j09j13L39J14o90r11m8P42L12O51J206J001o02
4115A139j08p4O20l70j68K06l41l59j211j19p24n67L64J177Q10j88q48n95l07
4134a663M48J502J325J077j88p62R7o13j255o92n70p08J9J322R69L67n32j099
$$ plain form
4152 -956 -1272 -753 331 1921 2513 1467 -595 -1627 -996 -294 817 971 644 -783 -1258 -1100 73
4169 73 412 39 55 87 263 1463 1766 748 -807 -1990 -2202 -390 1741 2383 1903 301 -1995 -2422
4187 -2422 -1728 -656 -53 -104 -622 -454 277 1393 1936 1966 1243 380 360 1134 1153 544 -909 -2470 -3093 -2050
4207 -2050 -769 512 548 -585 -1617 -1455 -384 916 2306 2279 1489 681 462 463 614 -37 -875 -1045 -820
4226 -820 -5 895 957 -54 -1617 -2265 -2036 -1024 -64 505 586 249 -62 632 1605 1928 1861 997 -147 -424
4246 -424 -188 -181 -299 -730 -1477 -1450 -455 -63 434 164 -515 -1231 -1037 29 1320 1789 1028 339 -369 -707
4266 -707 -806 262 276 76 108 574 703 1024 700 -60 -721 -1442 -1292 -874 25 78 -165 -337 -258 -86 376
4287 376 1206 683 -22 -455 -514 -92 271 717 626 531 216 -152 3 -5 -492 -704 -941 -722 -137 256 411 646
$$ packed form
4152i56l16N19J084J590N92j046k062j032O31P02J111J54l27j427m75J58J173
4169G3L39l73J6L2J76J200L03j018j555j183k12J812K131O42m80j602k296m27
4187b422O94J072O03n1n18J68P31J116N43L0p23q63k0P74J9o09j453j561o23J043
4207b050J281J281L6j133j032J62J071J300J390k7p90q08k19JJ51o51q38j70K25
4226h20Q15R00O2j011j563o48K29J012R60N69Q1l37l11O94R73L23o7q64j144k77
4246d24K36Pj18m31p47K7R95L92M97k70o79p16J94J066J291M69p61o89p08l38
4266g07r9J068J4k00L2M66J29L21l24p60o61p21J50M18Q99N3k43j72P9J72M62
4287C76Q30n23p05m33n9M22L63M46r1r5l15l68J55qm87k12k37K19N85L93J55K35
$$ plain form
4309 646 -178 -893 -943 -608 -52 619 940 967 899 754 454 296 -106 -781 -725 -728 -1040 -579 252 -30 7 155
4331 155 -77 -85 237 144 38 -286 -329 -239 245 485 546 981 366 65 -334 -466 -306 -64 281 467 541 136
4353 136 -96 -118 -333 -674 -740 -760 -628 -214 554 848 782 436 -121 -329 -306 159 392 403 320 -126 184 60
4375 60 494 986 307 -668 -1009 -973 -1073 -24 269 -578 -686 -689 -260 752 1086 343 18 -680 -352 930
4395 930 1549 1766 1059 188 -904 -1111 -603 -388 -750 -1063 -1369 -998 -136 553 989 216 -391 -934 -352 381
4415 381 1038 1328 828 -129 -579 184 923 1040 435 -707 -1546 -1097 -1028 -330 180 -317 -1155 -1394 -312 767
4435 767 743 862 237 -339 278 803 2134 1801 809 -439 -928 -1164 -515 291 85 -627 -1143 -455 276 704
4455 704 426 -29 -804 -922 -502 316 859 238 195 -131 -300 500 1154 973 439 -549 -957 -171 454 236
$$ packed form
4309F46q24p15n0L35N56O71L21K7o8j45l00j58m02o75N6ll12M61Q31k82L7J48
4331A55k32qL22r3j06l24m3R0M84K40O1M35o15l01l99j32J60K42L45J86P4m05
4353A36k32k2k15l41o6k0J32M14P68K94o6l46n57k08K3M65K33J1q3m46L10j24
4375F0M34M92o79r75l41L6j00J049K93q47j08lM29J012L34p43l25o98L28J282
4395I30O19K17p07q71j092k07N08K15l62l13l06L71Q62O89M36p73o07n43N82P33
4415C81O57K90n00r57m50P63P39J17o05j142q39M49O9O98N10m97q38k39J082J079
4435G67k4J19o25n76O17N25J331l33r92j248m89k36O49Q06k06p12n16O88P31M28
4455G04k78m55p75j18M20Q18N43o21m3l26j69Q00O54j81n34r88m08P86O25k18
$$ plain form
4475 236 51 -505 -1380 -1144 -219 488 122 -214 -220 -12 321 683 1039 714 -430 -872 -341 -114 209 542
4495 542 343 -184 -104 174 926 505 -157 -736 -848 -849 -394 29 382 -418 -595 -53 572 694 804 282 61
4516 61 49 -149 532 985 467 -287 -807 -438 -390 1 416 307 -312 -472 -82 415 -9 -504 -651 -898 -903 -457
4538 -457 321 763 494 570 1069 900 842 370 46 -515 -1131 -1137 -44 -105 -662 -432 -580 -480 166 397 754
4559 754 42 -510 -225 604 536 291 559 499 -295 -454 328 585 352 -153 -330 149 181 191 87 -486 -1387
4580 -1387 -1854 -839 -419 172 422 604 329 426 826 1110 667 -211 -698 -587 -399 -39 691 651 -277 -663
4600 -663 -471 48 219 10 -262 -492 -704 -538 433 564 195 -397 -338 -337 144 658 1364 719 -75 -274 207
4621 207 582 613 146 -439 -1161 -1298 -620 12 339 570 -72 10 -28 224 333 81 -236 -828 -478 198 909
$$ packed form
4475B36j85n56q75K36R25P07l66l36oK08L33L62L56l25j144m42N31K27L23L33
4495E42j99n27Q0K78P52m21o62n79j12jM55M23L53q00j77N42O25J22J10n22k21
4516F1j2j98O81M53n18p54n20L69M8L91M15j09o19j60L90M97m24m95j47k47nM46
4538d57P78M42k69P6M99j69n8m72l24n61o16oJ093o1n57K30j48J00O46K31L57
4559G54p12n52K85Q29o8k45K68o0p94j59P82K57k33n05j77M79L2J0j04n73r01
4580a387m67J015M20N91K50J82k75R7M00K84m43q78m87J11J88L60P30m0r28l86
4600f63J92N19J71k09k72k30k12J66R71J31l69n92N9JM81N14P06o45p94j99M81
4621B07L75L1m67n85p22j37O78O32L27K31o42Q2l8K52J09k52l17n92L50O76P11
$$ plain form
4642 909 994 968 472 -88 -238 346 217 -106 -752 -1013 -631 -623 -408 168 -19 -658 -531 -39 327 590 857
4663 857 880 715 409 446 643 335 11 -350 -552 -456 -268 -132 -127 -359 -370 -164 -202 179 -30 -183 -119 -358 -116
4686 -116 242 888 481 539 628 414 227 575 -45 -200 -280 -576 -431 -204 256 -235 -286 -666 -358 -72 423
4707 423 485 245 -182 -339 197 296 811 796 224 -124 80 544 213 324 -16 -236 -568 -186 340 309 -164
4728 -164 -861 -543 -745 -265 371 854 414 -76 -323 -227 356 883 948 297 150 -86 -151 -78 347 -584 -557 -326
4750 -326 -810 -356 277 202 -352 -592 -658 -434 581 770 668 325 -12 -406 82 395 662 568 73 -287 -271
4771 -271 -293 99 185 -249 -529 -450 173 -67 44 -266 -628 -482 -231 324 431 643 659 267 -97 -357 -522
4792 -522 109 207 294 314 -58 48 20 -51 -259 -219 -51 -75 -280 -401 -641 -294 -194 -205 -21 150 225 486 734
$$ packed form
4642I09Q5k6m96n60j50N84j29l23o46k61L82QK15N76j87o39J27M92L66K63K67
4663H57K3j65l06L7J97l08l24l61k02R6J88J36Nk32j1K06l8L81k09j53O4k39K42
4686a16L58O46m07N8Q9k14j87L48o20j55q0k96J45K27M60m91n1l80L08K86M95
4707D23O2k40m27j57N36R9N15j5n72l48K04M64l31J11l40k20l32L82N26l1m73
4728a64o97L18k02M80O36M83m40m90k47R6N83N27O5o51j47k36o5P3M25r31K7K31
4750c26m84M54O33p5n54k40o6K24J015J89j02l43l37l94M88L13K67r4m95l60J6
4771b71k2L92Q6m34k80P9O23k40J11l10l62J46K51N55J07K12J6l92l64k60j65
4792e22O31R8Q7K0l72J06k8p1k08M0J68k4k05j21k40L47J00j1J84J71P5K61K48
$$ plain form
4815 734 343 237 43 -211 261 545 502 724 399 -334 -1545 -933 -492 -56 113 -102 -433 -410 32 22 420
4836 420 611 -187 -338 339 906 1192 1169 668 -93 -372 -537 231 459 -14 -1054 -1508 -1122 -777 350 984
4856 984 748 41 -354 -213 649 1181 953 327 -503 -543 -150 665 820 395 -471 -1314 -1225 -305 419 795 462
4877 462 -865 -1215 -623 -276 797 691 203 -650 -552 7 976 1156 975 -67 -368 -445 -64 591 685 -414
4897 -414 -949 -1009 -658 266 593 784 71 -594 -745 -154 305 458 148 -342 -610 -171 640 704 953 216 -167
4918 -167 -204 241 156 483 212 -253 -785 -552 -376 24 36 -72 -189 -535 42 -40 581 516 434 75 523 309
4940 309 270 281 155 -159 -235 -133 121 -80 -180 -406 -503 -408 -376 -338 -260 92 42 182 205 404 398 359 651 951
4964 951 575 319 10 -132 -412 -210 48 -427 -554 -640 -748 -88 12 129 239 -103 -177 -74 155 738 473
$$ packed form
4815G34l91j06j94k54M72K84m3K22l25p33j211O12M41M36J69k15l31K3M42j0L98
4836D20J91p98j51O77N67K86k3n01p61k79j65P68K28m73j040m54L86L45J127O34
4856I84k36p07l95J41Q62N32k28o26q30m0L93Q15J55m25q66q43Q9R20P24L76l33
4877D62j327l50N92L47J073j06m88q53R8N59R69J80j81j042l01p7L81O55R4j099
4897d14n35o0L51R24L27J91p13o65j51N91M59J53l10m90k68M39Q11O4K49p37l83
4918a67l7M45q5L27k71m65n32K33J76M00J2j08j17l46N77q2O21o5q2l59M48k14
4940C09l9J1j26l14p6J02K54k01j00k26r7R5L2L8P8L52n0J40K3J99ol9K92L00
4964I51l76k56l09j42k80K02K58m75j27q6j08O60J00J17J10l42p4J03K29N83k65
$$ plain form
4985 473 322 -89 33 -252 155 389 571 -210 -713 -204 150 15 414 24 -387 -345 -490 26 375 -1
5005 -1 222 143 -24 197 622 319 293 -285 -470 -432 -102 361 566 412 182 -122 231 1024 569 242 -506 -587
5027 -587 -671 -523 -430 15 -204 -493 -269 91 154 384 583 378 -25 398 720 458 434 74 -465 -433 -514 -94
5049 -94 113 50 -666 -628 -401 -230 -202 94 -19 -98 10 -164 87 720 528 574 713 656 396 637 299 -601
5071 -601 -935 -1540 -1153 -438 -361 -273 -192 -301 -339 27 687 709 486 630 476 179 239 124 275 -235 -459 -331
5093 -331 -19 94 -36 -168 -578 -899 -768 56 350 390 81 -26 -108 -234 295 733 583 308 58 81 74 -38
5115 -38 -598 -388 -747 -560 -142 219 442 66 27 203 -186 36 757 651 188 -374 -248 -352 -178 209 207
5136 207 379 20 -168 437 448 230 152 101 -268 -301 152 261 -113 -313 -537 -378 -43 -165 -30 183 250 -285
$$ packed form
4985D73j51m11J22k85M07K34J82p81n03N09L54j35L99l90m11M2j45N16L49l76
5005aK23p9j67K21M25l03k6n78j85L8L30M63K05j54k30l04L53P93m55l27p48q1
5027e87q4J48R3M45k19k89K24L60O3K30J99k05m03M23L22k62k4l60n39L2q1M20
5049i4K07o3p16L8K27J71K8K96j13p9J08j74K51O33j92M6J39n7k60K41l38r00
5071f01l34o05L87P15P7Q8Q1j09l8L66O60K2k23J44j54k97O0j15J51n10k24J28
5093c31L12J13j30j32m10l21J31Q24K94M0l09j07q2j26N29M38j50k75k50K3pj12
5115c8n60K10l59J87M18L61K23l76l9J76l89K22P21j06m63n62J26j04J74L87k
5136B07J72l59j88O05J1k18p8n1l69l3M53J09l74k00k24J59L35j22J35K13O7n35
$$ plain form
5158 -285 -209 -98 38 83 100 329 413 320 528 685 130 81 50 -7 -13 -153 -32 -336 -790 -883 -172 -200 -63 204
5182 204 87 405 404 89 370 278 -236 -254 334 79 -213 -226 -317 -406 -392 275 15 -13 -358 -266 -158 -209 -151 263
5206 263 50 109 -14 425 678 668 -107 -128 -160 -346 85 124 442 -286 -260 -490 -519 -299 -133 -2 2 -23 -125
5229 -125 315 326 225 97 -81 -418 -263 399 508 88 -280 -495 78 541 226 449 287 -453 -534 -237 89
5250 89 -76 -136 -445 -245 140 38 383 108 -244 -276 -146 259 465 142 654 -9 14 -4 301 354 -2 -150
5272 -150 -320 -278 -250 -319 -200 -316 -145 -417 -190 311 544 436 -56 231 266 612 779 874 322 67 -502 -559
5294 -559 -285 -196 -201 -829 -423 -492 -67 329 87 -310 -60 -150 -97 299 607 563 312 240 -7 286 568 106 -15
5317 -15 -577 -733 -887 -471 -235 -25 -586 -179 -119 39 213 370 306 -66 -104 385 434 354 342 -197 -526 -325
$$ packed form
5158b85P6J11J36M5J7K29Q4r3K08J57n55m9l1n7oj40J21l04m54r3P11k8J37K67
5182B04j17L18jl15K81r2n14j8N88k55k92j3r1q9J4O67k60k8l45R2J08n1N8M14
5206B63k13N9j23M39K53j0p75k1l2j86M31L9L18p28K6k30k9K20J66J31Mk5j02
5229a25M40J1j01j28j78l37J55O62J09m20l68k15N73M63l15K23j62p40q1K97L26
5250H9j65o0l09K00L85j02L45k75l52l2J30M05K06l23N12o63K3j8L05N3l56j48
5272a50j70M2K8o9J19j16J71k72K27N01K33j08m92K87L5L46J67R5n52k55n69n7
5294e59K74Q9no28M06o9M25L96k42l97K50r0N3L96L08m4k51p2k47K93K82m62j21
5317a5n62j56j54M16K36K10n61M07O0J58J74J57o4l72l8M89M9q0j2n39l29K01
$$ plain form
5339 -325 -267 -299 -43 116 -70 -321 4 -48 190 56 51 -38 -1 77 197 364 261 -33 -21 -266 194 174 182 -501
5363 -501 -311 -380 -104 72 289 262 189 315 106 55 180 38 -336 -272 -302 -166 -345 -97 -552 -142 -562 -88
5385 -88 215 228 373 250 319 29 144 362 -23 -45 -331 90 -298 -167 -172 -207 -493 -608 -280 196 13 18 21 -10
5409 -10 222 443 391 414 535 149 393 -28 -18 155 -266 -611 -438 -381 -32 -214 -215 -172 -311 -214 117 20 291
5432 291 385 -144 216 394 275 200 -22 -539 57 -142 78 268 91 -210 -399 -403 -196 -222 210 -59 208 -16
5454 -16 -70 351 353 643 135 27 -21 -102 -21 18 -110 -109 -323 -193 130 -38 -154 -70 -178 -332 -201 -55 189 -157
5478 -157 53 -163 -121 108 299 195 48 -172 26 127 346 379 269 131 -124 -214 -165 5 -92 -192 -534 -340
5500 -340 -2 -108 -8 -48 -76 -115 157 67 377 424 227 164 -48 285 -28 134 -60 -536 -278 -475 -65 -62 -161
$$ packed form
5339c25N8l2K56J59j86k51L25n2K38j34nq9L7P8J20J67j03k94J2k45M60k0Qo83
5363e01J90o9K76J76K17k7p3J26k09n1J25j42l74O4l0J36j79K48m55M10m20M74
5385h8L03J3J45j23O9k90J15K18l85k2k86M21l88J31nl5k86j15L28M76j83NLl1
5409a0K32K21n2K3J21l86K44m21J0J73m21l45J73N7L49j82jM3j39R7L31r7K71
5432B91R4n29L60J78j19p5k22n17N96j99K20J90j77l01j89mK07k6M32k69K67k24
5454a6n4M21KK90n08j08m8q1Q1L9j28Jk14J30L23j68j16Q4j08j54J31J46K44l46
5478a57K10k16M2K29J91j04j47k20J98J01K19L3j10j38k55r0M9J70r7j00l42J94
5500c40L38j06J00m0k8l9K72r0L10M7j97o3k12L33l13J62j94m76K58j97M10Lr9
$$ plain form
5523 -161 -243 -276 -267 5 494 82 -26 -74 -48 -122 420 448 207 67 -152 -167 -215 231 126 -214 -272 -211 222 183
5547 183 229 -7 57 -311 -274 41 343 431 363 -215 -7 -347 97 212 286 188 -436 -217 -297 210 113 212 -55
5570 -55 -37 -250 10 31 198 -496 -379 -161 -59 175 458 431 375 134 -306 -61 101 332 216 -10 -107 -60
5592 -60 21 126 206 -190 -280 -135 -177 -52 83 62 -323 -420 -176 185 176 450 248 -90 -132 -109 162 465 508 527
5616 527 -114 -355 -374 -412 -179 85 -364 -253 -130 -450 21 -108 45 -32 -119 267 78 -25 229 471 -16
5637 -16 39 47 213 -1 132 -166 82 -589 -400 -609 -250 17 -156 -83 230 23 84 -177 137 214 312 357 131
5660 131 284 20 78 -31 -139 -164 -94 94 -198 4 99 -354 -483 -387 116 475 483 251 212 -277 -350 -10 233
5683 233 161 218 -133 -304 -360 -37 454 228 48 -62 -111 -122 187 181 -142 -155 -468 -85 251 453 225 91 -183
$$ packed form
5523a61q2l3RK72M89m12j08m8K6p4N42K8k41j40k19j5m8M46j05l40n8O1M33l9
5547A83M6k36O4l68L7L15L02Q8o8n78K08l40M44J15P4r8o24K19q0N07r7R9k67
5570e5J8k13K60K1J67o94J17K18J02K34K83k7n6k41m40K45J62K31j16k26r7M7
5592f0Q1J05Q0l96r0J45m2J25J35k1l85r7K44L61rK74k02l38m2K3K71L03M3J9
5616E27o41k41j9l8K33K64m49J11J23l20M71j29J53p7q7L86j89j03K54K42m87
5637a6N5QJ66k14J33k98K48o71J89k09L59K67j73P3L13k07O1k61L14P7R8M5k26
5660A31J53k64N8j09j08k5P0J88k92K02R5m53j29R6N03L59Qk32l9m89p3L40K43
5683B33p2N7l51j71n6L23M91k26j80j10m9j1L09ol23j3l13L83L36K02k28j34k74
$$ plain form
5706 -183 -403 -333 227 312 252 43 -447 -1 75 399 233 -3 -179 -175 -291 219 25 -76 -234 -656 -152 -199
5728 -199 176 417 299 -86 -137 -113 87 419 747 316 123 -287 -176 212 235 -459 -148 91 -321 -153 167
5749 167 140 -142 -209 -213 78 106 410 221 282 63 -328 297 138 -3 318 163 -105 -324 -155 -253 -196 -11 -12
5772 -12 -279 -296 -93 178 131 -90 -34 237 279 341 118 27 -18 -202 -241 19 -51 -245 42 -2 122 -197 14 -94
5796 -94 -130 -256 220 84 -33 -103 74 -4 176 -1 302 215 31 -90 -90 -79 -36 -102 -160 -80 120 -96 266 171
5820 171 -221 -42 31 70 -106 -48 -119 -30 -252 109 39 50 210 116 125 69 114 365 110 -17 -32 -183 213 136 23
5845 23 25 -376 -71 23 -265 180 -81 -123 122 34 -151 105 284 62 418 43 228 142 362 -23 -40 -129 -26
5868 -26 -207 158 45 -230 -13 -200 -56 -229 162 173 199 23 -2 3 -142 -18 155 196 -63 -261 -126 -117 -301
$$ packed form
5706a83k20P0N60Q5o0k09m90M46P6L24j66k36j76Mj16N10j94j01j58m22N04m7
5728a99L75K41j18l85n1K4K00L32L28m31j93m10J11L88K3o94L11K39m12J68L20
5749A67k7k82o7mK91K8L04j89O1k19l91O25j59j41L21j55k68k19J69r8N7J85j
5772a2k67j7K03K71m7k21N6K71M2O2k23r1m5j84l9K60p0j94K87m4J24l19K11j08
5796i4l6j26M76j36j17p0J77p8J80j77L03q7j84j21%J1M3o6n8Q0K00k16L62r5
5820A71l92J79P3L9j76N8p1Q9k22L61p0J1J60r4Rn6M5K51k55j27j5j51L96p7j13
5845B3Km01L05R4k88M45k61m2K45q8j85K56J79k22L56l75J85q6K20l85j7q9J03
5868b6j81L65j13k75K17j87J44j73L91J1K6j76k5Nj45J24J73M1k59j98J35Rj84
$$ plain form
5891 -301 -26 -239 -48 113 56 218 5 -228 150 -238 -8 96 203 -128 35 42 116 -28 -14 -20 -123 -48 -64
5914 -64 -243 -25 -2 101 -113 6 -209 -128 91 106 -9 340 320 55 157 -121 -52 71 -53 -76 124 174 -38
5937 -38 -17 102 45 83 -72 11 -299 -129 -236 61 -82 17 100 -105 46 -14 56 -378 -136 -15 33 -127 -206 -243
5961 -243 136 83 -52 22 -210 -37 -17 -219 -266 -445 -4 -349 -163 -45 205 9 84 -1 69 4 7 -77 203 102
5985 102 219 245 261 100 -328 -212 -465 -228 153 -57 198 351 12 -51 -162 67 -56 143 55 -219 328
6006 328 344 73 31 -318 -98 7 15 -47 -127 168 -32 -312 80 -39 -137 -284 -257 118 28 -55 39 19 61 331
6030 331 217 147 295 -66 131 125 -121 24 158 181 -15 -120 -173 -160 -119 47 41 -234 103 -53 -51 109 101 21 -257
6055 -257 57 228 245 94 187 169 -91 113 106 150 -110 -161 -49 -71 -127 -59 -26 -85 34 -84 189 -195 -66 -125
$$ packed form
5891c01K75k13J91J61n7J62k13k33L78l88K30J04J07l31J63PP4j44J4oj03P5j6
5914f4j79K18K3J03k14J19k15Q1K19J5j15L49k0k65J02k78O9J23j24k3K00N0k12
5937c8K1J19n7L8j55Q3l10J70j07K97j43R9Q3k05J51o0P0m34K42J21M8j60p9l7
5961b43L79n3j35P4k32J73K0k02m7j79M41l45J86J18K50j96P5q5P0o5Lq4K80j01
5985A02J17K6J6j61m28J16k53K37L81k10K55J53l39o3j11K29j23J99q8k74N47
6006C28J6k71m2l49K20J05Qo2q0K95k00k80L92j19r8j47K7L75r0q3R4k0M2K70
6030C31j14p0J48l61J97ok46J45J34K3j96j05n3J3M1J66ok75L37j56KJ60qq0k78
6055b57L14J71J7j51R3j8k60K04pM4k60n1J12k2n6O8L3n9J19j18K73l84J29n9
$$ plain form
6079 -125 140 -133 150 -85 7 -7 193 -198 6 -135 -29 -456 -240 211 -189 111 213 -174 41 -161 -70
6100 -70 108 51 -79 300 165 -79 -49 -126 49 13 340 5 -240 -43 -19 -143 247 128 136 78 -220 317 -88
6123 -88 -231 72 -69 -168 130 84 131 22 -53 -268 38 146 -44 56 262 38 -35 -113 -7 -147 -45 -73 -82
6146 -82 -26 -58 -63 -61 -58 219 69 -146 268 77 -63 99 -158 30 58 24 71 -102 -53 -10 -25 11 -85 -2 -201 -148
6172 -148 -2 -40 131 60 162 146 16 -211 13 238 63 47 90 -142 -105 -199 82 -50 -207 -298 -9 25 60
6195 60 -35 21 -12 -1 -13 -33 380 203 211 -305 299 -12 133 -103 43 69 -243 -163 -125 21 -194 -52 -49 124 121
6220 121 52 -159 214 -142 -134 -138 92 146 -260 79 77 -18 57 -82 28 -20 36 147 80 13 -26 -152 -74 27 65 29
6246 29 306 -8 30 -129 -167 22 148 88 72 82 -73 78 162 48 99 14 -44 86 73 294 283 194 -121 -21
$$ packed form
6079a25K65k73K83k35R2j4K00l91K04j41J06m27K16M51m00L00J02l87K15k02R1
6100g0J78n7j30L79j35k44L0p7J75l6L27l35k45J97K4j24L90j19Qn8k98N37m05
6123h8j43L03j41r9K98m6M7j09p5k15L06J08j90J00K06k24p3p8J06j40J02k8r
6146h2N6l2nKLK77j50k15M14j91j40J62k57J88K8l4M7j73M9M3j5L6r6Q3j99N3
6172a48J46l8J71p1J02j6j30k27K24K25j75j6M3k32L7r4K81j32j57r1K89L4L5
6195F0r5N6l3J1j2k0M13j77Qn16O04l11J45k36J46K6l12Q0L8J46k15J42LJ73l
6220A21o9k11L73l56QmK30N4m06L39kr5P5j39J10m8N6J11o7o7l9j26P8J01L8l6
6246B9K77l14L8j59l8J89J26o0j6J0j55J51Q4j14N1q5n8J30j3K21j1q9l15J00
$$ plain form
6270 -21 129 49 104 -185 -126 152 -88 15 -204 112 -190 104 210 42 190 39 -43 77 -66 153 278 -66
6292 -66 -220 -271 -81 -131 -78 -229 68 133 29 122 -264 76 134 341 -138 -73 -111 104 37 31 -224 -40 84 9
6316 9 -102 -100 -146 -110 -270 177 7 128 24 -70 149 43 55 -2 -132 183 63 -42 -87 -4 73 -88 -149 -35
6340 -35 -97 -19 -79 31 -78 -9 -137 0 164 9 -131 193 225 -90 -41 -9 -186 -49 279 223 54 -297 77
6363 77 70 48 77 85 197 -194 77 -12 21 -278 -96 222 10 138 -98 29 73 -295 13 9 298 -53 -49 18 -174
6388 -174 -59 -8 -9 -247 77 -30 123 -10 73 -250 -14 -172 -396 217 -127 93 92 -40 125 30 228 203 186
6411 186 74 123 91 27 -129 -237 -108 117 -52 -156 -210 100 138 33 108 18 -12 136 213 -81 54 120 38 -247
6435 -247 49 161 -65 -113 -211 207 96 107 139 106 53 -243 -168 223 -28 212 37 48 436 46 -248 124 36
$$ packed form
6270b1J50q0N5k89N9K78k40J03k19L16l02K94J06j68J48j51q2J20j43K19J25l44
6292f6j54n1J90n0N3j51K97O5j04R3l86L40N8K07m79O5l8K15o7ok55J84J24p5
6316Ij11Km6L6j60M47j70J21j04r4K19j06J2n7j30L15j20j05m5Q3P7j61o1J14
6340c5o2P8o0J10j09O9j28J37J64j55j40L24L2l15M9L2j77J37L28n6j69l51L74
6363G7pk2K9QJ12l91K71q9L3k99J82L18k12J28k36J27M4l68L08mK89l51MO7j92
6388a74J15N1jk38L24j07J53j33Q3l23K36j58k24O13l44K20jj32J65r5J98k5j7
6411A86j12M9l2o4j56j08J29K25j69j04n4L10L8j05P5r0l0J48P7k94J35O6q2k85
6435b47K96J12k26m8r8M18j11J1L2l3n3k96P5L91k51K40j75J1L88l90k94L72q8
$$ plain form
6458 36 -157 -7 29 -42 172 -103 165 85 14 -34 -209 187 96 127 -33 -73 -280 -140 -27 172 -27 -18 -12 101
6482 101 -81 38 250 94 -162 -38 -140 77 182 -57 92 124 4 -23 20 -85 -182 30 -124 -12 -8 -82
6504 -82 25 41 89 -75 4 -316 -153 45 167 -46 180 -151 -11 73 45 8 -149 -18 77 44 -109 -42 -84 43
6528 43 -145 142 -118 -51 70 91 154 -13 -54 -53 93 310 317 66 149 96 211 37 93 136 -112 136 -86 114
6552 114 -35 -23 41 -84 224 14 -282 113 -7 -110 -259 -41 -275 -5 -97 142 43 -106 -23 205 -129 -60
6574 -60 -60 5 -196 -234 31 -37 -2 -1 -124 -236 10 -189 17 -219 -155 -331 -68 235 -68 165 49 -18 45 206
6598 206 173 16 -79 -77 170 -47 35 -43 -61 90 -18 -2 125 59 25 -21 238 -144 -118 46 -70 -87 -4 27 38
6623 38 -146 -139 -71 -16 -66 -54 -80 152 -129 -258 58 33 112 171 -99 63 96 136 -309 -57 -87 -22 -61 181 -164
$$ packed form
6458C6j93J50L6p1K14k75K68q0p1m8j75L96r1L1j60m0k07J40J13J99j99ROJ13
6482A01j82J19K12j56k56J24j02K17J05k39J49L2j20k7M3j05r7K12j54J12Mp4
6504h2J07J6M8j64P9l20J63J98J22k13K26l31J40Q4k8l7j57J31R5l3j53O7m2J27
6528D3j88K87k60O7J21K1O3j67m1JJ46K17Pk51Q3n3J15j74N6M3k48K48k22K00
6552A14j49J2O4j25L08k10k96L95j20j03j49K18k34K70r2K39r9j49Q3K28l34O9
6574f0%O5k01l8K65o8L5Jj23j12K46j99K06k36O4j76K63L03l03K33j16o7O3J61
6598B06l3j57r5KK47k17Q2p8j8J51j08J6J27o6l4m6K59l82K6J64j16j7Q3L1J1
6623C8j84PO8N5n0J2k6K32k81j29L16k5P9N9k70J62L3M0m45K52l0O5l9K42l45
$$ plain form
6648 -164 -249 -133 -105 -89 -99 -51 -9 23 -93 116 -41 85 -79 138 128 -137 114 -97 -53 -87 49 -27 58 19
6672 19 -32 90 533 -179 65 109 -41 17 -119 -247 -132 160 -19 -95 281 317 -277 -210 -142 -26 -132 -256 12
6695 12 264 67 -55 -79 -65 186 94 46 130 7 -69 57 -275 -72 106 -3 -42 41 -232 150 155 -22 143 -56
6719 -56 -312 -69 -31 152 255 -78 -124 -3 191 133 -48 158 59 -264 -134 -115 -144 -96 77 -162 186 164 -263
6742 -263 13 149 -151 257 135 171 -246 -218 78 -11 -303 -258 -24 -251 -114 -28 191 -225 -85 92 81 -157
6764 -157 279 87 29 22 -71 131 -80 -72 71 158 -169 -39 -108 -166 -26 207 48 -31 -65 -91 -81 -85 47 65 165
6789 165 206 193 -110 5 153 -275 -285 136 71 52 -51 -45 -173 56 -171 -8 148 -127 -13 245 173 34 168
6812 168 -20 230 -143 -72 56 -118 -107 25 199 -45 -26 257 28 195 -12 155 81 83 128 -135 132 61 156
$$ packed form
6648a64q5J16K8J6j0M8M2L2j16K09j57J26j64K17j0k65K51k11M4l4J36p6Q5l9
6672A9n1J22M43p12K44M4j50N8j36j28J15K92j79p6L76L6n94O7O8J16j06j24K68
6695A2K52j97j22k4J4K51r2m8Q4j23p6J26l32K03J78j09l9Q3k73L82Nj77J65j99
6719e6k56K43L8J83J03l33m6J21J94n8j81K06r9l23J30J9k9M8J73k39L48k2m27
6742b63K76J36l00M08j22L6m17K8K96q9k92M5K34k27J37Q6K19m16J40J77j1k38
6764a57M36j92n8pr3K02k11QJ43Q7l27J30o9n8J40K33j59p9l4k6J0mJ32J8J00
6789A65M1j3l03J15J48m28j0M21o5j9j03Oj28K29k27J63J56k75J14K58p2j39J34
6812A68j88K50l73P1J28j74J1J32J74k44J9K83k29J67k07J67p4KM5k63K67p1R5
$$ plain form
6835 156 -42 110 -2 -112 6 95 19 -119 14 -10 153 379 -13 80 -25 -31 -98 15 -28 226 87 40 8
6858 8 170 -76 43 -81 96 195 68 -117 215 -50 -192 139 235 122 -160 288 -30 112 -91 258 -124
6879 -124 -3 -198 -206 82 -50 71 226 12 77 7 168 -37 39 44 -168 89 -54 -107 -75 -404 15 -353 181
6902 181 38 -47 27 -190 13 297 118 70 3 56 92 -66 27 -40 57 122 240 -254 -219 -152 -289 96 -29 196
6926 196 44 -56 -93 21 -16 -1 -40 162 -114 -82 14 93 210 51 -21 -18 126 -267 79 -25 26 117 221 -30
6950 -30 49 -129 195 -236 -141 -226 253 -202 37 -147 -95 47 -49 102 359 137 304 51 113 -120 46 -3 -123
6973 -123 -49 -260 -21 -62 -175 40 12 -33 -120 220 241 -31 45 -151 212 -102 0 -57 89 -48 -13 40 -254
6996 -254 9 49 -95 -171 -60 -46 0 68 42 -1 303 191 20 320 -34 122 117 -156 37 19 296 31 163
$$ packed form
6835A56j98J52j12j10J18Q9p6j38J33k4J63K26l92R3j05oo7J13m3K54j39m7l2
6858HJ62k46J19j24J77R9j27j85L32k65j42L31R6j13k82M48l18J42k03L49l82
6879a24J21j95qK88j32J21J55k14O5p0J61k05P6Nk12K57j43n3L2l29M19l68N34
6902A81j43q5P4k17K03K84j79m8o7N3L6j58R3o7R7O5J18m94L5O7j37L85j25K25
6926A96j52j00l7J14l7J5l9K02k76L2R6P9J17j59p2LJ44l93L46j04N1R1J04k51
6950c0P9j78L24m31R5q5M79m55K39j84N2J42r6J51K57k22J67k53O2k33J66m9j20
6973a23P4k11K39m1j13K15k8m5q7L40K1k72P6j96L63l14J02n7J46j37L5N3k94
6996b54K63M0j44p6J11J4M6O8k6m3L04j12j71L00l54J56nk73J93j8K77k65J32
$$ plain form
7019 163 -106 -84 108 212 -223 206 277 -63 -302 -83 40 118 138 195 -54 -126 -64 71 31 378 178 81 -23
7042 -23 -41 -129 25 119 63 -57 -182 -22 95 -86 144 78 63 -295 20 -57 169 -76 33 105 95 -73 168
7065 168 79 -120 -96 91 189 49 -79 -77 -127 -46 106 -83 -135 -39 80 56 7 60 76 -128 318 -37 123 103 47
7090 47 188 181 -267 59 68 -62 -79 -77 -308 -75 -274 -327 -140 -12 30 45 9 29 68 83 43 -133 76 68 164 -17
7116 -17 -66 -127 -46 -24 -420 -131 196 -43 90 115 220 208 262 11 364 -102 179 92 -101 -75 -270 97 65 -11
7140 -11 26 4 150 20 -209 -141 -153 -6 113 -72 108 0 257 148 12 10 163 -35 1 -239 100 -131 -299
7163 -299 -94 137 101 156 172 312 -113 -186 41 118 257 59 -145 -136 -332 -179 183 14 -229 -148 240 -80 80
7186 80 186 146 457 -86 57 65 48 133 168 -50 -95 -166 -74 -124 -169 -197 -217 -116 44 19 109 193 238 384 -5 256
$$ packed form
7019A63k69K2J92J04m35M29P1l40k39K19J23P8K0N7k49p2O2J35m0L47k00r7j04
7042b3j8q8J54R4n6j20j25J60J17j81K30o6j5l58L15p7K26k45J09P2j0j68K41
7065A68q9j99K4J87R8j40j28Kn0Q1J52j89n2R6J19k4m9N3J6k04M46l55J60k0n6
7090D7J41pm48L26Rj30j7Kk31K33j99n3J87J28M2J5l6K0L9J5m0j76K09qR6j81
7116a7m9o1Q1K2l96K89L27k39J33K5J05j2N4k51L53m66K81q7j93K6j95L67l2p6
7140a1L7k2J46j30k29O8j2J47J19j85J80j08K57j09j36kJ53j98L6k40L39k31j68
7163b99K05K31l6N5J6J40m25p3K27P7J39j98k04Rj96J53L62j69k43Q1L88l20J60
7186H0J06m0L11n43J43Qj7Q5L5k18m5p1R2n0m5k8k0J01J60k5R0Q4M5J46l89K61
$$ plain form
7212 256 279 164 184 -320 18 -95 -227 -101 -94 -110 -168 -70 -22 -34 -21 227 209 39 310 192 189 230 -261 -144 175
7237 175 -31 -171 19 49 92 -397 -209 -18 40 -130 -163 -117 8 -182 316 189 -67 113 -23 -77 85 -75
7259 -75 237 73 -72 -155 -302 -149 56 -61 -18 198 84 272 2 350 -40 -15 79 -4 -199 -147 157 81 -190
7282 -190 -159 -101 -132 449 -113 25 239 -2 339 16 8 112 44 232 217 80 127 -116 -190 -68 -177 -139 -50 -71
7306 -71 24 105 202 6 4 331 299 337 121 219 230 91 -212 -183 -219 -97 -112 51 45 -51 -454 19 -13 -12 230 206 163
7333 163 299 172 246 190 -142 123 152 -176 289 -150 -185 -289 -401 -242 -241 116 -52 -298 63 224 250 118
7355 118 49 -49 178 288 -133 -199 157 -164 -45 -140 -124 212 -55 -96 -260 41 -89 -230 30 -67 45 265
7377 265 154 -130 -100 -220 276 239 78 17 -109 70 1 79 23 -72 -95 -85 -28 180 284 -38 245 108 -52
$$ packed form
7212B56K3j15K0n04L38j13j32J26Pj6n8R8M8j2J3K48j8j70K71j18lM1m91J17L19
7237A75k06j40J90L0M3m89J88J91N8j70l3M6J25j90M98j27k56J80j36n4J62j60
7259g5L12j64j45q3j47J53K05j17M3K16j14J88k70L48l90K5R4q3j95N2L04p6k71
7282a90L1N8l1N81n62J38K14k41L41l23qJ04o8J88j5j37M7k43p4J22j09L8Q9k1
7306g1R5Q1R7j96kL27l2L8k16R8J1j39l03K9l6J22j5J63or6m03M73l2JK42k4m3
7333A63J36j27P4n6l32K65K9l28M65m39l5j04j12J59JL57j68k46L61J61K6j32
7355A18o9r8K27J10m21o6L56l21J19r5J6L36k67m1j64L01j30j41K60r7J12K20
7377B65j11k84L0j20M96l7j61o1j26J79o9P8n6r5k3J0N7K08J04l22K83j37j60
$$ plain form
7400 -52 -164 164 -211 -200 -210 -89 43 -78 60 52 72 2 72 -270 121 124 138 38 309 4 46 141 -284 0
7424 0 -134 45 -387 -112 -76 -170 -250 -142 96 183 193 208 -51 157 48 97 72 250 -136 48 -13 -221 -50 -266
7448 -266 26 -151 -89 -108 102 -335 328 -24 287 283 92 66 114 23 -8 331 -116 98 -179 -153 8 12 -73 -47
7472 -47 -30 -132 -209 39 385 21 86 140 5 379 203 247 99 65 306 -53 -168 -138 -34 -88 -195 -81 -69
7495 -69 146 150 121 -57 -5 -62 106 -34 64 118 -61 -230 165 233 -143 -87 28 -3 -57 -104 278 211 9 -227 2
7520 2 -70 -35 -20 -6 -49 115 134 -79 105 115 110 -44 157 -318 -122 364 235 79 138 102 -126 -4 -72 282 -102
7545 -102 -102 -146 -144 25 -109 67 8 -179 -154 2 54 180 108 -87 308 165 0 41 -14 32 -40 -100 -49 58 -286
7570 -286 -92 23 -256 -192 153 79 -77 173 -81 -28 -57 221 82 -31 42 62 -180 200 226 45 -40 -91 -149
$$ packed form
7400e2j12L28l75J1j0J21J32j21J38qK0p0P0l42L91LJ4j00K71l05M2R5m25K84
7424@j34J79m32K75L6r4q0J08K38Q7J0J5k59K08j09M9k5J78l86J84o1k08J71k16
7448b66K92j77O2j9K10m37O63l52L11mj91k6M8r1l1L39m47K14k77K6J61Mq5K6
7472d7J7j02p7K48L46l64O5N4j35L74j76M4j48l4K41l59j15L0J04n4j07J14J2
7495f9K15Mk9j78N2n7J68j40R8N4j79j69L95O8l76N6J15l1n4m7L82o7k02k36K29
7520Bp2L5J5J4m3J64J9k13J84J0nj54K01m75J96M86j29j56N9l6k28J22o8L54l84
7545a02%m4KJ69j34J76n9j87K5J56N2J26p2j95L95j43j65M1n5M6p2o0N1J07l44
7570b86J94J15k79O4L45p4j56K50k54N3k9K78j39j13P3K0k42L80K6j81q5n1n8
$$ plain form
7593 -149 -207 -119 70 375 -68 -79 -102 57 87 10 52 18 -159 45 312 172 111 79 22 -135 -97 165 18 79
7617 79 -80 -331 -4 -98 -64 154 91 -44 -246 -294 -70 -270 -75 -33 4 14 -113 17 87 -24 202 -81 59
7640 59 73 -45 -346 -7 -79 -238 -81 -316 27 257 -104 136 -88 102 -12 -74 155 46 165 263 -16 112
7662 112 180 75 -162 -58 -60 -131 -40 -87 -44 -460 -407 -100 182 -88 51 304 267 205 -30 -165 35 -123 -224
7685 -224 18 35 -117 -68 22 -60 13 -75 146 264 -61 98 90 201 78 143 -115 32 29 34 154 -40 -102 167 83
7710 83 0 169 -101 -445 23 -202 66 33 -207 77 86 -64 -183 -125 -62 -118 -172 -71 -137 57 157 13 -62 292
7734 292 -138 -106 156 82 200 287 2 -56 -75 -351 -128 -316 -218 -227 -550 -266 -215 -36 -287 -123 111 -96 357
7757 357 465 136 -11 116 -240 -63 -113 121 -86 -87 -273 -239 -10 -334 -126 -272 93 -149 238 151 165 303
$$ packed form
7593a49n8Q8J89L05m43j1k3J59L0p7M2l4j77K04K67j40o1l2n7j57L8K62j47O1
7617G9j59k51L27r4L4K18o3j35k02m8K24k00J95M2L7J0j27J30P0j11K26k83J40
7640E9J4j18l01L39p2j59J57k35L43K30l61K40k24J90j14o2K29j09J19R8k79J28
7662A12O8j05k37J04kp1R1m7M3m16N3L07K82k70J39K53l7o2k35j35K00j58j01
7685b24K42J7j52M9R0q2P3q8K21J18l25J59qJ11j23O5k58J47lNJ20j94o2K69q4
7710H3q3J69k70l44M68k25K68l3k40K84Rj50j19N8O3n6n4J01o6J94J00j44p5L54
7734B92m30L2K62p4J18Q7k85n8j9k76K23j88R8rl23K84N1J79k51J64K34k07M53
7757C57J08l29j47J27l56J77n0K34k07jj86L4K29l24K08j46L65k42L87q7J4J38
$$ plain form
7779 303 153 -31 -137 -75 140 3 -45 -16 55 19 30 -200 44 -338 -350 -375 -415 -169 331 38 -10 249 -38
7802 -38 78 117 257 81 8 200 102 185 175 -18 -182 -206 -57 -222 124 -121 258 101 223 115 131 -64 156
7825 156 31 154 30 10 35 68 195 149 43 -44 -72 -69 -126 -16 129 -3 5 -67 31 149 268 189 214 99 -220
7850 -220 -87 -6 -100 -259 87 -28 -63 -38 34 208 198 -94 92 -21 60 -6 -16 -89 -419 -137 -326 -151 -331
7873 -331 -56 -169 -60 103 361 66 147 -80 -116 -1 9 212 260 -192 -93 -152 -108 170 -7 178 -156 -389
7895 -389 -378 109 -135 -91 -30 -194 -257 201 143 281 168 173 295 216 200 -19 198 175 30 32 -169 44 -258 87
7919 87 -8 -346 -277 -39 -163 178 209 -63 147 152 141 114 24 62 265 -54 -87 99 -15 -28 129 -16 -86 -229
7943 -229 -126 284 169 83 95 -272 -71 60 144 130 -11 -6 -79 35 53 -284 -112 -135 -167 40 126 152 68 184
$$ packed form
7779C03j50j84j06O2K15j37m8K9P1l6J1k30K44l82j2k5m0K46N00k93m8K59k87
7802c8J16L9J40j76p3J92r8Q3j0j93j64k4J49j65L46k45L79j57J22j08J6j95K20
7825A56j25J23j24k0K5L3J27m6j06q7k8Ln7J10J45j32Qp2R8J18J19p9K5j15l19
7850b20J33Q1r4j59L46j15l5K5P2J74j0k92J86j13Q1o6j0p3l30K82j89J75j80
7873c31K75j13J09J63K58k95Q1k27l6J15J0K03M8m52R9n9M4K78j77J85l34k33
7895c89J1M87k44M4O1j64o3M58n8J38j13NJ22p9j6k19K17k3j45Kk01K13l02L45
7919H7r5l38O9K38j24L41L1k72K10Nj1k7r0L8K03l19l3J86j14j3J57j45p0j43
7943b29J03M10j15q6J2l67K01J31Q4j4j41Np3J14J8l37J72k3l2K07Q6K6q4J16
$$ plain form
7967 184 -187 -7 -272 -81 152 -239 93 -338 -249 -203 -140 -100 -75 404 44 291 150 68 -86 -127 189 -36
7989 -36 125 256 42 -102 28 6 -139 -161 -49 -297 130 -92 -154 282 -166 -71 113 53 112 108 81 -123 32
8012 32 -206 -484 -116 100 -72 -13 -109 -241 -81 -309 132 -128 -102 245 216 440 181 637 307 139 131 335
8034 335 257 -127 -74 -143 -173 -357 -15 111 -143 -90 93 -158 155 -45 29 204 7 -37 -58 306 82 197 218
8057 218 -200 -152 4 29 -255 5 -303 18 -193 -380 180 -36 -212 32 -28 330 59 -216 127 -159 163
8078 163 -43 103 -104 65 90 -195 7 -131 197 243 62 34 -103 -217 -15 -53 -93 -118 122 -13 -125 173
8100 173 191 -10 -242 -337 -293 256 -5 23 210 36 -17 70 -114 247 -77 21 59 -33 -86 -126 -147 -51 -284 18
8124 18 192 33 284 141 -66 24 148 260 182 191 266 3 -233 75 107 -113 -124 -380 141 -65 -380 -178 -285
$$ packed form
7967A84l71J80k65J91K33l91L32m31Q9M6O3M0K5M79l60K47j41q2j54m1L16k25
7989c6J61J31k14j44J30k2j45k2J12k48M27k22o2M36m48R5J84o0N9mk7k04J55
8012C2k38k78L68K16j72N9r6j32J60k28M41k60K6L47k9K24k59M56l30j68qK04
8034C35p8l84N3o9l0j84L42J26k54N3J83k51L13k00P4J75j97m4k1L64k24J15K1
8057B18m18M8J56K5k84K60l08L21k11j87N60k16j76K44o0L58k71k75L43k86L22
8078A63k06J46k07J69K5k85K02j38L28M6j81k8j37j14K02l8m0k5K40j35j12K98
8100A73J8k01k32r5M4N49k61K8J87j74n3Q7j84L61l24R8L8r2n3m0k1R6k33L02
8124A8J74j59K51j43k07R0J24J12p8RP5k63k36L08L2k20j1k56N21k06l15K02j07
$$ plain form
8147 -285 62 62 -1 231 161 248 -64 -162 0 34 257 -74 -25 154 -103 -17 -253 -291 -182 -170 -90 -86 -432 49 -73
8172 -73 84 54 114 146 148 276 90 239 315 3 11 86 267 -389 -195 -155 -215 -87 -76
$$ packed form
8147b85L47%o3K32p0Q7l12r8J62L4K23l31M9J79k57Q6k36l8J09J2Q0Ml46M81j22
8172g3J57l0O0L2KJ28j86J49P6l12QP5J81o56J94M0o0J28J1
8191g6
$$ Imaginary data points
##PAGE= N=2
##DATA TABLE= (X++(I..I)), XYDATA
$$ plain form
0 0 0 0 0 0 0 0 0 0 0 -1 0 -8 8 -8 8 -16 16 -22 24 -32 40 -42 52 -62 72 -83 98 -114 130 -150 169 -194 220
33 220 -249 281 -317 356 -399 444 -496 554 -613 682 -754 835 -921 1017 -1121 1235 -1361
50 -1361 1498 -1652 1822 -2010 2220 -2461 2731 -3045 3412 -3843 4365 -5005 5820 -6888 8366
65 8366 -10545 14102 -20930 38936 -194664 -473807 -212234 85906 408221 569362 588840
76 588840 421916 229927 82382 22098 -63493 -181925 -288710 -298592 -246455 -137491 -21492
87 -21492 25666 -50096 -139946 -133267 -9792 134232 210704 174860 60509 -68615 -102274 11914
99 11914 184478 267149 234438 136363 16792 -86209 -137330 -158971 -193493 -249618 -272647 -205160
111 -205160 -72020 41654 104490 124014 97794 66391 108611 216275 294131 276839 170728
$$ packed form
0@%%%%%%%%%jJqJ6j6J6k4L2l8M6n6P2q2R4j14J34j55J81k12K44k80L19l63M14
33B20m69N30n98O73p55Q43r40J050j167J295j436J589j756J938k138K356k596
50a361K859l150L474l832M230m681N192n776O457p255Q208r370J0825j2708J5254
65H366j8911K4647l5032N9866k33600k79143K61573K98140L22315J61141J9478
76E88840j66924j91989j47545o0284q5591j18432j06785r882N2137J08964J15999
87b1492M7158p5762q9850O679J23475J44024P6472l5844j14351j29124l3659J14188
99A1914J72564Q2671l2711r8075j19571j03001n1121k1641l4522n6125k3029O7487
111b05160J33140J13674O2836J9524k6220l1403M2220J07664P7856j7292j06111
$$ plain form
122 170728 17989 -129902 -227907 -249824 -217856 -196820 -202444 -175483 -89558 20155 125032
133 125032 202180 217593 171937 109180 65737 43838 17182 -29863 -67229 -73195 -62866 -39000
145 -39000 2643 26107 4908 -34113 -64973 -83598 -85033 -69486 -39703 -2246 20055 28963
157 28963 49908 83018 108620 130746 145706 126677 74301 12431 -45735 -96018 -135547 -162307
169 -162307 -166285 -150060 -128371 -91551 -31696 30408 82196 132093 166979 174607 165226 141264
181 141264 98343 37461 -39898 -117805 -161159 -157205 -118303 -58407 -9489 440 -11672 -16118
193 -16118 -6551 15216 37528 41110 32308 26876 28176 38289 51097 45299 21997 3160 -4188
206 -4188 2029 18358 23042 2029 -36002 -79591 -113667 -115299 -88999 -53408 -14768 19221 44971
$$ packed form
122A70728j52739j47891r8005k1917L1968K1036n624K6961Q5925J09713J04877
133A25032P7148J5413m5656o2757m3443k1899k6656m7045l7366n966J0329K3866
145c9000M1643K3464k1199l9021l0860j8625j435J5547K9783L7457K2301Q908
157B8963K0945L3110K5602K2126J4960j9029n2376o1870n8166n0283l9529k6760
169a62307l978J6225K1689L6820N9855O2104N1788M9897L4886P628r381k3962
181A41264m2921o0882p7359p7907m3354L954L8902N9896M8918R929j2112m446
193a6118R567K1767K2312L582q802n432J300J0113J2808n798k3302j8837p348
206d188O217J6329M684k1013l8031m3589l4076j632K6300L5591L8640L3989K5750
$$ plain form
219 44971 77321 114585 134905 126856 87920 24216 -32395 -58168 -64533 -64618 -66984 -77722 -83093
232 -83093 -63312 -24132 18509 51218 57552 46431 40920 39118 33748 28347 16698 -5186 -20192
245 -20192 -22460 -20747 -16000 -16139 -26090 -34691 -34329 -24278 3811 39766 55766 47276 22793 -12118
259 -12118 -39480 -41783 -26216 -3323 20555 38104 52154 63597 53834 16729 -30906 -76848
271 -76848 -105196 -96877 -60917 -21661 10657 33390 45432 56468 64326 61360 52619 37921 13145
284 13145 -8392 -19633 -29991 -37921 -37443 -36069 -35339 -31280 -27189 -21531 -11897 -7183 -5104 8522
298 8522 30065 53813 78605 85071 59771 17717 -23796 -53187 -60353 -51452 -37368 -17336 4925
311 4925 19574 27806 25131 682 -30256 -47593 -48461 -31861 -1981 25973 45143 57219 56823
$$ packed form
219D4971L2350L7264K0320q049l8936o3704n6611k5773o365q5k366j0738n371
232h3093J9781L9180M2641L2709O334j1121n511j802n370n401j1649k1884j5006
245b0192k268J713M747j39r951q601L62J0051K8089L5955J6000q490k4483l4911
259a2118k7362k303J5567K2893K3878J7549J4050J1443r763l7105m7635m5942
271g6848k8348Q319L5960L9256L2318K2733J2042J1036P858k966q741j4698k4776
284A3145k1537j1241j0358p930M78J374P30M059M091N658R634M714K079J3626
298H522K1543K3748K4792O466k5300m2054m1513k9391p166Q901J4084K0032K2261
311D925J4649Q232k675k4449l0938j7337q68J6600K9880K7954J9170J2076l96
$$ plain form
324 56823 45217 31022 10595 -12337 -26712 -35721 -44709 -44772 -35064 -21605 -1830 15819 22106
337 22106 21481 16035 3749 -4786 -6732 -7648 -177 18214 33368 38486 32303 10257 -18831 -41653
351 -41653 -57728 -62201 -47895 -22070 11952 47924 66278 56618 33250 6932 -11950 -13818 -7888
364 -7888 -9350 -13600 -16191 -14965 -4004 6702 1303 -14265 -27378 -30925 -16790 9055 25274
377 25274 26786 21664 13964 14799 28086 37500 31265 9330 -24900 -52612 -53417 -32426 -6534 12738
391 12738 12270 -4654 -14839 -8829 1815 8004 -1407 -23159 -30311 -7087 35549 76346 86944
404 86944 53058 2934 -28317 -32793 -20480 -9073 -20577 -47928 -62618 -50462 -15552 21927
416 21927 33374 16639 -2817 -7243 11105 47667 71999 58473 18845 -21712 -42519 -34187
$$ packed form
324E6823j1606j4195k0427k2932j4375r009q988o3R708J3459J9775J7649O287
337B2106o25n446j2286q535j946r16P471J8391J5154N118o183k2046k9088k2822
351d1653j6075m473J4306K5825L4022L5972J8354r660k3368k6318j8882j868N930
364g888j462m250k591J226J0961J0706n399j5568j3113l547J4135K5845J6219
377B5274J512n122p700Q35J3287R414o235k1935l4230k7712q05K0991K5892J9272
391A2738m68j6924j0185O010J0644O189r411k1752p152K3224M2636M0797J0598
404H6944l3886n0124l1251m476J2313J1407j1504k7351j4690J2156L4910L7479
416B1927J1447j6735j9456m426J8348L6562K4332j3526l9628m0557k0807Q332
$$ plain form
428 -34187 -12298 -3193 -13944 -35955 -48508 -27614 18057 49933 47097 17417 -19472 -33733
440 -33733 -12242 21894 36573 18402 -18926 -39260 -21648 14381 39466 39043 9735 -28013
452 -28013 -38426 -16363 8586 13125 -6176 -32148 -38557 -17575 18492 50757 55502 26815 -3475
465 -3475 -8025 5033 19349 21764 -1446 -41360 -69536 -67090 -36527 -2503 7885 759 397
478 397 16634 47852 84550 93560 54515 -7042 -50484 -57338 -36490 -14129 -10045 -19347 -28770
491 -28770 -25484 200 26098 18680 -13722 -36664 -33918 -4786 37537 65551 58311 22093 -17032
504 -17032 -26785 -5412 17375 25527 22204 5495 -16349 -21746 -11907 -12790 -34529 -60900 -70808 -51057
518 -51057 -10096 31687 56942 51029 23177 13929 40719 74737 84742 61156 6901 -55259
$$ packed form
428c4187K1889R105j0751k2011j2553K0894M5671L1876k836k9680l6889j4261
440c3733K1491L4136J4679j8171l7328k0334J7612L6029K5085m23k9308l7748
452b8013j0413K2063K4949M539j9301k5972o409K0982L6067L2265M745k8687l0290
465c475m550J3058J4316K415k3210l9914k8176K446L0563L4024J0388p126l62
478C97J6237L1218L6698R010l9045o1557m3442o854K0848K2361M084r302r423
491b8770L286K5684K5898p418l2402k2942K746K9132M2323K8014p240l6218l9125
504a7032r753K1373K2787Q152l323j6709k1844n397R839q83k1739k6371r908J9751
518e1057M0961M1783K5255n913k7852r248K6790L4018J0005k3586n4255o2160
$$ plain form
530 -55259 -91579 -89714 -63635 -39989 -33928 -27458 -1941 30598 51388 54557 31267 -11538 -39072
543 -39072 -26456 14566 55499 69831 52043 16075 -22832 -46223 -39772 -20712 -15376 -20647 -19112
556 -19112 -12515 -3383 8307 10484 -6334 -29624 -36642 -11592 33403 66697 72771 56780 25413
569 25413 -2862 -6847 2049 -2903 -26157 -54193 -74251 -74843 -58255 -31524 -2339 20109 36843
582 36843 60247 85192 89126 68612 34553 -8013 -44931 -58732 -48380 -26532 -8356 -5089
594 -5089 -13258 -24022 -34293 -34445 -18194 -170 9976 22271 39660 51264 54035 45235 23388
607 23388 -3162 -22568 -25481 -10494 5574 7372 484 -11143 -29163 -43871 -45959 -43400 -38605
620 -38605 -24887 -4454 16201 33934 46404 56450 63714 60284 49193 38121 20839 -5090
$$ packed form
530e5259l6320J865K6079K3646O061O470K5517L2539K0790L169k3290m2805k7534
543c9072J2616M1022M0933J4332j7788l5968l8907k3391O451J9060N336n271J535
556a9112O597R132J1690K177j6818k3290p018K5050M4995L3294O074j5991l1367
569B5413k8275l985Q896m952k3254k8036k0058n92J6588K6731K9185K2448J6734
582C6843K3404K4945L934k0514l4059m2566l6918j3801J0352K1848J8176L267
594e089q169j0764j0271j52J6251J8024J0146J2295J7389J1604K771q800k1847
607B3388k6550j9406k913J4987J6068J798o888j1627j8020j4708k088K559M795
620c8605J3718K0433K0655J7733J2470J0046P264l430j1091j1072j7282k5929
$$ plain form
632 -5090 -28869 -50453 -73489 -86842 -78862 -53352 -19707 10134 28761 36615 34218 26817 25285
645 25285 29175 26260 20820 22879 22776 14055 2366 -9728 -23223 -34069 -38191 -30962 -16275 -7115
659 -7115 -2554 2292 -1495 -16003 -21301 -11602 1843 15466 29187 37609 38299 35570 33741 32909 19737
674 19737 -8712 -33145 -42141 -46877 -46988 -36628 -27199 -24038 -15808 3616 26935 42079 44206 40531
688 40531 35267 22685 9223 6262 2301 -14390 -30823 -36528 -37532 -32046 -17190 2490 13195
701 13195 8307 -2009 -8 10503 17005 21288 23072 12047 -3974 -3876 7772 13690 6681 -5109
715 -5109 -13267 -15293 -13688 -7197 -2537 -14648 -37145 -41779 -24172 -578 23554 44256 49621 37518
729 37518 20667 13603 16926 16159 3622 -9734 -22276 -35739 -37115 -21039 -10293 -19307 -33477
$$ packed form
632e090k3779k1584k3036j3353P980K5510L3645K9841J8627P854k397p401j532
645B5285L890k915n440K059j03q721j1689j2094j3495j0846m122P229J4687R160
659g115M561M846l787j4508n298R699J3445J3623J3721Q422O90k729j829q32j3172
674A9737k8449k4433q996m736j11J0360R429L161Q230J9424K3319J5144K127l675
688D0531n264j2582j3462k961l961j6691j6433n705j004N486J4856J9680J0705
701A3195m888j0316K001J0511O502M283J784j1025j6021R8J1648N918p009j1790
715e109q158k026J605O491M660j2111k2497m634J7607K3594K4132K0702N365j2103
729C7518j6851p064L323p67j2537j3356j2542j3463j376J6076J0746r014j4170
$$ plain form
742 -33477 -35686 -20242 9203 39928 58445 53624 26450 2644 2995 13406 12540 2839 -10657
755 -10657 -25856 -30730 -16625 3102 9804 -3483 -23407 -30678 -23304 -9457 8262 21164 13535
768 13535 -4252 -6277 9129 29619 43165 41047 21636 -5440 -26007 -26520 -11775 -5077 -14791
781 -14791 -24738 -24955 -16220 1673 18704 17914 -175 -17208 -16503 4656 27929 36631 31397 15713
795 15713 -6236 -18521 -14162 -8341 -9851 -12554 -12327 -7515 1208 9605 14389 12720 1932 -9567
809 -9567 -9904 -4115 -64 4649 6803 1901 -3257 -2048 3654 8234 6488 -1350 -6758 -8904 -11774
824 -11774 -10605 -3531 1944 7077 16766 21160 15579 2904 -10289 -14920 -8678 -2039 -786 -2452
838 -2452 -6815 -8180 1302 11979 9354 -4363 -18235 -22123 -9176 13301 28062 27503 11378 -9679
$$ packed form
742c3477k209J5444K9445L0725J8517m821k7174k3806L51J0411q66r701j3496
755a0657j5199m874J4105J9727O702j3287j9924p271P374J3847J7719J2902p629
768A3535j7787k025J5406K0490J3546k118j9411k7076k0567n13J4745O698r714
781a4791r947k17Q735J7893J7031p90j8089j7033P05K1159K3273Q702n234j5684
795A5713k1949j2285M359N821j510k703K27M812Q723Q397M784j669j0788j1499
809i567l37N789M051M713K154m902n158J209N702M580j746p838n408k146k870
824a1774J169P074N475N133R689M394n581j2675j3193m631O242O639J253j666
838b452m363j365R482J0677k625j3717j3872l888J2947K2477J4761n59j6125k1057
$$ plain form
852 -9679 -16253 -3363 11154 16055 7687 -11117 -25603 -21557 -3506 14849 19011 2924 -19467
865 -19467 -26416 -13516 9206 26339 20620 -5531 -25852 -20144 7795 39244 47546 21666 -17059
878 -17059 -41090 -35817 -4497 24240 23709 -865 -23914 -26264 -4323 23370 29738 7573 -24854
891 -24854 -42280 -28555 10199 41400 40911 13635 -21121 -37371 -18862 17609 40371 34088 3759
904 3759 -27485 -32671 -10549 15498 24046 6616 -25130 -40257 -22483 11379 34755 29056 -3247
917 -3247 -34213 -34174 -5612 30137 46630 27670 -9850 -32948 -28209 -1790 25489 31054 11555
930 11555 -11494 -19617 -10088 9528 17221 1733 -23444 -38816 -33256 -6435 23097 32945 18875
943 18875 -4671 -20128 -12357 12971 32446 31678 12897 -11349 -22584 -12430 3860 9712 911
$$ packed form
852i679o574J2890J4517M901q368j8804j4486M046J8051J8355M162j6087k2391
865a9467o949J2900K2722J7133n719k6151k0321N708K7939L1449Q302k5880l8725
878a7059k4031N273L1320K8737n31k4574k3049k350K1941K7693O368k2165l2427
891b4854j7426J3725L8754L1201m89k7276l4756j6250J8509L6471K2762o283l0329
904C759l1244n186K2122K6047Q548j7430l1746j5127J7774L3862K3376n699l2303
917c247l0966L9K8562L5749J6493j8960l7520k3098M739K6419K7279N565j9499
930A1555k3049q123R529J9616P693j5488k5177j5372N560K6821K9532R848j4070
943A8875k3546j5457P771K5328J9475p68j8781k4246j1235J0154J6290N852q801
$$ plain form
956 911 -16041 -26491 -17411 2259 16211 17254 3554 -14141 -18335 -7159 6441 14637 13801 3990
970 3990 -3197 -1544 4562 12305 15387 7503 -4021 -10350 -11897 -8212 -825 485 -6393 -13027 -15352
985 -15352 -11126 871 10919 13067 11682 7143 3493 5551 7928 2837 -4206 -8330 -9410 -4578
999 -4578 2976 5333 3646 -27 -5902 -7611 -4861 -2170 2086 8481 9344 3544 -2368 -8910 -12264
1014 -12264 -7743 795 7674 11802 10239 6030 3362 -1397 -9481 -14193 -13490 -9468 1083 12794
1028 12794 16472 12015 4097 -4905 -8652 -5169 229 7725 13116 9794 1246 -7609 -17531 -23539 -20043
1043 -20043 -11327 -1773 7910 15509 17906 16998 9770 -938 -6971 -6171 640 12502 20512 13864 -131
1058 -131 -12995 -21616 -22753 -16571 -9111 -2161 2994 4731 5137 3335 -4713 -10820 -6621 2308 13455
$$ packed form
956I11j6952j0450R080J9670J3952J043j3700j7695m194J1176J3600Q196q36r811
970C990p187J653O106P743L082p884j1524o329j547L685P387J310o878o634k325
985a5352M226J1997J0048K148j385m539l650K058K377n091p043m124j080M832
999d578P554K357j687l673n875j709K750K691M256O395Q63n800n912o542l354
1014a2264M521Q538O879M128j563m209k668m759q084m712P03M022J0551J1711
1028A2794L678m457p918r002l747L483N398P496N391l322q548q855r922o008L496
1043b0043Q716R554R683P599K397r08p228j0708o033Q00O811J1862Q010o648j3995
1058a31j2864q621j137O182P460O950N155J737M06j802q048o107M199Q929J1147
$$ plain form
1073 13455 26080 31486 24845 10704 -4978 -16743 -20200 -16589 -8516 1086 2861 -5183 -12456 -15890
1087 -15890 -17986 -14921 -5279 3556 12194 21797 28388 28732 18927 1688 -10195 -10505 -6107 1250 9455
1102 9455 7086 -5542 -16054 -19589 -19973 -17068 -11482 -3749 4804 9533 11931 15949 15120 6542 1183
1117 1183 2631 3493 4389 8985 10062 2000 -11320 -21440 -20977 -14024 -6711 1804 7901 4261 -1662
1132 -1662 2841 9503 7905 2095 -1291 -1371 1848 6414 10476 9574 -2005 -15989 -17095 -10273 -6503
1147 -6503 -2362 4117 5286 1228 633 4266 7038 4461 1100 3006 7200 5828 5802 9434 3891 -11521
1163 -11521 -20830 -18999 -14384 -8613 -1595 2694 1647 -2185 806 12595 17371 11353 8424 10460
1177 10460 9163 7297 8238 3744 -9325 -20122 -19668 -10850 -5885 -8533 -9670 -6852 -6458 -3393 8263
$$ packed form
1073A3455J2625N406o641j4141j5682j1765l457L611Q073R602J775q044p273l434
1087a5890k096L065R642Q835Q638R603O591L44r805j7239j1883l10M398P357Q205
1102I455k369j2628j0512l535l84K905N586P733Q553M729K398M018q29q578n359
1117A183J448Q62Q96M596J077q062j3320j0120M63O953P313Q515O097l640n923
1132a662M503O662j598n810l386q0L219M566M062r02j1579j3984j106O822L770
1147f503M141O479J169m058n95L633K772k577l361J906M194j372k6L632n543j5412
1163a1521r309J831M615N771P018M289j047l832K991J1789M776o018k929K036
1177A0460j297j866R41m494j3069j0797M54Q818M965k648j137K818L94L065J1656
$$ plain form
1192 8263 14640 8298 2111 3560 9026 12838 15010 15580 11129 -309 -9405 -5936 -2187 -8025 -14757
1207 -14757 -17076 -20561 -20273 -10247 2380 6264 481 -3622 4863 19874 28646 30434 24094 5268
1221 5268 -13291 -12927 -1375 3396 -2430 -12473 -20097 -20951 -15040 -4304 3817 -1080 -9923 -4294
1235 -4294 12584 24899 27732 21680 4351 -14307 -20008 -9117 6676 13079 6015 -3767 -9970
1248 -9970 -11706 -5645 4959 4187 -9213 -18583 -13964 618 16520 23475 16959 2035 -9766 -7510
1262 -7510 8994 19627 11043 -6600 -21006 -26342 -17185 -23 8886 4003 -6355 -9458 -145
1275 -145 14602 20763 16581 5997 -5361 -7254 5281 17115 14403 -118 -19463 -32535 -30545
1288 -30545 -16825 -646 9394 7601 918 2586 11260 17727 17860 8661 -7029 -14727 -6570 8755
$$ packed form
1192H263O377o342o187J449N466L812K172N70m451j1438r096L469L749n838o732
1207a4757k319l485K88J0026J2627L884n783m103Q485J5011Q772J788o340j8826
1221E268j8559L64J1552M771n826j0043p624q54N911J0736Q121m897q843N629
1235d294J6878J2315K833o052j7329j8658n701J0891J5793O403p064r782o203
1248i970j736O061J0604p72j3400r370M619J4582J5902O955o516j4924j1801K256
1262g510J6504J0633q584j7643j4406n336R157J7162Q909m883j0358l103R313
1275a45J4747O161m182j0584j1358j893J2535J1834k712j4521j9345j3072J990
1288c0545J3720J6179J0040j793o683J668Q674O467J33r199j5690p698Q157J5325
$$ plain form
1302 8755 19213 16566 1229 -13450 -16983 -10215 -523 3073 -6978 -20915 -23282 -13176 2477
1315 2477 15550 17063 9221 3851 6810 14222 20435 16780 3209 -9339 -13208 -9049 842 6219
1329 6219 -1504 -15901 -25349 -25390 -14625 2398 12376 12296 8196 5237 9211 17332 17856 7914 -5965
1344 -5965 -17380 -17819 -4321 10337 13215 5002 -5766 -11096 -5726 4155 7766 2711 -8704 -17836
1358 -17836 -13930 -420 9563 11640 7776 -149 -3764 1036 7799 9703 4479 -5695 -11672 -7801
1372 -7801 344 8210 12762 6557 -6538 -13556 -10308 -2042 6456 9240 4305 -1331 -4212 -2282 3050
1387 3050 2748 -6714 -14941 -14545 -6997 5166 16935 18722 11206 3435 18 2645 5838 4052 -1997
1402 -1997 -6917 -11063 -12110 -7024 -2451 -2802 -4018 -4005 -2792 1034 5914 8384 8682 4765 -830 -1007
$$ packed form
1302H755J0458k647j5337j4679l533O768R692L596j0051j3937k367J0106J5653
1315B477J3073J513p842n370K959P412O213l655j3571j2548l869M159R891N377
1329F219p723j4397r448m1J0765J7023R978q0m100k959L974Q121N24r942j3879
1344e965j1415m39J3498J4658K878q213j0768n330N370R881L611n055j1415r132
1358a7836L906J3510R983K077l864p925l615M800O763J904n224j0174n977L871
1372g801Q145P866M552o205j3095p018L248Q266Q498K784m935n636k881J930N332
1387C050l02r462q227L96P548J2163J1769J787p516p771l417K627L193j786o049
1402a997m920m146j047N086M573l51j216J3J213L826M880K470K98l917n595j77
$$ plain form
1418 -1007 3471 6113 6818 5889 -731 -6905 -7784 -4552 -1274 507 -2109 -4683 -3578 -2686 -2496 -1055
1434 -1055 -2376 -4206 -1214 5402 10332 12630 11186 6504 1585 -3104 -6378 -6486 -5245 -5902 -4952 -2839
1450 -2839 -3499 -3920 -955 1814 3642 4631 4061 4636 7555 8570 6974 4044 -3085 -10303 -11966 -10949
1466 -10949 -10307 -8213 -5686 -2469 3727 10120 13146 13444 9697 2873 -780 -1285 -2083 -532 1646 1533
1482 1533 -879 -3701 -7776 -9853 -8492 -7311 -5832 -2864 -2405 -993 3417 6750 6773 7080 7612 8016
1498 8016 10647 11733 7759 1481 -5686 -10084 -7540 -2425 -645 -2583 -7569 -15345 -20017 -18787 -14422
1513 -14422 -5472 6366 16984 24761 29023 26641 18990 9392 -2518 -12666 -15901 -13328 -7534 -40
1527 -40 2185 -2531 -10271 -15770 -15768 -8170 885 4737 5217 4514 3733 8103 14077 15281 11583 6564 582
$$ packed form
1418a007M478K642P05r29o620o174q79L232L278J781k616k574J105Q92J90J441
1434a055j321j830K992O616M930K298j444m682m919m689l274j08J241o57R50K113
1450b839o60m21K965K769J828R89n70N75K919J015j596k930p129p218j663J017
1466a0949O42K094K527L217O196O393L026K98l747o824l653n05p98J551K178j13
1482A533k412k822m075k077J361J181J479K968M59J412M410L333K3L07N32M04
1498H016K631J086l974o278p167m398K544N115J780j938m986p776m672J230M365
1513a4422Q950J1838J0618P777M262k382p651r598j1910j0148l235K573N794P494
1527d0K225m716p740n499KP598R055L852M80p03p81M370N974J204l698n019n982
$$ plain form
1544 582 -2125 -770 -751 -3257 -7190 -11661 -12572 -7209 -1730 1092 239 -5734 -13194 -12940 -3933 9225
1560 9225 21433 26096 20484 11775 5543 2461 1160 -4234 -16955 -27905 -28649 -19622 -2573 13551
1574 13551 18935 12773 3953 -899 853 6001 6347 2075 -2003 -4193 -990 7407 11531 3823 -9925
1589 -9925 -21590 -24316 -14354 2521 15911 19550 10310 -3587 -8336 -2949 4678 9837 9332 1238
1603 1238 -5920 -4220 4191 9028 5979 -4126 -12050 -11426 -5903 117 701 -9585 -23483 -24326 -8693
1618 -8693 13616 32998 40275 32281 15182 -1499 -10498 -9751 -7769 -9910 -10820 -10022 -8931 -6676 -3026
1633 -3026 -4700 -11324 -14407 -8419 5689 20151 25490 21792 10614 -3310 -9580 -3169 5979 6789
1647 6789 2496 -3177 -7939 -9004 -5989 -3274 -3124 -6481 -8049 -3800 393 -1962 -5597 -5793 -3681
$$ packed form
1544E82k707J355J9k506l933m471r11N363N479K822q53n973p460K54R007J3158
1560I225J2208M663n612q709o232l082j301n394j2721j0950p44R027J7049J6124
1574A3551N384o162q820m852J752N148L46m272m078k190L203Q397M124p708j3748
1589i925j1665k726R962J6875J3390L639r240j3897m749N387P627N159n05q094
1603A238p158J700Q411M837l049j0105p924O24N523O020N84j0286j3898q43J5633
1618h693K2309J9382P277p994j7099j6681q999P47J982k141r10P98J091K255L650
1633c026j674o624l083N988J4108J4462N339l698j1178j3924o270O411R148Q10
1647F789m293n673m762j065L015K715J50l357j568M249M193k355l635j96K112
$$ plain form
1662 -3681 4032 16824 25853 24444 14509 2331 -5673 -9135 -11373 -11737 -9800 -10927 -11952 -7866 -1857
1677 -1857 -275 -389 1605 4764 10676 16809 18817 14089 1313 -12551 -15923 -9081 -2237 2407 2015
1692 2015 -5875 -13143 -9505 1788 11846 13339 7153 576 -2089 -1143 786 1409 -4518 -11693 -8432
1707 -8432 4469 16499 20061 11450 -5903 -21431 -25678 -16051 1243 12065 9586 2141 -4098
1720 -4098 -5946 61 10372 14337 10136 4428 2958 6509 10203 6474 -5730 -20200 -30531 -26679
1734 -26679 -9681 5635 8417 1765 -5451 -6999 3367 20649 31190 27143 10916 -5775 -12692
1747 -12692 -10668 -6434 -2775 -2932 -6997 -7238 -154 5710 4072 -4245 -15160 -21258 -17236 -3472 13588
1762 13588 24006 20367 9844 2888 1133 3543 8800 9211 954 -9060 -12696 -9040 -2626 -986
$$ packed form
1662c681P713J2792R029j409r935j2178q004l462k238l64J937j127j025M086O009
1677a857J582j14J994L159N912O133K008m728j2776j3864l372O842O844M644l92
1692B015p890p268L638J1293J0058J493o186o577k665R46J929O23n927p175L261
1707h432J2901J2030L562q611j7353j5528m247R627J7294J0822k479p445o239
1720d098j848O007J0311L965m201n708j470L551L694l729j2204j4470j0331L852
1734b6679J6998J5316K782o652p216j548J0366J7282J0541m047j6227j6691o917
1747a2692K024M234L659j57m065k41P084N864j638q317j0915o098M022J3764J7060
1762A3588J0418l639j0523o956j755K410N257M11q257j0014l636L656O414J640
$$ plain form
1776 -986 -4629 -10710 -15084 -13975 -4755 6181 9331 7318 8280 11343 14548 17539 15313 5841 -7817
1791 -7817 -18501 -20486 -14576 -8660 -3371 3168 5367 3720 4148 6472 4676 -21 -4321 -5791 -4366
1806 -4366 -620 4964 10790 10256 3055 -2951 -3833 -5576 -7429 -7086 -5914 -6070 -3414 3172 9626 11004
1822 11004 6720 3121 1125 -1667 -4236 -1455 880 -27 458 3663 4298 381 -4583 -8239 -10519
1837 -10519 -12737 -12888 -5803 2958 8294 13130 17837 16433 9780 4662 1474 -2822 -7388 -9472 -7559
1852 -7559 -4527 -4064 -3139 -1099 -2974 -7084 -6438 -2637 -1635 -1184 2331 6745 10274 11627 12417 12374 8106
1869 8106 -63 -4897 -6955 -10905 -12464 -7882 -2545 -1109 -482 770 589 -1116 -3146 -2276 -345 -896
1885 -896 796 6615 11627 10507 7839 5219 895 -3118 -5124 -5494 -5770 -7190 -7653 -4569 -1138 -834
$$ packed form
1776i86l643o081m374J109R220J0936L150k013R62L063L205K991k226r472j3658
1791g817j0684j985N910N916N289O539K199j647M28K324j796m697m300j470J425
1806d366L746N584N826n34p201o006q82j743j853L43J172j56K656O586O454J378
1822A1004m284l599j996k792k569K781K335r07M85L205O35l917m964l656k280
1837a0519k218j51P085Q761N336M836M707j404o653n118l188m296m566k084J913
1852g559L032M63R25K040j875m110O46L801J002M51L515M414L529J353P90m3m268
1869H106q169m834k058l950j559M582N337J436O27J252j81j705k030Q70J931n51
1885h96J692N819N012j120k668k620m324m013k006l70k76j420m63L084L431L04
$$ plain form
1901 -834 251 3070 3170 1584 2166 3417 3630 3874 4387 4428 2751 -1783 -5472 -5446 -6893 -9533 -8543 -4735
1919 -4735 -581 4863 10616 12630 10320 5435 1302 -206 -1117 -3402 -4652 -4603 -6180 -6153 -3098 -993
1935 -993 -1526 -2045 -2100 -1405 732 2756 5652 8343 6820 3070 1284 902 1085 2753 3676 1106 -2031
1952 -2031 -3492 -3475 -2299 -3127 -7783 -11819 -12697 -11356 -5468 2789 7418 8591 10020 12306 15095 16765
1968 16765 13742 6780 -1309 -9696 -14411 -13633 -11280 -10004 -8153 -6809 -5028 -1687 2025 4149 4387
1983 4387 3163 1772 4631 10169 13425 12899 7370 -1508 -8905 -9710 -6469 -1953 -118 -2016 -3429
1998 -3429 -2210 -25 -130 -2547 -7754 -12866 -11114 -2781 7134 14774 16723 13662 10486 8855 7529
2013 7529 5656 -594 -10993 -19278 -21235 -17846 -10594 -1945 3133 4442 6111 7707 11354 13895 10772
$$ packed form
1901h34J085K819J00j586N82J251K13K44N13M1j677m534l689K6j447k640R90L808
1919d735M154N444N753K014k310m885m133j508r11k285j250M9j577K7L055K105
1935i93n33n19n5O95K137K024K896K691j523l750j786l82J83J668R23k570l137
1952b031j461J7J176q28m656m036q78J341N888Q257M629J173J429K286K789J670
1968A6765l023o962q089q387m715P78K353J276J851J344J781L341L712K124K38
1983D387j224j391K859N538L256n26n529q878p397q05L241M516J835j898j413
1998c429J219K185j05k417n207n112J752Q333R915P640J949l061l176j631j326
2013G529j873o250j0399q285j957L389P252Q649N078J309J669J596L647K541l123
$$ plain form
2028 10772 3753 -2333 -4887 -3128 2680 5327 196 -8463 -15089 -15665 -9201 -1295 2405 3084 2264
2043 2264 2877 8949 14685 13306 5211 -4634 -11285 -8824 -1071 6259 8672 6371 372 -3360 -2978
2058 -2978 -3277 -7092 -13235 -19301 -20412 -11902 2280 15449 22332 21636 15561 11705 11044 10610 8397
2073 8397 298 -12431 -21151 -20772 -14692 -7169 -3889 -7217 -10686 -9155 -1352 8261 15029 14278 9388
2088 9388 7337 9982 14208 15835 9041 -3219 -14384 -19308 -15687 -6937 -555 -84 -1888 -3480 -3436
2103 -3436 -1075 477 -2198 -6510 -8614 -4507 5641 17321 22926 21150 13788 4792 -742 -1627 -3423
2118 -3423 -8891 -16663 -22764 -22057 -13385 -2713 5057 7245 5103 3560 7405 13314 15355 13159 6935
2133 6935 -118 -2975 -2151 -1806 -4372 -10194 -16082 -15925 -9712 -1596 5786 9267 7464 4538 4512 6433
$$ packed form
2028A0772p019o086k554J759N808K647n131q659o626n76O464P906L700O79q20
2043B264O13O072N736j379q095r845o651K461P753P330K413k301n999l732L82
2058b978k99l815o143o066j111Q510J4182J3169O883o96o075l856o61m34k213
2073H397q099j2729q720L79O080P523L280l328l469J531P803R613O768p51m890
2088I388k051K645M226J627o794j2260j1165m924L621Q750O382M71j804j592M4
2103c436K361J552k675m312k104M107J0148J1680N605j776p362q996n534q85j796
2118c423n468p772o101P07Q672J0672P770K188k142j543L845N909K041k196o224
2133F935p053k857Q24L45k566n822n888J57O213Q116P382L481j803k926k6J921
$$ plain form
2149 6433 7310 5486 516 -5693 -7768 -5748 -31 5459 6066 1565 -2652 -4745 -5214 -4450 -4985 -8315
2165 -8315 -10564 -7082 1133 11007 17074 15839 10289 5088 1609 2233 4819 2548 -4234 -10150 -13928
2180 -13928 -14722 -12848 -10477 -8856 -6489 -2519 4042 13127 18718 18367 15095 9539 2964 -6 220
2195 220 -794 -4406 -9136 -12749 -12341 -8094 -3203 1081 2400 -1229 -3764 -2133 -133 741 1959 2525
2211 2525 2919 5477 9484 12107 11225 5474 -427 -3261 -4493 -5593 -4936 -4847 -8428 -11342 -10957 -8757
2227 -8757 -5783 -2195 2114 6898 10344 11827 13747 15154 11376 4454 -630 -5961 -10879 -11768 -9726
2242 -9726 -7131 -5942 -3802 223 4525 5819 3986 3181 799 -3366 -3529 220 2404 2508 3830 4621
2258 4621 4730 2363 -112 -970 -3010 -6011 -5848 -2687 -2327 -2573 -450 2248 1383 -49 439 2231 3247
$$ packed form
2149F433Q77j824m970o209k075K020N717N490O07m501m217k093m69P64n35l330
2165h315k249L482Q215R874O067j235n550n201l479O24K586k271o782n916l778
2180a3928p94J874K371J621K367L970O561R085N591l51l272n556o575k970K26
2195B20j014l612m730l613M08M247M891M284J319l629k535J631K000Q74J218N66
2211B525L94K558M007K623q82n751n901k834j232j100O57Q9l581k914L85K200
2227h757K974L588M309M784L446J483J920J407l778o922n084n331m918q89K042
2242i726K595J189K140M025M302J294j833q05k382m165j63L749K184J04J322P91
2258D621J09k367k475q58k040l001J63L161L60k46K123K698q65j432M88J792J016
$$ plain form
2275 3247 3104 4549 6472 5012 1323 593 -1097 -6393 -11094 -11651 -10273 -8528 -3964 2115 7709 10748
2291 10748 11644 12965 11518 5135 -1110 -3823 -5538 -8319 -7502 -3988 -1443 -1082 -767 92 -673 -3868
2307 -3868 -5350 -2490 327 305 3554 7515 8175 6530 6127 4914 1311 -2287 -3616 -2566 -2599 -4624
2323 -4624 -3708 -662 -1686 -3711 -3319 -3026 -5166 -4872 -1998 2057 4347 6011 8992 11534 9271 4204
2339 4204 1236 -2391 -7216 -9004 -6594 -4824 -4367 -2342 1696 4210 3959 1607 225 -1194 -4263
2354 -4263 -3977 51 1599 1074 1946 4280 4206 2762 1307 -445 -2915 -4994 -4568 -139 2695 2880 3138
2371 3138 2848 -1101 -3856 -2556 -1244 -982 -1747 -2135 -1048 849 1861 3385 3339 -1203 -4387 -2654
2387 -2654 -56 1543 2306 1979 837 1587 4088 6883 6644 1550 -5445 -8744 -8880 -7012 -2393 1101
$$ packed form
2275C247j43J445J923j460l689p30j690n296m701n57J378J745M564O079N594L039
2291A0748Q96J321j447o383o245k713j715k781Q17L514K545L61L15Q59p65l195
2307c868j482K860K817k2L249L961O60j645m03j213l603l598j329J050l3k025
2323d624R16L046j024k025L92K93k140K94K874M055K290J664K981K542k263n067
2339D204k968l627m825j788K410J770M57K025M038K514k51k352j382j419l069
2354d263K86M028J548n25Q72K334p4j444j455j752k470k079M26M429K834J85K58
2371C138k90l949k755J300J312K62p65l88J087J897J012J524m6m542l184J733
2387b654K598J599P63l27j142P50K501K795k39n094o995l299j36J868M619L494
$$ plain form
2403 1101 725 -844 -701 440 2547 3452 1732 -29 -512 686 4650 8900 8224 3150 -1981 -5691
2419 -5691 -6246 -2738 -61 -942 -4139 -7080 -7133 -2355 2834 4148 3053 218 -1207 1702 6232 7342
2435 7342 5071 987 -2607 -2472 974 2969 1540 -2926 -8679 -10141 -5907 -83 4716 6569 3944
2450 3944 -79 -1030 161 982 1031 -900 -3178 -2313 1406 5262 6968 3964 -3307 -7508 -6205 -1684
2466 -1684 3716 6464 2913 -2580 -5074 -3549 740 3419 2597 -54 -1880 -1198 901 3702 1920
2481 1920 -3308 -5963 -4854 -1385 2403 4174 1181 -2842 -4501 -1569 5473 11150 10239 5408 -777
2496 -777 -6608 -8153 -5367 -3931 -3941 -4680 -3769 229 5170 6672 4573 341 -4838 -5723 522 6232
2512 6232 7083 3781 -1564 -5337 -3799 1115 5242 5710 934 -4513 -5193 -2301 -122 898 -803 -4438
$$ packed form
2403A101l76j569J43J141K107R05j720j761m83J198L964M250o76n074n131l710
2419e691n55L508K677q81l197k941n3M778N189J314j095k835j425K909M530J110
2435G342k271m084l594J35L446J995j429m466n753j462M234N824M799J853k625
2450C944m023r51J191Q21M9j931k278Q65L719L856J706l004p271m201J303M521
2466a684N400K748l551n493k494J525M289K679q22k651j826O82K099K801j782
2481A920n228k655J109L469L788J771k993m023j659K932P042N677r11m831o185
2496g77n831j545K786J436j0p39R11L998M941J502k099m232n179q85O245N710
2512F232Q51l302n345l773J538M914M127M68m776n447o80K892K179J020j701l635
$$ plain form
2528 -4438 -6451 -3703 749 3080 2441 -644 -1304 1859 6658 11266 12585 6414 -3699 -10142 -11263
2543 -11263 -8088 -2837 259 160 -835 -777 1579 4900 5655 669 -3547 -5202 -4231 -176 3892 3382 -382
2560 -382 -2692 -2078 2869 7683 8145 4418 -693 -5816 -7012 -3899 126 911 -15 -2017 -3466 -2814
2576 -2814 -1272 -238 891 655 1263 3743 6987 6771 3931 -1086 -6992 -9741 -7267 -1402 3855 6262
2592 6262 5292 3089 2581 1418 928 135 -2313 -5670 -7048 -5691 -3948 -1645 -285 560 2610 4689
2608 4689 6398 7007 5573 1393 -2092 -2935 -3649 -2191 375 1726 1371 311 -2026 -3245 -2657 -1933
2624 -1933 -1002 800 1328 650 957 59 -1962 -2719 -2605 -1469 1594 4283 5415 6206 5337 3111 1393
2641 1393 -188 -2444 -4598 -5265 -6678 -5927 -4798 -3497 -1037 1919 4121 5936 6520 4142 1545 -244
$$ packed form
2528d438k013K748M452K331o39l085o60L163M799M608J319o171j0113o443j121
2543a1263L175N251L096r9r95N8K356L321P55m986m216j655R71M055M068n10l764
2560c82k310O14M947M814M62l727n111n123j196L113M025P85r26k002j449O52
2576b814J542J034J129k36O08K480L244k16k840n017n906k749K474N865N257K407
2592F262r70k203n08j163m90p93k448l357j378J357J743K303J360Q45K050K079
2608D689J709O09j434m180l485q43p14J458K566J351l55j060k337j219N88P24
2624a933R31J802N28o78L07q98k021p57J14J136L063K689J132P91q69k226j718
2641A393j581k256k154o67j413P51J129J301K460K956K202J815N84k378k597j789
$$ plain form
2657 -244 -1842 -1901 -800 -86 -145 900 1105 521 116 -867 -1931 -1765 -858 -984 -300 468 -702 -1217 -1299
2676 -1299 -1570 -633 1624 3115 3641 3593 1941 423 10 -706 -1441 -1511 -2679 -3967 -3227 -1958 -550 1331
2694 1331 2476 3048 3713 4465 3441 1893 -643 -3862 -5143 -4813 -3992 -2086 463 903 374 795 692
2711 692 1106 2151 2504 2584 2720 1404 382 810 335 -1422 -2087 -2323 -2217 -1176 307 288 -1170 -3378
2729 -3378 -4115 -2663 -462 412 1563 2511 1724 2178 4172 5130 4430 3390 2063 107 -955 -2907 -3648
2746 -3648 -4401 -6113 -6192 -3948 -1843 -361 1918 2912 1761 958 1469 2410 3993 3475 2667 2033 1205 -201
2764 -201 201 -40 -1975 -3352 -2891 -1754 -810 -742 -1164 -2480 -3506 -3290 -1049 1313 2069 1716 2685 3617
2782 3617 3692 4250 4280 2236 -9 -1706 -2741 -2609 -2912 -3955 -2929 -2102 -1297 272 2535 2325 381
$$ packed form
2657b44j598n9J101P14n9J045K05n84m05r83j064J66R07j26O84P68j170n15q2
2676a299k71R37K257J491N26m8j652j518m13p16p35p0j168j288P40J269J408J881
2694A331J145N72O65P52j024j548k536l219j281L30Q21J906K549M40n29M21j03
2711F92M14J045L53Q0J36j316j022M28m75j757o65k36J06J041J483j9j458k208
2729c378p37J452K201Q74J151R48p87M54J994R58p00j040j327j956j062j952p41
2746c648p53j712p9K244K105J482K279R94j151q03N11R41J583n18q08o34q28j406
2764b01M02k41j935j377M61J137R44O8m22j316j026K16K241K362P56l53R69R32
2782C617P5N58L0k044k245j697j035J32l03j043J026Q27Q05J569K263k10j944
$$ plain form
2799 381 -515 -635 -815 294 1542 1918 1409 -13 419 2203 2052 381 -1094 -1977 -2217 -951 1309
2816 1309 1284 -422 -2094 -2699 -659 1036 1184 1283 -23 -1840 -1143 2053 3198 1750 -502 -2932 -4030
2833 -4030 -2663 175 2333 2660 867 172 2237 3884 3883 2804 -115 -4404 -6901 -5258 -2190 -557
2849 -557 -531 -1658 -1244 643 3383 6023 5811 1098 -3122 -3327 -1585 1620 3701 2530 -1134 -3626
2865 -3626 -3253 418 3346 2220 -939 -2712 -3519 -2580 1296 2969 361 -3274 -4560 -2380 1414 4082
2881 4082 4669 2941 -143 -2048 664 4061 3872 296 -3211 -6680 -7027 -3472 1682 4003 2528 -102
2897 -102 -481 1953 3144 3374 1407 -3033 -7726 -6500 -1482 2387 2507 1304 -422 -331 1782 5020
2913 5020 7069 4028 -1265 -4827 -3563 -1974 -434 970 -638 -3653 -4545 -1836 2394 4053 2662
$$ packed form
2799C81q96j20j80J109J248L76n09j422M32J784j51j671j475q83k40J266K260
2816A309k5j706j672o05K040J695J48R9j306j817O97L196J145j448k252k430j098
2833d030J367K838K158L27j793o95K065J647jj079k919m289k497J643L068J633
2849e57K6j127M14J887K740K640k12m713m220k05J742L205K081j171l664k492
2865c626L73L671K928j126l159j773q07R39L876J673k608l635j286K180L794K668
2881D082N87j728l084j905K712L397j89l576l507l469l47L555N154K321j475k630
2897a02l79K434J191K30j967m440m693J226N018L869J20j203j726R1K113L238
2913E020K049l041n293l562J264J589J540J404j608l015q92K709M230J659j391
$$ plain form
2928 2662 -119 -1530 -2299 -1094 2473 3310 88 -2744 -2234 104 3334 5458 5136 2750 -537 -1973
2944 -1973 -332 940 -2352 -6333 -7859 -7836 -5362 -235 3860 4268 2644 2156 4086 6141 6161 5294 2936
2961 2936 -1379 -5244 -4281 -1884 -1895 -2602 -2509 -2071 -1109 358 1919 2330 -337 -3628 -3322 -666 898
2978 898 2085 3000 1979 -71 732 3296 4836 4120 1430 -995 -2156 -3395 -3688 -2624 -3110 -4972
2994 -4972 -4456 -1308 1283 2725 3190 3223 2673 2026 2369 3511 2919 -358 -2833 -3640 -4057 -3798 -1394 458
3012 458 1078 1264 1734 2423 2966 1641 479 -835 -2745 -3520 -2121 -319 -614 -1173 -430 537 1753 2883
3030 2883 2938 1874 -182 -2229 -1993 -498 -488 -392 260 280 160 1055 1563 1700 1219 -568 -985 -956 -1688 -2128
3050 -2128 -1523 -1974 -2650 -1827 -505 699 2186 3285 3417 3730 3246 2704 2598 1628 -1473 -3657 -4333 -4691
$$ packed form
2928B662k781j411p69J205L567Q37l222k832N10K338L230K124l22k386l287j436
2944a973J641J272l292l981j526K3K474N127M095M08j624m88J930K055K0q67k358
2961B936m315l865R63K397j1p07R3M38R62J467J561M11k667l291L06K656J564
2978H98J187R15j021k050Q03K564J540p16k690k425j161j239k93J064m86j862
2994d972N16L148K591J442M65L3n50o47L43J142n92l277k475q07m17K59K404J852
3012D58O20J86M70O89N43j325j162j314j910p75J399J802k95n59P43R67J216J130
3030B883N5j064k056k047K36J495J0R6O52K0j20Q95N08J37m81j787m17K9p32m40
3050b128O05m51o76Q23J322J204J487J099J32L13m84n42j06r70l101k184o76l58
$$ plain form
3068 -4691 -4185 -1902 -725 208 710 1145 1891 2313 1453 746 604 -309 -780 -430 48 -115 318 969 931
3087 931 1554 1449 812 -204 -1124 -2998 -3075 -1829 -1135 -297 382 -30 -594 -502 -140 924 2040 2113 1884
3106 1884 1649 1180 -249 -1449 -2115 -2506 -1751 -593 666 1706 2042 1102 767 33 -535 -621 -490 -822
3124 -822 -1355 -1809 -2809 -3163 -2513 -595 1924 4463 4600 4504 3277 1656 -594 -1269 -1065 -1410 -922 -849
3142 -849 -867 -1076 -1767 -2705 -2024 -1572 -1113 797 2436 2245 1488 342 -1015 -1506 289 2585 4167 4304
3160 4304 2184 -298 -1345 -1893 -1726 -708 -786 -1699 -2290 -2077 -1892 -1266 -1284 -1453 -679 1181 2961 5303
3178 5303 5123 2491 -320 -1683 -1868 -287 1257 1515 127 -2388 -3880 -3245 -531 1284 1467 1019
3194 1019 -295 -1135 -319 8 287 -788 -1785 -1465 1291 3818 4238 2736 -96 -3279 -3478 -1332 1652
$$ packed form
3068d691N06K283J177R33N02M35P46M22q60p07j42r13m71L50M78j63M33O51l8
3087I31O23j05o37j016r20j874p7J246O94Q38O79m12n64R2L62J064J116P3k29
3106A884k35m69j429j200o66l91P55J158J259J040L36r40l35p34n68q6J31l32
3124h22n33m54j000l54O50J918K519K539J37r6j227j621k250o75K04l45M88P3
3142h49j8k09o91r38O81M52M59J910J639j91p57j146j357m91J795K296J582J37
3160D304k120k482j047n48J67J018p8r13n91K13J85O26j8j69P74J860J780K342
3178E303j80k632k811j363j85J581J544K58j388k515j492O35K714J815J83m48
3194A019j314q40Q16L27K79j075r97L20K756K527M20j502k832l183j99K146K984
$$ plain form
3211 1652 2320 1112 -1082 -2606 -1844 -270 1508 2521 630 -1259 -1422 -716 64 839 -126 -1237 -1377
3228 -1377 -262 1865 3109 1877 -751 -2462 -2772 -722 2365 4554 3620 859 -1401 -2187 -1615 -337
3244 -337 -645 -1056 -1841 -2098 -596 1359 1298 -30 -856 -1574 -551 1224 2258 2190 1104 118 393 2092
3262 2092 2784 1894 571 -1592 -3410 -3409 -2770 -1772 -1140 -740 -172 913 1599 1067 771 -176 -1657 -1060 1372
3281 1372 2635 2722 2129 1054 442 510 764 944 -858 -2983 -3969 -2924 -938 -561 -114 -355 -1323 -874
3299 -874 946 2365 1886 690 -395 61 2083 3206 4182 3056 -1109 -3982 -3261 -2194 -606 115
3315 115 -732 -1968 -2030 -639 1985 2915 1305 -1722 -2699 -2660 -552 2291 3593 1661 -507 -927 1104
3332 1104 3459 3544 1617 -2047 -4772 -5241 -2185 1529 2038 85 -1285 -2060 -1358 1420 3043 2394 141
$$ packed form
3211A652O68j208k194j524P62J574J778J013j891j889j63P06P80P75r65j111j40
3228a377J115K127J244j232k628j711l10K050L087K189r34k761k260p86N72J278
3244c37l08m11p85k57J502J955o1j328q26p18J023J775J034o8j086r86K75J699
3262B092O92q90j323k163j818JO39R98O32M00N68J085O86n32k96r47j481N97K432
3281A372J263Q7n93j075o12O8K54J80j802k125r86J045J986L77M47k41r68M49
3299h74J820J419m79j196j085M56K022J123R76j126m165k873P21J067J588P21
3315A15q47j236o2J391K624R30j610l027r77L9K108K843J302j932k168m20K031
3332A104K355Q5j927l664k725m69L056L714N09j953j370p75P02K778J623o49k253
$$ plain form
3349 141 -2137 -1553 1157 2554 2515 849 -2331 -4599 -3103 977 2778 2432 806 -1034 -1503 134
3365 134 1928 3160 1129 -2471 -4155 -2603 -468 1276 1792 556 -1802 -2126 163 2564 2988 813
3381 813 -1743 -2613 -2223 -328 3144 4458 2130 -448 -646 -488 447 858 502 -1427 -3460 -4150 -2160
3398 -2160 -515 -1097 -1521 -1100 -1289 103 3320 5709 5427 3216 806 -42 -23 -232 82 -168 -2319 -4626
3416 -4626 -3747 -1684 -1072 -985 -507 -637 -997 -99 1441 2493 1828 80 462 1593 1811 2470 3418 2480
3434 2480 -483 -1890 -1648 -1269 -1046 -1198 -1282 -2205 -3694 -3988 -1629 -430 171 1089 2756 3423 4094 4634
3452 4634 4214 2013 -528 -2130 -2547 -2269 -2344 -1898 -1359 -2043 -2254 -385 775 1303 1341 990 354 -268 -410
3471 -410 231 1419 1201 759 919 708 -582 -949 -153 -1076 -1751 -1806 -356 869 1374 1075 649 -86 -1400
$$ packed form
3349A41k278N84K710J397l9j666l180k268J496M080J801l46j626j840m69J637
3365A34J794J232k031l600j684J552K135J744N16j236k358l24K289K401M24k175
3381H13k556q70L90J895L472J314k328k578j98J58R35M11l56j929k033o90J990
3398b160J645n82m24M21j89J392L217K389k82k211k410q48J9k09L14k50k151k307
3416d626Q79K063O12Q7M78j30l60Q98J540J052o65j748L82J131K18O59R48r38
3434B480k963j407K42L79K23j52q4r23j489k94K359J199O01R18J667O67O71N40
3452D634m20k201k541j602m17K78p5M46N39o84k11J869J160N28L8l51o36o22j42
3471d10O41J188k18m42J60k11j290l67P96r23o75n5J450J225N05k99m26p35j314
$$ plain form
3490 -1400 -1572 601 1747 2105 2313 1879 290 -949 -1675 -1633 -2499 -3063 -2808 -1793 -931 65 2165 3760
3508 3760 3506 3118 3356 2734 1909 422 -1684 -3342 -3879 -3675 -1829 -182 287 -586 -990 -2005 -2497 -928
3526 -928 974 2020 2707 3225 3248 3060 2097 1442 666 -952 -2325 -2107 -828 -625 -468 -1148 -2422 -3483
3544 -3483 -2908 -1455 385 1008 644 174 763 1981 3842 5521 5060 2571 110 -1267 -2493 -2695 -2838
3561 -2838 -3366 -3651 -3060 -1079 1098 2365 1609 546 -633 -1295 153 2237 3260 2563 1208 24
3577 24 -505 -336 72 -315 -1133 -3021 -3203 -1203 518 1627 1744 775 -900 -1091 -22 1160 1645 127
3595 127 -1226 -1355 -552 384 1525 1342 -920 -2480 -2247 -926 213 851 685 711 944 1442 2630 3174
3613 3174 1626 -541 -2071 -2654 -2396 -1008 65 -644 -1586 -1954 -1474 -85 363 774 846 920 1254 2200
$$ packed form
3490a400j72K173J146L58K08m34j589j239p26M2q66n64K55J015Q62R96K100J595
3508C760k54l88K38o22q25j487k106j658n37K04J846J647M69q73m04j015m92J569
3526i28J902J046O87N18K3j88r63o55p76j618j373K18J279K03J57o80j274j061
3544c483N75J453J840O23l64m70N89J218J861J679m61k489k461j377j226k02j43
3561b838n28k85N91J981K177J267p56j063j179o62J448K084J023o97j355j184
3577B4n29J69M08l87q18j888j82K000J721J109J17r69j675j91J069J182M85j518
3595A27j353j29Q03R36J141j83k262j560K33J321J139O38j66K6K33M98J188N44
3613C174j548k167j530n83K58J388J073p09r42l68M80J389M48M11P2P4L34R46
$$ plain form
3631 2200 3805 3211 1631 354 -880 -1106 -1089 -1328 -1796 -2634 -3331 -2442 -817 45 220 467 193 -3
3649 -3 881 2165 2547 2364 1568 1373 1672 1236 88 -569 -1647 -2790 -2522 -1014 -190 -130 -836 -1594 -1602 -289
3669 -289 445 1289 1360 643 551 1957 2487 2236 1545 -17 -1133 -1285 -741 -339 -566 -1603 -2816 -2258 -291
3688 -291 892 2026 1909 -220 -1152 -749 422 1632 2068 1035 -239 -470 -692 21 151 -711 -2343
3705 -2343 -1920 -500 1371 2981 2881 1059 -320 -1307 -1074 510 1033 -194 -1286 -1825 -1418 -51 1558
3722 1558 1134 -308 -1761 -2029 -783 954 1549 1067 945 338 841 2898 2967 1908 -498 -2595 -3097
3739 -3097 -1936 -301 408 194 -1653 -2835 -2113 -480 435 633 804 64 787 2429 4254 4476 2975
3756 2975 439 -1246 -1388 -1346 -1067 -1364 -2526 -3500 -2411 -964 1588 2497 1447 -293 -1549 -1437 -61
$$ packed form
3631B200J605n94j580j277j234k26J7k39m68q38o97Q89J625Q62J75K47k74j96
3649cQ84J284L82j83p96j95K99m36j148o57j078j143K68J508Q24O0p06p58qJ313
3669b89P34Q44P1p17r2J406N30k51o91j562j116j52N44M02k27j037j213N58J967
3688b91J183J134j17k129r32M03J171J210M36j033j274k31k22P13J30q62j632
3705b343M23J420J871J610j00j822j379r87K33J584N23j227j092n39M07J367J609
3722A558m24j442j453k68J246J737N95m82j22o07N03K057O9j059k406k097n02
3739c097J161J635P09k14j847j182P22J633R15J98J71p40P23J642J825K22j501
3756B975k536j685j42M2K79k97j162r74J089J447K552R09j050j740j256J12J376
$$ plain form
3773 -61 1592 2183 1272 965 1292 1365 1566 1157 -599 -1997 -3017 -2480 -858 818 633 -159 -1193 -1475
3791 -1475 -934 642 1532 1285 497 -32 498 1649 2351 1663 663 -742 -2293 -2111 -1500 -1171 -983 -639
3809 -639 -579 665 2427 2678 2498 970 -1026 -2115 -1840 -1120 -171 60 -308 -709 -46 -68 381 401 -44
3828 -44 -507 -171 230 943 1988 1626 879 163 -185 -60 -15 -34 -1000 -1467 -1444 -1123 -848 -14 -250 -842 -997
3849 -997 -1232 -132 665 1259 1518 2460 2715 2545 2823 2081 82 -1375 -2485 -3087 -2920 -2409 -2095 -1774 -1042
3868 -1042 -1000 128 887 816 756 1437 1442 1376 1938 2422 2054 1501 21 -338 -667 -1094 -1479 -1416 -1904 -2577 -1735
3889 -1735 -894 -487 -201 -96 -300 -205 615 1620 2455 2644 1653 1769 1968 1113 590 -541 -1555 -2823 -3161
3908 -3161 -2682 -1521 -552 -596 50 244 407 1072 1659 1875 1465 687 926 418 829 322 -243 -961 -1581 -2270
$$ packed form
3773f1J653N91r11l07L27P3K01m09j756j398j020N37J622J676j85p92j034k82
3791a475N41J576Q90k47p88n29N30J151P02o88j000j405j551J82O11L29J88L44
3809f39O0J244J762K51j80j528j996j089K75P20R49K31l68m01O63k2M49K0m45
3828d4m63L36M01P13J045l62p47p16l48J25M5j9r66m67K3L21K75Q34k36n92j55
3849i97k35J100P97N94K59R42K55j70K78p42j999j457j110o02J67N11L14L21P32
3868a042M2J128P59p1o0O81No6N62M84l68n53j480l59l29m27l85O3m88o73Q42
3889a735Q41M07K86J05k04R5Q20J005Q35J89r91J16J99q55n23j131j014j268l38
3908c161M79J161R69m4O46J94J63O65N87K16m10p78K39n08M11n07n65p18o20o89
$$ plain form
3928 -2270 -1221 -581 -428 -104 517 794 647 1375 1646 1194 431 -78 -236 102 -168 569 774 -160 -927
3947 -927 -1271 -1240 -1642 -1592 -1022 -488 -132 605 1701 2425 2249 1979 1582 1433 315 -423 -591 -911 -1397 -1627
3967 -1627 -1827 -1807 -2166 -1797 -1309 -441 -400 42 1243 1814 2749 3549 4169 2721 1036 -220 -1204 -1874 -1444
3986 -1444 -1083 -948 -1920 -2605 -1880 -1057 -702 -733 -900 -524 -411 1032 2595 3748 3208 1894 1173 1118 1102
4005 1102 1131 634 -1358 -3481 -4039 -2969 -1377 -117 362 -470 -1666 -2080 -845 1537 2687 2224 1768
4022 1768 1852 1238 2046 2035 913 -1455 -3279 -3507 -2389 -683 388 44 -1145 -1942 -1701 709 2625
4039 2625 2606 1129 -386 -1597 -1174 602 2292 2605 570 -1187 -1579 -1326 -1119 -575 -457 -1731 -1764 267
4057 267 2603 3478 2856 434 -1561 -2210 -1740 783 2804 1529 -672 -1701 -2124 -1787 -598 369 -178
$$ packed form
3928b270J049O40J53L24O21K77j47P28K71m52p63n09j58L38k70P37K05r34p67
3947i27l44L1m02N0N70N34L56P37J096P24j76k70l97j49j118p38j68l20m86k30
3967a627k00K0l59L69M88Q68M1M42J201N71R35Q00O20j448j685j256r84o70M30
3986a444L61J35r72o85P25Q23L55l1j67L76J13J443J563J153n40j314p21n5j6
4005A102K9m97j992k123n58J070J592J260M79q32j196m14J235K382J150m63m56
4022A768Q4o14Q08j1j122k368j824k28J118J706J071l44j189p97K41K410J916
4039B625j9j477j515j211M23J776J690L13k035j757l92K53K07N44J18j274l3K031
4057B67K336Q75o22k422j995o49M70K523K021j275k201j029m23L37J189R67n47
$$ plain form
4074 -178 -1370 -1282 -48 1751 2327 1797 1874 1281 998 1557 2037 605 -1038 -3056 -3561 -3086 -1562 142
4092 142 803 150 -1209 -1625 -816 95 579 2172 2838 2767 2524 2097 1294 -79 -1697 -1965 -1855 -1192 -1265
4111 -1265 -735 -560 -1558 -1729 -858 -228 420 663 891 1144 823 766 705 1099 1052 1213 1886 1450 -436 -1845
4131 -1845 -2531 -2797 -1922 -889 91 515 -93 -469 -190 483 642 589 1208 1189 1057 1560 1688 706 -1213 -2343
4151 -2343 -2371 -1560 151 936 1054 -375 -1503 -854 666 1840 2201 1265 -276 -1521 -1412 -835 36 311
4169 311 -164 -384 94 392 616 930 -565 -1848 -1827 -481 1657 2869 2153 961 -583 -1315 -1203 649
4187 649 1228 950 21 -1166 -1889 -1203 -589 -765 -673 -1380 -841 634 2120 2598 2013 1076 270 285 931 1735
4207 1735 980 -397 -2599 -3268 -2411 -1260 -103 1191 546 -223 -704 -184 242 569 477 73 217 899
$$ packed form
4074a78j192Q8J234J799N76n30P7n93k83N59M80j432j643k018n05M75J524J704
4092A42O61o53j359m16Q09R11M84J593O66p1k43m27q03j373j618k68J10O63p3
4111a265N30J75r98j71Q71O30O48K43K28K53l21n7o1L94m7J61O73m36j886j409
4131a845o86k66Q75J033R80M24o08l76K79O73J59n3O19j9j32N03J28r82j919j130
4151b343k8Q11J711P85J18j429j128O49J520J174L61r36j541j245J09N77Q71K75
4169C11m75k20M78K98K24L14j495j283K1J346K138J212p16j192j544p32J12J852
4187F49N79k78r29j187p23O86O14j76R2p07N39J475J486M78n85r37q06J5O46Q04
4207A735p55j377k202o69Q57J151J157J294o45p69m81N20M26L27r2m04J44O82
$$ plain form
4225 899 1578 2129 1540 85 -1376 -1518 -620 14 836 40 -1071 -2001 -2104 -1078 67 167 110 8 8
4244 8 665 1476 1799 1560 1024 276 -117 223 230 -502 -1233 -1827 -1682 -742 507 1267 910 459 -818 -1422 -826
4265 -826 -607 186 607 -197 -30 255 656 683 595 384 -506 -169 -57 656 905 342 -617 -962 -973 -655 -97
4286 -97 8 -561 -930 -762 -457 415 797 745 614 418 -67 -406 103 -28 -67 191 274 672 968 1163 501
4307 501 -446 -1548 -1824 -1289 -939 -305 449 71 136 -181 568 397 508 380 391 126 591 185 772 759 74
4328 74 -158 -432 -573 -877 -269 -254 -344 -18 -198 110 361 554 -11 221 -346 -1099 -722 -270 39 516 1147
4349 1147 885 610 333 -80 -165 80 -203 -510 -149 -31 -78 577 496 -188 -567 -1347 -948 -277 298 433 421
4370 421 437 -186 159 719 773 724 -141 -409 -526 26 805 1086 601 -658 -637 -530 -442 -85 -233 -998 -1537
$$ packed form
4225H99O79N51n89j455j461j42Q98O34Q22p96j111r30j03J026J145J00n7j02%
4244HO57Q11L23k39n36p48l93L40Pp32p31n94J45R40J249P60l57m51j277o04N96
4265h26K19P93M21q04J67K85M01K7q8k11q90L37J12P13K49n63r59l45j1L18N58
4286i7J05n69l69J68L05Q72L82n2j31j96m85l39N09j31l9K58Q3L98K96J95o62
4307E01r47j102k76N35L50O34P54l78O5l17P49j71J11j28J1k65M65m06N87j3o85
4328G4k32k74j41l04O08J5r0L26j80L08K51J93n65K32n67p53L77M52L09M77O31
4349A147k62k75k77m13q5K45k83l07L61J18m7O55q1o84l79p80L99O71N75J35j2
4370D21J6o23L45N60N4m9q65k68j17N52P79K81m85j259K1J07Q8L57j48p65n39
$$ plain form
4391 -1537 -1404 -281 760 1588 1166 580 -165 -100 273 977 1398 660 -78 -342 -325 61 460 -120 -1033 -1963
4411 -1963 -1960 -624 522 794 383 -31 -831 -539 663 1616 1123 124 -571 -173 475 1155 1216 908 -378
4430 -378 -1476 -1001 -328 -189 -586 -1080 -1642 -1553 -440 943 1544 1113 -3 -313 -31 445 973 1281 461
4449 461 -451 -587 -301 223 388 84 -748 -831 -776 -187 782 821 -267 -661 -872 -589 -23 734 407 -291 -567
4470 -567 98 1068 1592 908 685 4 -642 -547 -66 296 -402 -774 -906 -720 7 309 444 259 -856 -695
4490 -695 -85 705 267 119 130 -481 -218 299 564 568 -137 -184 79 453 579 802 224 -1035 -1544 -966 -467
4511 -467 -202 -240 -610 -348 64 387 957 1384 266 -236 -268 24 -42 273 190 -41 -177 -150 685 756 725 -271
$$ packed form
4391a537J33J123J041Q28m22n86p45O5L73P04M21p38p38k64J7L86L99n80r13r30
4411a963LJ336J146K72m11m14q00K92J202R53m93r99o95L98O48O80O1l08j286
4430c78j098M75O73J39l97m94n62Q9J113J383O01m31j116l10K82M76N28L08q20
4449D61r12j36K86N24J65l04q32q3N5N89R69L9j088l94k11K83N66P57l27o98k76
4470e67O65R70N24o84k23o81o46R5M81L62o98l72j32J86P27L02J35j85j115J61
4490f95O10P90m38j48J1o11K63N17K65Mp05m7K63L74J26K23n78j259n09N78M99
4511d67K65l8l70K62M12L23N70M27j118n02l2K92o6L15q3k31j36K7Q35P1l1r96
$$ [...]
8191c
##END NTUPLES=NMR FID
##END=
