##TITLE=1H_CA-8417-11-3
 CDCl3, 8 sc, 
 8.2.2019
##JCAMPDX= 6.0         $$ Bruker NMR JCAMP-DX V2.0
##DATA TYPE= NMR FID
##DATA CLASS= NTUPLES
##ORIGIN= UXNMR, Bruker Analytische Messtechnik GmbH
##OWNER= root
$$ XWIN-NMR		Version 3.5
$$ Fri Feb  8 14:13:47 2019 Russian Standard Time (UT+4h)  she@DPX200
##.OBSERVE FREQUENCY= 200.1313
##.OBSERVE NUCLEUS= ^1H
##.DELAY= (6, 6)
##.ACQUISITION MODE= SIMULTANEOUS
##.ACQUISITION SCHEME= undefined
##.AVERAGES= 8
##.DIGITISER RES= 18
##SPECTROMETER/DATA SYSTEM= spect
##.PULSE SEQUENCE= zg30
##.SOLVENT NAME= CDCl3
##.SHIFT REFERENCE= (INTERNAL, CDCl3, 0, 15.7039)
##AUDIT TRAIL= $$ (NUMBER, WHEN, WHO, WHERE, WHAT)
$$ ##TITLE= Audit trail, XWIN-NMR		Version 3.5
$$ ##JCAMPDX= 5.01
$$ ##ORIGIN= Bruker BioSpin GmbH
$$ ##OWNER= she
$$ F:/spectra/data/she/nmr/H-F/1/audita.txt
$$ ##AUDIT TRAIL=  $$ (NUMBER, WHEN, WHO, WHERE, WHAT)
(   1,<2019-02-08 14:12:47.29 +0400>,<she>,<DPX200>,
      <created by zg, POWCHK disabled, PULCHK disabled
       configuration hash MD5:
       00 E9 B6 7A A2 85 ED C7 34 08 36 98 17 FE 4E 26
       data hash MD5: 16K
       94 FB EF DF 8F BD A7 38 21 6B B0 40 8F 05 6C 0B>)
$$ ##END=
$$ 
$$ hash MD5
$$ D7 9A EA 13 2E 03 62 4A C1 80 21 BF F8 6A 9F 6D
##$RELAX= 
##$RELAX= 
##$RELAX= 
##$RELAX= 
##$RELAX= 
##$RELAX= 
$$ Bruker specific parameters
$$ --------------------------
##$DU= <F:/spectra>
##$EXPNO= 1
##$NAME= <H-F>
##$PROCNO= 1
##$TYPE= <nmr>
##$USER= <she>
##$AMP= (0..31)
100 100 100 100 100 100 100 100 100 100 100 100 100 100 100 100 100 100 
100 100 100 100 100 100 100 100 100 100 100 100 100 100 
##$AQSEQ= 0
##$AQ_mod= 1
##$AUNM= <au_zg>
##$AUTOPOS= <>
##$BF1= 200.13
##$BF2= 200.13
##$BF3= 200.13
##$BF4= 200.13
##$BF5= 200.13
##$BF6= 200.13
##$BF7= 200.13
##$BF8= 200.13
##$BYTORDA= 1
##$CFDGTYP= 0
##$CFRGTYP= 5
##$CHEMSTR= <none>
##$CNST= (0..31)
1 1 145 1 1 1 1 1 1 1 1 1 1 1 1 1 1 1 1 1 1 1 1 1 1 1 1 1 1 1 1 1 
##$CPDPRG= <>
##$CPDPRG1= <>
##$CPDPRG2= <>
##$CPDPRG3= <>
##$CPDPRG4= <mlev>
##$CPDPRG5= <mlev>
##$CPDPRG6= <mlev>
##$CPDPRG7= <mlev>
##$CPDPRG8= <mlev>
##$CPDPRGB= <>
##$CPDPRGT= <>
##$D= (0..31)
0 1.2 0 0 0 0 0 0 0 0 0 0.03 0 0 0 0 0 0 0 0 0 0 0 0 0 0 0 0 0 0 0 0 
##$DATE= 1549620766
##$DBL= (0..7)
120 120 120 120 120 120 120 120 
##$DBP= (0..7)
150 150 150 150 150 150 150 150 
##$DBP07= 0
##$DBPNAM0= <>
##$DBPNAM1= <>
##$DBPNAM2= <>
##$DBPNAM3= <>
##$DBPNAM4= <>
##$DBPNAM5= <>
##$DBPNAM6= <>
##$DBPNAM7= <>
##$DBPOAL= (0..7)
0.5 0.5 0.5 0.5 0.5 0.5 0.5 0.5 
##$DBPOFFS= (0..7)
0 0 0 0 0 0 0 0 
##$DE= 6
##$DECBNUC= <off>
##$DECIM= 32
##$DECNUC= <off>
##$DECSTAT= 4
##$DIGMOD= 1
##$DIGTYP= 9
##$DL= (0..7)
0 120 120 120 120 120 120 120 
##$DP= (0..7)
150 150 150 150 150 150 150 150 
##$DP07= 0
##$DPNAME0= <>
##$DPNAME1= <>
##$DPNAME2= <>
##$DPNAME3= <>
##$DPNAME4= <>
##$DPNAME5= <>
##$DPNAME6= <>
##$DPNAME7= <>
##$DPOAL= (0..7)
0.5 0.5 0.5 0.5 0.5 0.5 0.5 0.5 
##$DPOFFS= (0..7)
0 0 0 0 0 0 0 0 
##$DQDMODE= 0
##$DR= 18
##$DS= 0
##$DSLIST= <SSSSSSSSSSSSSSS>
##$DSPFIRM= 0
$$ [...]
##$SUBNAM2= <"">
##$SUBNAM3= <"">
##$SUBNAM4= <"">
##$SUBNAM5= <"">
##$SUBNAM6= <"">
##$SUBNAM7= <"">
##$SUBNAM8= <"">
##$SUBNAM9= <"">
##$SW= 20.0189088683792
##$SWIBOX= (0..15)
0 0 2 0 0 0 0 0 0 0 0 0 0 0 0 0 
##$SW_h= 4006.41025641026
##$TD= 16384
##$TD0= 1
##$TE= 0
##$TE2= 300
##$TE3= 300
##$TEG= 300
##$TL= (0..7)
0 120 120 120 120 120 120 120 
##$TP= (0..7)
150 150 150 150 150 150 150 150 
##$TP07= 0
##$TPNAME0= <>
##$TPNAME1= <>
##$TPNAME2= <>
##$TPNAME3= <>
##$TPNAME4= <>
##$TPNAME5= <>
##$TPNAME6= <>
##$TPNAME7= <>
##$TPOAL= (0..7)
0.5 0.5 0.5 0.5 0.5 0.5 0.5 0.5 
##$TPOFFS= (0..7)
0 0 0 0 0 0 0 0 
##$TUNHIN= 0
##$TUNHOUT= 0
##$TUNXOUT= 0
##$USERA1= <user>
##$USERA2= <user>
##$USERA3= <user>
##$USERA4= <user>
##$USERA5= <user>
##$V9= 5
##$VALIST= <valist>
##$VCLIST= <CCCCCCCCCCCCCCC>
##$VD= 0
##$VDLIST= <DDDDDDDDDDDDDDD>
##$VPLIST= <PPPPPPPPPPPPPPP>
##$VTLIST= <TTTTTTTTTTTTTTT>
##$WBST= 1024
##$WBSW= 4
##$XGAIN= (0..3)
0 0 0 0 
##$XL= 0
##$YL= 0
##$YMAX_a= 457434
##$YMIN_a= -335933
##$ZGOPTNS= <>
##$ZL1= 120
##$ZL2= 120
##$ZL3= 120
##$ZL4= 120
##$ABSF1= 10
##$ABSF2= 0
##$ABSG= 5
##$ABSL= 3
##$ALPHA= 0
##$AQORDER= 0
##$ASSFAC= 0
##$ASSFACI= 0
##$ASSFACX= 0
##$ASSWID= 0
##$AUNMP= <proc_1d>
##$AZFE= 0.1
##$AZFW= 0.1
##$BCFW= 1
##$BC_mod= 2
##$BYTORDP= 1
##$COROFFS= 0
##$CY= 11.3945322036743
##$DATMOD= 1
##$DC= 2
##$DFILT= <>
##$DTYPP= 0
##$F1P= 18.9103706918063
##$F2P= -1.10871071338519
##$FCOR= 0.5
##$FTSIZE= 0
##$FT_mod= 4
##$GAMMA= 1
##$GB= 0.15
##$INTBC= 1
##$INTSCL= 1
##$ISEN= 128
##$LB= 0.24
##$LEV0= 0
##$LPBIN= 0
##$MAXI= 10000
##$MC2= 0
##$MEAN= 0
##$ME_mod= 0
##$MI= 1.114404
##$NCOEF= 0
##$NC_proc= 0
##$NLEV= 6
##$NOISF1= 3.799351
##$NOISF2= 2.8
##$NSP= 1
##$NTH_PI= 0
##$NZP= 0
##$OFFSET= 15.70392
##$PC= 1
##$PHC0= -8678.222
##$PHC1= 12.20019
##$PH_mod= 1
##$PKNL= yes
##$PPARMOD= 0
##$PSCAL= 0
##$PSIGN= 0
##$REVERSE= no
##$SF= 200.130013532006
##$SI= 16384
##$SIGF1= 3
##$SIGF2= 2
##$SINO= 400
##$SIOLD= 16384
##$SREGLST= <1H.CDCl3>
##$SSB= 0
##$STSI= 0
##$STSR= 0
##$SW_p= 3612.71676300578
##$SYMM= 0
##$S_DEV= 0
##$TDeff= 0
##$TDoff= 0
##$TI= <>
##$TILT= no
##$TM1= 0
##$TM2= 0
##$TOPLEV= 0
##$USERP1= <user>
##$USERP2= <user>
##$USERP3= <user>
##$USERP4= <user>
##$USERP5= <user>
##$WDW= 1
##$XDIM= 8192
##$YMAX_p= 0
##$YMIN_p= 0
$$ End of Bruker specific parameters
$$ ---------------------------------
##NTUPLES= NMR FID
##VAR_NAME=  TIME,          FID/REAL,        FID/IMAG
##SYMBOL=    X,             R,               I
##VAR_TYPE=  INDEPENDENT,   DEPENDENT,       DEPENDENT
##VAR_FORM=  AFFN,          ASDF,            ASDF
##VAR_DIM=   8192,          8192,            8192
##UNITS=     SECONDS,       ARBITRARY UNITS, ARBITRARY UNITS
##FACTOR=    0.0002496,     1,               1
##FIRST=     0,             0,               0
##LAST=      2.0444736,     0,               0
##MIN=       0,             -335933,         0
##MAX=       2.0444736,     457434,          0
$$ Real data points
##PAGE= N=1
##DATA TABLE= (X++(R..R)), XYDATA
0 0 0 0 0 0 0 0 0 0 0 0 -8 8 -8 9 -16 17 -24 32 -33 41 -49 60 -72 82 -98 114 -136 155 -179 206 -235 267
32 267 -305 346 -390 439 -492 554 -619 688 -766 853 -945 1047 -1158 1280 -1413 1557 -1717
49 -1717 1889 -2082 2293 -2530 2790 -3084 3416 -3792 4225 -4726 5319 -6032 6906 -8010
63 -8010 9452 -11428 14313 -18955 27659 -49828 235810 398527 126844 146532 51359 -9202
75 -9202 12857 69262 -88808 -236873 -245781 -183909 -203184 -169983 -83104 -23327 -6476 84816
87 84816 160844 144038 90558 73527 29885 8125 50294 80079 45630 39496 32955 -40681 -97663
100 -97663 -49886 -10085 -42681 -64380 -55340 -99782 -141071 -69333 34863 32205 6643 73618
112 73618 139241 134196 156590 184126 78091 -84150 -126291 -105646 -126683 -124947 -68714 -49227
124 -49227 -62588 -22327 46678 67710 67771 93508 99976 55632 17882 6407 -23572 -46164 -18648
137 -18648 -7860 -48579 -54688 -14884 -12083 -24040 5329 17514 -15641 -11435 37649 38512 -11288
150 -11288 -28838 -6384 4221 12893 50616 70875 35944 11221 30268 23458 -22380 -42244
162 -42244 -46189 -70714 -77533 -55521 -55334 -62680 -25631 31475 64429 80733 88807 74150 49466
175 49466 47529 54845 23568 -30791 -49208 -43407 -56039 -58530 -33042 -32261 -53039 -34436 906
188 906 -1151 -5269 24810 49690 47469 42395 37693 18657 972 9922 28460 17930 -9931 -17135
202 -17135 -13787 -18259 -16063 -19192 -48993 -64375 -33608 -3049 4354 14450 19849 8157 14448
215 14448 44568 53470 29863 10887 11185 8151 -4140 -5639 -1991 -19561 -39359 -30668 -26374 -46448
229 -46448 -41293 -240 24538 29055 35327 29552 11961 14632 31025 27383 4011 -16078 -23480
242 -23480 -24215 -23248 -20797 -24056 -31627 -16566 20633 38672 29561 21152 8224 -11452 -6738 12988
256 12988 8559 -4921 3564 14189 6923 -6502 -16750 -26115 -30436 -22195 -6127 -2364 -9248 255
270 255 23045 26164 15371 10882 4510 2346 20198 33701 19891 258 -8468 -13915 -13555 -11548
284 -11548 -22527 -40626 -44998 -31986 -13583 -3529 1398 15521 33282 45138 56033 53543 23814
297 23814 -5010 -10437 -14218 -26137 -27979 -21381 -15014 -2761 7999 1866 -13536 -22345 -17603 -4271
311 -4271 1641 -816 1400 9967 22572 36923 34670 11446 -5661 -7502 -9571 -8312 -3639 -9174
325 -9174 -15236 -4330 8725 5968 -5775 -15507 -16906 -10504 -2536 2684 4076 -302 5589 25627
339 25627 32481 15697 168 -6610 -13323 -13551 -10073 -15872 -19488 -7264 11215 24113 23337 10815
353 10815 -473 -3877 -5543 -5438 -4999 -7331 -3266 8842 10536 -170 -9363 -17953 -20262 -8370
367 -8370 2337 -1752 -3587 7342 21657 31947 29456 11814 -6004 -11348 -4267 5653 1557 -17139
381 -17139 -27200 -21102 -10012 4253 11827 2197 -9035 -5526 -1182 -2596 158 3328 1974 7433
395 7433 16516 18123 15720 15777 16217 9524 -8631 -24078 -23180 -15832 -8135 -562 -5343 -24461 -27204
410 -27204 -4897 15081 21921 18017 5713 -1280 11170 26800 25822 8823 -13618 -26329 -20297
423 -20297 -4536 4561 1538 -8016 -9907 -1438 4070 7419 13743 9207 -5892 -10781 -7616 -10739
437 -10739 -7565 8027 13428 2272 -7813 -6992 2471 14508 20607 13851 -3123 -20005 -16567 1872
451 1872 9617 782 -10855 -14564 -5011 15704 23674 11979 -4201 -15997 -17689 -1908 12559
464 12559 4959 -11039 -15357 -12116 -6924 1157 10515 14854 11516 7852 12612 15161 6353 2506 5418
479 5418 -4948 -23379 -25427 -11612 490 7426 5742 -4839 -15921 -18407 -6742 9400 10084
492 10084 -2880 -2738 13688 27089 29413 19787 -200 -17358 -18056 -3574 13341 11368 -9433
505 -9433 -21933 -16730 -13072 -12659 -5665 -1771 -6489 -6814 2624 11814 13595 12144 15576 20512 13237
520 13237 3981 9960 17131 6301 -10209 -21837 -32796 -35365 -20602 1186 10057 -666 -12686
533 -12686 -4862 11332 14696 11856 12170 7614 6874 22908 37117 23303 -8248 -33386 -40356 -34363
547 -34363 -24948 -10704 4984 10860 8764 12941 17002 9636 1840 2155 3861 673 -3858 -3876 6081
562 6081 13534 5403 -5935 -10197 -15833 -18236 -5868 6008 -2890 -19002 -17416 315 14371 17506
576 17506 23041 27841 20881 15954 22568 14733 -16500 -36882 -33254 -26861 -23680 -14481 -8964 -10194
590 -10194 -9422 -2194 7556 15869 25111 37710 46050 40079 22012 -202 -18208 -25529 -26075 -30460
604 -30460 -31538 -23103 -16865 -8233 11326 20841 8158 392 9759 12688 4542 2038 3245 -885
618 -885 -1893 8744 16273 6134 -5793 388 8415 2836 -4658 -7275 -16596 -23711 -17154 -10670 -11446
633 -11446 -6063 5251 14002 21367 22162 10555 -74 2879 7615 4480 -1776 -4465 -8511 -13164
647 -13164 -6947 4955 1609 -9797 -3060 10804 6844 201 3600 11 -11870 -9843 -2750 -9452
661 -9452 -15457 -4060 12649 18604 18392 18109 12293 2648 1069 3464 -7612 -22579 -20676 -12097 -10146
676 -10146 -5133 2569 1048 1836 15244 23856 17318 6847 -834 -7380 -10025 -6578 -5922 -12227 -15398
691 -15398 -7861 -412 -720 2952 11993 13283 11420 15620 10801 -5723 -8180 3502 4719 -2729 -5451
706 -5451 -9761 -16778 -12713 1013 3434 -6191 -7711 1995 4699 500 3974 5360 -4399 -1042 19850
721 19850 25274 12032 7585 7393 -5285 -14484 -9668 -9277 -17049 -14901 -4827 -4865 -12010 -8072 3495
736 3495 7571 7875 11796 8625 2144 11070 23588 16732 3311 -3627 -14115 -19930 -6445 5134
750 5134 -4792 -13542 -6213 -1495 -4574 -226 6965 344 -8663 1025 13560 5590 -2654 6799 8948
765 8948 -3076 -1463 8861 2406 -5265 1986 2718 -12390 -17100 -5814 2211 4200 7474 5906
779 5906 -4503 -7056 3576 9195 1535 -3933 -4295 -6930 -1989 11166 10058 -3971 -5643 191
793 191 -4255 -5118 4687 5511 -1990 2884 12775 6099 -5767 -3960 2311 -2726 -7232 -1589 -1793 -11358
809 -11358 -7074 6954 3998 -5155 236 6367 1991 2357 6720 1573 -3881 3213 9439 4479 -969
824 -969 -479 -1696 -4145 -2260 -2003 -9867 -12908 -1229 6601 1927 -1096 1382 -2993 -3338 9034 11625
840 11625 -2454 -8531 -1301 4132 6055 10947 9578 -2607 -10633 -5135 1594 -693 -2286 401
854 401 -3273 -9342 -5718 -254 -486 1991 6898 1073 -6934 -3510 3915 7660 10082 7253 -3266
869 -3266 -8519 -4 10638 10087 1326 -7483 -13555 -13769 -2179 10881 7108 -6103 -7919 -3241 -1314
884 -1314 4672 9898 1936 -8990 -6792 1020 4657 7747 10013 5861 -3812 -7727 -4208 1306 5065
899 5065 8237 5095 -7902 -14743 -7341 1028 4336 5088 -1469 -11810 -9547 4108 11317 8284 2000
914 2000 -4525 -7338 -582 10511 13439 4209 -5067 -6421 -3760 -1264 3837 5973 -863 -6215 -3268
929 -3268 -3062 -5651 -3126 -564 -3118 -4497 -1888 1571 6626 12026 11314 3982 -4800 -7034 -1083 5363
945 5363 6713 2728 -4917 -11419 -7151 1575 2805 685 -773 -3039 -2826 3083 5293 238 -4382
960 -4382 -4420 -2883 -751 1886 3304 3369 3041 4060 5383 1583 -1883 1099 3208 -189 -3010 -4106
976 -4106 -7036 -6531 -471 1361 -2222 -3289 -453 3398 5498 4460 1623 -1789 -2779 308 3905 1954
992 1954 -1607 -497 1106 1815 3323 1739 -2454 -2022 389 385 -1136 -2746 -4335 -2866 1159 1993 -294
1009 -294 -4106 -4258 118 4018 4212 3561 2033 -1084 -876 2464 1570 -1912 -467 3202 4450 3514 1359
1026 1359 -2440 -5112 -4888 -3806 -3151 -4660 -5230 -1229 3047 2359 261 -968 -808 2047 6807 7648
1042 7648 5405 4029 1916 1668 2542 -1319 -7244 -7766 -4129 -1036 355 -581 -3424 -5863 -5873 -1651
1058 -1651 2484 1850 1419 5771 9141 5505 2262 1637 -1172 -1911 1557 3135 25 -3084 -2959 -1811
1074 -1811 -2654 -5752 -6333 -4286 -1469 3213 6237 4180 -404 -1021 -335 912 2203 1006 -1475 1577
1090 1577 5507 4100 274 -1956 -5182 -6182 -2182 2495 2416 -365 -256 1675 -142 -4222 -3005 -168
1106 -168 18 1685 5626 2529 -4361 -4425 -680 -580 -806 539 1115 1989 3963 5684 3295 -1174 -2997
1123 -2997 -754 1394 1154 -354 -3293 -5641 -3513 -663 -1843 -2276 -1118 -1155 774 5599 5442 1389
1139 1389 1126 2832 1595 -506 -840 141 -24 528 2556 1236 -3625 -5384 -1070 564 -1721 -1409
1155 -1409 -708 -3231 -2430 1573 898 -2229 -1458 2000 4217 4891 4716 2560 -2 482 2634 3072 -280
1172 -280 -3848 -3332 -3214 -2405 -1618 -3357 -5657 -3915 -513 93 1353 2665 1545 2675 5423 4711 2136
1189 2136 1799 2179 1389 -236 -1386 -2055 -3571 -3302 -702 -316 -4137 -5314 -672 1459 655 1827 1712
1206 1712 -917 -106 4712 5418 1409 -2111 -2704 -263 2108 2662 1225 -2422 -5523 -4273 -266 1591
1222 1591 2149 1810 1017 1285 1031 -1128 -1380 741 160 -1875 -464 120 -2121 -1901 594 219 -2914
1239 -2914 -2644 1879 5764 5568 3885 1908 -959 -2853 979 3844 338 -5299 -6292 -4626 -1878 1784
1255 1784 1879 -375 -2067 -2247 -449 3430 3845 1408 336 1093 972 370 1179 2913 2670 180 -544
1272 -544 412 -1512 -3688 -1783 -795 -4329 -5785 -1488 1836 1895 1265 -70 -1965 -1290 2662 6738 7191
1289 7191 3222 -788 -620 781 567 -824 -3235 -4807 -4777 -2796 437 2514 35 -2990 -855 1908
1305 1908 110 80 2916 2142 -1112 -689 1382 1213 341 1612 3197 741 -2650 -1909 324 -440 -2129
1322 -2129 -1604 -1860 -2133 629 3168 2567 -536 -3117 -3477 39 3536 2775 684 -691 -1222 -574 1566
1339 1566 2876 773 -2039 -1747 417 1323 -176 748 1395 -882 -2676 -699 -96 -2249 -1917 327
1355 327 -170 -2024 -1256 1372 2873 2210 1062 681 -429 -660 1382 2183 -158 -2371 -1963 -630 2100
1372 2100 2617 -113 -2787 -2558 -1837 -933 734 1286 -1018 -1496 622 1430 -112 -367 1057 1353 298
1389 298 345 1755 982 -646 836 1806 -1191 -2885 -1229 -457 -1142 -444 -207 -1666 -1360 853 2108
1406 2108 1173 -51 -104 112 575 1938 1632 -1414 -2161 418 986 -78 1171 837 -1580 -1472 1311
1423 1311 525 -1498 -763 1164 -5 -1105 -863 -725 -2208 -1346 1030 1387 -613 -269 2110 1671 1333
1440 1333 2331 1006 -1420 154 1429 90 -1238 -887 -1461 -1686 -652 -160 -1892 -2626 -815 1215
1456 1215 649 570 1720 922 -488 1445 2624 204 -809 1499 1644 -414 -246 4 -1411 -1531 -12
1473 -12 -120 -2276 -2968 -1613 -655 -74 1208 1882 400 301 2117 1985 -5 332 1016 -535 -224 1429
1491 1429 1 -2032 -1160 612 -4 -821 -554 -820 -1692 -1350 -53 -169 -1572 91 2328 1895 421
1508 421 606 228 -745 786 2162 888 -595 -171 -46 -811 -686 -1098 -2844 -3011 -1429 649 1257 1748
1526 1748 2628 1966 580 279 76 -1479 -1858 -85 247 -1378 -1216 -751 -706 266 1559 1596 429 462 973
1545 973 986 152 -667 -1194 -1717 -614 658 608 -983 -1512 -1220 -1487 -849 1291 1302 279 891 1901 713
1564 713 -44 528 890 145 -204 162 131 96 749 1357 -372 -2608 -3099 -2265 -1632 -490 626 -36 -401
1583 -401 1140 2482 2846 2502 1416 -207 -281 -186 -158 -683 -1460 -1245 -1031 -1081 -556 289 -97 -661 129 189
1603 189 -405 37 921 895 323 296 361 110 784 1559 1048 -264 -1457 -1068 -88 405 820 145 -1134 -1888
1623 -1888 -944 -645 -594 -189 743 776 1288 1955 1320 -285 -769 -1211 -520 -417 -373 9 -208 64 485 176
1643 176 35 -52 615 498 40 123 -583 -947 -610 -321 -972 -527 146 466 614 636 255 -354 -559 689 1267
1664 1267 923 -208 -69 -401 -830 -258 -131 -1164 -1176 48 1227 783 462 -477 -1347 -1104 -682 426
1682 426 680 751 353 1 -41 -10 508 712 897 1066 -78 -658 -247 48 -553 -420 -514 -1345 -1203 58 486
1703 486 -192 -878 -528 3 811 1641 1960 1073 -415 -975 4 502 436 385 -181 -817 -910 -406 -251 -342 -612
1724 -612 -885 -594 319 672 768 879 549 -245 -175 128 677 683 488 172 -721 -1535 -947 94 637 -269 -504
1745 -504 -545 -241 -241 548 731 41 -472 268 1016 733 -619 -708 -621 -1224 -891 271 701 245 273 720 286
1766 286 85 87 -34 181 -379 -522 -478 -254 -236 56 -144 -41 -555 -498 233 772 275 -108 504 433 134 -2
1788 -2 526 142 -583 -344 335 -56 -458 -477 84 -92 -272 -75 327 -514 -1007 -245 -146 -122 164 601 868 795
1810 795 604 527 33 -384 -348 -538 -385 -398 -730 -387 -20 -6 -487 -126 46 190 290 37 412 -230 -312 505
1832 505 699 161 -194 316 446 -279 -509 -176 -538 -434 7 313 -231 -245 -140 -274 -425 -276 134 -56
1852 -56 446 373 550 -33 81 -31 -106 210 114 -67 -320 -70 179 459 337 278 290 -40 -149 166 -424 -555
1874 -555 -516 -241 -20 -115 458 10 -87 130 541 -51 101 12 361 148 124 116 143 -135 -335 94 75 -373 -160
1897 -160 148 -259 -145 206 -196 -151 155 120 -169 120 238 -226 72 172 108 55 -19 121 236 84 -550 -307
1919 -307 -558 -220 230 30 132 -181 230 14 18 140 199 31 56 50 132 80 111 -11 -110 -322 143 -28 -206
1942 -206 -109 -168 74 -208 -280 34 209 526 181 -108 -297 26 113 93 71 132 -160 -26 -36 422 111 -306 229
1965 229 -51 -160 -91 21 117 6 -13 190 -67 92 121 14 160 47 -191 -86 36 155 -122 -53 -17 127
1987 127 -48 261 47 215 -86 -72 -184 -153 -364 -253 -412 -376 -23 -63 -246 280 226 84 8 179 202 137 237
2010 237 -48 -113 -201 -170 -247 243 -75 -22 -17 -235 -160 218 102 -208 50 96 184 190 232 -79 -286 166 -107 177
2034 177 -46 176 -5 -418 -87 -106 -262 -271 -95 -168 -16 44 160 532 617 408 156 -178 -189 -306 -52 30 -369
2057 -369 -250 -333 -32 -145 149 325 -148 -94 71 -75 -86 87 -388 -328 -26 210 64 325 27 -191 -58
2078 -58 -333 158 116 -165 401 201 -187 28 396 -76 311 29 -331 -229 -181 85 106 -242 -144 -342 -412 -35
2100 -35 125 126 30 237 175 583 436 291 213 -111 -301 -43 -327 -255 120 52 69 -59 132 82 210 68 -134
2123 -134 -299 15 115 246 241 38 200 11 77 424 332 -12 -429 -385 -404 -282 100 38 -199 -154 -280 349 71
2146 71 208 28 -19 29 257 -83 344 -105 -6 -112 -38 -241 -68 31 -142 -82 13 -204 166 -92 -40 146 -198
2169 -198 -317 12 205 493 236 -202 29 118 95 -125 55 -378 -199 -174 0 135 144 48 -311 34 -25 42 -46
2192 -46 -121 -122 61 -159 46 -71 -368 -109 237 111 -392 -136 361 363 -97 168 -36 -168 -160 212 -132 -533 -246
2215 -246 -263 198 -42 93 -33 -89 -201 72 119 -205 -21 75 48 362 404 113 -12 236 -168 -141 -98 -337 -365
2238 -365 -248 153 -124 -49 -55 -141 195 85 274 471 345 143 130 410 54 -209 -344 -200 -396 -485 -176 -282
2260 -282 -91 135 206 132 173 188 243 93 -18 -78 91 -315 214 159 29 -136 73 -167 253 -58 -74 -206 -182
2283 -182 -160 -242 -48 65 -65 -190 74 -212 -152 -62 -233 179 166 109 215 62 503 -10 373 294 -48 -259
2305 -259 -56 -93 -47 -111 -149 -227 45 -60 228 130 -172 -113 295 177 168 49 166 252 270 -12 130 -315 -373 -432
2329 -432 55 134 76 304 20 119 -56 -233 -158 -235 -61 -154 109 112 -228 -112 16 338 146 -96 -274 -243 271
2352 271 113 256 -25 -281 33 327 -18 -153 -350 -111 -157 57 -14 238 76 38 296 -78 267 -108 173
2373 173 378 -74 214 -6 -31 84 -125 190 -131 -472 -258 44 170 12 -126 -56 178 128 176 88 214 -324
2395 -324 -370 -171 -89 96 208 189 280 456 324 311 67 -158 -383 -317 -284 -188 -237 70 358 1 -182 202 240
2418 240 466 204 288 71 -28 143 222 -149 -169 -382 -322 -153 320 401 -7 -316 -172 -79 -215 133 52 -202 -125
2441 -125 144 136 56 223 628 208 38 -22 -18 3 -234 -396 -201 -196 -129 41 319 203 -98 -400 -234 -93 429
2464 429 -29 121 125 -263 -423 376 472 117 251 210 371 216 -68 -132 -324 -478 -253 87 -332 -186 400 -70
2486 -70 -201 -133 406 416 319 301 9 -150 -323 -151 -267 -126 -77 -427 -150 75 362 142 -136 -324 -232 -92
2508 -92 164 332 268 -81 -189 18 -48 78 357 -52 -209 -283 124 268 164 -87 197 167 177 257 583 147
2530 147 -292 -272 -463 -438 -289 -18 260 -284 -275 -380 -13 -43 457 678 250 -122 216 261 -105 171 -407 -726
2552 -726 -305 97 270 89 -3 -226 -353 -191 35 86 -186 192 82 -96 -223 308 176 303 264 -58 -265
2573 -265 -423 -164 -133 -399 -368 58 5 187 518 218 134 -103 -305 -85 -25 203 -17 -57 90 273 125 -76
2595 -76 -264 78 -36 329 470 347 -165 -13 -73 -62 -305 8 -5 251 241 347 319 99 360 93 359 193
2617 193 35 14 -276 -215 -130 10 190 270 404 192 533 330 -111 -480 -104 24 -284 -337 42 -209 50 308
2639 308 320 -81 147 241 520 28 7 119 -307 134 224 116 53 -26 169 -128 -103 13 -16 -150 -223 56 -68
2662 -68 -257 -57 247 156 181 11 216 -15 3 448 80 -389 -195 -288 -186 -283 -113 -14 33 38 337 -73 26 -10
2686 -10 -48 20 17 20 -81 62 31 93 275 -31 -98 69 -118 132 104 -231 -90 -274 -179 25 83 -52 -121 -70 56
2711 56 114 -60 179 310 135 34 206 -132 -148 102 -174 -123 137 -102 -3 206 240 303 -224 -100 -150 154 -124
2734 -124 -56 34 93 165 125 103 -10 -150 114 -144 -102 49 -152 125 207 271 172 186 -274 -392 52 -56 1 -50
2758 -50 -273 75 -68 115 -60 197 39 91 14 70 13 -11 375 255 -141 116 -215 -33 196 -187 5 -182
2780 -182 -364 -223 2 19 -198 24 -120 146 203 -174 -116 44 10 57 -28 428 -38 -240 -185 -267 -14 -203 -53
2803 -53 -95 -111 -222 41 346 -47 -157 -165 -29 257 218 121 128 40 147 243 -129 202 330 55 6 49 250 49
2827 49 244 -25 -186 -250 -183 -83 -1 245 -236 -241 -43 185 301 409 141 153 -26 67 84 -170 9 -187 -391
2850 -391 -20 -141 -169 -61 63 -140 -114 5 -111 1 325 183 -273 -2 64 67 -202 -251 -218 -117 205 64
2872 64 61 385 119 -87 -379 -8 68 131 -455 1 -310 8 165 144 59 -292 72 -158 -140 275 165 121 -151
2895 -151 74 116 92 95 254 -245 -200 -86 -25 -60 277 -260 -43 38 -85 135 89 316 184 36 268 361 21
2918 21 115 -59 -210 -101 -209 -3 -21 256 167 58 -157 6 317 -202 -160 40 -152 -33 -175 -231 3 -41
2940 -41 98 29 288 -27 90 23 -42 -123 -184 -162 20 -133 74 38 -79 35 -44 268 -160 18 -23 -103 -161 -37
2964 -37 98 -81 194 63 -29 248 50 273 50 151 250 -41 72 -122 -39 -329 -350 12 334 -41 48 0
2986 0 0 10 244 53 -224 -57 34 -259 -288 263 -53 147 -16 119 -129 -80 82 -80 -65 -132 104 85 187 43
3010 43 -237 -25 -144 5 136 153 -92 -42 -132 -33 -94 35 -181 -149 -9 328 186 -33 -184 -160 -1 -164 -113
3033 -113 -335 -166 140 -376 57 -174 -17 153 353 9 -29 334 108 -128 -87 206 99 -100 -115 -39 76
3054 76 53 -220 -97 -168 40 -13 -275 45 -25 162 67 381 -8 169 -2 -15 -357 -337 -32 18 -92 63 46
3077 46 -62 48 1 125 -102 -153 -117 -20 177 190 127 14 -213 -79 -135 37 275 0 -206 97 -3 239 -76
3100 -76 81 -185 -15 -222 129 141 -78 32 7 371 60 143 -55 134 -184 57 -1 72 -189 57 -136 -104
3122 -104 -154 200 125 -40 -28 70 7 -50 116 16 230 290 -175 86 -156 114 -28 53 96 -80 40 43 83 -40
3146 -40 -14 130 -4 -190 299 -99 -174 -168 -239 -190 -123 -176 18 -129 -29 71 65 148 41 -96 -113 -98 101 145 -23
3171 -23 104 -53 224 -112 -176 257 78 323 -24 9 196 194 -52 -30 160 -76 -165 -104 -42 -65 -117 -11 89 37
3195 37 49 175 118 195 -60 -31 15 1 -107 -138 -15 96 6 45 -5 6 -29 -158 -100 -70 138 0 279 91 174
3220 174 37 -57 99 172 327 123 -57 46 -42 -108 326 41 52 -270 20 -109 203 -41 175 124 114 -38
3242 -38 73 -99 -328 -135 -75 122 52 147 97 177 106 56 -235 39 18 210 -27 157 -35 -258 -247 142 -325
3265 -325 -83 -143 -119 33 62 -143 73 97 372 128 -23 116 -44 37 13 146 -126 232 -118 -109 -98 39 91
3288 91 91 244 21 -92 -67 248 -119 99 -26 -173 -88 -1 -233 115 -11 -91 143 -108 257 -88 121 -143
3310 -143 -230 42 -47 136 -76 -78 168 -73 20 -53 11 243 116 1 -200 136 -187 154 -93 -130 -87 48 -221
3333 -221 122 -10 -274 48 -217 -188 -146 -99 -137 0 -189 34 222 -159 -17 -19 -131 84 191 -47 6 -68 -222
3356 -222 -58 -140 -2 123 111 -79 259 -19 303 -150 43 74 -123 196 -251 169 -36 -147 -60 277 -58
3377 -58 140 -178 64 -50 -177 3 16 -145 133 10 106 150 -51 236 50 -117 -113 44 96 -26 166 -3
3399 -3 153 -222 34 46 -187 -36 142 25 135 212 66 6 -90 179 67 61 -330 214 -32 -141 -52 -28 65 191
3423 191 26 -151 -159 188 -9 28 177 383 207 75 -34 114 -77 -11 -47 -225 76 -212 -96 129 -137 -77
3445 -77 -113 -31 -8 -69 580 134 -125 1 -81 245 107 -56 -59 -248 187 -177 108 -367 152 -55 -140 15 -30
3468 -30 129 121 -76 15 48 59 -87 -116 7 -69 65 -119 -111 -217 -10 84 33 -83 -2 -154 129 211 2 -6 -76 -68
3494 -68 -178 129 -127 80 127 -96 18 -53 -28 -95 252 -115 228 -73 -105 37 -64 -169 -121 -139 -85 289 265
3517 265 127 40 -87 -40 163 395 46 -94 205 43 133 6 -166 26 131 44 -203 -266 -184 -60 -166 -44
3539 -44 -43 -349 -153 32 -124 83 337 226 9 156 13 135 185 200 88 15 220 -318 -47 30 147 210 -49
3562 -49 247 11 16 -121 -249 70 112 140 178 -22 280 199 -79 -88 71 -345 174 -122 -142 -8 -246 90 -205
3585 -205 286 -112 10 -107 162 -3 -103 45 -107 167 167 164 177 -222 -23 183 -162 -31 43 31 219 -66
3607 -66 144 6 54 124 -141 -123 -24 -5 -214 -282 45 244 -10 149 181 23 -126 170 -135 18 267 -144 70
3630 70 -114 266 -107 18 -7 -382 -70 -186 -169 -112 -228 -262 -161 145 -209 103 9 -36 288 -32 349 138
3652 138 4 26 -155 -196 184 -325 23 -66 -13 -124 -211 78 -82 -218 239 44 -128 176 77 283 83 200
3674 200 158 179 -257 -24 79 197 45 -79 -272 -183 126 34 -201 -104 -139 8 -301 100 202 53 -62 13
3696 13 83 -91 146 -64 177 -185 -226 95 117 -12 126 -2 20 -302 -2 184 2 -228 -186 -278 -20 105
3718 105 150 59 -254 -106 5 233 161 302 46 -231 54 -116 -184 -70 -77 -146 9 274 -204 -52 -232 5
3740 5 -19 -113 102 -42 55 58 -80 -274 -34 200 134 40 70 -6 64 -125 -152 14 315 25 -61 -134 16 -180 35
3765 35 -272 -183 -127 44 60 146 189 220 125 -61 239 181 254 -170 99 -295 13 -155 -111 20 -144 -91 -63 -133 393
3790 393 142 -72 228 -16 146 -9 171 170 89 -92 148 3 54 -69 74 -134 -107 -115 -114 -32 -249 -225 -168 -48
3814 -48 71 97 11 117 -63 -35 0 114 85 -119 -231 -358 -35 66 16 -10 20 50 266 -98 -80 -38 -112 -186 147
3839 147 83 -184 -145 131 -253 94 -182 -329 234 -19 215 172 376 11 97 156 266 -105 -132 -302 -80 -99
3861 -99 -144 62 -249 -157 115 -18 -64 -138 61 -160 -45 215 100 110 496 437 80 31 97 -62 -43 -151 36
3884 36 -515 -208 -10 188 58 -26 109 -97 -174 211 335 -164 103 110 308 47 -15 199 -62 -335 -109 -219
3906 -219 -271 -181 86 -170 -315 -183 21 238 -58 -22 179 -38 59 0 142 147 336 180 -80 22 30 -149 -180
3929 -180 227 66 63 -146 335 95 -104 121 12 -96 -121 88 55 -191 -294 79 -491 107 -72 -21 -84 -2
3951 -2 425 219 373 -84 234 26 -31 -48 3 -133 -309 -129 -346 -151 -114 172 -222 9 224 -121 -17 371
3973 371 -5 -79 314 430 311 137 221 169 -169 -160 88 51 -200 -506 39 -206 -83 -268 -278 -353 -347 177 78 303
3997 303 523 196 27 187 96 -114 -13 126 -6 -388 -196 -109 -67 -78 33 253 -238 -350 253 256 27 -100
4019 -100 53 108 201 266 468 352 -33 -184 -170 -442 -118 230 -244 -304 -121 -36 -294 -143 -185 -56 -116 53 63
4042 63 172 -25 68 120 55 -8 -16 -34 159 293 -193 171 -43 157 -107 -177 280 -58 -379 -210 -267 -121 -38 173
4066 173 99 50 62 -223 -466 -124 -10 138 82 218 235 33 7 282 55 27 -296 -344 -95 -336 -150 -302 -251
4089 -251 -274 210 -200 4 188 87 -138 -17 209 222 290 243 156 201 -233 -70 272 35 -124 -265 -281 -167
4111 -167 -135 24 -163 24 -145 -84 99 422 282 344 211 9 -154 -188 76 25 -44 -348 -27 -198 -261 292
4133 292 146 -41 98 122 48 260 66 -44 -232 -609 32 188 229 10 66 -184 -13 -18 121 175 64 11 305
4156 305 -140 -103 -213 -219 17 -259 -106 -53 292 324 169 -224 -127 -212 167 356 193 -168 69 117 -53 330 55
4179 55 365 271 -260 -241 -228 -233 -499 -236 -8 -188 -66 23 275 195 136 141 16 -32 311 114 220 -35 54 -156
4203 -156 -79 79 -10 -172 -201 1 -151 -117 -165 -10 -140 150 -234 -15 116 -14 56 -139 -283 267 331 405 225
4226 225 282 15 -153 -256 -267 -328 54 -237 -136 -58 228 -109 118 128 -173 362 426 20 146 18 121 -57
4248 -57 391 266 -24 147 -16 -59 -88 -120 -444 -260 -124 -129 -97 -59 59 8 90 -58 -10 157 370 109 200 104
4272 104 52 -69 111 -122 32 -159 62 -317 80 -158 -343 -12 -208 -212 -290 108 43 278 94 -74 69 416
4294 416 -88 100 -67 352 174 74 380 23 87 15 173 181 -144 -250 169 -94 -185 -93 -118 49 330 -58
4316 -58 105 469 148 217 92 106 -100 152 -222 -39 -54 79 77 11 -241 -275 60 138 -158 31 -143 109 -77
4339 -77 -104 -143 -74 -344 26 99 -31 54 333 219 -30 199 -117 -47 109 -19 1 -140 -155 -266 -52 272 54
4362 54 -242 -113 122 -52 107 -159 149 23 96 74 222 -4 109 57 25 -204 22 -123 84 -79 -418 -221
4384 -221 -67 -130 26 50 -66 4 171 154 437 149 68 13 282 15 37 104 81 -198 -169 197 43 -29 -20 -236
4408 -236 82 -198 -41 -102 -10 -189 -29 214 75 540 70 176 161 -92 475 -36 197 -32 59 67 -315 -41
4430 -41 -227 -178 -59 -195 105 -145 -103 55 103 -104 174 139 -27 46 35 323 -22 66 89 85 263 -234 131 -350
4454 -350 -144 -235 -366 -118 -63 -30 5 34 -123 241 -32 -85 -51 220 -47 68 124 -104 169 -127 -101 199 -104
4477 -104 -239 -232 27 -195 120 -12 -153 -153 -237 -355 -367 97 96 300 266 198 11 91 228 233 -142 -95 244 -200 -45
4502 -45 131 61 85 -100 157 -160 55 -70 -156 -351 -27 288 -67 -91 199 -112 -19 -12 135 330 -54 -21 -59
4525 -59 201 17 81 197 -260 12 111 -68 -264 -248 -4 -461 -149 -25 91 -51 33 437 150 169 247 330 130
4548 130 178 64 -71 -262 7 -127 -185 -234 -182 -81 82 -55 -169 -86 77 67 -23 180 214 305 193 -119 94
4571 94 100 12 130 159 -7 -247 -39 -85 -177 -213 -132 -71 -364 -65 273 25 -169 -145 214 88 -240 343 184 141
4595 141 87 106 81 -181 175 339 -112 164 141 -248 17 -111 -52 -34 -38 29 -326 -315 -101 160 85 243 335 -72
4619 -72 111 434 73 -10 -100 244 -50 -225 -99 84 -101 -104 -287 -174 11 22 -59 -345 -26 63 24 -102 -20
4642 -20 142 163 362 208 202 -109 246 30 2 77 445 -277 -524 -271 -12 -36 -137 -56 122 -284 -198 125 178
4665 178 142 249 268 6 177 -188 169 -25 -162 57 -64 -318 -138 82 -200 -400 -497 -124 6 -275 -53
4686 -53 49 91 97 138 54 35 129 40 -29 231 13 85 10 133 -93 -32 173 -128 -121 -179 240 -288 -315 -289 -55 -38
4712 -38 -162 -65 52 -46 -50 194 134 123 60 115 -10 -21 81 84 -153 -145 -138 -226 -386 -261 -79 44 -165 342 -216 38
4738 38 -65 59 -199 185 293 236 81 -13 192 119 72 134 235 -130 -73 1 -55 -282 -376 -261 -114 33 -20 -86
4762 -86 60 -18 -202 5 -110 157 88 260 128 28 -127 -94 20 70 -106 -129 -186 -81 -241 -68 -80 -428 -290
4785 -290 191 137 230 28 134 -141 332 245 423 361 -16 269 -66 164 -106 -31 -27 -146 -102 -60 -27 -64 104 -123
4809 -123 -266 -87 -231 10 78 6 -110 110 155 473 157 165 170 45 -196 -183 -325 220 122 -137 -303 -95 -102 -71
4833 -71 57 -7 -132 -170 49 219 75 14 234 106 -132 6 -70 255 27 154 -192 -14 165 -25 357 -2
4855 -2 74 -240 71 130 153 376 90 -49 160 133 99 -8 -12 66 151 63 -61 67 -47 -26 85 -180 6 -116
4879 -116 6 -231 -141 -203 -381 -171 11 156 78 249 276 240 140 162 133 99 25 -17 21 -161 -63 161 -65 188
4903 188 -243 -273 -15 43 -298 -231 -125 -252 45 -122 178 121 179 134 199 123 21 122 66 317 -125 -155 -109 -235
4927 -235 -121 170 -168 -162 76 77 -23 -270 141 63 55 -200 -187 -13 -24 -37 166 190 -103 77 144 264 -28 -104
4951 -104 -295 -456 -359 -66 -277 -217 -21 -146 302 190 12 109 68 -66 -136 135 -3 177 138 52 112 -141 -35
4974 -35 -66 -185 -108 100 -153 -129 -161 -199 -10 -278 11 -139 347 64 62 597 62 -83 113 194 35 -27 -149
4997 -149 -124 242 -272 190 159 -180 1 33 -208 72 -285 -46 -139 -169 -204 12 -112 -126 161 309 269 167 18
5020 18 225 89 -351 -215 -326 -11 -79 10 307 -461 -175 131 -71 8 136 6 -139 -300 47 175 -22
5041 -22 29 365 22 177 26 63 92 -63 68 -76 -127 -181 -180 -34 88 -168 -277 217 250 -62 255 132 0
5064 0 45 75 201 123 -176 -183 112 53 -129 -211 -3 -118 -225 -116 40 128 30 -267 -42 30 14 26 177 122 16
5089 16 -78 -6 199 218 260 95 72 119 142 -213 -174 -205 -209 -33 -127 41 73 60 -226 -224 -40 -186 174 -121 119 -26
5115 -26 -214 282 131 131 -5 223 94 18 -30 -178 129 -53 -323 -265 -142 -75 75 22 66 -387 -41 273 125
5138 125 -66 60 164 -94 -59 75 402 -85 -170 -157 -161 -153 -230 106 -318 -229 154 239 -180 -200 107 -24 -43 41
5162 41 195 -96 379 149 110 116 37 -255 -6 35 -172 -163 -189 -280 -181 -261 112 56 -243 -110 -131 18 -27 -123 1
5187 1 124 170 189 -80 34 7 8 301 -149 -157 -113 -154 64 -73 135 94 185 32 84 -84 3 237 -49 304 186
5212 186 51 -183 50 74 34 113 -141 -96 248 16 67 -6 -20 120 1 -175 -166 249 1 -21 -119 -145 -128 168
5236 168 15 152 239 -12 -1 152 53 180 64 -187 -158 106 -131 -114 -339 -150 -259 -232 42 -268 -119 79
5258 79 -56 -61 111 131 250 -231 48 230 190 -77 -29 280 -185 -281 -149 -130 -145 -358 -39 -37 -15 108 -34 17
5282 17 53 111 176 125 169 309 129 156 41 258 212 144 362 -81 -74 43 152 -345 13 -215 -27 -7 110 -75
5306 -75 -281 -137 -52 -22 -25 110 212 150 105 -50 -30 231 -444 30 75 -312 39 -1 -329 7 -55 -213 -120 -327
5330 -327 -200 -4 -10 -213 127 95 15 -60 28 -71 310 299 92 113 -119 68 -151 238 -212 -147 -26 -64 13 -234
5354 -234 91 202 79 -313 118 -215 -238 -8 91 -24 157 394 228 -29 -125 59 97 -232 -79 133 -52
5375 -52 -173 16 -200 -4 -22 186 -3 -11 41 213 226 216 347 -2 28 198 -124 -96 72 -316 112 -69 -71 -10
5399 -10 -56 -132 -86 231 12 -231 -336 -85 -252 50 259 127 175 229 50 33 209 46 -122 -58 37 -195 78
5422 78 -177 -179 -220 -196 -175 -227 -36 113 172 169 -120 -63 -260 -140 37 -35 140 35 63 197 310 -52 135 -157
5446 -157 -186 129 -223 -342 -104 147 -291 47 -39 27 30 -129 -106 -3 -234 136 148 -119 -4 -131 -47 92 162
5469 162 124 57 78 -3 149 -47 -12 -52 135 114 -23 -184 -147 58 6 78 -110 22 190 -141 122 48 -237 185
5493 185 -153 -44 -59 -112 80 -113 -381 -176 -155 34 -104 -109 186 -215 -162 -129 233 -248 296 224 1 344 75
5516 75 159 158 139 36 -13 -270 91 -161 158 -35 -167 134 73 48 -41 -268 -165 -78 26 263 113 11 -33 162
5540 162 194 0 178 201 -64 143 -114 -59 282 -163 -21 75 -211 -20 171 -78 -123 -180 128 160 268 -103
5562 -103 247 154 160 -4 20 -51 -183 43 64 230 60 -88 138 -130 -199 -6 96 44 -48 2 141 -3 379
5585 379 262 171 261 61 20 -291 -51 71 -110 15 -106 -91 -241 -152 75 57 235 178 27 98 184 -136 126
5608 126 167 -76 135 102 -116 14 -23 -6 -44 64 -145 55 56 63 78 30 0 -241 37 88 -33 33 67 97 -87
5633 -87 -90 -103 -179 242 206 -19 -170 166 -2 -161 -89 -117 -61 55 -39 -32 -78 206 102 179 -1 -199 6 129 -10
5658 -10 74 -143 147 -137 -260 38 141 -72 66 72 -5 130 -116 -255 100 -276 -156 -81 -106 14 -38 -58 -143
5681 -143 -90 -63 33 28 -18 64 128 -178 19 -50 -120 42 -63 -16 -232 57 158 276 -47 173 -186 28 11 5 84
5706 84 43 56 -6 -129 66 187 -237 42 -82 -118 14 164 146 -82 103 -5 -193 -96 -52 -62 175 101 -61
5729 -61 124 18 2 -170 43 -53 49 -87 200 248 59 -146 12 -198 82 -34 -305 239 125 -40 -119 -190
5751 -190 -124 -158 -121 46 163 163 -48 200 91 63 -83 -23 95 -124 144 -128 -109 55 -136 -206 149 -64 -89
5774 -89 14 -28 -191 -356 -104 -26 21 42 91 -162 211 -221 131 102 72 235 147 -272 -21 92 -43 -18 35 38
5798 38 -55 180 227 22 170 103 86 -42 -66 282 64 73 186 178 -243 371 -81 -159 38 -53 -18 122 -254 24
5822 24 -152 153 -194 -37 -190 -24 -1 47 61 -21 -163 66 73 -77 36 24 -56 2 -124 -90 76 55 2 122
5846 122 10 -366 171 153 -144 -162 94 94 125 -397 173 71 15 -201 124 -99 135 -69 131 44 172 47
5868 47 12 -36 215 -183 -178 -385 178 21 65 126 61 -109 -123 -269 -16 115 64 15 -68 -27 150 222 141 134 -326 204
5894 204 21 118 89 -179 161 165 110 2 140 -81 7 -127 -152 -13 71 111 -80 -72 -222 -23 -91 38 138 -138
5918 -138 -258 124 50 -123 -15 -34 -8 -7 -137 84 38 46 15 -296 -198 -17 85 67 -218 10 100 245 -79 -49
5942 -49 -76 -21 -127 -102 -129 -370 -231 276 83 62 -148 -24 170 -140 124 -54 338 43 -26 6 220 -145 152
5965 152 85 -120 -36 -160 24 129 31 -255 -132 -290 131 -55 232 -6 41 -74 -176 -41 -196 -154 -43 17
5987 17 -165 -102 -88 -83 -276 -49 49 40 -103 40 31 -51 -91 -121 133 158 164 66 -182 -33 -259 -112 97 156 40 37 236
6014 236 -158 39 273 9 16 45 94 -87 77 -261 -71 -39 175 70 3 -63 -175 -93 266 -138 -33 -156 -23
6037 -23 -14 -103 435 -72 -44 121 -138 -1 51 -311 -98 -32 218 71 -30 -28 38 52 46 13 -36 10 61 198 -185 -211
6063 -211 -126 -266 105 132 58 -80 360 -120 -85 -9 141 -19 -94 -106 45 105 52 64 21 243 -64 32 25 116 110 -88
6089 -88 -100 -121 -88 164 22 -331 266 77 152 -9 -93 -171 -90 152 37 133 -2 -342 166 59 -140 -160 -69 -174
6113 -174 -143 68 -44 76 -34 86 401 47 104 241 63 39 -61 -72 -5 18 109 93 -58 -41 -76 266 56
6136 56 181 2 23 270 -291 -115 24 -77 230 199 3 125 -122 87 -53 133 64 -160 180 -117 -26 -156
6158 -156 116 -214 -22 -170 35 47 -198 -5 -119 -103 -115 82 -234 168 64 47 -366 -46 -56 -56 35 314 -267
6181 -267 140 168 5 -129 -15 -172 -69 -62 -106 122 -63 -230 49 -187 -67 -130 98 221 -28 111 -187 -122
6203 -122 112 -256 25 -65 161 277 -79 236 254 -106 -94 -65 -215 182 78 -232 -147 22 -118 210 -278 -276
6225 -276 139 40 72 166 376 31 212 183 -4 53 -101 110 -73 53 -240 33 -44 65 -144 -148 62 -247 -41
6248 -41 158 -12 64 137 -150 30 -72 194 116 35 168 -30 46 -125 9 -142 195 -131 185 28 -251 71
6270 71 -106 -66 -245 -103 -4 -118 15 -20 168 -74 10 23 -17 -55 163 -132 152 7 -58 140 -170 -36 -94
6293 -94 -3 -149 -282 16 33 169 120 69 -259 59 40 172 253 17 -25 -148 232 178 -141 40 -325 -96 -51
6316 -51 27 -132 -38 95 -145 72 -172 50 70 -36 392 -13 1 123 231 113 -1 100 238 -244 -278 268
6338 268 86 -106 -171 -9 -344 -192 -81 -115 -74 235 91 66 -29 -8 44 -51 425 53 -57 92 195 37 64
6361 64 -28 1 -89 -155 76 -211 -94 33 192 132 167 162 46 -6 113 44 39 136 153 159 -176 113 3 49 69 6 157
6388 157 241 47 95 11 56 -57 246 -154 80 -132 -42 10 162 187 -125 164 -30 313 -433 90 -104 -47 -6
6411 -6 139 -285 -104 -275 -20 102 -333 -346 -28 24 -175 -10 -287 -1 112 -195 -22 -141 154 282 3
6432 3 -108 101 73 -149 179 -43 109 14 -172 91 185 -98 -339 -63 -127 106 156 69 53 16 91 -30 -134 -144
6456 -144 141 -16 -306 15 -144 -106 -140 -23 193 -149 -117 -164 218 52 8 84 209 16 48 165 120 88 -181
6479 -181 116 64 -44 -153 -198 -129 -260 -203 -17 93 151 47 -49 -191 -184 11 -53 -131 -76 -210 -183 200 -138 5
6503 5 33 35 -4 -30 -8 48 73 126 -157 -220 -9 -108 -345 132 -69 -96 19 -174 127 303 178 -123 57 8 17 -27
6529 -27 138 86 -101 -238 112 -88 53 114 172 11 -53 -44 -131 -57 -26 112 -186 -91 24 15 -42 129 -120 34 -57
6554 -57 22 -77 246 -284 140 117 -15 192 18 -20 -392 -84 -70 -1 -1 -129 119 23 -22 173 -49 37 22 -21 -171
6579 -171 127 -128 -112 75 -200 -68 -24 38 -212 -216 192 16 193 31 116 7 -139 33 -73 -60 -51 4 -145
6602 -145 -132 65 -266 197 -42 122 113 67 61 209 -47 2 257 -14 -3 -124 -69 80 48 -7 -132 92 -60 228
6626 228 -66 -159 209 163 135 78 -144 12 -318 -166 136 35 -156 168 -171 -180 -70 -192 -41 -432 -365 46
6648 46 155 111 -160 189 187 50 97 53 60 61 68 -32 50 -189 262 181 -51 -101 -64 23 75 -69 25 -184 157 77 155
6675 155 222 129 93 -68 -5 -94 -19 48 -117 118 -131 -5 -17 -155 13 71 -146 213 -109 -161 -159 23 51 144 -50
6700 -50 37 122 -39 237 111 -126 -87 -90 -260 -161 -169 -146 48 60 102 44 15 -20 -59 -86 -21 154 180 -52 -75 106 -87
6727 -87 -231 -246 307 -261 -69 -95 24 200 105 -51 8 11 -59 60 -39 -28 -122 -120 -161 -22 -203 66 104 -176 -126
6752 -126 91 28 3 -29 121 23 41 55 -144 -183 23 134 -63 103 -44 -11 133 -102 -316 32 264 6 49
6775 49 187 46 -79 48 -63 184 117 -114 21 15 100 -203 302 -87 67 -185 86 105 156 4 -15 -18 -76 -7
6799 -7 152 186 293 51 -243 73 70 -298 19 67 -21 -120 159 -261 -45 254 -243 -185 -42 193 32 -96 -202
6822 -202 -281 97 150 73 -15 -46 230 92 -77 -95 -101 -237 103 -33 -85 20 -150 -45 14 -7 -76 71 -181 -202
6846 -202 -55 225 -87 -213 129 -191 -53 -13 109 265 242 -77 -50 -392 21 86 -17 -176 9 45 -295 7
6868 7 170 -223 24 -107 59 130 -121 -318 35 -138 -87 -38 -63 94 -129 134 -17 -58 264 -150 77 230
6890 230 -320 2 125 37 85 101 171 126 17 233 -42 4 196 100 40 -237 -117 -45 -109 193 -32 -52 -106 -28
6914 -28 -82 60 -229 -68 293 329 118 -49 164 74 60 98 -217 -179 -35 300 402 -87 30 -117 271 145
6936 145 249 169 35 -227 -102 -64 39 8 -162 82 32 -153 -33 37 -1 19 -101 175 -6 -71 95 -162 -14
6959 -14 -46 100 92 166 2 -19 145 -33 -132 -36 -129 10 33 131 91 127 21 65 160 184 -35 -50 317 -58 16 -157
6985 -157 -11 -624 -115 288 -176 96 -45 42 -24 265 -5 -167 -115 -186 -6 234 -188 212 5 101 -240 6
7007 6 -154 11 11 -109 68 17 2 115 -27 47 3 -176 56 -8 65 -231 354 181 83 125 141 312 -164 4
7031 4 -94 -49 171 -165 -30 23 -221 66 -45 285 -111 -352 175 -56 -326 165 191 -259 112 -4 -98 -128 -112
7054 -112 -77 -282 31 226 18 77 -178 37 73 84 -59 -198 123 55 81 -64 139 18 -104 -3 -82 -183
7076 -183 -139 17 -93 -87 52 80 16 101 257 -160 -1 -94 -53 -230 3 90 -53 72 28 219 21 -90 -227
7099 -227 -103 64 64 264 139 -127 103 -131 339 188 2 124 161 -241 -8 348 -38 -84 -128 -72 -235 195
7121 195 24 2 -230 33 107 -113 38 3 132 139 115 -198 110 67 104 111 -30 -189 -132 -169 -35 -244 266 27
7145 27 -47 172 -128 -176 -93 18 8 -90 119 40 -61 101 14 65 -33 56 42 117 251 -116 -42 142 -43 14 -15
7170 -15 10 64 193 -19 82 314 -19 -42 -11 -177 9 -200 -42 83 156 -70 17 -129 -157 7 143 -56 -45
7193 -45 -90 217 -118 -231 93 65 -71 167 -129 -92 -145 -87 -41 -151 -128 -27 63 -32 -7 172 -245 -208 -127 194
7217 194 261 -170 -112 134 97 -32 -25 -110 -179 100 238 -27 232 149 147 -18 117 35 -22 145 44 -287 125 -138
7241 -138 -76 -250 91 125 150 -120 64 116 88 348 -177 34 121 31 206 -137 -78 -172 -274 19 -301 171 3
7264 3 -8 63 -125 -134 -6 -115 -178 91 161 -14 -13 19 104 -118 -92 146 161 83 -53 62 -75 102 -175 -127 -153 135
7290 135 -402 -126 39 83 -35 -42 66 76 -31 168 141 -113 -8 -157 -38 281 -222 -32 73 -3 -175 43
7312 43 100 -33 41 -87 133 -65 182 -39 6 -64 -132 -8 59 -96 -10 -35 -47 41 -163 34 28 -112 -243 154
7336 154 -203 54 56 -237 -160 -47 -197 68 -266 -2 -90 -166 -63 -59 -183 135 -64 -83 17 -20 -30 -183 -156 146
7360 146 -52 149 -144 -107 -252 -12 59 -152 -66 123 82 -16 -27 161 80 -144 67 102 54 79 56 -150 1 -101
7384 -101 -217 -70 356 73 -125 -65 -315 42 10 -60 -178 -92 -102 129 -136 -283 171 11 -43 49 -17 -64 117
7407 117 2 157 -209 39 -318 -146 -113 -168 -106 128 -167 -61 -229 -68 51 12 209 76 26 -72 57 408
7429 408 62 155 -44 43 159 -49 173 34 -38 -139 197 -81 224 -135 -69 -9 -118 -130 101 61 -48 -37 144
7452 144 -165 155 263 73 98 193 4 103 11 -17 178 141 216 126 69 132 277 -65 267 4 15 45 -60 -32
7476 -32 -82 10 -43 -130 -71 36 34 58 22 24 105 -186 -115 -138 -126 -100 -90 358 -85 -2 -69 348 76 33 -27 -72 -143 48
7504 48 -19 -27 152 -33 -339 94 61 22 -25 -195 -227 -285 39 -83 28 -29 37 30 0 -108 -144 12 43 103 9 -24
7530 -24 117 -138 -58 -213 61 98 -67 -43 118 -283 -124 167 -25 -20 62 -42 -186 17 10 -293 224 -12 21
7553 21 348 54 102 -41 6 199 56 107 51 -61 139 125 -90 2 -90 131 21 127 92 -149 211 -99 87
7576 87 -50 -39 315 -164 -160 -52 78 3 -17 -156 -105 114 236 -211 -45 53 -250 -100 -206 -42 -123 101 165
7599 165 124 133 -96 103 136 78 68 -8 -68 -137 -12 220 -143 40 93 -89 -40 138 102 161 -125 66 40 -14 166
7624 166 188 123 175 -36 -40 202 -29 151 -193 -37 8 210 -194 60 -121 6 21 147 206 -141 -209 -35 -251
7647 -251 27 107 103 -13 -18 83 114 39 163 -4 -39 31 -16 -246 88 238 -189 31 206 -164 -103 47 104 -166
7671 -166 -5 -24 -48 -63 77 -2 -241 209 64 -96 -15 -196 30 -64 99 -205 -184 -25 -76 -69 -197 215 59
7694 59 -33 -261 -182 -102 118 161 -102 178 142 59 80 64 -217 -78 46 131 -5 -347 65 -305 53 219 60
7717 60 -119 139 185 63 -219 54 248 -51 -63 172 -31 7 46 57 -24 -148 152 110 -35 43 -259 14 -94
7740 -94 -139 -23 -228 90 118 104 -69 37 -20 -10 63 127 171 34 161 100 -141 59 67 -245 -62 -189 162 -50
7764 -50 -84 192 97 155 -148 -172 -130 35 33 230 58 144 60 92 -191 232 -14 -59 -20 98 -101 309 -74 -117 -66
7789 -66 -90 56 38 -188 -300 -31 157 -242 71 196 -29 184 66 180 -470 104 -209 71 -2 55 14 8 -234
7812 -234 -32 78 -193 -74 72 193 -109 170 53 -321 130 94 89 -40 -44 -122 207 54 -176 -137 -283 106
7834 106 -165 -33 117 30 -20 -208 -195 -116 -67 -65 21 272 -41 -33 81 223 -58 209 95 184 73 -69 119 253
7858 253 -44 216 147 160 -54 -163 96 -295 -163 -49 14 230 77 188 171 454 -181 2 111 -39 -164
7879 -164 -90 59 -17 199 -71 -1 265 159 -112 -75 -150 151 220 205 -271 -107 123 -106 -115 -62 -175 -26 159
7902 159 371 -74 -231 -98 -66 160 137 -94 153 77 30 -30 -186 -177 43 119 -9 53 -93 -96 39 181 -122 52
7926 52 66 124 -46 144 69 -100 -86 57 147 18 -138 -98 -159 -187 -41 -50 8 124 8 -56 -183 -10 -192 171
7950 171 180 161 -135 -71 85 -286 54 -53 -122 3 -27 -110 37 -164 -16 -104 41 143 101 262 -60 -143 115
7973 115 -6 59 91 54 89 74 -90 -178 81 206 88 -86 -184 -201 -91 -243 -83 -11 86 163 37 384 -34 49
7997 49 -95 304 -111 111 226 166 -2 228 38 -149 -194 159 -96 -78 69 7 -130 -277 9 167 34 48
8019 48 12 74 154 -50 226 -16 155 101 -49 42 -98 -84 113 -200 -35 -46 78 -144 -146 -71 -127 -131 -108 120 87
8044 87 -227 20 176 218 8 165 245 76 120 195 141 -236 163 164 139 -6 -79 -186 -56 -96 2 -24 -52 -11 -24
8069 -24 -110 -56 26 142 -14 -59 -144 59 195 41 -21 22 -97 -94 202 44 -139 144 -192 123 -214 -102 -188 -101
8093 -101 80 25 73 8 215 199 56 -24 5 -160 92 256 222 102 38 -233 40 155 41 230 -53 -123 98
8116 98 -341 111 -67 77 -127 134 -73 159 142 32 206 132 -117 47 -138 -37 239 -14 62 -52 11 -16
8138 -16 -97 73 -23 -157 106 95 20 50 -101 120 52 -4 128 -74 -233 -177 -159 -88 64 -47 -11 -115 -77 274
8162 274 -64 -14 137 -231 47 -46 115 21 -103 -255 -222 315 77 21 130 -56 19 127 119 -195 -69 7 -299
8185 -299 -24 86 -107 -81 -222 -272
8191b72
$$ Imaginary data points
##PAGE= N=2
##DATA TABLE= (X++(I..I)), XYDATA
0 0 0 0 0 0 0 0 0 0 0 0 0 -8 8 -8 8 -8 16 -16 20 -24 32 -32 40 -48 56 -65 75 -89 100 -115 131 -150 172 -195
34 -195 219 -246 275 -310 346 -386 428 -475 529 -584 648 -712 787 -867 956 -1053 1161 -1279
52 -1279 1409 -1555 1720 -1907 2117 -2362 2644 -2982 3387 -3886 4522 -5358 6516 -8225 11026
67 11026 -16403 30542 -150727 -335933 -48039 133185 230377 347350 457434 325600 133017
78 133017 53531 25764 -80881 -137367 -118283 -130894 -188228 -148691 -60591 -39462 -59773 -42051
90 -42051 -33755 -8826 76159 132895 79641 22976 10264 -7754 9913 107120 152333 81031
102 81031 19942 24278 -8938 -81657 -95311 -82620 -138204 -175915 -94558 -6593 -6094 23481 111312
115 111312 112692 46007 63868 118228 95098 60003 61116 2892 -110062 -149545 -106089 -73434
127 -73434 -62766 -35512 -16603 -20696 10610 78751 99634 69526 59234 51312 7934 -12564
139 -12564 -3245 -38290 -81469 -46255 8455 5830 1245 26067 16786 -23529 -25972 -5858 -25308
152 -25308 -55166 -30173 13966 13691 4685 33621 55219 52458 72235 86094 38508 -18670 -30488
165 -30488 -37301 -57990 -59368 -55797 -69136 -66772 -33890 -11243 -11015 3686 42116 67380 69477
178 69477 76605 76397 41124 14734 27950 16470 -41319 -72441 -61183 -55007 -41391 -4890 3587
191 3587 -25850 -35904 -11488 7296 6803 8503 20290 27558 33473 50254 52010 23290 3767
204 3767 6995 -1797 -17629 -14767 -17443 -32042 -24253 -10481 -27793 -45467 -28673 -6618 364
217 364 7259 17463 18806 21196 46513 72486 53234 3718 -19123 -19487 -27847 -24150 -7782 -19603
231 -19603 -43450 -31293 -5540 -1104 203 10912 16710 20734 30060 30285 13749 -2836 -2157 6418
245 6418 772 -11086 -14848 -20898 -28372 -18489 -11302 -23182 -16926 19775 43531 41146 34601 16987
259 16987 -11220 -19366 -5170 1855 -8393 -14647 -3394 11916 13266 6120 -6682 -31449 -45301
272 -45301 -28428 -8710 -6816 289 16353 24909 33751 42315 32255 15817 13680 14450 4490 -12000
286 -12000 -28087 -36815 -34176 -23869 -12836 -13120 -22828 -17073 4474 13311 8988 11933 15986 19674
300 19674 36692 50418 33871 5615 -12313 -18760 -20012 -20463 -23791 -26116 -20766 -7304 8324
313 8324 12699 1870 -5245 -3263 -2465 -812 1970 -3690 -2556 18139 31627 24971 13659 4361
327 4361 -4595 -6110 -3879 -11108 -23310 -27625 -16318 2074 7052 1860 3636 8372 7077 10504
341 10504 10335 -5396 -17074 -7517 5568 10439 9738 3177 -2445 -1263 24 -5384 -15823 -22978
355 -22978 -13814 10474 27477 27300 19230 6723 -1274 3030 2022 -13647 -25456 -23441 -17998 -7184
369 -7184 4025 3745 -2107 -515 5547 9716 10007 6904 7709 11581 9103 5905 3125 -1388 1888 11795
385 11795 7372 -12194 -24962 -27750 -20942 -1746 10101 -550 -12747 -8827 4521 15268 15275 3440
399 3440 -10069 -10857 6310 31146 37585 21774 6172 -2706 -13706 -19240 -16532 -21610 -28143 -21224
413 -21224 -10148 -4309 5117 15901 20223 18382 11136 -380 -4311 3208 12243 12466 -376 -16084
427 -16084 -18733 -8815 6035 18512 10329 -15527 -22819 -2723 14326 18342 12625 -6084 -25621
440 -25621 -22477 -2088 10263 7881 -160 -1658 3489 7223 9140 10449 3189 -6823 -7593 -5355
454 -5355 -5626 -2166 2429 2381 2902 1659 -2380 5052 19078 16555 -498 -14785 -22396 -20517 -4806
469 -4806 10760 8478 -9663 -22431 -10177 12280 18464 11940 5677 -2263 -4137 13336 30720
482 30720 22686 298 -13914 -16653 -13689 -12078 -12252 -8712 -5568 -5511 957 8625 2500 -7727 -8244
497 -8244 -4999 -3530 2041 15014 30256 33350 17489 -720 -7780 -10202 -8152 3002 4645 -13750
511 -13750 -29290 -22172 -4733 3454 -2127 -11379 -13027 -7336 5786 25973 31915 12382 -3768
524 -3768 3343 16128 18834 15531 9988 -1223 -16056 -26271 -26208 -24629 -29787 -25811 -4957 9609
538 9609 12725 21791 33527 28721 11243 -2392 -8182 -6275 962 12006 15149 -620 -25381 -30189
552 -30189 -15237 -3903 -1833 -2033 -3426 -1338 8955 19173 22059 12179 -5970 -11092 2880 11687
566 11687 5359 1886 2838 -4594 -14638 -14669 -11643 -15064 -17640 -6971 6397 2589 -5598 6028 20757
581 20757 19454 19457 28803 27554 17201 14193 4554 -22683 -51339 -60769 -49504 -27400 -6010 7898
595 7898 14932 17888 22908 29892 29447 22567 14028 6056 4432 6690 -2454 -19505 -20604 -13411 -15951
610 -15951 -16583 -7513 -6087 -10136 384 15193 12085 -1213 -3004 3139 3028 -204 4338 8252 3012
625 3012 6098 19182 17575 1901 -5011 -4412 -5623 -5641 -8581 -19527 -25149 -18211 -9157 -1502 8813
640 8813 14988 14781 17056 21361 13726 -4670 -14384 -7587 -3528 -8723 -4812 3455 113 788 17010
655 17010 19469 74 -10961 -6664 -7200 -10162 -5983 -5179 -12061 -11759 516 8927 5462 4279 12771
670 12771 16760 13770 14499 8931 -8596 -16617 -10485 -10461 -16642 -13152 -5359 -795 7428 15180 12918
685 12918 7560 9733 13742 8841 -3515 -12788 -17475 -18146 -9580 2646 249 -10122 -6658 3343
699 3343 5486 10726 18385 11526 920 4486 8554 -154 -7209 -2854 754 -2694 -2747 -523 -7876
714 -7876 -16659 -9565 1010 -6103 -11922 62 7851 3361 6673 12253 1971 -2022 14833 26836
728 26836 16961 4147 -2382 -10107 -16219 -11940 -6618 -14613 -23350 -14554 -2142 1839 7796 13365
742 13365 6268 898 8133 9410 1825 6775 15862 8573 -1144 -288 -5106 -14708 -9590 4131 1285
757 1285 -13536 -11536 616 690 -2236 5361 3484 -11017 -5563 16218 17161 2272 -794 -392 -7291
772 -7291 -3585 9081 7732 -3958 -5989 -741 -2392 -5319 -1175 160 -3280 -647 5868 2237 -2254
787 -2254 5529 8484 -1504 -5088 -4155 -11345 -10870 5730 11533 -814 -4746 2636 3403 513 6064
802 6064 8216 -2226 -7364 4299 10386 -908 -7023 -301 -743 -5630 -115 1931 -10833 -14057
816 -14057 -1926 3730 684 2920 5221 2584 4826 10613 7737 -2640 -5601 -253 914 41 3878
831 3878 3251 -5584 -5587 3087 -855 -9310 -5082 82 -5656 -5986 2623 3852 1379 7410 11413 1071
847 1071 -9266 -5686 4685 8607 8507 6639 -3110 -12131 -4712 8141 6647 -1921 -7419 -12804 -12654
862 -12654 -447 8236 3326 -2657 -2929 -1880 1251 8210 10502 3972 -2699 -2060 -346 -1570 2678
877 2678 9958 6410 -5195 -8507 -6031 -6380 -531 8255 2917 -10779 -10703 -30 7232 10040 7304
892 7304 -4767 -15561 -11972 3750 14787 13086 5193 -2516 -7750 -3709 7348 9513 942 -4118
906 -4118 -4723 -7120 -4290 2739 2188 -3518 -4601 -4121 -4909 -1638 6155 9420 3757 -4351 -6240 -3483
922 -3483 1712 10027 13249 4000 -6910 -4914 1461 4348 5060 371 -9498 -12902 -4894 3029 3614
937 3614 -360 -5881 -8422 -4207 3411 9646 9835 5263 2920 891 -2215 -2403 132 274 -204 1473
953 1473 -379 -4722 -2213 2843 2904 265 -2318 -5212 -4450 82 3703 880 -5995 -8034 -3278 2678
969 2678 5444 7623 6044 1248 1903 6652 4457 -1632 -3471 -3805 -4573 -2198 -175 -2252 -4041 -2550
985 -2550 1097 2048 -371 -2090 15 1562 2250 2393 -264 -3801 -1923 2817 3321 1918 671 -1158
1001 -1158 490 4506 4458 574 -2221 -2944 -3112 -1970 -1690 -2208 -1802 -848 2228 3064 -1668 -6284 -3115
1018 -3115 659 2175 3896 4031 295 -353 3354 4872 2516 -754 -1496 1188 3729 2650 -249 -4152
1034 -4152 -7684 -7382 -3609 -2855 -3827 -2555 -33 3026 5419 3385 -26 727 3070 4056 5564 5441
1050 5441 2469 578 893 -483 -4440 -8206 -7557 -2314 950 129 -943 -2621 -6156 -4382 2393 4082
1066 4082 1270 2878 6118 7023 6284 3663 -1149 -4599 -4363 -605 2500 588 -2394 -2030 -1543 -2323
1082 -2323 -2995 -3868 -4564 -718 3820 3844 3503 2744 -611 -1444 1237 996 -2022 -1219 3244 5183 3136
1099 3136 -454 -2775 -5838 -5761 301 5737 2409 -1790 940 1892 -1203 -1299 -356 -3018 -3710 1130 2966
1116 2966 -188 -3278 -3175 -1396 717 2177 3061 3236 3373 4652 4528 804 -2138 -2550 -2779 -1721 -210
1133 -210 -2902 -5922 -2962 619 131 -458 -25 -2217 -1790 3243 6963 4621 439 -630 889 404
1149 404 230 1684 954 -1871 830 4195 547 -4044 -3569 -2610 -3031 -1431 -104 -2370 -3224 -788 1346
1166 1346 918 22 1141 3234 4522 4244 4167 2007 28 1541 2044 -506 -2895 -4439 -5225 -2984 -661
1183 -661 -2168 -4831 -3633 -1401 985 3709 4064 1153 63 3099 5896 5100 1464 -427 -679 -1777
1199 -1777 -1642 772 -1429 -5700 -3805 -80 -798 -2023 136 325 -283 67 1688 2054 1923 2126 2620
1216 2620 982 -2660 -3668 -741 2171 3068 1497 -2508 -4598 -3020 -245 3045 4454 1842 -1631
1231 -1631 841 4452 2257 -1800 -3248 -4832 -5346 -1895 2152 1967 -1636 -2731 425 2018 1508 3334
1247 3334 5002 2792 336 660 818 107 442 373 -1473 -3892 -5577 -4370 -62 2975 728 -1739
1263 -1739 -2646 -2072 2 3512 4339 1556 -2245 -1289 3047 4878 1972 633 788 -900 -551 3255
1279 3255 1784 -3922 -6658 -5452 -4095 -3034 -642 1006 1746 1403 1083 2227 2909 2315 2514 3022 1606
1296 1606 -600 -1115 364 2026 180 -4194 -4495 -2149 -1648 -182 2639 474 -4419 -3472 1477 4034
1312 4034 2471 871 345 -571 -706 1707 3419 560 -2241 -292 2033 1500 783 -206 -2074 -3348
1328 -3348 -2750 -1463 285 1614 963 340 630 -535 -1888 -194 1906 1174 -1488 -2414 -807 1302
1344 1302 2077 3204 3270 -869 -3079 339 3145 1089 -1463 -1654 -2458 -2337 420 1751 68 -2456
1360 -2456 -2151 -22 1121 612 536 785 156 776 2190 1730 1068 707 -330 -1507 -986 -1248 -1485 1125
1378 1125 2855 266 -2018 -2080 -932 -823 -206 657 -923 -2742 -1600 2542 3216 465 -141 986 474
1395 474 628 2571 1453 -1491 -1363 252 126 -634 -832 -1494 -1538 -883 497 -110 -850 -212 1321 365
1413 365 -67 1005 630 -746 1017 1917 -893 -2584 15 982 511 1661 1972 -499 -1828 67 1522
1430 1522 -625 -2053 -1236 -805 -1197 -884 297 -1333 -2175 156 1763 688 799 1746 1093 1189 2588
1447 2588 1796 -475 -1146 -5 -475 -1049 -659 -571 -1869 -1248 761 61 -2756 -1889 360 257 219 2001
1465 2001 1492 -425 770 3216 2246 282 324 369 -661 -829 -34 -871 -1842 -915 228 -868 -2039 -1010
1483 -1010 -884 -749 923 2444 383 -777 1570 2119 564 381 774 -299 -724 773 1010 -960 -1825
1500 -1825 -185 696 3 -165 462 -1856 -3045 -1087 -96 -1121 -524 1437 1882 1854 2533 1753 181 -280
1518 -280 543 -628 -1789 -1469 -656 -339 189 632 -552 -2523 -1331 868 1485 1575 1838 990 -698 -506
1536 -506 478 -632 -1944 -1030 -615 -706 -211 469 125 403 1342 2013 1709 842 794 488 -748 -1359 -1517 -2359
1556 -2359 -1430 855 1752 156 -743 -383 -1301 -847 644 -134 -1159 -1247 884 2043 2321 2038 1501 205
1574 205 -905 -206 482 -764 -1460 -774 -1041 -1892 -1545 -973 -720 -254 353 383 160 1108 2285 2541 2227
1593 2227 844 -64 -817 -478 210 -511 -1870 -1698 -1270 -291 472 1209 -64 -1419 -563 353 75 85 -17
1612 -17 -264 -487 277 1385 1847 1463 1287 1141 -358 -1300 -1176 -1561 -1362 -159 470 -257 -732 -159 302
1631 302 -39 244 122 -102 836 1293 1191 55 -991 -1146 -769 -84 22 492 -67 -185 1030 1242 534
1650 534 -33 -170 -730 -57 558 -358 -1520 -1399 -650 -692 166 682 868 405 647 808 406 -524 -447 271
1670 271 394 -41 678 745 98 -203 -454 -544 -785 -149 621 1015 225 -1228 -1710 -989 -483 440 665 155
1690 155 31 -120 537 1536 1368 398 63 585 277 -257 39 -396 -1588 -1376 -520 -75 190 -81 352 -169
1710 -169 -641 -505 488 1148 1268 1322 1008 -148 -480 -282 435 556 -558 -1274 -633 -352 488 364 -377 -1041
1730 -1041 -1291 -399 756 1051 629 135 341 342 218 501 703 602 -380 -660 -299 -617 -1048 -231 99 -37
1750 -37 -171 219 745 413 -330 9 -124 -798 -374 449 751 -148 -634 -675 -791 -174 217 504 368 131 376
1771 376 913 973 574 -404 -370 -475 -963 -851 -622 -332 -204 -213 199 497 147 -344 390 150 -392 -446 234 135
1793 135 96 642 627 431 -247 294 191 -504 -1086 -882 -300 -437 -274 336 -66 -499 -382 61 173 217 214 388
1815 388 377 799 247 190 191 -16 -376 -466 24 -669 -869 -292 397 132 -441 -19 380 73 -31 190 -52 -530
1837 -530 -184 343 466 290 586 571 8 176 -158 -396 -661 -680 107 25 -105 128 42 -2 186 314 24 29
1859 29 42 -49 25 -153 -14 -248 -94 454 166 318 -280 239 341 -51 95 439 -91 -144 190 39 -523 -680
1881 -680 -323 -276 -100 271 93 17 142 478 508 -145 99 182 462 -77 228 38 -382 -208 78 -68 -371
1902 -371 112 -400 -302 -98 -43 105 -432 191 252 91 449 -116 212 -35 243 15 122 -126 -201 -207 -163 -419
1924 -419 -336 -387 -428 27 -82 -52 10 65 88 75 2 -180 -153 132 251 20 15 -110 110 -160 -408 146 134 -204
1948 -204 99 -120 -332 66 -3 -70 180 14 100 66 81 65 60 -106 55 92 1 -125 196 181 12 -354 77 -98
1972 -98 -79 167 132 -171 32 93 234 100 -43 -96 86 -103 67 -45 78 -309 -52 84 -90 242 55 10
1994 10 152 174 137 148 90 -117 -354 -390 -305 -217 -336 -155 73 51 45 -91 -51 136 202 144 210 66 83 -41 -324
2019 -324 -124 -213 -236 -110 -40 -70 -252 312 153 -211 9 -195 -40 45 370 281 260 -146 16 279 -95 -153 -349
2042 -349 -68 -449 -36 200 -28 250 135 -40 -73 144 300 190 179 3 -216 101 -179 -320 3 -280 201
2063 201 -341 -72 40 -32 143 32 -48 -25 -108 271 -20 -72 -133 -105 231 115 64 248 -49 -151 17 165 29
2086 29 -172 -206 -154 -73 49 344 353 231 45 -74 -140 -311 -280 -406 -376 -347 -71 43 58 274 417 534 199 64
2110 64 390 195 224 85 -86 -234 -115 -163 -2 -115 111 -54 -45 34 339 64 -76 -65 -53 -69 149 197 168 139
2134 139 -115 90 -51 141 156 160 -253 -205 -682 -296 -279 84 -67 -120 -141 99 215 254 283 99 -83 -247 245
2157 245 149 -13 -420 -430 -181 55 87 128 -387 -264 -65 89 -408 -44 154 101 -129 144 503 -180 -42 152
2179 152 55 192 -95 98 10 -302 -104 -276 -444 -286 -148 16 -60 -263 65 -60 216 68 65 -75 -45 -331
2201 -331 -116 -6 106 -25 -423 -71 343 126 109 126 403 -114 63 167 -134 -152 -74 -6 -25 -217 -309 -215 -68
2224 -68 149 -71 3 296 63 -67 136 -124 146 26 249 231 93 -93 -172 -162 -429 -223 20 -405 -343 -117
2246 -117 -78 -123 -70 71 511 491 452 577 -31 22 -56 -140 -17 -262 -242 -248 11 -124 -190 7 -372 -157 -22 343
2270 343 411 -138 146 84 182 -84 -11 -136 -57 -165 2 126 125 -183 276 113 37 -186 297 -171 -453 -239 -271
2293 -271 39 132 -278 80 158 20 -209 -75 201 94 234 378 323 255 249 174 208 -283 -253 -281 -474 2 -197
2316 -197 -352 193 41 20 310 365 153 -164 -79 424 -171 -148 230 -81 284 -213 -193 -238 -67 -122 172 269 -132
2339 -132 -37 144 22 -57 -19 -111 -412 -179 -38 -27 100 52 181 384 321 -17 58 63 -188 -10 -220 -244 60 294
2363 294 312 274 64 -276 -623 -414 36 -313 -144 -45 -78 -158 498 591 44 99 64 136 -193 -157 -87 49 -130 -109
2387 -109 201 -124 203 297 306 -39 90 0 -157 -75 61 -78 22 -127 -23 -71 -13 187 133 -127 297 427 308
2410 308 158 -154 -371 -310 -249 -23 -307 -443 -72 -79 298 63 229 -87 -113 4 434 235 -63 103 219 85
2432 85 -32 -36 -11 -128 67 127 -329 -776 -401 -88 20 13 -25 -60 -197 192 429 410 -134 135 261 140 376
2455 376 392 0 -419 -339 -151 -70 26 168 113 -152 1 16 -260 -350 -10 -289 -101 373 183 -81 12 473 341
2478 341 154 -145 161 69 -83 -73 -213 -721 -411 327 491 329 -317 -313 -125 -108 80 305 -48 -152 225 398
2500 398 280 157 -344 -274 -472 -118 140 163 395 -183 -158 -340 -211 -130 -107 232 310 23 -355 -102 -19 -157
2522 -157 -127 -414 -251 -155 202 503 151 -72 181 -126 411 792 301 -69 -550 -569 -285 -341 -160 -59 298
2543 298 312 109 175 374 8 46 69 131 158 337 227 -110 25 -268 -591 -348 114 146 1 -340 -103 -223
2565 -223 -74 267 221 -201 -58 172 351 87 47 382 149 -49 292 198 46 -300 -429 -457 -68 -173 -79 105
2587 105 303 431 151 -129 -28 -313 -355 -417 0 -8 62 449 574 114 -56 41 -23 95 83 -32 51 -464 -368
2610 -368 23 -198 187 140 -42 281 -56 390 -140 -225 -189 105 -53 343 -185 15 -218 272 75 330 386
2631 386 208 332 95 -85 -71 -192 -411 -433 -198 -240 -128 188 325 170 234 139 -523 -36 280 169 -243 71
2653 71 -154 -183 163 97 368 99 44 -227 -52 -12 -370 -476 -419 -119 -91 144 383 386 139 54 228 126 84 340
2677 340 385 5 -38 -299 -307 -186 -293 -35 -34 -168 -288 112 303 -99 -15 -232 43 101 254 -129 -106 151 -236
2700 -236 -1 182 44 16 -110 223 46 -123 80 -298 -585 -411 182 20 25 139 31 -17 114 -206 50
2721 50 -26 -28 157 68 -137 39 -183 14 26 -22 114 -303 -398 130 -297 132 -163 -115 -194 348 137 -142 -68 -128
2745 -128 68 199 51 11 -101 36 74 49 35 10 -13 32 83 309 31 -40 -15 158 -89 -309 -89 -102 -130 -50
2769 -50 115 151 83 202 5 42 325 50 334 374 115 70 -136 -41 -262 -172 -63 -300 20 71 -2 285 243 357
2793 357 215 -72 -27 60 -1 -81 -105 4 70 -83 33 -62 -135 -100 -280 84 1 -459 -173 214 -195 -119 -378 57
2817 57 -91 118 236 19 -173 129 265 186 197 10 -95 -49 152 161 79 14 -145 -75 -301 -145 -106 -181 -108 134
2841 134 72 -37 85 204 507 245 76 164 256 18 177 -254 -316 -231 -337 -66 72 148 67 100 -158 136 294
2864 294 9 222 -35 -172 -147 -14 -132 -34 -275 -54 53 -191 392 288 175 -162 117 -16 -40 -128 46
2885 46 -40 256 -35 -18 260 314 99 9 -65 -201 228 -211 288 -4 -112 -126 -21 32 131 187 111 26 -201 -71
2909 -71 19 68 -135 -39 42 -29 94 -70 155 -232 -174 55 -9 53 -16 -232 -110 -25 -109 -7 272 190 99 -43 39
2934 39 75 -140 157 -231 -45 -266 -146 57 33 106 157 187 15 -146 195 294 245 -100 -99 70 138 231 237 -195 -149
2959 -149 -151 -105 122 185 34 -94 -152 -143 -200 -68 138 13 90 -87 85 247 41 48 191 36 -135 -231 180 -289
2983 -289 -223 -82 49 -77 222 63 -252 -117 21 116 95 170 91 -42 -122 349 70 -135 295 69 -230 121
3005 121 44 -11 -271 -60 -67 -56 61 220 20 -59 21 131 36 -29 40 160 187 120 -206 -152 144 7 91 96 -13
3030 -13 41 149 -4 -79 87 35 -104 -30 -265 -80 -88 -29 -159 125 25 48 68 -91 233 265 -74 52 216 -281
3054 -281 3 93 -40 -312 -174 -85 -106 105 -135 102 106 -3 3 -335 -112 120 -153 277 -50 161 74 -322 -281
3077 -281 19 -17 -42 -95 154 154 35 71 65 15 -77 -2 364 55 3 -169 235 131 -37 77 123 214 96 130 -118
3102 -118 -153 -86 147 54 55 223 -40 126 67 -119 -30 -160 6 -123 220 -159 -51 43 -222 -166 85 12 121
3125 121 149 272 52 108 188 97 196 51 75 86 -83 -48 88 -88 38 146 -33 53 -226 -100 -20 91 59 43
3149 43 314 9 56 174 179 -1 -35 -112 -250 -108 -11 -459 -94 29 77 -77 -80 75 69 -240 -37 240 111 -116
3173 -116 110 183 108 17 -29 -32 -56 -21 -191 95 -163 38 -76 -156 65 -142 -35 -114 15 85 -131 -43 29 -104
3197 -104 213 -57 189 161 44 -5 -125 -86 24 155 30 73 -6 62 111 -136 -312 20 -227 -105 346 -57
3219 -57 -193 169 -364 40 -86 -202 124 11 201 436 224 76 -137 -190 99 -198 -74 -22 -276 -11 269
3240 269 218 -70 128 91 -171 180 140 -101 209 -53 297 19 33 135 346 -176 217 246 -303 59 -35 -20
3262 -20 112 -245 -270 -192 -127 -45 -81 346 -57 92 65 129 24 -106 204 -123 108 -27 -147 12 -62 254 -152
3285 -152 -120 -75 -139 39 -160 -98 -158 -78 -130 -160 -18 171 222 -22 9 -141 -18 81 -89 83 361 -96 80 0
3309 0 -138 -85 78 93 -91 -283 -115 -81 -145 11 -90 -120 30 7 -33 34 -133 -189 -110 -8 119 147 -59 -29 -146
3334 -146 312 32 24 -118 -187 -163 -60 0 -250 -260 -127 196 191 -105 -84 -128 12 23 55 -58 124 82 -83 174
3358 174 146 -90 255 -83 117 -253 22 162 -187 85 -200 179 1 -21 126 228 -213 -35 -165 41 20
3379 20 123 -301 124 -150 -100 202 -135 65 -29 32 -198 3 4 20 -81 -100 276 28 52 -19 -37 286 235 173
3403 173 87 181 189 142 133 9 -4 65 47 -196 95 190 164 456 -14 74 252 -150 -84 -121 108 -155 -88 -77 -30 -195
3429 -195 -121 72 32 132 163 140 -55 187 313 -4 -118 46 68 64 -276 -54 -190 -2 -86 -102 -9 -108 -51 117
3453 117 275 130 -60 144 -4 121 -58 177 -144 199 -76 -66 -178 -126 169 60 -182 -201 230 -19 -8
3474 -8 -133 -18 119 66 91 -27 -21 338 33 168 199 -97 -85 344 39 -101 -49 241 -27 60 333 -219 -45
3497 -45 -65 8 88 -64 49 -12 29 148 130 29 56 62 95 26 32 -16 -120 17 199 173 -292 -174 -133 8 131 69
3523 69 -37 218 -8 -284 -197 69 3 -64 -71 -91 132 206 205 -64 -29 -19 43 -202 -126 -157 -223 156 -70 -54 17 166
3549 166 302 143 19 -29 39 -115 357 315 66 205 328 156 -178 127 -133 -454 -220 118 -85 73 101
3570 101 -111 71 -76 -105 -35 8 -25 172 85 118 95 -71 -126 74 -131 287 -124 53 18 173 -149 -409 19
3593 19 122 147 -36 -3 -81 -21 21 -222 151 130 -96 -81 82 297 -120 127 -68 -55 218 181 103 117 -376 -116
3617 -116 -68 93 -248 -29 -54 -106 -23 -85 -216 70 -58 142 60 -122 157 79 -93 196 -68 94 205 -142
3639 -142 -261 -25 -51 -198 56 54 -337 -240 -102 75 214 -18 239 -52 166 -17 282 91 168 304 -48 -12
3661 -12 -144 -206 -269 -85 -355 -471 120 -270 -186 184 294 -145 128 -82 -145 63 -9 -11 -66 -6 16 1 -101 183
3685 183 72 -86 -172 -263 61 -91 22 -81 -67 -158 50 239 72 79 -163 -61 -42 -13 19 289 30 -143 -3
3708 -3 -118 167 -26 40 -17 88 -59 -158 222 -166 -274 -224 -304 -197 -84 7 231 25 -40 -162 -23 -17 -16 -127
3732 -127 -95 -43 -1 342 417 411 -242 -40 -37 -129 -13 -248 -350 -81 -51 -102 190 235 -1 -93 -88 104 86 157 365 88
3758 88 56 143 213 -51 -122 6 -36 -15 -207 -11 141 17 9 -114 -14 100 -14 157 -126 49 -77 110 121
3781 121 183 232 34 82 -90 -221 39 -186 -113 -455 -140 -22 38 -25 5 176 -290 -110 -202 188 2 25 36
3804 36 103 -57 -130 -88 -98 -52 133 -153 -99 -165 -203 -42 4 -106 -62 -65 28 223 218 -278 6 -73 68 44 290 -200
3830 -200 -211 271 -83 73 34 31 69 232 153 196 -8 9 -241 -3 -133 -207 -167 -260 -146 -294 -11 146 -8 187
3854 187 -9 -41 73 208 38 58 81 120 6 -47 -525 -66 -495 -45 41 -425 -423 -108 28 -35 -54 148 -3
3877 -3 59 70 139 276 -30 193 122 -179 54 -70 13 33 -318 80 -380 -337 52 -141 -118 120 14 66 -140 172
3901 172 -32 72 223 378 -22 28 223 -188 -189 -29 160 -106 -219 -309 -13 224 36 -12 -104 80 177 70
3923 70 -168 42 23 -82 -242 410 103 -166 65 302 48 -403 -201 -59 63 71 201 279 -84 196 52 36
3945 36 -63 -169 48 -270 -109 67 26 -227 -92 156 -32 166 169 116 222 68 255 -122 -137 -145 -281 -203 106
3968 106 161 -221 -450 -91 180 -145 206 32 93 -204 -71 358 231 313 270 457 -150 -331 0 35 -50 -104
3990 -104 -201 -230 -632 -26 -230 94 251 -33 -170 -82 229 319 100 207 169 89 128 139 224 -98 -124 -196 -153 -196
4014 -196 -153 -146 -105 -194 -157 194 -210 123 17 115 -35 -32 -139 208 74 473 231 0 -138 -31 35 93 72 -21
4038 -21 59 176 156 25 -113 -42 -219 194 208 209 114 -142 110 -192 -102 29 243 142 209 -32 40 -59 125 151
4062 151 41 135 25 9 -243 -137 -267 -130 -94 -151 -79 -215 26 -58 10 -293 40 -2 282 184 207 157 -289 -40
4086 -40 145 27 -222 -171 -41 -203 -47 -184 -224 -393 82 137 99 298 -10 -191 -123 271 321 457 154 252 121
4109 121 -23 -183 219 -134 -71 -182 -166 -67 21 -61 -331 -136 220 -141 407 656 402 48 -90 -109 112 171
4131 171 -43 212 -71 -406 36 -323 80 85 -192 55 -109 152 148 71 54 80 -439 -319 -265 -18 188 240 44
4154 44 173 193 -74 -3 -82 -135 -19 -165 63 -120 -179 -164 -253 -161 28 22 32 16 -99 -340 -28 110 199 72 161
4179 161 72 -17 196 112 -262 68 65 -117 -161 -202 -97 -196 -268 -345 -409 -81 -67 118 269 -34 159 81 -13 218 164
4204 164 331 285 -55 -291 16 245 198 -6 -85 -165 -296 -407 -80 -13 -473 2 63 18 284 302 20 66 171
4227 171 -230 -5 -1 248 260 79 -45 -204 -116 -254 -132 -5 -192 -128 -80 158 48 13 -472 -246 80 145 172
4250 172 -23 -25 87 348 64 -8 -199 343 67 92 -155 180 -54 183 -178 -46 -23 15 -34 291 -31 32 169
4273 169 -109 133 159 242 74 161 -4 -42 -90 24 112 5 -122 174 -105 -36 -44 -138 41 37 206 -183 145 -85
4297 -85 -347 -139 70 148 -39 -14 104 211 -180 75 29 95 19 -46 -173 -137 -150 -282 -19 2 -117 94 -161
4320 -161 118 113 -1 161 -25 -108 240 -231 75 -99 95 298 301 137 -250 -12 102 227 -118 -301 -153 -140
4342 -140 -537 90 195 -163 129 -53 -30 -39 -110 193 95 203 167 60 -81 168 53 -56 -357 -262 -257 -1 212
4365 212 104 87 -151 1 71 -189 38 -94 -82 -136 23 130 292 271 185 210 23 241 -193 -23 -235 -193 -167
4388 -167 -258 -116 226 -168 -18 47 36 58 -236 237 146 15 -224 -41 77 230 233 142 82 2 80 -17 538 -85
4412 -85 -175 -43 -221 -167 -255 -265 19 -19 -206 175 231 266 372 16 94 -224 31 262 151 -233 92 -270 -35
4435 -35 -240 -116 131 -179 -43 97 -150 -128 -145 -115 -229 -200 -37 69 293 -48 78 -59 14 -20 260 57
4457 57 -39 101 140 10 -89 203 -271 -148 -68 -10 224 218 339 181 -71 207 184 167 220 111 148 200 50 158
4481 158 200 -104 32 117 -388 -85 155 -212 -19 -94 49 -145 23 129 170 -149 -271 -8 191 122 8 -77
4503 -77 64 24 100 263 151 14 241 -262 -148 74 -74 177 -281 -80 14 0 14 -18 -168 -28 35 164 267
4526 267 161 215 -97 314 219 124 -200 345 159 52 -177 -109 -172 -214 -74 58 -181 -357 -70 133 131 166 -64
4549 -64 218 134 -33 341 -187 173 264 139 -157 149 -140 -161 -382 -104 -87 -137 -51 147 -347 39 44 -123 -91
4572 -91 115 282 -48 -286 214 342 43 64 207 32 -62 -58 48 13 -235 -54 -329 -371 -193 80 -19 -117 -185
4595 -185 24 -208 83 -9 155 -12 356 -141 128 178 329 170 -212 76 -141 -137 47 53 3 -313 63 192
4617 192 210 -9 -75 -104 39 -273 188 305 -141 243 52 -70 -16 303 22 -178 -195 -14 188 -247 -44 -412
4639 -412 -250 -461 -69 114 -146 -127 180 253 -51 650 357 194 121 265 -248 -103 -25 -81 -165 -286 -100 -28
4661 -28 -138 -144 -179 -364 -300 199 72 -197 -175 238 -52 137 261 606 171 94 173 190 159 -108 -259 45 -82
4684 -82 -245 -165 -291 -108 37 -133 -263 -124 172 33 222 172 71 141 -36 142 119 195 202 -127 -19 44 291
4707 291 257 -75 104 54 -144 -42 -202 -81 -203 -109 19 -39 115 340 -13 355 125 113 419 379 206 -13
4729 -13 -21 -38 70 -195 33 175 23 -323 -154 84 -142 -188 -107 -5 -28 -413 90 -42 63 91 429 54 -17
4752 -17 -15 -70 -75 54 -27 -32 24 78 -223 -295 -226 -100 -70 58 0 140 -180 302 108 -88 188 -84 268 289 -79
4777 -79 441 -64 0 342 348 -125 -320 102 78 -36 -228 151 -87 36 148 227 -143 20 307 19 173 -8
4799 -8 182 310 -139 -2 -127 -21 239 213 266 -104 -281 -34 52 178 -253 -477 -333 -130 71 196 135 236
4821 236 -129 157 243 161 347 183 240 45 65 46 -66 -75 -329 -23 -176 -236 230 444 -14 -268 -120 -188 46
4844 46 359 -51 -166 21 29 293 271 121 107 272 -120 -234 -54 -260 -185 -149 -131 70 -14 -261 34 71 -2 -48
4868 -48 -267 -160 -14 -248 93 113 -52 427 -108 89 -233 -51 -70 -336 -275 -195 97 142 -174 -100 -84 78 -318
4891 -318 49 89 -54 -113 88 108 259 74 160 94 115 19 -117 -150 89 28 -410 -206 -91 -233 -372 -138 -180
4914 -180 2 -149 25 208 211 158 487 102 274 142 13 13 -15 179 -2 137 -201 -37 -16 -15 -18 118 -40 -219
4938 -219 -226 -9 -158 140 -22 16 36 -150 199 80 159 100 73 167 37 -57 62 -69 -233 -3 -289 25 -102
4961 -102 2 -177 -41 -75 -11 95 385 -4 -103 -25 -147 59 279 217 105 17 92 127 -3 -102 -132 -289 -6
4984 -6 102 -43 77 21 -230 -62 -112 -49 -81 106 214 74 79 -17 109 -94 -125 -69 348 -45 77 305 -118 175
5008 175 -218 -22 -424 -431 -194 -525 -20 -16 -205 -135 311 239 195 -93 303 216 188 20 187 113 -252 -171 -77 96
5032 96 -35 -13 -18 -319 144 -74 -81 27 -189 59 -99 125 156 142 288 317 153 -13 86 179 50 -226 39 -159
5056 -159 -63 38 -72 -387 -123 -169 -192 -39 -129 304 171 -278 -15 236 230 43 -133 256 -29 -61 147 304
5078 304 -165 -350 -275 -133 -144 -46 96 74 -53 -248 -69 -118 -6 -19 420 1 -39 66 5 139 69 -54 115
5101 115 -43 -38 -27 35 174 -185 30 32 19 -164 -115 89 34 -130 212 -132 -63 -278 -97 292 214 143 -86 139
5125 139 252 43 187 273 40 -110 99 -76 -291 -77 -157 -19 -157 -113 -110 120 -48 -77 44 58 91 376 79
5148 79 -58 -93 138 134 -195 -317 -203 -116 -89 14 -295 -36 -134 -194 -201 -80 -16 -383 409 -14 89 49 -148 93
5172 93 443 108 97 223 -98 81 -164 -165 -135 14 -130 1 24 17 41 -86 143 -194 -109 -109 87 190 -111 -125
5196 -125 76 -77 -60 78 217 179 -16 125 -207 -162 -9 -13 -261 -22 -178 -168 222 -316 138 -290 -14 229
5218 229 -83 139 129 185 -39 46 -189 -105 1 186 -208 187 -205 -146 -51 25 4 -145 -244 -157 -126 -61 -112 198
5242 198 -127 154 333 103 444 230 60 77 154 -78 -247 -217 -35 -339 -165 -278 -153 -153 -55 -95 -232 32
5264 32 -205 -73 -37 -36 283 319 -42 158 358 109 -11 343 -20 -196 114 -214 -328 -327 -150 87 -158 -8
5286 -8 -154 -103 32 -123 54 77 -75 19 -53 -206 164 134 20 240 -78 -103 -227 13 -408 135 23 119 63
5309 63 -93 -142 9 -146 88 170 -37 1 203 169 208 -82 31 -14 131 126 60 250 -38 27 -35 -100 -90 -131 -14
5334 -14 -158 -88 207 -19 16 -182 279 114 45 -12 -13 -54 28 75 -152 138 164 -64 28 -39 -321 162 -275 -51
5358 -51 24 268 -354 41 -13 -21 -130 20 90 -2 367 88 -233 217 66 -31 -43 112 197 -95 30 -377 -263
5381 -263 -101 135 -262 -8 -205 61 161 55 153 312 -117 36 68 290 -237 -169 -17 -26 -103 32 -172 239
5403 239 -86 316 114 -231 46 -243 -113 -27 91 -149 -69 -21 37 -2 -171 205 27 46 -90 -30 40 -147 123
5426 123 -8 -55 133 -54 18 -93 -38 -162 -197 -81 53 57 339 211 -49 164 -47 476 175 74 22 395
5448 395 -68 -75 189 214 -176 -149 -66 -247 -18 -10 143 -110 154 18 -1 106 -140 -166 -148 203 189 89 190 221
5472 221 212 152 117 43 236 87 -100 -119 -229 -339 -14 205 -116 -11 87 -249 -57 29 65 181 89 336 131
5495 131 -131 -247 166 149 -120 247 35 31 46 -195 -154 110 -166 -130 -151 -54 83 232 35 380 35 39 -1 -35
5519 -35 -169 52 264 -109 21 107 -126 -55 -103 3 -59 3 -101 25 -64 1 72 -56 -328 219 59 237 69
5542 69 176 377 -1 253 51 158 77 -50 -45 -123 96 -181 8 178 -211 39 94 -48 34 35 -211 -103 -32
5565 -32 -98 176 -107 39 18 59 -94 121 162 -55 -167 -145 -123 -107 -201 8 -229 -146 118 -316 45 90 128 -8
5589 -8 -165 363 10 235 163 -3 122 56 170 232 -332 55 -88 -101 -317 -1 -192 -98 -147 69 -7 -51 -205
5612 -205 -12 -107 139 180 128 3 103 10 71 -129 -41 211 81 -288 -69 87 -43 -20 -70 -204 -168 123 -156
5635 -156 -249 223 -74 75 199 -51 173 -33 195 134 1 153 124 -99 50 -91 75 -7 -53 -223 -27 9
5657 9 -194 -365 87 -96 54 176 2 -46 209 -73 4 151 114 0 277 -164 -237 -19 -7 9 -281 -69 -68
5680 -68 -59 10 -111 -163 -60 -7 97 287 273 -146 318 161 0 114 115 -39 197 -88 113 159 -134 -114 51 -129
5704 -129 188 -9 -10 104 -4 -211 51 127 203 101 1 162 -32 73 -258 -70 115 49 52 -81 -69 64 -108
5727 -108 67 -149 -22 -41 -134 20 32 167 -127 -84 -131 253 -164 -180 135 91 -81 -137 148 -125 -33 101 167
5750 167 -77 -72 10 -160 -4 -56 -162 95 -2 47 -300 119 31 -127 232 77 -34 -192 264 -61 -43 77 32
5773 32 64 -23 -38 -92 -122 20 -483 -18 -212 -213 82 70 -201 148 71 -228 209 -23 175 110 3 265 -40 -58
5797 -58 296 -56 -113 -113 -266 77 -265 205 -55 -18 17 73 144 -128 39 243 166 -92 24 15 62 -70 33 36 -111
5822 -111 -19 -329 29 -156 -77 -48 64 -111 -62 187 92 -66 -53 54 66 266 240 -163 -33 -17 186 -196 -225
5845 -225 234 123 43 -218 -160 -89 -142 144 79 -71 -40 -371 -36 -172 -108 -145 -379 59 -336 133 159 -275 29
5868 29 98 35 73 25 22 55 36 111 25 -32 -5 -249 -237 18 -209 33 29 -108 84 -112 152 -13 -17 -7 -132 -31
5894 -31 -26 238 290 -195 117 146 145 10 58 73 32 -162 30 -352 -117 123 -79 233 2 47 -219 -87 -57 -160
5918 -160 111 -96 -122 -177 -107 -214 -259 16 -135 141 7 -67 5 -25 -69 -63 79 3 -31 271 22 30 52 219 43
5943 43 -67 -10 -104 -161 32 -127 339 -68 -101 -113 -73 -79 -146 24 -157 141 -281 53 -63 63 191 129 119 98
5967 98 53 -145 -24 118 188 86 51 -39 95 -139 169 41 -125 -3 -47 -253 -62 170 20 -185 344 138
5989 138 237 195 -237 170 28 193 137 -151 -52 -142 143 10 -258 -91 -3 -94 -108 157 264 -170 -59 51 51
6012 51 79 35 216 177 -43 -5 54 70 59 0 -196 44 -24 -33 -153 -167 59 39 -168 -26 135 178 -78 106 17
6037 17 40 -62 75 -269 -30 205 -20 28 -88 -284 -7 182 -102 129 -77 -257 -31 -162 10 131 65
6058 65 123 -98 80 -77 -152 63 -27 31 -207 -27 13 -2 -152 29 -72 -183 89 -8 14 140 114 -173 -107 -5
6082 -5 2 126 467 -56 -74 -150 -77 118 -142 38 -111 -100 -169 18 -72 -110 151 18 -249 -103 -46 -215 -167 11
6106 11 99 102 -118 -141 322 -45 22 44 -155 114 30 235 -223 -114 -35 -122 -28 72 -7 -36 -206 -36 188 -136
6130 -136 -67 -183 108 -235 95 227 41 140 37 -24 283 -86 92 113 -195 79 -52 42 62 -85 70 12
6152 12 -184 -203 -147 -31 -127 268 -352 39 101 -134 -4 214 191 82 50 -301 119 -31 139 27 -84 81
6174 81 116 -19 -96 56 -209 170 187 -8 -138 130 25 -43 -5 59 189 -74 -70 102 -248 -54 19 126 -144
6197 -144 64 -14 -16 55 -133 -70 47 104 -78 27 -86 -165 30 -110 -220 91 165 217 -6 -208 -163 -42 162
6220 162 5 -64 58 -17 -114 39 119 181 121 23 -54 -112 1 188 220 471 154 20 29 58 -201 21 16 57 -77
6245 -77 -57 81 229 63 120 -29 -150 44 126 -64 -200 -91 -138 159 124 -77 -73 -120 29 -211 -150 -181 77 -176
6269 -176 -11 -93 -29 -40 8 -189 -54 -38 -126 113 134 -65 81 30 -162 -296 92 -184 95 29 -377 -99 -28
6292 -28 178 103 57 106 31 109 101 -193 132 57 35 -157 2 163 -76 131 -18 -12 160 -2 38 -2 227 33 79
6317 79 -236 -13 255 3 -174 5 46 120 -143 -181 -13 32 18 -132 -34 193 177 38 -217 96 62 -324 -12
6340 -12 34 -5 -74 -62 173 337 -240 -139 101 -98 -117 79 -110 -147 32 53 -49 84 77 91 -187 141 22 -16
6364 -16 61 -113 -154 63 -145 202 -94 47 -161 -120 132 161 356 234 -49 -85 -96 -126 215 -62 42 74 -187
6387 -187 -46 -153 78 -234 -164 -50 -67 129 13 -141 62 -234 41 118 -3 -2 46 215 291 -4 52 -59 42
6410 42 -146 73 296 212 0 91 144 -365 121 176 -39 263 -175 184 -52 230 165 -286 11 -1 133 -6
6432 -6 223 287 24 -270 -148 -105 197 191 -94 255 -45 185 19 164 -128 120 13 -33 -26 -13 -104 83 -38 -126
6456 -126 -150 -65 284 144 -95 -184 -37 -20 -73 -25 -173 -30 190 51 -184 -72 -84 148 -19 -143 -148 -98 224
6479 224 -167 -244 -146 -37 149 133 164 16 -9 53 -78 -14 83 152 112 -91 -116 -137 -112 -25 114 241 -249 155 -255
6504 -255 -262 66 148 23 44 -20 -107 3 266 145 103 -35 136 -65 -68 109 127 131 -119 -29 59 -107 -123 105 228
6529 228 -238 -98 -95 189 -41 -95 -164 -20 68 176 41 0 -100 -249 -22 -68 -224 -303 -72 9 3 -43 -87 119
6553 119 172 67 50 -73 140 203 -223 -30 -62 34 101 14 30 -256 -118 -14 8 285 86 -161 -169 331 173 -18
6577 -18 -196 -93 -153 137 -199 48 96 -247 26 1 215 56 -128 80 61 122 18 -1 191 -33 -274 -315 -163
6600 -163 17 137 -185 198 -120 -110 203 -91 -129 331 124 14 342 -250 37 288 -177 -116 -358 236 -150
6621 -150 -191 24 -78 153 -323 -202 -44 118 93 -138 22 -11 -34 -57 -45 19 -183 -166 -237 -13 -29 -61 21 -92
6645 -92 276 -19 -103 -62 -298 -103 33 262 -78 33 100 -12 157 -146 238 -145 160 223 -95 -19 354 -22
6667 -22 -163 -11 80 -120 -7 -34 13 -140 -146 -90 219 -25 100 -145 67 -175 216 45 21 -100 198 91 -100
6690 -100 -139 157 -20 5 254 -215 155 -19 -73 -89 366 86 155 -148 220 -117 -402 10 -141 -91 -115 0
6712 0 58 117 118 -82 -31 -161 63 82 -50 158 -115 -89 39 143 -181 101 139 -184 33 65 -8 112 83 192
6736 192 21 -334 -67 187 65 37 -28 175 23 2 9 -138 188 -218 19 172 -151 -138 -106 110 -348 -10
6758 -10 202 62 -56 234 5 -292 -199 -58 149 -248 -226 -162 -15 -185 -223 86 -10 37 -110 30 -230 -284 116
6781 116 196 56 46 18 -55 131 130 -19 -10 212 -227 -154 3 -11 -179 -83 194 204 -117 67 20 -47 -139 296 -44
6806 -44 -65 16 -127 79 63 188 32 179 158 -156 -70 228 -85 32 125 33 67 205 -90 -124 -84 144 -108 -50
6830 -50 -58 -195 53 -84 103 -120 -187 28 -43 -136 145 111 -64 -91 319 176 176 211 192 73 -21 -170 -24 166
6854 166 28 73 149 110 -101 -96 74 -86 -23 -49 -50 -141 12 118 30 -148 60 21 -253 -120 -165 8 -102 35
6878 35 54 48 158 -153 3 123 -308 32 -97 163 31 -16 5 114 49 105 121 -26 -109 -36 143 161 -43 -143
6902 -143 -43 111 13 -214 -73 -87 -54 136 -17 -198 -33 -164 104 -34 -70 100 -126 -197 39 -35 57 -125
6924 -125 -108 97 -218 117 246 151 -71 120 130 40 -158 -39 -110 76 33 75 45 62 248 67 -187 -178 25 103
6948 103 151 127 -238 -218 -171 66 209 20 6 81 -13 90 -86 -226 -189 98 -24 -394 38 156 136 62 -12 -173
6972 -173 -18 -167 -58 78 81 -32 -185 22 -210 -78 -272 117 93 -26 2 -205 92 185 143 178 346 -39
6994 -39 39 -145 -82 -278 364 76 40 122 144 21 13 119 133 -50 -73 132 -1 -39 40 239 123 -146 -280 160
7018 160 -64 -14 -153 333 -14 -133 -357 -269 20 33 307 23 54 24 33 55 38 -27 0 85 160 -15 53 -24 35
7043 35 39 -457 -146 -134 290 -228 -46 127 44 25 32 -127 -23 -125 52 389 25 -203 -65 149 -207 155 21
7066 21 48 99 -145 -135 132 283 -57 164 -144 -175 202 -8 -113 -44 -68 -20 101 -7 -79 8 -304 -62 -10 -58
7090 -58 80 184 246 102 -155 -80 50 23 -17 -220 241 -207 -81 33 57 306 -191 71 286 127 -73 -73 214
7113 214 -37 -17 -70 36 -120 -104 -81 -142 41 230 141 -119 -28 -110 62 79 94 -73 -74 62 -73 50 109 27 189
7138 189 -53 -28 -42 187 -117 88 -185 -116 -34 -39 -85 -100 -245 -86 155 40 5 -70 124 0 -139 54 -89
7161 -89 18 -129 -34 266 161 204 277 -153 -192 111 -167 -100 40 -4 -191 27 -135 -187 148 127 39 101 -160 5
7185 5 -128 60 41 -150 -23 6 -15 -177 -97 -90 -114 50 -91 53 31 -255 93 196 131 43 32 90 -3 -175 105
7210 105 -41 56 -76 197 39 -144 -38 -18 -23 -84 82 140 -5 155 89 -156 102 58 -34 -164 -19 23 -32 31
7234 31 -34 -34 82 104 179 -59 273 97 -327 38 -115 112 -162 -102 69 163 -166 31 91 -177 303 -81 79
7257 79 -143 -224 62 61 -75 87 24 -92 -58 59 -113 -66 189 -68 -20 -165 166 -14 -33 -238 259 -166 -81
7280 -81 3 152 141 40 42 238 -112 440 142 -314 174 -78 -157 36 -104 -294 -167 -38 -73 55 -48 -23 50
7303 50 133 -161 -176 124 -29 -41 -23 -89 4 92 52 -100 -130 -60 -57 105 -12 -51 -63 -32 193 100 182 143 -53 -131 83
7330 83 60 173 -55 -126 -45 -9 -81 -255 -10 110 53 -225 -7 -68 -70 -94 -20 80 118 32 -22 71 81 77 132 397 23
7357 23 70 61 122 -98 -73 84 104 -71 17 -17 -37 47 -6 -167 -154 -6 -242 61 -122 181 -25 164 64 -129
7381 -129 58 181 75 -9 -131 -56 186 90 184 108 -104 -180 -173 -26 -178 -300 -171 -27 -212 287 121 -120 -154
7404 -154 19 -15 32 62 -233 -4 109 241 74 44 314 199 -17 17 96 184 90 314 30 -73 119 81 -251
7427 -251 65 16 246 224 126 105 -122 -50 -184 20 94 -34 -89 -33 194 -194 -68 191 -214 -57 -125 -26 53 14
7451 14 -98 -50 -38 185 -92 -55 53 -246 -33 -9 -41 -155 -69 -28 -72 3 -102 -118 246 -29 105 -134 120 -225
7475 -225 141 61 59 49 -79 73 106 231 119 154 -278 -177 173 141 -110 -82 34 137 -162 106 -122 -145 -19
7498 -19 214 -70 -205 -180 -81 -11 153 92 -10 -12 -125 167 -77 155 152 43 -155 -71 -40 1 -48 153 -113 -26 48
7523 48 -21 18 -144 38 -5 73 67 159 -164 83 12 71 124 -74 107 -21 202 -159 -54 -183 -122 -86 -145 -148 74
7548 74 -198 -137 63 -83 92 90 -24 48 162 120 -42 162 -88 -65 40 26 35 121 -107 -100 131 -48 -49 106 -120
7573 -120 -117 217 42 272 103 -91 -39 45 -3 -119 190 155 -98 22 64 232 60 -257 -87 69 -42 -112 157
7596 157 79 -162 -273 138 -70 -296 170 373 35 42 -26 6 9 161 -141 -74 120 93 -50 279 156 102 15 37
7620 37 28 -232 -10 -58 17 12 98 -100 -110 294 201 51 -39 31 -229 -156 127 -147 171 14 105 66 -61 -115 -225
7645 -225 -57 -167 38 -15 60 20 117 -224 189 250 -53 219 -194 -33 125 76 87 31 -48 -70 -298 -42 -105 -226
7669 -226 128 -76 -45 -75 77 -45 -45 4 116 121 -50 -11 111 100 -107 189 -5 -97 -173 -25 -16 -243 6 -215
7693 -215 -91 -51 -143 157 -159 -102 -235 -70 -13 115 65 53 128 -241 99 83 -144 242 -30 111 284 -88 -40
7716 -40 73 122 -19 -326 176 -80 -79 50 -73 -209 -13 -160 -146 -156 176 160 115 179 201 268 193 -87 49 45 102
7741 102 -43 -91 48 -24 115 70 372 210 -13 -119 -108 -48 114 -194 229 4 207 51 -109 -88 79 -75
7763 -75 89 75 218 -68 -88 -67 -59 2 -172 59 -150 -108 -32 -89 -78 -195 35 215 23 15 -55 -165 -74 37 -73
7788 -73 47 -30 -157 -271 -14 -19 -149 231 -39 -129 17 -177 79 19 93 49 -103 241 -140 218 75 12 187
7811 187 46 -6 -217 -55 39 -45 -50 -94 -106 -263 22 143 -118 16 57 -160 -28 37 -131 -16 -117 33 34 -18
7835 -18 -23 15 2 -133 10 139 273 202 203 84 -185 -3 168 26 -62 -103 168 87 -60 149 7 -189 -26 157
7859 157 160 67 91 246 239 -173 -117 46 -127 -77 110 13 -83 -69 -51 -74 -233 16 -94 -278 -59 71 117 -172 44
7884 44 83 -21 -146 80 -230 78 104 -165 -80 -56 -207 -107 -72 75 108 -14 -141 -158 0 98 65 -269 82
7907 82 -23 49 -44 151 -84 -2 -83 37 -191 -77 -269 -130 194 -46 -86 69 -208 -212 -46 -39 -209 8 -78 -80
7931 -80 117 182 -11 -91 90 -41 100 -129 -126 -139 66 53 72 -272 48 -41 109 -265 102 106 55 86 110 305 14
7956 14 125 40 -104 -334 43 -96 184 -52 -9 -327 -161 -6 58 -170 -22 -11 58 -4 -6 -87 -127 -73 148 -248
7980 -248 93 96 -163 132 -50 49 -25 -82 -1 96 29 -109 -85 21 -26 -301 -114 -74 -94 85 -127 -106 113 -88
8004 -88 15 -7 165 201 155 125 52 11 -95 -94 -27 135 -241 374 33 -98 -298 5 -17 -168 -275 316 -97 -54
8028 -54 -149 87 50 74 122 21 -21 -26 -76 -47 -93 -230 -34 -145 -67 10 -86 -187 357 34 -37 -61 275 -128 71
8053 71 -115 99 107 40 -45 21 -169 140 -6 -97 -80 -144 -84 15 -40 97 -29 -109 82 -167 147 -144 81 159 -16
8078 -16 -72 81 -118 -142 167 -205 -113 -109 139 -38 32 188 -8 -6 -43 -69 18 -65 151 152 93 162 -17 159 79 -75
8104 -75 -200 -58 53 105 -214 -91 -125 38 235 -54 209 -4 -138 4 159 11 115 -27 -106 -155 -161 1
8126 1 -36 -19 22 -192 43 -57 -177 -66 67 176 113 131 53 83 -87 -138 -122 -94 205 22 -87 -160 212 82
8150 82 -9 110 -114 139 4 159 221 149 -128 124 -320 123 233 -171 71 183 -436 -41 116 208 -63 -65
8172 -65 -273 -56 42 -265 59 47 -50 76 228 -151 97 191 -5 220 203 -38 92 -28 38
8191C8
##END NTUPLES=NMR FID
##END=
