##TITLE=1H_CA-8417-11-2
 CDCl3, 8 sc, 
 7.2.2019
##JCAMPDX= 6.0         $$ Bruker NMR JCAMP-DX V2.0
##DATA TYPE= NMR FID
##DATA CLASS= NTUPLES
##ORIGIN= UXNMR, Bruker Analytische Messtechnik GmbH
##OWNER= root
$$ XWIN-NMR		Version 3.5
$$ Thu Feb  7 15:45:24 2019 Russian Standard Time (UT+4h)  she@DPX200
##.OBSERVE FREQUENCY= 200.1313
##.OBSERVE NUCLEUS= ^1H
##.DELAY= (6, 6)
##.ACQUISITION MODE= SIMULTANEOUS
##.ACQUISITION SCHEME= undefined
##.AVERAGES= 8
##.DIGITISER RES= 18
##SPECTROMETER/DATA SYSTEM= spect
##.PULSE SEQUENCE= zg30
##.SOLVENT NAME= CDCl3
##.SHIFT REFERENCE= (INTERNAL, CDCl3, 0, 15.7039)
##AUDIT TRAIL= $$ (NUMBER, WHEN, WHO, WHERE, WHAT)
$$ ##TITLE= Audit trail, XWIN-NMR		Version 3.5
$$ ##JCAMPDX= 5.01
$$ ##ORIGIN= Bruker BioSpin GmbH
$$ ##OWNER= she
$$ F:/spectra/data/she/nmr/H-F/1/audita.txt
$$ ##AUDIT TRAIL=  $$ (NUMBER, WHEN, WHO, WHERE, WHAT)
(   1,<2019-02-07 15:44:25.71 +0400>,<she>,<DPX200>,
      <created by zg, POWCHK disabled, PULCHK disabled
       configuration hash MD5:
       00 E9 B6 7A A2 85 ED C7 34 08 36 98 17 FE 4E 26
       data hash MD5: 16K
       73 36 9E 54 03 4C BD E9 7E 89 A4 F8 A4 D7 F0 C0>)
$$ ##END=
$$ 
$$ hash MD5
$$ 68 EB E1 B4 B4 7E 9F D6 30 7D A5 82 41 53 84 B2
##$RELAX= 
##$RELAX= 
##$RELAX= 
##$RELAX= 
##$RELAX= 
##$RELAX= 
$$ Bruker specific parameters
$$ --------------------------
##$DU= <F:/spectra>
##$EXPNO= 1
##$NAME= <H-F>
##$PROCNO= 1
##$TYPE= <nmr>
##$USER= <she>
##$AMP= (0..31)
100 100 100 100 100 100 100 100 100 100 100 100 100 100 100 100 100 100 
100 100 100 100 100 100 100 100 100 100 100 100 100 100 
##$AQSEQ= 0
##$AQ_mod= 1
##$AUNM= <au_zg>
##$AUTOPOS= <>
##$BF1= 200.13
##$BF2= 200.13
##$BF3= 200.13
##$BF4= 200.13
##$BF5= 200.13
##$BF6= 200.13
##$BF7= 200.13
##$BF8= 200.13
##$BYTORDA= 1
##$CFDGTYP= 0
##$CFRGTYP= 5
##$CHEMSTR= <none>
##$CNST= (0..31)
1 1 145 1 1 1 1 1 1 1 1 1 1 1 1 1 1 1 1 1 1 1 1 1 1 1 1 1 1 1 1 1 
##$CPDPRG= <>
##$CPDPRG1= <>
##$CPDPRG2= <>
##$CPDPRG3= <>
##$CPDPRG4= <mlev>
##$CPDPRG5= <mlev>
##$CPDPRG6= <mlev>
##$CPDPRG7= <mlev>
##$CPDPRG8= <mlev>
##$CPDPRGB= <>
##$CPDPRGT= <>
##$D= (0..31)
0 1.2 0 0 0 0 0 0 0 0 0 0.03 0 0 0 0 0 0 0 0 0 0 0 0 0 0 0 0 0 0 0 0 
##$DATE= 1549539865
##$DBL= (0..7)
120 120 120 120 120 120 120 120 
##$DBP= (0..7)
150 150 150 150 150 150 150 150 
##$DBP07= 0
##$DBPNAM0= <>
##$DBPNAM1= <>
##$DBPNAM2= <>
##$DBPNAM3= <>
##$DBPNAM4= <>
##$DBPNAM5= <>
##$DBPNAM6= <>
##$DBPNAM7= <>
##$DBPOAL= (0..7)
0.5 0.5 0.5 0.5 0.5 0.5 0.5 0.5 
##$DBPOFFS= (0..7)
0 0 0 0 0 0 0 0 
##$DE= 6
##$DECBNUC= <off>
##$DECIM= 32
##$DECNUC= <off>
##$DECSTAT= 4
##$DIGMOD= 1
##$DIGTYP= 9
##$DL= (0..7)
0 120 120 120 120 120 120 120 
##$DP= (0..7)
150 150 150 150 150 150 150 150 
##$DP07= 0
##$DPNAME0= <>
##$DPNAME1= <>
##$DPNAME2= <>
##$DPNAME3= <>
##$DPNAME4= <>
##$DPNAME5= <>
##$DPNAME6= <>
##$DPNAME7= <>
##$DPOAL= (0..7)
0.5 0.5 0.5 0.5 0.5 0.5 0.5 0.5 
##$DPOFFS= (0..7)
0 0 0 0 0 0 0 0 
##$DQDMODE= 0
##$DR= 18
##$DS= 0
##$DSLIST= <SSSSSSSSSSSSSSS>
##$DSPFIRM= 0
$$ [...]
##$SUBNAM2= <"">
##$SUBNAM3= <"">
##$SUBNAM4= <"">
##$SUBNAM5= <"">
##$SUBNAM6= <"">
##$SUBNAM7= <"">
##$SUBNAM8= <"">
##$SUBNAM9= <"">
##$SW= 20.0189088683792
##$SWIBOX= (0..15)
0 0 2 0 0 0 0 0 0 0 0 0 0 0 0 0 
##$SW_h= 4006.41025641026
##$TD= 16384
##$TD0= 1
##$TE= 0
##$TE2= 300
##$TE3= 300
##$TEG= 300
##$TL= (0..7)
0 120 120 120 120 120 120 120 
##$TP= (0..7)
150 150 150 150 150 150 150 150 
##$TP07= 0
##$TPNAME0= <>
##$TPNAME1= <>
##$TPNAME2= <>
##$TPNAME3= <>
##$TPNAME4= <>
##$TPNAME5= <>
##$TPNAME6= <>
##$TPNAME7= <>
##$TPOAL= (0..7)
0.5 0.5 0.5 0.5 0.5 0.5 0.5 0.5 
##$TPOFFS= (0..7)
0 0 0 0 0 0 0 0 
##$TUNHIN= 0
##$TUNHOUT= 0
##$TUNXOUT= 0
##$USERA1= <user>
##$USERA2= <user>
##$USERA3= <user>
##$USERA4= <user>
##$USERA5= <user>
##$V9= 5
##$VALIST= <valist>
##$VCLIST= <CCCCCCCCCCCCCCC>
##$VD= 0
##$VDLIST= <DDDDDDDDDDDDDDD>
##$VPLIST= <PPPPPPPPPPPPPPP>
##$VTLIST= <TTTTTTTTTTTTTTT>
##$WBST= 1024
##$WBSW= 4
##$XGAIN= (0..3)
0 0 0 0 
##$XL= 0
##$YL= 0
##$YMAX_a= 866840
##$YMIN_a= -609933
##$ZGOPTNS= <>
##$ZL1= 120
##$ZL2= 120
##$ZL3= 120
##$ZL4= 120
##$ABSF1= 10
##$ABSF2= 0
##$ABSG= 5
##$ABSL= 3
##$ALPHA= 0
##$AQORDER= 0
##$ASSFAC= 0
##$ASSFACI= 0
##$ASSFACX= 0
##$ASSWID= 0
##$AUNMP= <proc_1d>
##$AZFE= 0.1
##$AZFW= 0.1
##$BCFW= 1
##$BC_mod= 2
##$BYTORDP= 1
##$COROFFS= 0
##$CY= 11.3945322036743
##$DATMOD= 1
##$DC= 2
##$DFILT= <>
##$DTYPP= 0
##$F1P= 18.9103706918063
##$F2P= -1.10871071338519
##$FCOR= 0.5
##$FTSIZE= 0
##$FT_mod= 4
##$GAMMA= 1
##$GB= 0.15
##$INTBC= 1
##$INTSCL= 1
##$ISEN= 128
##$LB= 0.24
##$LEV0= 0
##$LPBIN= 0
##$MAXI= 10000
##$MC2= 0
##$MEAN= 0
##$ME_mod= 0
##$MI= 1.114404
##$NCOEF= 0
##$NC_proc= 0
##$NLEV= 6
##$NOISF1= 3.799351
##$NOISF2= 2.8
##$NSP= 1
##$NTH_PI= 0
##$NZP= 0
##$OFFSET= 15.70392
##$PC= 1
##$PHC0= -8675.71
##$PHC1= 5.000189
##$PH_mod= 1
##$PKNL= yes
##$PPARMOD= 0
##$PSCAL= 0
##$PSIGN= 0
##$REVERSE= no
##$SF= 200.130013532006
##$SI= 16384
##$SIGF1= 3
##$SIGF2= 2
##$SINO= 400
##$SIOLD= 16384
##$SREGLST= <1H.CDCl3>
##$SSB= 0
##$STSI= 0
##$STSR= 0
##$SW_p= 3612.71676300578
##$SYMM= 0
##$S_DEV= 0
##$TDeff= 0
##$TDoff= 0
##$TI= <>
##$TILT= no
##$TM1= 0
##$TM2= 0
##$TOPLEV= 0
##$USERP1= <user>
##$USERP2= <user>
##$USERP3= <user>
##$USERP4= <user>
##$USERP5= <user>
##$WDW= 1
##$XDIM= 8192
##$YMAX_p= 0
##$YMIN_p= 0
$$ End of Bruker specific parameters
$$ ---------------------------------
##NTUPLES= NMR FID
##VAR_NAME=  TIME,          FID/REAL,        FID/IMAG
##SYMBOL=    X,             R,               I
##VAR_TYPE=  INDEPENDENT,   DEPENDENT,       DEPENDENT
##VAR_FORM=  AFFN,          ASDF,            ASDF
##VAR_DIM=   8192,          8192,            8192
##UNITS=     SECONDS,       ARBITRARY UNITS, ARBITRARY UNITS
##FACTOR=    0.0002496,     1,               1
##FIRST=     0,             0,               0
##LAST=      2.0444736,     0,               0
##MIN=       0,             -609933,         0
##MAX=       2.0444736,     866840,          0
$$ Real data points
##PAGE= N=1
##DATA TABLE= (X++(R..R)), XYDATA
0 0 0 0 0 0 0 0 -8 0 -8 8 -8 16 -16 24 -24 33 -40 56 -64 79 -90 111 -129 153 -183 209 -243 283 -327 374 -427
31 -427 488 -554 626 -707 797 -893 1002 -1120 1250 -1389 1547 -1713 1899 -2101 2319 -2560
47 -2560 2824 -3111 3426 -3776 4158 -4586 5060 -5591 6193 -6874 7660 -8574 9653 -10949
61 -10949 12541 -14554 17188 -20809 26111 -34678 50859 -92527 442840 866840 335185
72 335185 191581 37891 65334 60362 66234 -157845 -395869 -527438 -443314 -374878 -314462
83 -314462 -229705 -64981 42808 149113 257054 314355 214837 90208 47663 96406 123465
94 123465 131783 140035 127401 13406 -112748 -136634 -83457 -75169 -97015 -120074 -175837 -260877
106 -260877 -259441 -133757 6774 56681 73691 155252 274254 352337 387062 345845 159944
117 159944 -99237 -251666 -257542 -224226 -215999 -208617 -181923 -144699 -92211 5426 121379 180396
129 180396 174217 166502 157851 104008 31000 -4184 -3530 -7247 -33240 -60983 -69583 -72293 -74254 -48184
143 -48184 -12691 -15504 -30121 -2232 34849 19818 -33557 -69658 -59903 -12826 52072 118954
155 118954 155347 131596 84471 72659 71423 28923 -39872 -95814 -135462 -162439 -173503 -167000
167 -167000 -136638 -81461 -1450 97293 167046 162826 122772 108253 110932 94031 51850 -2213
179 -2213 -50689 -79461 -83213 -66590 -56194 -80436 -104240 -77352 -24002 5922 21405 41031
191 41031 50319 45549 38843 33481 24041 13957 21849 52666 68036 40182 6717 385 -7841 -37586
205 -37586 -72627 -102278 -116616 -96732 -44417 11107 34652 19450 12671 50837 96224 103158
217 103158 79148 43329 7875 -4635 9279 16965 -8566 -57671 -94328 -95376 -80759 -71397
229 -71397 -46437 -1361 33255 51531 63939 59407 38290 28868 39545 50285 37640 1744
241 1744 -25664 -26242 -23354 -31838 -40285 -43307 -39650 -16078 11481 9152 -22318 -50330 -41437 9174
255 9174 61765 79596 71030 54164 31879 16535 9828 -9756 -41768 -57282 -44718 -20459 -8474
268 -8474 -18074 -29371 -25860 -18877 -12646 1227 13963 23545 45807 71776 72963 47007 15012
281 15012 -4031 -6126 -10794 -33338 -59721 -74874 -73313 -47045 -9706 8200 7970 18835 44608
294 44608 65552 60999 27594 -7809 -17765 -5718 14573 29463 19741 -7031 -20361 -19332 -24920
307 -24920 -39975 -52041 -51069 -31444 -5259 13052 24030 29241 31553 41688 49651 31927 934
320 934 -14318 -10056 3910 13107 5108 -12080 -20303 -18663 -15424 -19509 -38119 -53494 -40230 -6739
334 -6739 20418 33561 34747 34600 44538 54263 43115 12753 -21800 -44295 -38816 -17815 -9404 -12853
348 -12853 -11960 -3095 9165 13332 -3696 -29242 -37668 -21063 11672 42289 47987 33600 23097
361 23097 20010 13627 -367 -24166 -46265 -46305 -26826 -8411 3340 7628 7642 13257 19263 12383
375 12383 -1141 -6691 -2240 7774 11586 476 -10569 -2828 16345 30074 24305 -6661 -42811
388 -42811 -50858 -28812 -1246 11051 -824 -17799 -10670 17833 40583 40796 16999 -12881 -18021
401 -18021 4650 28941 33737 16362 -11028 -29029 -34780 -38098 -37164 -29517 -22860 -13406 5339 24513
415 24513 38624 52687 57097 41249 8642 -24531 -36709 -20073 1915 3728 -12663 -34564
427 -34564 -41213 -15128 25235 40035 17812 -17359 -32062 -10906 23971 36601 19310 -11247
439 -11247 -33696 -25150 9473 32641 25780 8729 -324 1426 6956 5154 -5910 -20943 -36435
452 -36435 -42070 -28232 -8272 5414 19463 30210 25936 16511 17774 29413 37157 24177 -10876
465 -10876 -45593 -60571 -50167 -17670 15101 15824 -7938 -16722 4602 34306 45410 26511 -5599
478 -5599 -25482 -20905 4401 28921 21204 -14011 -34039 -23250 -4735 6780 10679 8037 3863
491 3863 4527 12180 16157 195 -30930 -47092 -38453 -23422 -2179 34293 65017 63542 36148
504 36148 6383 -11946 -18860 -17255 -9115 -10227 -35145 -55990 -37787 993 17581 12262 6413
517 6413 6000 14485 36442 55233 41989 -5377 -43676 -34937 -221 16069 12867 6158 -9789
530 -9789 -29499 -26931 -8611 -5876 -20417 -23415 -1876 20336 24082 23657 28585 15861 -13074 -21067
544 -21067 -1679 15565 27152 42937 43182 7252 -41202 -58516 -41728 -29035 -34494 -32935 -18489
557 -18489 -8127 9731 44826 60881 34479 5949 11888 35499 39784 22671 3063 -16422
569 -16422 -41768 -49809 -30450 -18979 -34195 -40339 -17830 3852 6145 7461 19033 26931 24090
582 24090 27618 45939 51828 34992 20002 11757 -19355 -65987 -80740 -56023 -26079 -8167 3372
595 3372 7514 -1179 -10013 2833 25584 25967 12647 22213 46311 49334 31325 11696 -9093 -30857
609 -30857 -39256 -29882 -20621 -29038 -41647 -31219 -7814 63 -998 9599 23784 28381 32656 39113
623 39113 34950 18154 7279 11246 11757 -10051 -34863 -35962 -25416 -24219 -25648 -24014 -27672 -27675 -6609
638 -6609 27282 47893 44943 34223 32560 28486 9033 -11728 -19976 -24333 -25874 -15022 -1554
651 -1554 -1093 -9361 -9071 3536 11605 2270 -9587 -7566 -1725 -328 4171 7580 -96 -7520 3130
666 3130 20254 20961 5798 -3555 5131 14687 10707 1277 -10735 -28664 -36824 -21648 -3231 -2099
680 -2099 -7296 -2206 11109 19308 19114 18813 18930 11138 764 -2186 -5913 -18332 -21671 -6398 7936
695 7936 6537 -4134 -9127 -3265 3407 5665 5538 -1868 -14921 -15419 3061 15095 8333 -364 2806
710 2806 12426 19048 16969 5806 -10141 -22882 -20571 -4278 2263 -7890 -17138 -17022 -14313 -7238
724 -7238 6897 22522 33256 37123 30517 15986 -2300 -17957 -20696 -13366 -13045 -22310 -27605 -19945
738 -19945 -1220 17270 21410 10196 -3723 -9363 69 18756 25642 12363 -2028 -4579 228
751 228 4451 2649 -6162 -14522 -16218 -8952 3205 8255 28 -9771 -12273 -12063 -9905 -1479 9647
766 9647 18453 18747 10721 3043 2588 6638 14695 20323 9858 -17401 -35596 -30616 -15987 -6045 -4688
781 -4688 -7796 -7320 1709 18397 33054 27379 4260 -10469 -5885 1696 3926 4606 2042 -4050 -6667
796 -6667 -2991 -1027 -5799 -12915 -11116 -1516 1594 -990 1225 7574 7703 4691 3723 1416 -1465 981
812 981 8483 11763 1229 -13776 -13597 -1587 3733 1757 78 -5576 -11348 -6803 3825 7103 1841
827 1841 483 8936 17219 11150 -917 -7491 -10016 -9039 -703 3926 -4088 -14416 -9804 5293 15766
842 15766 12631 66 -9023 -9876 -4155 6610 13931 7089 -4709 -6282 -1025 2206 1458 -297 -1494
857 -1494 -3877 -7839 -6864 8 3696 3583 3931 567 -6494 -4745 8401 18365 12179 -5303 -19560
872 -19560 -18350 -3025 14287 21502 10100 -12483 -23035 -10590 8672 15984 8157 -7797 -17120
885 -17120 -10450 6612 18737 16649 -1011 -17345 -17345 -4437 8399 16050 15308 4961 -7040 -12597
899 -12597 -9067 800 7860 6274 -1881 -11467 -15568 -5450 11241 16710 6424 -7559 -12662 -3832
913 -3832 13687 22081 11408 -10493 -26614 -22456 103 19704 19592 4408 -11477 -16680 -5296
926 -5296 9704 14440 7720 -3581 -9552 -4899 3559 6960 4424 -1903 -9971 -13765 -9219 476 9830
941 9830 15257 10842 -643 -9282 -9361 261 11626 12705 1779 -9137 -11368 -4445 6091 8656
955 8656 -672 -11297 -12638 -3556 8438 13169 4660 -7298 -11482 -5518 4823 11221 7460 859
969 859 -1381 41 2288 3537 1327 -2110 -2995 -3689 -5967 -7223 -4890 -154 5102 4451 -2075 -5246
985 -5246 -2238 3951 10139 11549 4570 -4227 -6684 -3164 515 -429 -5835 -7676 -2374 3789 7806
1000 7806 8179 2014 -4572 -4036 581 531 -2772 -4788 -1704 3574 4113 1024 -2629 -4891 -4171 3375
1016 3375 10752 8380 1992 612 1493 -759 -6776 -12716 -12441 -6524 2177 10718 12930 4331 -4771
1031 -4771 -3708 1482 2475 1576 2040 2189 877 -1252 -2739 -5639 -9983 -8741 1314 8790 5009 566
1047 566 2074 3369 1221 -997 -2893 -4612 -3441 2337 9512 7949 -2175 -7283 -2490 1039 -1123
1062 -1123 -1786 -1478 -2953 -2609 2221 3808 -2335 -9819 -7803 3925 11739 11103 9503 7172 213 -4319
1078 -4319 -3721 -4299 -7783 -7222 -1286 4739 1875 -5673 -6792 -1846 -125 912 4501 4809 2351 5027
1094 5027 10729 8998 -537 -8030 -6525 -412 1972 543 -847 -3534 -7557 -5298 -356 -2220 -7265
1109 -7265 -6084 2415 10032 11152 8248 5063 1684 -1210 481 4736 2823 -3164 -4020 -2440 -5941
1124 -5941 -11100 -11368 -4745 2841 5554 5251 4203 778 -838 4426 9725 4985 -2380 -3093 1003 2916
1140 2916 1626 -1615 -5130 -8301 -7494 -1841 3009 -691 -5421 -1041 5855 7567 5485 2979 674
1155 674 -964 -17 3168 3981 -323 -5206 -3570 -1835 -6336 -8352 -3547 1829 4051 4487 4470 2133
1171 2133 -291 1746 6366 5645 -2263 -6682 -2540 931 -8 -1721 -2832 -4685 -3127 2407 5418
1186 5418 2040 -4352 -5300 815 5394 3455 409 -2328 -4528 -2086 4312 7148 3499 -843 -891 1809
1202 1809 2058 -1015 -2919 -2862 -4545 -5000 -2517 -1450 -2138 -706 2393 2695 1412 1874 4583 7674 7326
1219 7326 2416 -2325 -4971 -4190 518 3425 85 -5188 -7165 -4190 703 2035 -2631 -8350 -7367
1234 -7367 -129 8638 13375 10460 2391 -2688 -2495 1669 5236 3491 -1191 -3604 -4090 -4719 -4282 -3446
1250 -3446 -3850 -4778 -3667 -1401 1831 4711 6613 7946 5633 -177 -2157 2153 5446 3319 -964
1265 -964 -5845 -10301 -8509 -1091 5366 4028 -3344 -6222 -880 5191 6018 4060 -1276 -6928 -5947 3314
1281 3314 10390 8166 1344 -3024 -3688 -3826 -3440 -696 361 -2089 -3669 179 2601 851 -42 1431
1297 1431 1124 -1592 -2141 2242 6143 4322 1214 -477 -3153 -5684 -1906 3810 1440 -6167 -8945
1312 -8945 -4389 1207 4222 4673 2971 -79 -1011 4244 9745 5293 -3846 -7057 -4087 -485 2407
1327 2407 3485 1422 -3627 -7143 -4461 -858 -1013 -2831 -249 3154 3006 2464 4862 5505 2849 406
1343 406 -396 -591 -1815 -1765 1162 1233 -4332 -7298 -3727 1471 2557 1666 -1126 -4061 -4126 946 7512
1360 7512 8185 1936 -2773 -1004 2402 2775 1827 -745 -5462 -7464 -4013 1619 3761 1930 -8 262
1376 262 454 -1250 -1431 440 174 -474 801 2195 591 -813 251 1198 -400 -3160 -2457 1917 3859
1393 3859 2753 974 -1121 -3731 -2621 2208 3807 126 -4159 -4703 -1278 1959 2530 2146 369 -1634
1409 -1634 -814 2134 2940 -220 -2130 -1529 -259 669 23 505 1550 1351 866 907 -568 -3440 -2847 493
1427 493 1753 -490 -1938 -1838 -573 23 -232 -500 -225 436 3282 6429 4543 -14 -2515 -1826 -815
1444 -815 184 -375 -1779 -3395 -3356 -1466 768 773 -987 -557 1525 2478 1059 751 750 2116 3147 2730 844
1463 844 -1936 -3894 -2458 -200 -773 -2725 -2397 -1007 264 1325 1102 -579 -1064 319 2636 3846
1479 3846 2502 97 128 1438 1426 251 -1405 -3818 -4733 -3430 -2002 -1241 -1132 -1134 1066 3812 4160 3568
1497 3568 3197 2402 1912 509 -1357 -3995 -4493 -2182 1003 2411 188 -3133 -3577 -2509 -886 943
1513 943 1905 1987 2689 4131 3942 1537 -1191 -3408 -3197 -1049 183 613 153 -381 39 730 747 -762
1531 -762 -1529 -2071 -1699 -1689 -1991 -1902 476 3448 5237 4429 2076 -482 -263 679 1416 17 -2416 -4646
1549 -4646 -4175 -1231 774 1132 -88 -1326 -1481 10 1196 1787 1464 830 1274 2336 2524 1415 591
1566 591 -566 -1962 -2920 -3422 -2422 -472 1306 1869 998 -1024 -2627 -1662 247 310 -1128 -1483 305
1583 305 3638 6656 6866 2946 -2207 -5244 -4193 -1296 482 -827 -2317 -3769 -3610 -1635 1018 3115
1599 3115 3291 2831 2150 1262 256 -1060 -455 180 254 -216 281 599 324 -953 -2456 -4260 -4135 -1162
1617 -1162 3177 6016 3682 -269 -2791 -2418 -842 1137 1873 499 -643 97 1920 3005 1459 -1999
1633 -1999 -3616 -3286 -1898 -486 835 275 -1220 -1066 374 1779 2332 3173 3163 2443 -221 -2278 -2463
1650 -2463 -2254 -1615 -307 535 -850 -1633 -757 299 -405 -931 -283 2007 3726 3503 2534 270 -2440
1667 -2440 -2682 -401 1317 472 -1252 -2070 -2257 -1216 -817 -6 -200 -601 -8 2208 2404 627 -870
1684 -870 -761 750 2095 2891 2175 -334 -2291 -2817 -2234 -1406 -717 -278 838 266 -866 -581 -142 674
1702 674 1221 1293 529 360 1142 2067 1920 -61 -3163 -3949 -2436 -100 1988 1926 -138 -1640 -948 769
1720 769 2130 1877 116 -1019 -1072 -381 933 788 -427 -1623 -1137 167 1205 1795 1281 -174 -1248
1737 -1248 -1739 -957 323 1606 2151 1276 -905 -2520 -1601 -173 500 1311 969 -106 -188 1269 2268 751
1755 751 -1675 -3461 -2908 -1274 464 1446 1217 -66 -689 1109 2468 1901 781 -269 -752 -1196 -915
1772 -915 37 566 -430 -529 -163 -420 -1167 -1229 -40 315 -683 -508 953 1824 2260 1844 1317 -186 -2381
1791 -2381 -1841 240 918 -94 -605 -672 -365 5 301 -53 -1383 -2101 -1139 738 1104 710 1267 1923 1768
1810 1768 1124 935 -159 -1725 -2705 -1838 -1403 -1277 -1219 115 1771 1391 364 247 451 -137 429 1104
1828 1104 587 -716 -763 351 906 -98 -1019 -1005 -551 -1059 -276 829 405 -296 338 1497 1219 -55
1846 -55 -951 -776 -525 -722 -226 594 574 382 1266 1523 200 -1250 -1456 -1170 -774 -888 -574 15 319 427
1866 427 1444 2002 701 -103 -83 455 -7 -699 -1007 -629 -185 -505 229 312 -633 -468 156 578 698 143
1886 143 850 1338 489 173 35 -271 -790 -674 -473 -62 -942 -924 108 832 453 -95 148 -287 -553 -211
1906 -211 670 873 195 331 1315 1544 160 -226 -504 -699 -1219 -976 -894 -937 -1237 -592 623 1245 242 438
1926 438 1508 1087 895 792 211 -202 -554 64 -204 -1226 -2006 -1350 -628 174 38 248 352 246 385
1945 385 1193 1005 356 -124 -272 251 14 -521 -252 61 -436 -417 -143 -287 -983 -571 295 419 196 45
1965 45 485 1120 993 413 114 -336 -629 -47 -90 -416 -796 -838 -410 85 171 -215 -313 -223 -115 745 1477 1548
1987 1548 704 391 235 6 -391 -527 -586 -772 -944 -685 -238 -286 62 52 205 9 -134 28 418 584 439
2008 439 422 349 573 354 251 -168 -1257 -1623 -799 -236 47 -8 -188 -295 157 763 1143 604 -91 -598 -526
2029 -526 47 468 533 883 290 317 166 -306 -515 -848 -1109 -558 -428 -454 74 381 945 728 494 84 499
2050 499 653 626 264 -32 -592 -291 281 574 -40 -1014 -1089 -1007 -445 342 628 450 218 4 478 659 377
2071 377 -74 -385 -391 -333 -154 -81 411 225 261 118 -377 -525 -721 -732 -745 -551 -267 479 1206 1323 1006 376
2093 376 22 -21 62 52 88 -885 -1450 -994 -266 163 322 66 -183 -276 500 786 1076 941 373 212 189 155
2115 155 -171 -355 -359 -612 -563 -295 -19 124 70 442 -3 -171 -256 135 392 257 -78 62 330 1044 1132 1056
2137 1056 167 -537 -944 -1024 -795 -847 -1211 -1005 -866 -180 1137 1052 1392 1057 638 568 304 -145 -72 -574 -652
2158 -652 -557 -380 -600 -463 -670 -415 -7 497 630 793 691 366 -220 -399 -481 -97 613 464 364 -176 -95
2179 -95 237 493 550 -327 -879 -941 -597 -667 -50 -200 -144 496 724 1001 1404 842 181 -50 -60 -675 -808 -507
2201 -507 -724 -681 -308 36 117 220 572 609 708 216 680 656 404 231 -278 -894 -1414 -762 -204 333 241 327
2223 327 14 330 351 369 367 -369 -281 -173 -102 227 222 254 351 374 630 581 -476 -497 -330 -550 -495 -419 -150 -143 -67 210
2249 210 78 101 -71 363 482 457 67 -211 56 130 -2 -34 -176 -861 -915 -379 423 160 478 -122 175 57
2271 57 197 -118 -55 -416 -283 297 471 307 292 640 889 502 -276 -299 -1006 -1071 -1052 -750 -178 -199 79 911
2293 911 994 789 242 506 520 235 331 152 -264 -579 -471 -408 -513 -764 -732 -166 12 -121 308 733 442 522
2315 522 623 771 -18 -625 -495 -320 8 -357 -49 137 -52 24 161 377 -70 -369 -59 125 2 -222
2335 -222 58 659 583 438 662 63 -683 -807 -535 -259 -683 -332 -200 501 795 322 273 546 355 464 603
2356 603 217 -215 -630 35 7 25 -282 -384 -539 -633 -5 500 390 211 45 609 502 186 -194 -203 -207 -422
2378 -422 -140 75 303 -103 565 501 67 -266 -472 -308 -502 -560 -442 -304 -358 143 704 679 124 -316 279
2399 279 266 37 -288 -301 -337 -497 86 485 788 -544 -236 317 731 311 412 127 -244 -495 -566 294 282
2420 282 -298 -410 15 171 -278 173 613 584 177 -117 -8 71 -174 260 447 -173 -314 514 1012 837 -64
2441 -64 -610 -1039 -1040 -882 -240 271 5 -416 143 888 861 792 738 332 -6 -74 -7 -100 -567 -1296 -914 -599 -600 138
2465 138 186 471 200 -133 227 648 499 375 532 -71 -681 -527 -49 7 36 -296 -185 20 194 11 -117
2486 -117 -907 -1294 -1198 43 632 940 554 603 229 537 485 494 79 -667 -1251 -764 -563 -560 -371 -21 166 134
2508 134 406 647 779 438 91 -108 -212 -692 -29 261 -564 -941 -786 -489 322 439 840 882 410 -228
2528 -228 348 217 -270 -972 -1336 -762 -215 596 914 680 271 -225 64 191 209 37 -216 -670 -458 -658
2548 -658 209 682 648 657 365 299 421 -93 -3 -414 -902 -807 -500 183 467 153 -197 -243 -516 85 775 1210
2570 1210 739 -107 -460 -438 -412 -330 37 -509 -208 116 1043 437 404 -119 -483 -6 -110 -152 -362 -303 -619 -370
2592 -370 64 244 435 808 1089 641 112 -75 -332 -261 -810 -413 -83 -18 98 456 461 316 -418 -290 40
2613 40 291 511 307 -65 -443 -737 -351 -140 -211 -131 275 209 307 53 200 -307 -36 200 376 150 -508 -698
2635 -698 -265 -21 -173 -82 214 455 217 338 167 -281 -536 -450 126 124 -164 -91 241 178 299 145 75 -38
2657 -38 -215 -150 -56 164 -482 -279 -299 25 80 -234 -241 -23 213 261 207 -157 -421 -108 469 488 378 -127 -590
2680 -590 -474 -425 12 130 218 6 280 192 113 -494 -610 104 70 228 468 120 -102 -37 414 632 360 123
2702 123 35 -64 217 -202 -587 -353 -365 -93 -109 -172 -396 -295 91 626 549 430 629 83 117 119 337 196 -322
2725 -322 -213 -45 -672 -514 -373 -48 -45 114 -98 -43 -376 -153 363 550 365 462 213 343 243 -248 -182 -223
2747 -223 -321 125 60 -302 -442 -430 -358 136 223 333 415 164 195 171 367 131 -370 -468 -452 -477 -436 -86 14 -79
2771 -79 14 468 215 -2 132 226 209 -74 -340 -240 -592 -311 223 452 -140 -372 97 147 -184 -611 -490 55
2793 55 256 308 284 143 -407 -307 40 367 331 -110 120 112 200 120 -108 -222 -91 -227 17 95 -156 -278 -97
2816 -97 30 -245 -243 -84 138 192 51 105 135 303 661 921 670 65 -116 -292 -303 -782 -859 -1108 -967 -721 29
2839 29 821 921 130 50 749 845 420 705 243 -504 -836 -424 47 -186 -348 -702 104 -49 274 367 702
2860 702 200 -225 -188 224 257 201 123 -67 -571 -689 -36 875 387 100 60 -682 -448 -207 348 363 -539 -717
2882 -717 -165 476 337 278 254 -468 -1057 -554 342 108 -451 -653 -61 258 392 850 1130 699 -117 -124 379
2903 379 -18 -476 -431 -509 -853 -1010 -462 268 309 -222 543 504 323 252 724 758 -140 -817 -375 -45 310 257
2925 257 -148 -504 -465 -252 889 807 -1 -315 -413 -497 -37 123 234 1 -437 267 835 504 450 315 88
2946 88 -110 -205 -232 23 -495 -935 -664 -367 -85 439 651 827 396 -183 -322 221 183 -116 56 -246 -514
2967 -514 -293 491 263 -131 -290 -242 129 246 -332 -52 -161 -663 -176 481 551 67 -49 -176 -47 -34 -103
2988 -103 243 -23 -380 -276 -143 -23 -137 -124 196 -14 225 -10 278 728 761 84 -252 -229 -420 -27 103
3009 103 -5 -746 -630 -506 -124 131 42 431 25 -2 235 552 448 -64 76 182 140 451 -198 -233 -138 -287
3031 -287 -508 -39 -269 -101 -145 190 -51 14 226 334 454 153 -46 -80 -134 34 243 396 20 -197 -85
3052 -85 -246 27 -170 -482 -357 -407 -167 94 166 -180 -255 117 721 334 429 238 223 -59 19 80 193 -323 -213
3075 -213 261 358 -71 -431 60 129 -2 25 -136 121 95 -9 129 -34 -124 -570 398 529 501 335 114 145
3097 145 -228 -76 -154 -24 3 -690 -103 -110 -107 -28 410 363 471 133 147 75 -738 -642 -403 -111 -267 -47 540 273
3121 273 332 284 360 -74 185 416 261 7 -432 -659 -580 -645 -316 -85 180 109 464 592 196 250 93 121 399
3144 399 252 -203 160 -79 -378 -248 110 -77 -136 -244 54 399 -43 -456 -727 -120 -77 -7 559 485 89
3165 89 -251 355 151 -488 -157 -57 155 -203 -388 -77 -118 -153 -130 225 271 403 699 340 -54 -593 -912 -368
3187 -368 98 317 52 -170 -207 -434 -176 658 480 -59 73 107 238 247 167 29 -391 -408 -67 -9 96 12 31
3210 31 -232 -136 9 167 233 345 292 -176 35 70 43 103 226 119 -178 6 223 231 27 -189 -343 -49 -91
3233 -91 322 340 -263 -576 -163 273 207 272 52 -208 -341 -147 -106 311 -17 30 131 -31 125 33 -235 -362
3255 -362 -474 -387 -138 26 243 115 172 8 -175 -11 394 175 -72 -193 -79 -272 -2 149 299 132 -67
3276 -67 -253 -66 100 -148 -121 -200 -451 -166 334 200 124 -483 -391 153 -119 364 302 195 -74 170 556 120
3298 120 -338 -496 -357 -191 -167 370 -190 59 -270 113 239 223 80 17 -203 -421 -220 9 136 -166 232
3319 232 -166 100 -139 199 130 166 -250 -452 -47 219 149 152 -248 -388 -557 -273 161 312 116 -285 -236 -329
3341 -329 141 158 205 -101 -302 -43 19 397 181 377 -36 -285 -159 143 369 -132 -110 -437 -476 -444 166 549
3363 549 317 227 -298 -70 39 39 135 243 -55 -358 101 383 286 81 119 -456 -621 183 391 572 -300 -643
3385 -643 -355 -181 -202 56 459 323 -120 -16 398 346 148 307 113 -121 -151 -287 187 -222 -778 -537 -295
3406 -295 -346 -252 445 584 183 -132 303 589 665 368 -7 173 -558 -303 -162 -158 -187 -374 -30 232 5 95
3428 95 306 28 -21 -354 -38 60 84 -60 503 235 -244 -79 180 297 -187 -412 -277 -463 -213 -79 370
3449 370 83 -363 30 604 354 196 364 138 -124 -155 63 359 -265 -266 -118 -478 -28 -158 -147 -128 510 474
3471 474 191 202 86 122 -2 -151 -214 -268 87 270 139 171 49 -285 -288 102 1 19 -199 -761 -683 114 31
3494 31 420 562 506 407 451 64 -38 -181 -357 -246 20 -368 -337 -305 -260 -283 -163 -161 307 99 311 444 263
3517 263 -6 -139 143 228 118 -133 -109 -342 -438 -2 -27 -147 160 22 -270 -290 -231 61 -4 -279 128 248
3539 248 371 464 516 242 261 -195 -210 -632 -153 -130 -147 7 -27 -192 -16 -132 392 174 214 19 -19 570 233
3562 233 32 253 44 -350 -237 -52 -286 -342 -260 -225 -30 127 90 323 262 2 -409 -100 -244 29 -55 65
3584 65 -4 -41 -225 -192 350 -262 -369 -570 -709 -227 123 714 424 152 112 151 254 156 -150 -35 -173 -205 68
3607 68 247 -1 -77 -117 -103 -67 -51 -102 294 474 51 162 621 492 303 237 50 -687 -275 -330 -162 -119 -254
3630 -254 -187 -160 -240 -45 153 286 -109 161 324 477 158 -81 134 -309 -155 -79 -202 -160 -193 -477 -48 -55 -215
3653 -215 -102 270 57 -200 353 649 63 -139 -56 135 48 -87 271 280 68 -133 -394 -82 56 -95 258
3674 258 216 259 78 250 206 -93 -133 -3 64 370 69 121 -81 -112 -462 162 120 70 73 62 416 -207 191 383
3698 383 294 -287 -383 -182 -101 -149 -192 121 -129 -303 334 464 127 -188 -25 28 138 -33 182 333 295 144
3720 144 62 54 338 -57 33 -48 -94 -148 152 339 -79 -135 -270 -282 -542 82 193 79 23 129 238 575 330
3743 330 449 146 -91 -337 -441 -249 9 -2 -69 -186 -257 -142 -190 172 98 -300 -211 123 487 360 24 -23
3765 -23 165 -131 -56 182 -224 -288 -258 -157 -211 494 222 252 -146 -249 -280 25 -1 63 -44 154 242 314 140 -159
3789 -159 -203 -132 -513 24 -316 92 -146 22 270 -21 485 8 68 -216 5 -93 -180 -54 268 -70 -426 -69
3811 -69 -243 -140 -139 -272 98 49 63 156 415 541 255 79 -9 -259 -70 -126 170 -101 -86 51 -194 -184 -204 -269
3835 -269 -290 -267 37 -141 420 203 718 194 381 475 188 114 68 -178 -44 -166 -229 -177 -148 -54 -122 -208 -83 -68
3859 -68 -32 184 182 217 -44 390 295 -146 -151 -122 -24 -235 -174 12 -215 -294 -56 13 189 78 136 -40 -82 -83 -52 303
3885 303 288 258 184 -1 295 -130 -22 209 -232 -489 -525 -47 129 -97 103 -114 95 5 152 532 255 30
3907 30 98 55 94 161 117 -122 -257 -81 -372 -137 -91 -9 -143 281 19 21 175 215 110 59 313 100 36 -53 198
3932 198 -163 -15 -276 65 -3 -224 -9 -171 130 -103 136 263 315 -51 -179 132 166 43 -75 367 -75
3953 -75 8 33 -110 -185 -431 -310 -237 168 309 -162 275 164 156 266 232 26 134 -185 -302 -520 127 -6 -327
3976 -327 -150 -259 -275 -42 -44 -86 -2 125 -80 -287 443 398 326 277 -93 52 -183 84 181 -17 116 -165 -53
3999 -53 -145 -184 -289 -505 -235 149 20 394 148 398 -10 -27 194 265 171 -68 -278 -227 -330 -9 17 -140 -12
4022 -12 -416 -90 4 16 200 54 242 49 103 338 243 125 76 -122 -220 -79 216 186 57 24 -198 -192 22 -15
4046 -15 44 -220 -32 116 -39 333 393 316 112 -347 -272 -120 -80 -121 -62 -430 -300 -89 105 294 331 450 40
4069 40 -331 -62 169 506 130 77 85 -38 -77 -165 -44 -87 -280 -243 -78 117 78 -114 -87 -70 44 347 451 155
4093 155 147 38 9 -149 -201 227 -40 -156 -501 -540 -135 -283 -379 37 206 209 -129 194 180 289 -54 -42 -78 -138
4117 -138 262 406 76 -159 42 276 -124 -128 -92 -120 109 -207 173 192 216 17 190 -58 126 268 -3 -76
4139 -76 -229 -20 22 -240 -251 257 35 100 -211 -132 110 -5 132 113 711 179 -275 23 -114 -519 -233 95
4161 95 18 19 -101 -209 230 14 -9 37 222 -284 8 -389 136 -51 291 476 134 311 -27 16 -113 -246
4183 -246 -575 -243 -46 215 57 275 238 88 4 256 -43 171 142 139 -162 98 -88 -76 -109 -251 -499 -359
4205 -359 -194 -178 39 237 -132 -304 127 353 -88 53 32 113 -133 -96 68 -105 59 23 -34 404 -67 60
4227 60 -222 -11 -271 -373 126 -70 202 -1 72 -13 29 348 369 229 -53 -185 -89 -287 -57 -31 42 157 -298
4250 -298 -123 256 208 373 -145 12 -73 -134 20 -22 -154 5 60 -170 -31 11 143 73 78 117 -14 -49 -30 -133
4274 -133 -396 0 -48 211 76 198 25 -167 -125 60 9 -64 25 -135 -105 -37 -45 50 219 103 80 103 -97 64
4298 64 -86 310 -193 25 -269 -63 -296 32 23 -221 -103 -16 243 -27 227 110 154 3 -143 32 226 268
4320 268 75 205 136 203 -195 -151 11 -179 -6 -291 300 231 -152 -109 114 -19 -162 41 67 267 78 115
4342 115 92 -2 -167 -97 -152 115 -136 -293 -152 -70 -221 -187 140 -15 243 -75 -206 -136 -26 -10 254 -36 252
4365 252 212 253 -107 82 89 121 188 229 39 -78 -58 1 -22 -37 153 -72 -193 -120 -251 -76 -52 62 125 -227 -168
4390 -168 153 -35 -19 16 258 9 242 93 137 32 -136 87 -26 3 194 -186 -117 186 -64 -188 50 128
4412 128 129 107 154 -30 197 161 -117 62 177 -161 -86 -229 -237 -78 -186 41 -63 12 -160 -381 -41 95 -281
4435 -281 -238 -70 -124 248 178 114 -4 57 32 -62 98 94 37 -72 -111 -134 -19 -172 -62 -159 -36 65 -59 211
4459 211 -41 98 5 63 268 155 -165 77 -112 241 -50 214 -260 102 -45 -255 -13 -50 -56 9 6 -26 54
4482 54 31 -62 183 -287 -186 -49 -329 162 112 163 -60 -32 -154 64 97 379 84 -40 -92 77 -51 -18 68
4505 68 9 -349 58 -155 88 311 -59 -226 38 -103 -46 -112 -80 178 -31 152 24 239 51 67 279 234
4527 234 183 186 68 -261 -238 -357 -104 -26 34 259 356 -145 -9 219 197 213 -86 4 -19 -234 -30 -10 -150 161
4551 161 -8 229 -57 125 98 -105 -72 -3 110 -214 -98 56 35 -185 223 -90 246 196 154 -87 -184 154
4573 154 -276 57 -114 -81 117 -87 8 10 -66 -143 47 -105 71 326 -6 -107 -179 79 -59 -135 -58 83 -132
4596 -132 -95 -202 255 -370 97 158 -98 -169 -493 235 -78 118 45 -60 -32 81 257 247 338 -159 -11 29 154
4619 154 208 140 247 -119 106 288 -55 -144 125 66 -25 -127 -175 335 21 -140 -192 352 -179 35 -13 128 -156
4642 -156 -91 149 45 5 124 -203 50 -338 138 210 185 54 92 118 20 44 265 52 49 -149 -168 14 183 45
4666 45 -28 17 0 -90 177 113 -41 -181 -98 -67 -350 -191 -185 61 102 -100 62 396 317 243 -42 97 20 22 371
4691 371 -37 89 113 116 220 90 113 -158 181 -131 -192 28 108 -21 87 159 213 119 -4 216 56 -241 -17
4714 -17 9 211 33 -166 58 -38 114 82 -220 -112 115 -15 56 187 120 69 36 -5 -219 -253 -29 208 5
4737 5 -69 164 -53 -163 137 49 -101 -136 162 189 -101 -93 11 -100 -76 -106 69 135 307 -371 -14 139 -76 56
4761 56 165 34 13 -11 -381 108 -142 -146 168 210 -97 69 -367 -158 190 41 -26 -55 -70 -135 5 -52 -58 -101 -135
4786 -135 -175 163 308 -49 3 -106 -234 -56 220 -264 -87 55 120 64 74 194 -255 49 79 214 -173 -240
4808 -240 -32 43 11 -121 -58 -283 190 -4 -384 112 35 -36 -60 -193 -211 -130 35 23 151 -170 -9 118 53
4831 53 228 -133 120 139 -278 11 17 -156 -129 -173 84 -121 62 182 353 -209 -16 -78 41 34 -98 -384 85
4854 85 -220 -113 124 47 -194 -206 -249 27 128 -103 -71 -243 -312 63 -118 190 84 65 22 -121 -77 -317 120
4877 120 118 48 4 -84 -94 -65 101 -35 88 144 51 -50 316 205 -46 20 -325 -38 -45 -19 266 52 -11 17 168
4902 168 14 -326 191 -213 -19 112 9 27 -86 -166 143 -142 221 6 268 244 -287 -53 -11 -145 -8
4923 -8 -73 156 -125 -118 117 121 84 22 -63 181 -37 -174 -49 215 -69 -32 63 -4 4 155 2 20 -27 -92 304 -299
4949 -299 -157 -134 7 -233 6 76 125 336 365 194 308 75 10 -76 -173 -356 -342 -193 -105 190 -141 -10 149
4972 149 187 50 -115 -11 -276 -259 -86 127 225 -48 -238 110 -1 143 244 25 -56 103 -126 -357 51
4993 51 -101 76 144 125 -98 -68 175 241 187 27 -174 68 -225 98 24 -219 87 251 193 -100 282 -27 20
5016 20 209 135 -187 54 -84 67 176 -127 62 -20 34 78 36 33 50 159 342 -83 28 -121 -12 -69 -116 -7
5040 -7 8 -152 45 298 20 175 -11 -124 -118 122 -81 69 -130 111 -54 -395 -19 -82 -8 119 123 -94 79
5063 79 188 167 22 -19 -160 136 134 20 91 -120 -178 -400 7 -186 233 354 -319 -9 -137 -7 32 -53 10
5086 10 -147 61 -13 175 -56 -62 -94 13 -173 121 -32 50 -5 38 3 83 5 -42 -149 -99 -251 124 -160 107
5110 107 -43 205 485 162 85 16 61 -327 156 -213 104 -100 -25 108 209 -157 22 -94 -21 -118 -16 24
5132 24 -102 65 -101 164 10 -90 -47 -8 -48 -130 -40 13 247 -135 -36 405 275 -72 -1 130 48 -164 92
5155 92 150 -112 24 -45 14 -192 -140 64 72 152 105 188 276 -123 111 220 193 125 2 -112 -167 85 -251 -106 -21
5180 -21 -49 -187 144 216 -191 -231 46 -158 1 -105 92 -7 -97 282 -123 328 -122 143 -325 -242 -65 -122 -85
5203 -85 -41 -196 -56 -161 65 -26 91 155 68 -142 211 -7 -104 -170 164 -79 -41 302 135 -1 -383 -139 -78
5226 -78 251 -7 -207 221 168 5 57 -165 39 -81 -120 137 154 -105 98 195 -177 1 -59 -31 40 -272 114
5249 114 105 -267 -124 -26 -15 -43 -46 12 -14 -120 54 -5 -36 75 2 215 303 27 123 132 242 -154 -82 -96 -141 -29
5275 -29 114 100 43 -121 -109 209 -55 4 79 21 118 -66 218 279 156 -30 136 165 36 245 207 6 -133 -7
5299 -7 -46 -63 100 -89 -66 95 -341 -212 -67 24 117 233 -27 -244 -69 313 164 171 5 -292 28 108 17 -175
5323 -175 -142 -102 -156 187 -68 245 37 -73 88 -101 375 76 111 119 -182 39 14 -8 -177 -107 66 -33 -151
5346 -151 -143 81 -39 302 -36 -9 200 104 -3 -33 110 -22 -39 -112 256 274 -185 52 14 -61 -29 -289 -77 -183
5370 -183 -252 -123 -25 229 111 222 57 0 -59 76 145 -11 -31 128 425 202 95 19 97 -3 -142 -96 21
5393 21 -88 83 139 295 197 83 135 -128 150 31 290 12 1 133 39 -249 -169 -148 360 -46 82 -83 347
5416 347 329 248 245 228 -102 29 32 257 -178 141 -296 -61 277 -227 19 29 81 -325 49 123 -80 -76 -77 -88 -229
5441 -229 -168 -127 210 196 -107 -112 25 -164 -345 -212 -152 -325 -224 33 -110 -15 177 -100 -106 9 -73 -214 -249 14
5465 14 -283 -134 -155 -31 488 137 157 154 -71 108 -94 -67 -43 60 -126 -297 -18 179 -27 20 -3 221 138
5488 138 57 12 188 193 -86 -215 -278 -47 -149 -1 129 -101 21 201 273 218 -276 -312 10 -243 -117 56 142
5511 142 142 -54 177 85 165 -51 49 143 -173 105 61 -77 -95 -17 53 69 30 226 -153 182 -271 -235 96 103 185
5536 185 -9 -59 -78 38 167 45 333 -132 -85 -155 192 60 -320 -240 -247 -443 -352 -86 241 184 213 42 -166
5559 -166 37 -339 145 28 79 106 -90 245 12 -56 125 -336 -94 136 -107 71 24 -161 -54 156 -92
5580 -92 268 205 -235 -315 172 217 -135 -158 376 -10 13 -114 23 12 -347 -143 43 -221 151 102 126 214 170 -215
5604 -215 39 263 17 93 -99 -141 -151 172 107 436 183 -32 -14 -266 14 -40 0 -62 -117 -136 -211 -12 4 240
5628 240 170 -187 -48 183 15 -127 -24 -42 -70 -67 15 242 14 13 101 -67 -238 -98 24 295 -75 -151 47
5651 47 -164 -266 -38 84 211 209 12 183 4 79 -130 84 -219 129 -121 163 -171 -112 171 22 -104 -75
5673 -75 -319 -95 16 -131 71 -262 -50 130 85 57 373 294 197 103 -164 106 1 -14 -302 56 -207 192
5695 192 -50 -152 -2 119 76 -113 226 176 -66 -271 -766 -64 -299 -19 442 -15 -78 17 136 35 30 -35
5717 -35 148 -93 -77 -137 -42 70 -45 2 -25 -175 -66 116 -44 -43 -121 -53 -195 -190 -62 187 177 3 -137 31
5741 31 157 -88 5 50 -10 -12 41 101 -271 -140 -376 -54 -121 143 21 127 -97 152 -96 199 179 20 13 110
5765 110 -38 50 229 -101 342 73 -84 189 63 -195 -247 -178 -68 105 15 39 -178 -49 221 77 -5 22
5787 22 143 117 43 -135 -115 20 -68 15 -14 11 -17 13 98 245 15 -13 114 267 45 248 -14 -9 120 19 0
5812 0 225 -36 -73 -260 -87 -187 -293 -149 -266 -5 14 -26 -76 15 -177 23 44 -75 354 81 160 -138 8
5835 8 195 -34 149 320 7 93 -97 -131 31 -72 62 16 -153 87 81 -33 172 150 -130 -165 121 16 -3
5858 -3 -36 -53 45 237 141 -13 -19 23 170 92 -35 -146 161 287 -13 27 -7 217 282 -165 -39 77 111 -230 -43
5883 -43 158 22 175 36 201 -43 138 77 -119 306 -364 105 -139 43 -183 -297 57 -164 201 181 123
5904 123 103 90 48 -68 99 -70 -44 -166 -121 -114 2 241 139 52 34 38 181 -4 -81 -22 -11 -241 87 -131 40
5929 40 -267 79 -185 104 295 250 161 -66 -123 63 -224 -65 123 -137 -14 -330 -104 -102 29 106 218 22
5951 22 -73 51 -271 -45 267 -80 -38 224 258 -77 151 227 -87 -245 -97 23 259 -94 240 32 -189 109
5973 109 353 244 62 -51 -35 63 192 -152 185 -27 -180 -82 3 11 91 -66 -17 -258 214 63 121 250 -92
5996 -92 261 -198 38 2 -80 121 -46 36 -13 15 195 -106 -251 -2 33 -80 49 108 -9 8 -85 -507 219
6019 219 -33 61 176 -173 -199 -33 73 -18 -89 56 -126 115 -265 -7 -22 -44 -62 -51 189 26 224 -156 -176
6042 -176 -37 -149 -70 151 127 32 -210 71 41 6 81 102 -139 -110 414 225 101 157 141 76 -130 33 -23 15
6066 15 -16 -112 -44 206 183 97 35 48 -247 -18 -62 172 -146 76 52 -103 219 201 194 -76 -148 -119 34 205 11
6091 11 120 186 -146 -241 -21 132 161 101 77 -44 -42 149 96 -230 -165 71 126 300 38 26 70 109 154 103 20 -37
6117 -37 -119 -203 -29 -182 361 -174 107 -98 25 -26 -83 51 -133 -80 -395 -177 -81 -131 -241 -106 199 -196 152
6140 152 -311 185 -23 -37 0 24 246 -176 -258 29 -229 5 217 -77 -20 20 -171 -62 -90 -146 6 0 6 -176
6164 -176 96 -219 -236 -57 -322 -160 319 -332 -9 19 -239 -10 -155 -104 -85 76 61 24 -195 -254 -39 34 170
6187 170 103 147 255 -239 -35 125 -122 -30 -13 172 181 -321 1 -100 -38 -157 -100 -62 -14 218 49 141 -85 343
6211 343 143 45 -135 143 -8 77 63 37 91 -39 -21 -52 2 181 39 174 -27 22 285 95 273 6 23
6234 23 -144 86 -46 -16 -52 -58 -102 -44 -193 -6 -429 0 -297 96 299 28 155 -175 -74 -7 -105 236 -55
6257 -55 1 46 -54 -290 168 231 -214 -64 -225 7 -130 -84 -194 122 159 -86 17 77 -34 -183 145 -7
6279 -7 -178 96 102 80 -224 -110 22 -104 -166 -67 -78 220 97 -90 58 142 288 316 196 53 -17 151 92 69
6303 69 -34 -86 271 164 -25 -99 -143 -117 70 199 114 35 41 -203 -121 -122 -157 5 -221 132 22 -207 143 87 172
6328 172 25 -81 2 -165 -30 57 374 73 5 123 204 -201 -60 124 -173 -285 -69 -193 85 139 -23 52
6350 52 -67 -30 77 49 184 -13 -111 224 -40 7 227 7 52 -45 -112 -108 80 161 -52 -190 143 -141 -23 65
6374 65 -223 -49 -93 306 213 -23 64 203 306 81 -38 153 -39 100 -27 -292 50 62 15 161 179 -209
6396 -209 164 -106 8 168 278 59 208 -47 -135 22 168 190 277 -3 95 -89 82 208 45 23 -155 -147
6418 -147 -3 1 -83 55 54 -32 49 -179 235 46 -38 13 99 -49 -183 70 -220 -310 249 40 27 90 145 405 -118
6443 -118 86 -277 -82 -134 -211 -212 -181 -94 -116 298 6 142 -100 83 89 215 5 -84 -127 11 -94 -54 -71 -72 -135
6468 -135 -222 126 82 31 55 -125 166 95 -47 -372 103 -69 114 2 -15 105 -77 143 43 -106 -333 -192
6490 -192 159 138 -145 -104 73 -136 -84 -116 63 91 51 2 146 12 81 177 132 162 -49 238 142 -396 120 69
6514 69 89 313 356 35 -189 -230 -6 25 -20 -200 59 -182 -293 306 13 -214 -63 -90 -174 278 132 55 237
6537 237 153 -292 -128 283 194 44 -45 233 85 46 130 -1 -133 -51 -91 -106 -363 -80 -96 -80 40 19 25 -61 -252
6562 -252 -136 28 -22 -23 -213 -88 -140 234 -152 -248 -36 9 20 -102 -48 359 38 0 -267 -1 -5 53 -30 -87 -9
6587 -9 -44 83 -358 -137 -62 32 -7 -151 230 -153 40 119 -38 -43 -199 -110 -32 69 140 31 240 -153 3 -65
6611 -65 132 -16 -179 -90 43 170 -212 -9 97 4 -52 119 -122 -149 221 -129 -63 128 -49 -146 53 11 73
6634 73 -316 -228 139 -226 318 60 43 -70 234 77 -7 -184 -49 -10 -213 306 75 -240 82 -70 35 -102
6656 -102 -61 -23 -29 156 -171 275 -261 171 97 -38 29 -109 87 -13 -54 -92 124 -110 -4 86 125 -58 0 -107
6680 -107 -104 -60 224 -55 -104 140 183 -274 -74 -87 129 -102 -52 -100 -123 187 70 -170 -144 -66 -190 -35 187 136
6704 136 184 168 -132 -98 -138 45 -24 -152 6 -232 -103 -33 127 -109 -5 273 -111 -7 47 5 -6 165 139
6727 139 129 -59 164 -161 -138 -109 117 -84 -162 197 -128 52 -51 -137 18 -17 99 121 -173 128 164 133 -316
6750 -316 65 -148 -162 -60 -98 270 158 135 114 -56 102 98 225 -96 89 -8 156 -90 -54 236 44 -23 -45
6773 -45 145 132 67 -10 -46 67 261 143 108 -55 150 109 84 -34 57 -205 41 -74 -195 175 -154 -59 65
6796 65 -232 32 125 38 225 -407 -19 118 72 -19 69 -86 -99 -335 -89 190 -191 245 64 -24 -113 69 -53
6819 -53 -165 48 -33 -131 -20 -52 150 250 -46 67 13 -33 57 113 -40 -522 15 -248 -191 -69 -27 119 161 -121
6843 -121 -62 37 42 160 135 23 29 156 -84 14 1 -23 -179 -131 -130 -25 181 41 -281 52 188 -50 69 185
6867 185 24 134 -13 67 -49 48 -181 -237 -45 114 -254 21 18 -366 112 54 102 70 104 162 -5 190 226 88
6891 88 51 57 -172 25 128 18 -82 3 84 -28 57 -50 80 35 159 51 5 164 29 419 -19 -124 -125 -158
6915 -158 -131 -42 64 -150 -304 -121 -117 -361 96 142 -173 90 166 54 -195 -85 201 -57 -18 -256 -36 -167
6937 -167 75 84 -64 143 -156 82 -11 383 -58 115 327 155 6 -5 -26 179 -189 -111 147 56 -10 -58 -107
6960 -107 58 84 -55 -130 21 80 56 144 26 41 -83 95 -7 52 -37 -238 -234 -6 -32 -18 9 -112 -100 -20 202
6985 202 11 -29 -121 -81 41 4 -20 335 -254 -29 -151 83 -38 -93 189 -179 58 -117 -137 16 137 81 -72
7008 -72 -199 -146 152 20 -249 -43 -120 3 76 -15 198 -140 265 -132 -29 -51 -32 236 123 -47 131 -77
7030 -77 -2 -80 -14 -262 -206 -58 104 -60 -135 -53 316 309 -240 -4 252 -42 -102 192 15 -18 -81 24 93 123 -322
7055 -322 -94 -216 80 -169 -14 133 94 -254 -153 -72 35 166 -151 45 80 -192 172 -246 -76 -138 -45 -108
7077 -108 -4 154 73 219 -304 28 31 58 -123 -154 -164 121 114 43 265 -280 -33 161 73 217 85 -106 114
7100 114 -128 -274 158 110 -50 91 -4 -18 22 -254 79 -304 74 308 -181 76 -140 126 48 -38 -244 -29
7122 -29 -12 -6 -124 -164 170 -22 -111 -54 7 154 260 13 -2 112 -31 -120 46 58 -252 -349 -77 0 -268 19
7146 19 75 155 238 -100 -31 14 -140 -77 172 256 -66 -87 -14 -60 42 -210 37 -140 105 9 278 117 -103 102
7170 102 1 -12 165 182 -168 20 -84 132 -120 -382 -36 204 87 4 -178 -34 282 76 -67 279 -60
7191 -60 35 8 33 -180 103 90 317 78 -14 -99 16 37 142 -326 -23 84 23 32 -83 -14 -169 184 6 -189
7215 -189 276 10 -67 -159 184 74 45 -143 -291 -151 -264 60 158 -162 -54 59 -47 201 206 251 1 -191
7237 -191 -56 103 120 -61 -6 -98 91 -132 16 -142 87 99 138 73 10 334 195 124 -115 -89 109 -17 -302
7260 -302 286 -99 166 -136 -26 32 24 -301 162 -163 361 50 204 62 -113 67 -145 -1 -310 66 -5
7281 -5 -128 -8 6 -69 -62 -50 -212 -243 29 109 7 303 288 232 -130 -34 32 69 96 -30 121 -41 -157 130 -120
7306 -120 -16 -71 165 85 383 61 -21 123 -142 -140 258 17 284 -42 288 6 44 -153 24 159 54 -54
7328 -54 23 139 -360 -118 22 -229 32 60 -36 178 -96 -64 -128 -209 7 48 10 -83 49 -138 -179 -264 -135 -92
7352 -92 89 150 -133 239 52 158 116 -183 -155 -203 -121 -42 -16 74 -182 324 19 -278 75 -190 35 -267 -89
7375 -89 -73 67 213 -92 3 -32 9 131 84 -252 -75 -81 62 -13 -190 -111 76 -58 236 276 117 440 136 41
7399 41 165 -377 -49 80 23 66 -119 -245 -60 -91 -135 -100 49 -41 -48 135 -17 -52 224 -263 63 -30 -31 11 214
7424 214 -38 56 -86 10 97 -35 22 -64 -58 -50 28 -418 -45 261 -63 275 -106 -65 -113 144 180 162 -40 -87 101
7449 101 59 -11 114 -52 126 144 -37 113 132 41 -434 -125 153 -69 -280 -79 -188 -27 149 -79 86 -53
7471 -53 -132 -35 38 115 262 122 -31 -10 -105 -156 128 86 55 -22 214 -386 -43 -130 -118 -39 16 -4 -163 16 191
7496 191 397 126 -153 12 57 147 3 -120 -8 -320 194 138 -25 -6 -66 129 51 -53 -179 187 1 -152
7518 -152 -97 58 117 57 51 -91 228 -90 -173 -134 137 3 -36 -169 90 -198 -8 167 137 143 -216 -149 60 -149
7542 -149 47 -74 -7 -58 -173 131 -42 -178 -275 104 -179 -157 90 218 53 -33 66 -112 62 -2 111 182 -88
7565 -88 -123 125 118 -126 -79 1 101 117 -32 113 29 17 -73 276 -2 -160 121 -214 -4 183 -19 25 -56 -10
7589 -10 -81 -297 -219 65 33 108 -79 -111 111 -139 -288 -124 -65 -346 -61 -101 282 211 41 25 -219 37 -75
7612 -75 292 -189 -4 85 -164 -51 -60 8 80 17 175 190 22 -184 -122 282 28 130 120 -23 25 48 73 56 -146
7637 -146 -226 -285 198 -161 138 -9 6 48 19 -88 32 -154 -67 204 -242 100 196 -46 163 -93 -149 -163 -32
7660 -32 -204 -174 -10 7 151 48 180 27 126 -185 -88 -147 -23 17 180 -98 57 -53 -59 -157 -70 66 206 -163
7684 -163 213 -215 181 81 -110 68 -104 -4 147 36 238 -49 -74 -86 -21 32 -79 -142 97 -24 86 155
7706 155 -31 -87 -59 234 10 -89 -122 70 38 98 127 -71 77 3 -23 -200 -10 137 -64 20 197 -253 20
7729 20 136 -81 34 145 -22 54 34 85 112 261 -69 -97 -18 207 64 -144 27 148 -133 9 125 0
7751 0 154 -184 -14 -256 58 -297 48 138 41 -99 105 -51 22 -114 -28 61 -133 -216 7 214 1 348 -89
7774 -89 -145 -33 -23 -211 -251 -205 -55 52 -147 -278 -179 192 88 -76 -83 138 -171 174 356 -154 165 -135 -1
7797 -1 266 75 -32 -41 79 54 -39 73 -57 -207 33 125 -8 -163 63 39 25 -214 -86 -100 4 149 -18
7820 -18 113 160 -67 -227 56 -14 -69 -5 171 -24 55 -218 -30 -180 9 170 -70 -226 97 103 75 85 -150
7843 -150 72 104 -74 -263 -33 -222 -209 -61 -277 -7 -64 182 -155 43 -11 -125 116 287 149 95 238 35
7865 35 -285 164 3 141 -125 -18 147 270 -133 -277 62 -138 -37 -61 51 -71 -32 214 90 -39 208
7886 208 314 -11 -194 38 -19 254 43 49 -159 135 -129 52 112 76 140 -195 11 55 109 51 -99 271 -54
7909 -54 -71 90 65 -304 -31 155 -240 177 138 -100 0 -27 95 159 -77 -51 -63 145 71 -12 -2 -106 -90 -41
7933 -41 -150 -258 -49 66 75 28 -124 -36 135 106 -14 257 288 -332 -122 -157 -18 -16 79 -79 29 74 -203 -34
7957 -34 51 -28 76 -53 13 306 -92 -51 -169 -152 -206 140 228 -97 58 109 51 65 -97 -22 8 13 -272 19 -81
7982 -81 -241 -105 -221 239 -62 -30 103 0 121 -168 121 -250 -52 -268 160 192 -173 -119 64 -248 8
8003 8 103 113 -83 232 -16 -298 103 150 127 225 -184 275 -134 -57 -75 -92 -256 -58 -37 -155 267 78 -196 -202
8027 -202 64 242 295 65 217 -3 -176 99 171 33 -166 -183 -121 -44 107 -14 147 -255 75 81 49 -100 98
8050 98 102 -117 170 120 -108 -91 143 -187 62 74 -252 -183 54 -24 92 116 209 -15 32 -107 -156 121 14 -185
8074 -185 -183 99 -31 -162 -50 -9 -150 -21 -186 -15 -75 18 -60 -19 -116 227 -189 70 63 -112 -1 87 150 -127
8098 -127 -51 42 -150 313 89 -197 -31 -45 -230 -7 236 -132 142 -70 236 107 114 36 -159 125 207 -57
8120 -57 -200 152 141 -55 69 -64 -75 55 -122 -130 45 20 -177 -392 132 -62 -36 74 -75 17 -107 103 -230
8143 -230 146 -44 -181 -68 -232 64 57 -315 -222 216 81 60 -306 -21 -133 77 220 91 -124 17 119
8164 119 131 80 212 -133 -70 -123 96 -132 -236 91 82 -20 267 -76 75 116 72 -112 -128 -103 -236 148 166 -109
8188 -109 -85 -112 -242
8191b42
$$ Imaginary data points
##PAGE= N=2
##DATA TABLE= (X++(I..I)), XYDATA
0 0 0 0 0 0 0 0 0 0 0 -8 0 -8 8 -16 16 -16 24 -30 37 -40 53 -61 73 -85 101 -117 136 -157 182 -208 238 -270 307
33 307 -347 392 -441 496 -557 621 -692 770 -855 949 -1050 1163 -1282 1416 -1559 1719 -1894
50 -1894 2086 -2300 2535 -2798 3089 -3426 3802 -4240 4747 -5349 6074 -6964 8095 -9581
64 -9581 11635 -14663 19597 -29048 53861 -267206 -609933 -197030 195959 566692 764990
75 764990 847126 648790 342522 84700 -15108 -116476 -218770 -281849 -277969 -307804 -296196
86 -296196 -192625 -77998 -95023 -146139 -101256 42770 158062 199172 173201 100458 -5972
97 -5972 -30543 98177 259403 272168 174614 87405 21057 -64494 -131661 -167330 -224590 -313329
109 -313329 -334201 -229240 -85118 527 67537 150926 184171 160589 180454 251948 276522
120 276522 216985 112176 -19727 -169365 -276247 -271900 -182725 -122648 -131048 -128336 -67530 16287
132 16287 97728 168119 187883 143473 81926 51137 40788 3753 -63678 -93257 -52564 1716
144 1716 32331 51847 41512 -12562 -59082 -62483 -54658 -72218 -98439 -89101 -43804 -11604 -530
157 -530 34032 95269 146066 178368 185488 135816 42792 -34152 -63698 -67981 -84820 -122723 -145798
170 -145798 -136804 -118503 -93301 -45431 4554 43014 90082 143896 166460 140360 90575 55558
182 55558 37677 -114 -58860 -93354 -92022 -74433 -37105 3508 83 -43559 -68362 -46499
194 -46499 -7109 9499 232 -2042 16341 41553 71701 95138 76774 29022 8907 22337
206 22337 27589 5995 -28665 -55162 -67425 -77161 -82777 -71000 -55196 -43274 -13229 28785 49890
219 49890 56049 78116 108783 115240 79374 17323 -32728 -52443 -47786 -27095 -14846 -42757 -82103
232 -82103 -77535 -36355 -4289 6196 6775 9482 23334 40860 50643 46951 27321 12047 27740
245 27740 51798 42252 3607 -36216 -65344 -75242 -66194 -48195 -24764 369 19228 31889 29431
258 29431 -525 -29472 -19342 16589 43139 51650 47337 39161 36628 31465 11212 -26835 -75406
271 -75406 -102289 -79310 -33337 -9030 -5586 -1370 9968 31515 53748 56772 39300 17974 9343
284 9343 17203 24300 6969 -16764 -20643 -14585 -14816 -22494 -40072 -60194 -62021 -41837 -10159 19563
298 19563 37074 50723 72670 82642 57039 13530 -22470 -39654 -31035 -7687 967 -9508 -21186
311 -21186 -17734 310 8318 -13123 -43207 -50740 -36663 -9699 20111 34994 35327 41758 54568
324 54568 57052 39421 4100 -28464 -35360 -25792 -19945 -19957 -24572 -27883 -15584 3663 7664 -5059
338 -5059 -18160 -19049 -1619 20344 26274 22457 25654 34055 40845 37107 10650 -27066 -48182 -47070
352 -47070 -35406 -23097 -18356 -12552 6851 26855 28117 13942 -4897 -13734 -549 21335 26877
365 26877 15363 1744 -3300 5308 13730 -491 -28474 -45035 -38244 -11546 16004 19739 2665
378 2665 -9585 -3851 16419 35905 30341 5835 -11851 -13688 -7412 1421 5839 3323 3740 4966
392 4966 -1627 -11014 -17640 -22318 -19815 -16652 -22701 -24169 -4719 28624 57462 63611 40177 7313
406 7313 -7931 -2124 10371 8526 -22795 -61005 -64650 -34054 905 16884 5985 -15977 -17256
419 -17256 10441 45685 62006 45443 8920 -14445 -14842 -8541 -4608 -4784 -13650 -23268 -22151 -12166
433 -12166 2169 15928 20208 14747 818 -19889 -28442 -10559 12681 16477 3987 -11409 -14748
446 -14748 4281 34653 49597 34211 -2601 -28359 -19472 2796 2251 -24022 -51808 -60744 -35984
459 -35984 13452 50180 49925 24217 3594 8091 26569 30907 16875 -1625 -22330 -39133 -37024
472 -37024 -24201 -17106 -14439 -7957 2632 13622 21277 29482 40155 33355 1277 -29728 -39153
485 -39153 -32807 -14422 10509 21997 12744 3751 13639 33481 31769 -4003 -42361 -51137 -33911
498 -33911 -5585 21793 20267 -13956 -40657 -24573 18090 48665 49454 35203 22040 8059 -2867
511 -2867 -1798 -5853 -29887 -49094 -38207 -19063 -12244 -8115 2790 9609 3716 -705 16110 40171
525 40171 44774 36194 24495 -4145 -42312 -47692 -15171 12010 9431 -2839 -2512 5760 8786 5479
539 5479 -6816 -40827 -74351 -56762 6319 52780 57729 47199 33973 15503 3371 9354 17691
552 17691 3405 -21464 -21526 -5001 -10198 -30825 -33683 -27098 -33024 -34309 -11842 14262 25472 32712
566 32712 47165 50973 30232 12418 24327 35871 13411 -20820 -37957 -46966 -53659 -43283 -23356
579 -23356 -21077 -31960 -21416 21438 54494 46777 22918 12522 6149 3361 23021 47574 40669
592 40669 11421 -8350 -18647 -39510 -67339 -72016 -48052 -22180 -5338 16777 34058 27642
604 27642 16524 23800 32589 21852 7868 12672 27101 26053 7223 -11344 -22698 -34905 -38218
617 -38218 -25272 -19421 -33496 -40202 -18715 10604 23598 23673 25987 32126 33358 33896 39029 30402
631 30402 1340 -19851 -20397 -22335 -36523 -43270 -32255 -15304 -5128 -1166 1586 1546 456 13134
645 13134 36235 41625 22078 5474 4325 4157 -3650 -13863 -19755 -20014 -14745 -1520 14352 13486
659 13486 -3442 -9640 749 3931 -7235 -16300 -15953 -12728 -6244 6181 18332 19075 11926 14773
673 14773 24597 18232 -687 -7295 -3175 -5234 -13286 -20054 -26378 -28937 -18668 5032 23096 17955
687 17955 761 -480 12855 18246 13268 6429 -4120 -14103 -12300 -825 5903 705 -6415 -533
701 -533 8742 4745 -5953 -8619 -7615 -9429 -6282 52 -514 -5247 -1597 10233 17428 13153 9014
716 9014 15303 21006 12556 -4820 -23668 -39987 -39242 -16653 6716 10923 -262 -10133 -4236 13444
730 13444 27011 28405 21887 9950 1471 1698 2790 -4781 -16566 -24995 -25628 -19026 -12619 -5503 6162
745 6162 16771 16755 10820 5063 -1088 -2885 3983 9437 5414 -3102 -5356 5493 17827 15301 -1621
760 -1621 -17611 -22643 -14113 2766 9858 -2613 -23158 -31037 -16602 9618 26045 25451 20010 13724
774 13724 6820 5432 8638 4411 -6241 -11234 -9615 -9356 -12863 -12833 -5500 -1518 -6848 -9896 -3899
789 -3899 3879 11443 22856 25417 10063 -6965 -9639 -540 5374 216 -9260 -12091 -8292 -641
803 -641 9753 10322 -4959 -18023 -11853 2197 8159 4201 -1751 -2138 1219 5808 12395 14572 5497
818 5497 -2499 489 1443 -9460 -18468 -14670 -4985 3044 8088 8999 3830 -3984 -4197 4768 7743 -670
834 -670 -4395 962 3692 2102 1915 1719 -748 -3603 -5781 -7435 -9582 -9020 1358 15516 16355 2837
850 2837 -7558 -6814 479 9030 10973 1434 -11543 -15656 -3732 13593 15314 -316 -13858 -14355
864 -14355 -6379 5794 14337 7055 -8677 -16021 -7561 8312 17800 15028 5760 -4213 -13246 -14237
878 -14237 -4859 5358 8198 5425 -1185 -7518 -6098 3742 13058 11321 -4597 -22392 -21910 -3031
892 -3031 17004 24936 14308 -8954 -23466 -15773 6277 22033 18241 -597 -14764 -12915 -1206
905 -1206 10117 10766 -2379 -16340 -15785 -2217 10728 14910 8879 -1794 -9137 -8888 -1892 9320
919 9320 14447 8223 -3621 -14494 -18483 -9547 6581 16069 10952 -1980 -12124 -7813 7191 17316
933 17316 12927 -2281 -17263 -18247 -1874 14519 15624 1854 -14552 -20281 -10080 5368 13431
946 13431 11298 3095 -3275 -1406 4147 4463 2045 -1073 -3537 -2841 -55 1357 2285 3439 310 -5417
962 -5417 -9366 -9225 -2558 6565 8949 2581 -5041 -7697 -2650 7800 13137 7302 -1910 -6168 -2683
977 -2683 6360 10394 4407 -6072 -13568 -12880 -5482 1767 976 -1537 838 4584 6184 4459 543
992 543 -1521 196 2446 2818 710 -4317 -5254 257 3221 -818 -4502 -3579 711 6088 9275 5811
1008 5811 -1574 -7837 -8192 -2368 -887 -4812 -4870 1609 7442 8279 6865 1733 -4528 -5236 370 6001
1024 6001 5222 -1096 -3927 -2434 -4232 -9189 -9189 -4822 826 8909 16030 12583 1140 -7077 -5438 698
1040 698 1078 -2779 -3070 -495 272 1201 3182 -1279 -9250 -7993 1812 8051 6039 1785 280 470
1056 470 -1585 -1706 339 -1528 -3455 2993 10804 8024 -1290 -5956 -5150 -4904 -6496 -6757 -3050 -557
1072 -557 1621 5895 7305 -1133 -7662 -1779 8864 12706 9508 4259 -770 -4936 -6627 -3651 -2879
1087 -2879 -8450 -10753 -2098 6380 4441 -316 -1689 -1686 -1585 1609 5424 6301 3663 3675 8151 7554 -1256
1104 -1256 -7656 -5651 -2954 -3194 -2879 -2961 -5096 -5368 -2600 256 -1175 -4584 -1323 10320 17285 12497
1120 12497 4719 -885 -5196 -4926 384 3394 -444 -7863 -9367 -4238 -1443 -3946 -4209 -572 1329
1135 1329 2758 6373 7145 3197 1007 3723 5388 1632 -4018 -4618 232 714 -2556 -3615 -3772 -5274
1151 -5274 -3792 1076 1567 -1850 -2816 3013 10723 10814 3856 -1490 -3169 -3870 -717 4227 1754 -6858
1167 -6858 -9521 -4682 419 883 -952 -399 2121 3185 4588 6903 3205 -3041 -2692 1891 1966 -1928
1183 -1928 -3620 -1963 -237 -140 -354 981 382 -1656 20 1182 -2500 -5815 -1905 3344 4088 1006
1199 1006 -1794 -1655 1338 4820 7378 6098 -804 -5517 -1848 2848 1517 -3687 -8289 -9326 -5218
1214 -5218 1546 5397 3071 -2106 -3984 84 5598 6844 5127 3623 2319 2049 2551 1263 -1680
1229 -1680 -3983 -5418 -5010 -3144 -1435 -442 550 71 -3928 -7091 -6169 182 8558 12433 9106 3518
1245 3518 -285 -161 3657 5826 794 -7886 -11125 -7223 -456 2094 -809 -5393 -6640 -3643 3352
1260 3352 10767 9371 1593 -2444 -817 1778 2412 2957 2165 -693 -4193 -3870 -1079 -1129 -2988 -2764 -1392
1277 -1392 -2677 -2829 3193 8358 6890 1562 -3316 -5754 -4134 230 6900 8083 677 -5381 -2658
1292 -2658 2853 2410 -1422 -5034 -7837 -7000 -261 7089 7821 707 -3763 -359 4724 4751 3580 2605
1308 2605 -1425 -5503 -3248 1080 836 -2549 -3145 -977 -778 -2769 -1894 1656 1131 -1683 -884 2669
1324 2669 3865 5292 7776 6170 -1362 -7918 -7041 -634 2205 -230 -2352 -3510 -4510 -2181 3368
1339 3368 3584 -2535 -6328 -2132 4496 7404 5805 3277 720 -1721 -606 4048 3653 -2800 -6359
1354 -6359 -5350 -3506 -2520 -766 1329 1701 -129 -498 1397 2241 987 1676 3311 591 -2985 -2045
1370 -2045 3013 5104 3117 -1792 -4991 -5996 -3962 608 4646 1987 -2231 -1465 2386 3766 1560
1385 1560 -1624 -3561 -4103 -1957 1941 4411 1843 -2384 -2090 1601 2044 1045 1466 1225 -658 -1392 -829
1402 -829 -718 -864 -740 787 1816 -924 -3490 -1423 1860 2181 734 -808 -1836 -1308 1107 3387
1418 3387 2928 -1194 -3866 -1873 1868 2142 1378 1334 740 162 1174 1313 -1698 -4254 -4686 -1577 1128
1435 1128 615 -615 -229 -183 120 1297 2178 1414 1219 2851 3563 1439 -1656 -3286 -1964 46 -678
1452 -678 -2271 -3342 -3628 -2228 1121 3168 2005 7 -252 1203 2069 1393 149 15 583 961 2132
1469 2132 1066 -2144 -3624 -2580 -1416 -1343 -2181 -1977 -909 1559 2337 2454 2031 1263 1832 3565 2618
1486 2618 219 -1850 -1991 -727 38 -1365 -3223 -3769 -3145 -732 1751 1563 -564 -1098 1022 3971
1502 3971 5445 5092 3165 1002 -1119 -3199 -4377 -5012 -4828 -2252 1333 2816 1979 428 -680 -571
1518 -571 378 221 -538 -309 757 2215 3010 1557 -853 -1338 -225 1194 1521 -437 -2706 -3485 -1720
1535 -1720 58 920 657 -1424 -2398 -1500 -46 862 1540 1666 2071 3027 2731 1661 1166 633 -358 -1345
1553 -1345 -3558 -5536 -4870 -2555 850 2255 1574 -186 538 2059 2888 1923 -176 -2868 -2700 351
1569 351 3360 4439 2487 104 -1246 -1072 -1346 -1874 -2631 -4000 -3705 -1177 1218 2385 2554 1387 84
1586 84 -806 -699 751 3550 4906 3890 736 -2699 -4582 -3671 -665 942 -225 -3075 -4439 -2682
1602 -2682 483 2500 3108 2673 1896 1953 3539 2818 -674 -3839 -5150 -3138 385 2929 3933 2219
1618 2219 -699 -3199 -2957 -1768 -1316 -415 1036 1453 706 575 945 1628 1357 582 -104 -635 -503 766
1636 766 2255 588 -3299 -4678 -3415 -558 1444 2012 780 -1157 -1539 177 3072 3581 1717 1053
1652 1053 899 645 -875 -2062 -3313 -3830 -2489 -64 1816 1701 -442 -671 -290 108 767 2115 2627
1669 2627 1900 1342 650 -528 -1649 -1563 -297 646 -529 -1808 -1564 -993 -1242 -860 -122 626 1144 2386
1687 2386 2708 1117 -1140 -1928 116 2325 2699 1621 -523 -2762 -3118 -1412 -77 -533 -1578 -1586 -116
1704 -116 1930 3020 2096 450 -1274 -1618 -81 1698 1911 1168 500 -1050 -2112 -1918 -1041 -119 571
1721 571 268 -206 -612 26 1364 1739 981 -824 -1487 -958 403 1521 362 -1716 -3095 -1556 1532
1738 1532 3362 3382 962 -1709 -2862 -2102 -140 506 -153 -532 276 1170 1094 1413 1238 -312 -1045 -1064 58
1757 58 415 424 438 651 -880 -2124 -1385 -87 458 341 112 -84 -297 847 2729 3347 987 -929 -1285
1776 -1285 -788 -833 -673 -1003 -1641 -1812 -380 1834 2066 688 -1012 -1014 -631 -740 -14 1312 1249 692 999
1795 999 1714 640 -514 -479 -111 -1320 -2252 -2107 -947 -136 -205 577 876 -50 -643 885 1843 439 -310
1814 -310 430 945 1314 958 989 -476 -2026 -2748 -1429 -449 -935 -710 555 1361 1720 1425 1472 974 -545
1833 -545 -876 -372 -776 -1533 -1463 398 1298 495 160 548 242 -531 -286 -164 -655 -1298 -313 1148 1377 568
1853 568 20 93 -108 -57 86 100 -428 -664 100 620 203 -999 -1026 -216 -228 -541 -344 333 555 679 1646
1874 1646 1708 382 -535 -565 110 -871 -2094 -1546 -562 -315 200 921 955 9 -124 572 1169 363 -894 -54
1894 -54 273 413 34 547 342 -809 -583 -105 -330 -888 -1375 -246 396 122 -44 261 287 109 519 1277
1914 1277 951 357 113 663 557 -438 -861 -1185 -1104 -1357 -1014 -623 -611 -621 637 1623 1510 1149 654 479
1934 479 259 197 -369 -347 -916 -1110 -769 -233 -813 -1010 -292 613 413 98 91 355 560 527 1195 804 -351
1955 -351 -797 -184 164 -96 -124 -220 -354 -596 -290 -23 -441 -538 -441 173 862 854 526 783 669 436 45 -175
1977 -175 -158 -796 -1095 -1360 -843 -725 -258 584 939 560 -237 -418 7 529 633 779 414 -231 278 278 664
1998 664 21 -958 -942 -1117 -828 -466 -267 -326 -367 583 1018 898 539 552 20 -66 111 78 243 75 -4 -298
2020 -298 -235 -317 -479 -239 -3 -534 -806 -671 49 863 1426 877 375 -182 -243 232 611 230 -71 164 64
2041 64 361 164 -44 -874 -1131 -1150 -593 64 167 152 160 681 1054 1243 862 474 -216 -832 -734 -764 -660 -12
2063 -12 326 104 -170 -604 -81 545 441 224 -532 -741 -242 303 911 924 261 25 5 143 139 59 -364 -435
2085 -435 -382 3 165 52 -398 -834 -895 -449 468 580 1026 767 691 315 471 152 -380 -401 -811 -1415 -1554
2106 -1554 -947 -22 400 905 663 272 278 348 696 658 -361 -496 -285 -161 643 490 -225 -436 -407 -120 25
2127 25 42 -353 -957 -760 -228 202 862 521 446 267 255 689 434 718 252 -76 -481 -626 -844 -783 -885 -827
2149 -827 -561 -493 -98 610 1325 1437 1357 861 407 359 -3 -290 -839 -1174 -931 -175 161 190 2 -409 -360 34
2171 34 690 401 -68 -145 -336 52 136 354 685 697 195 142 163 86 -458 -282 -309 -650 -694 -844 -155 252 321
2194 321 616 476 575 872 1321 1024 231 -531 -449 -769 -639 -649 -774 -944 -585 409 760 996 392 274 158
2215 158 150 110 154 -164 -247 -293 -346 26 -221 -344 -300 -12 259 8 -22 -16 -159 103 218 -220 -364 -139 3 320
2239 320 141 70 381 273 361 346 114 -860 -776 -819 -438 -286 -185 -159 277 395 724 773 617 110 -260 209
2261 209 -404 -534 -479 -185 106 -1 346 293 -220 -575 -315 -30 -297 -731 -389 -36 -15 225 263 407 94
2282 94 284 511 535 95 23 -85 78 -41 -415 -555 -798 -1011 -814 -164 -124 174 792 1386 1438 1046 241 332
2304 332 -19 -578 -603 -608 -918 -806 -512 160 486 397 157 378 231 -146 160 -7 99 -172 337 281 146 -267
2326 -267 -510 -40 27 -413 -453 -370 -138 82 436 672 388 -228 -75 167 -156 -244 -15 489 138 200 388 -87
2348 -87 -601 -696 -719 -199 -422 -275 468 574 804 683 1005 557 -25 -253 -390 -327 -1177 -979 -282 138 -134
2369 -134 -222 440 39 34 561 195 -98 -529 -488 255 386 -320 -22 102 -148 179 436 389 -16 -723 -260 488
2391 488 115 -280 -434 -100 -445 -519 222 663 82 211 725 573 -127 -427 -267 -301 -589 -852 -283 9 184
2412 184 479 757 390 -186 -374 635 626 -332 -860 -647 -363 -118 311 580 243 -383 -117 495 217 -310
2432 -310 -623 -549 -313 -354 247 636 473 -157 22 142 72 117 568 308 -535 -984 -959 -856 -759 -216 113 511
2454 511 173 594 1130 1311 610 -13 -307 -346 -180 -135 -163 -649 -1176 -1085 -306 529 553 96 113 -98 -65 -15 171
2477 171 20 -199 -32 406 741 437 52 -182 -440 -438 -31 203 -20 -288 -431 -534 -657 -173 254 993 899
2498 899 343 325 428 623 294 -108 -563 -1147 -1124 -619 -147 76 -158 -381 280 1097 1177 988 539 -415 -1028
2519 -1028 -796 -627 -55 -265 -178 9 406 328 674 439 206 -93 103 109 370 -98 205 28 -548 -921 -393
2540 -393 533 796 540 185 -77 -497 -620 128 286 33 -552 -771 -89 310 266 252 398 448 580 912 835
2561 835 -223 -1164 -1242 -985 -122 331 388 867 330 331 412 172 102 -227 -168 -360 -713 -742 179 83 150 346 155
2584 155 136 266 391 533 -36 -869 -978 -727 85 236 145 -16 5 -326 93 519 529 -50 262 815 474
2605 474 -141 -315 -775 -700 -630 -436 244 474 624 404 688 192 -364 -217 -194 4 260 -174 -473 -229 -213
2626 -213 48 335 412 93 139 226 -34 -182 -50 -46 -202 371 372 250 -117 -460 -121 10 42 -284 222 208 -167
2649 -167 23 39 50 -581 -197 50 386 432 229 496 511 203 79 250 78 -498 -197 -102 115 -255 -226 -111
2671 -111 -12 385 215 90 234 6 -133 258 93 -189 268 570 729 122 -497 -437 -320 -59 122 385 0
2692 0 -395 -328 -32 -109 -394 -356 -203 325 553 353 397 192 324 460 557 240 88 -194 -207 -604 -350 -507 -164
2715 -164 -168 -278 -64 116 -201 11 476 812 431 395 24 22 348 325 368 -53 -344 -637 -222 -456 -319 86
2737 86 -113 5 81 -120 -15 -89 197 352 770 310 350 233 7 -421 -785 -234 -584 -645 -155 -27 173 -19
2759 -19 -10 263 423 406 106 344 -104 -65 295 356 -579 -692 -482 -300 159 307 137 171 226 314 258 366 -161
2782 -161 -233 -79 102 74 -148 -77 -263 64 252 554 216 149 -119 -102 -405 -444 -307 508 373 -21 352 56
2804 56 -193 78 203 278 94 -223 -158 329 -10 -329 145 124 106 304 545 258 -419 -746 -638 -20 -156 -145
2826 -145 215 195 189 542 1237 776 229 -420 -293 178 -237 -468 -398 -523 -954 -944 31 93 235 888 787 713
2848 713 30 178 801 459 -175 -259 -474 -649 -454 -87 266 -187 -440 120 534 748 149 -197 -709 -627 -295
2869 -295 432 913 211 -576 -36 12 65 158 223 -210 -478 -650 175 420 136 -23 460 65 -112 -8 732
2890 732 246 -500 -655 -624 -439 -437 -61 105 -346 -766 -78 1016 896 659 574 248 -575 -484 265 118 -746
2911 -746 -1378 -1064 -498 120 135 387 523 110 171 748 874 183 -313 -447 -309 -344 -136 388 456 -31 -273
2932 -273 117 -102 -143 263 222 -393 -598 -668 28 78 266 129 258 204 364 595 775 14 -852 -550 -314 55
2954 55 -29 -162 -639 -620 -816 222 862 296 222 222 177 116 -55 -67 131 -156 -168 -136 82 174 -45 -25 40 -194
2978 -194 -182 33 354 39 -213 -259 -350 -11 489 495 571 151 -355 168 7 -64 -497 -720 -728 -343 13 343 387
3001 387 -48 -348 149 329 318 -30 401 143 -266 -45 -189 -152 -119 -336 -62 -217 -512 -288 -209 448 134
3022 134 70 291 450 482 489 129 169 127 -282 250 3 -22 -363 20 -57 -64 45 209 -128 -332 -545 -134 518
3045 518 -14 -70 249 438 151 298 320 144 187 143 199 70 -228 -326 171 -115 -560 -346 -145 -168 214 126 367
3068 367 66 -18 391 429 248 -238 39 -123 -13 -31 128 285 35 155 315 327 145 -161 -354 -329 -170 -127
3090 -127 59 -204 -104 -11 260 164 -79 251 369 337 326 -278 -136 -142 -101 -113 -85 47 -201 -75 375 306 296 -48
3114 -48 -177 71 107 -220 -272 -431 -676 -387 83 191 416 558 694 907 277 64 -41 -207 -239 -162 -150 -301
3136 -301 -698 -568 -193 171 92 -55 634 394 81 233 254 -39 -301 16 184 424 42 194 181 25 19 -35
3158 -35 -84 -223 -238 -44 237 -7 -370 -88 391 94 467 338 203 -76 -10 195 -394 -639 -646 -191 237 269
3180 269 10 -87 -202 -234 347 550 698 104 -341 -91 -355 -541 -377 -114 -292 -302 210 249 265 402 461 359
3202 359 65 -53 -261 74 328 21 -257 -364 -421 63 405 347 -106 -467 -502 -66 194 10 29 -183 -250 -7
3224 -7 385 545 282 -596 -233 -206 197 194 348 -35 -450 -606 -54 273 121 104 116 -204 -349 83 19 613 235
3247 235 153 -16 -13 -159 63 233 -85 -356 -111 207 340 293 -127 -391 -426 -390 -43 273 16 -328 -227 46
3269 46 -61 32 305 31 -192 -261 2 -75 118 -469 -16 129 53 190 157 -81 -213 -101 -225 -230 -37 268 74
3292 74 79 123 227 218 53 -68 -225 -339 -291 80 355 176 -136 -550 -85 122 231 302 -111 -102 -154 203 532 328
3316 328 -100 -55 -156 -235 136 -102 -72 74 -19 -55 494 600 206 81 -137 -226 -408 18 163 508 -97 -117
3338 -117 -254 -49 25 215 70 -51 -510 -287 269 390 436 -71 -314 -145 -45 345 381 -121 -431 -449 180
3359 180 87 445 303 -212 -312 -388 -16 -79 -27 46 -170 -214 -332 117 612 108 -92 -294 -243 98 383 604
3381 604 219 -32 -598 -207 -272 20 97 -193 -206 -726 -504 118 408 -58 -119 -274 -1 443 642 602 247 41
3403 41 -19 346 -26 -371 -253 -265 -655 -564 -306 160 328 322 284 309 93 155 357 226 58 -89 265 -209 5
3426 5 131 -9 -225 -408 -408 299 414 287 -11 -98 -182 -182 185 470 228 102 -130 -59 302 141 -82 28 -182
3449 -182 -373 -113 -256 -203 -147 92 103 256 220 556 525 324 185 -153 -242 -536 -272 -99 -33 -114 -68 147 293
3472 293 247 3 55 -110 -188 -75 294 132 -202 61 98 -334 -140 149 148 145 -190 -393 -434 -353 -39 -203 27
3495 27 -333 -372 -453 -256 155 16 490 609 619 323 -29 232 -475 -692 -594 -399 -222 -123 70 142 109 21 25 290
3519 290 88 312 -66 -62 50 -186 24 202 413 107 173 -119 -123 -70 -353 31 -105 -426 103 127 -2 82 246
3542 246 279 191 87 69 491 588 334 299 -98 -55 -226 -525 -575 -244 -417 -49 -184 203 499 139 233 176 -97
3565 -97 -2 294 78 -98 -247 27 141 -66 232 356 11 -325 -605 14 331 299 127 150 -43 290 434
3586 434 425 267 -85 -203 -292 -188 -71 116 -45 -11 -343 -324 -214 -81 136 181 334 89 83 280 383 413 -257
3609 -257 -86 -375 -233 -270 -258 -256 -557 -439 -61 504 491 239 205 349 75 138 522 278 -197 418 -61 15 -415
3632 -415 -285 -207 -253 -480 -406 55 224 217 445 227 208 127 52 379 382 -278 -86 20 -241 -233 -238 -14 -486 -18 72
3657 72 229 -115 68 -46 111 -9 26 562 258 -111 -417 -64 279 284 -71 -72 -230 -135 -171 -195 273 -331 -489
3680 -489 240 302 175 429 -55 -124 -101 -148 231 237 257 100 -58 -195 -153 58 132 202 170 68 -15 130 140 202 349
3705 349 10 -152 -220 300 -65 -408 -505 48 102 245 180 296 -47 -381 -9 -56 4 -193 -123 157 105 75 422
3728 422 339 -281 -72 -358 -150 119 -115 6 -280 -132 -421 -194 295 127 2 -16 -298 -215 222 528 620
3749 620 280 150 163 -15 -56 -67 -261 -356 -464 -214 181 641 270 74 -66 -307 38 53 279 -55 -293 -216
3771 -216 241 37 295 78 69 189 -285 -438 -203 -168 -86 -106 -164 201 246 388 210 -92 -199 -353 351 203
3793 203 75 -81 157 -177 -531 -226 1 -123 -153 7 89 195 224 405 286 -25 -63 103 134 42 -356 -263
3815 -263 -232 -186 5 221 231 53 -113 -310 0 142 221 179 154 -116 102 -183 55 -175 -234 -123 -279 -284 -96
3838 -96 85 -8 -239 -52 15 80 330 259 294 267 116 62 307 174 137 111 -44 -262 -617 -238 -286 -77 120 215
3862 215 122 268 174 117 -25 163 290 151 -154 -14 356 1 -14 -82 18 -158 60 -13 -289 -177 -176 44 78
3885 78 124 96 227 -31 135 -45 80 116 91 305 269 128 -230 -196 -216 -202 72 -289 235 -374 -85 -64 252
3908 252 290 164 49 38 -34 -52 -159 -39 120 334 25 -159 32 -137 -242 48 -262 161 115 194 356 217
3930 217 364 186 67 -44 -128 -169 -84 -88 -124 25 -194 -163 9 -194 -184 -189 138 46 151 172 244 135 110 393 26
3955 26 22 243 -53 -226 -337 -82 -499 -158 -211 -495 -256 64 -141 81 397 607 291 308 240 147 -73 -63 157
3978 157 -30 -93 -101 -306 -52 -268 -146 -71 -141 -45 -119 -53 228 326 195 169 351 107 485 262 -126 -286 -34
4001 -34 -159 0 13 -123 -85 -118 -46 -235 189 73 162 283 178 120 235 283 167 320 -23 -22 -220 -206 -203 -103
4025 -103 -115 -146 -285 170 -30 230 241 -154 -20 -39 69 129 230 154 194 44 11 -23 95 273 -44 -84 -209
4048 -209 62 -89 125 157 -40 -1 -174 152 253 206 258 56 -199 -300 28 113 -59 -152 -420 -517 -593 -115 210
4071 210 358 399 219 110 231 284 135 71 -53 31 -12 148 145 -27 -213 -191 -488 -195 14 164 -77 208 -146
4094 -146 -39 368 285 390 429 -40 131 20 -143 -238 -250 -270 44 -353 -278 -49 -189 -220 109 -17 32 118 218
4117 218 395 306 34 -86 1 -36 -85 -54 -73 -172 164 -202 -247 -291 -108 -20 185 261 -111 102 171 269 381 326 180
4142 180 236 120 -254 -245 -221 -534 51 24 50 263 -8 426 -228 4 -124 8 21 156 396 103 -316 -286 13
4165 13 -43 63 113 31 -97 -125 39 145 -77 -28 -132 131 78 215 -19 7 -52 -173 195 -25 175 -42 -49 -262
4189 -262 -404 -428 158 -96 196 66 47 405 157 297 203 -149 1 -125 -151 81 28 79 24 -345 -220 245
4211 245 96 -56 134 -115 95 61 19 66 99 94 -61 -97 -36 57 -6 -42 61 -165 39 -56 45 17 -58 -299 -244
4236 -244 -33 -174 289 -142 -46 -51 292 51 -33 81 -20 -193 -42 -241 -300 -129 -23 -251 23 -83 -272 402
4258 402 230 -22 14 -173 -45 177 267 -81 -36 -9 -282 -40 69 223 -58 56 185 -147 -123 -182 -213 -132 -136
4281 -136 -380 -52 9 192 76 -141 -19 -297 11 159 -2 18 134 -36 18 -133 227 141 -13 24 -7 -55
4303 -55 316 -276 9 -112 155 231 34 -144 -294 0 -148 -115 -61 50 41 -55 163 388 124 53 -68 -51 38
4326 38 -198 67 77 120 74 -209 -117 -266 -180 -88 46 -141 267 93 38 85 193 -176 122 -96 -141 153 -436
4349 -436 -66 52 55 13 89 -1 29 -147 -37 -50 131 32 120 -56 181 -127 -42 143 80 -123 47 -128 -51 3
4373 3 115 -35 -388 -39 -115 163 9 -66 163 -154 -9 135 193 65 62 194 -46 100 -138 -25 79 16 -13
4396 -13 256 224 192 214 -15 38 -77 175 -77 11 122 -193 13 33 162 -212 -48 -138 52 43 12 201 204 -18
4420 -18 -153 188 233 64 140 102 123 -74 61 153 201 250 -268 -87 -125 -5 -46 -46 -319 1 -8 25 193 232 233 86
4446 86 -100 92 75 55 97 292 48 18 131 268 140 -63 3 -232 -414 -240 0 103 -35 -171 -3 171
4468 171 5 257 -44 -280 -16 65 -190 174 28 -128 -141 -87 76 -9 188 -33 134 188 -90 26 78 20
4490 20 -179 -82 -155 -456 147 102 82 38 314 276 47 -44 -59 247 -178 -138 -26 197 94 -218 -118 149 336
4513 336 -97 369 76 -58 22 131 35 -26 76 302 151 -188 35 303 183 -69 -86 33 207 -24 -67 359
4535 359 -153 -170 -91 -267 23 -24 51 -12 -7 172 152 -162 -196 201 -126 -28 28 -49 174 372 -116 204 15 -191
4559 -191 97 -92 -97 -43 -123 -96 338 61 -34 235 31 73 159 -94 190 -72 -8 -52 115 -372 -213 -177 -118 -150
4583 -150 -24 18 -48 64 96 58 -60 -219 -115 153 139 -167 -67 320 194 51 21 35 -70 122 38 70 -109
4606 -109 -134 -12 -46 13 43 261 232 -210 -139 6 270 28 2 -44 -89 326 -61 -64 300 -65 -157 -152 -66 131 250
4631 250 7 162 -136 -22 26 145 -30 185 -144 -73 -220 139 168 294 398 32 166 -334 -92 -189 29
4652 29 -53 -285 40 -188 143 94 -211 499 6 130 104 135 52 -245 67 -180 -450 247 292 -88 92 10 175
4675 175 241 9 -100 -97 -58 4 -70 63 163 -84 -226 22 -183 -79 -10 174 277 178 -71 149 6 123 204
4698 204 80 -132 45 70 114 -59 -284 -189 -151 298 -122 -259 19 108 -309 12 425 131 161 37 385 -132
4720 -132 -243 -68 -267 -55 -140 -108 239 225 -42 17 156 -23 -174 248 156 -75 164 -95 114 174 41 -129
4742 -129 5 -62 238 57 10 -140 135 -196 -8 66 -19 -119 17 -276 95 188 53 28 200 272 -326 43
4764 43 -32 -211 -54 173 21 -134 44 -4 -210 60 141 -48 155 114 85 76 -104 -263 -202 -74 28 31 -100 29
4788 29 43 -6 -212 -227 -159 9 8 -88 76 170 -83 -38 109 30 -39 15 77 32 211 67 82 96 -62 -383 -256 -57
4814 -57 9 -210 90 136 -332 -170 -11 223 78 -115 -364 -223 -17 118 143 -44 88 133 -84 104 -216 67
4836 67 264 119 104 -34 191 147 -62 10 158 -167 117 -31 279 115 -135 -113 -122 -103 -173 62 -233 -181 -123 -48
4860 -48 166 -5 187 70 -153 -46 -199 167 215 -73 -142 53 -7 177 -2 537 34 110 169 -310 -92 -113
4882 -113 142 26 -80 -93 136 69 -58 288 212 64 -259 -8 108 133 -184 -95 -146 -20 90 416 87 -136
4904 -136 -37 -80 -63 138 101 23 -18 -146 -167 76 182 239 -99 39 137 378 238 342 139 30 -281 -115 57
4927 57 -86 75 -176 23 106 207 -218 117 206 -63 -349 -153 74 -13 8 192 32 126 224 211 58 124 67
4950 67 21 -186 12 -82 -244 -183 84 -160 175 -16 -12 26 141 306 13 -199 -156 -154 -263 -62 -144 238 61 82
4974 82 -142 132 232 190 119 201 -158 -102 -118 137 -95 -206 -202 58 -167 87 352 -60 35 191 -7 55 -40 142
4998 142 75 86 -117 -144 85 386 -48 -22 -127 -151 -108 -284 -54 -96 -183 -23 129 250 -30 75 235 400 35
5021 35 128 -48 -27 -82 -14 -29 -15 83 163 225 -155 289 -91 -64 -96 -93 35 -263 -99 -50 15 374 -23 28 129 -27
5047 -27 211 228 162 269 123 -41 -4 131 108 79 24 -143 17 9 56 -8 -250 -75 31 125 31 137 116 96 -2
5072 -2 125 193 201 92 -177 72 -245 -47 84 -27 -75 -121 41 -139 48 119 62 187 -199 158 156 -112 307 139
5096 139 192 -248 -60 138 152 252 132 -17 -191 -447 -226 -111 1 97 111 105 14 191 293 308 155 18 23
5119 23 139 49 100 -24 -38 68 163 157 103 143 -125 -100 -105 -82 -133 94 53 92 -192 65 130 -70 -16 -58 -17 -246 -11
5146 -11 -28 -40 -264 -423 -136 105 -19 273 201 234 -262 -24 -80 -51 221 156 158 -412 -452 -201 46 -104 -39 -85
5170 -85 -177 37 138 216 381 87 161 -94 -196 24 42 36 65 -83 9 -161 148 -33 2 59 -25 -198 111 61
5194 61 -152 61 -136 -23 70 -26 -27 176 90 -304 -274 122 79 -17 -2 -62 -10 121 -184 38 -9 -106 193 175 -357
5219 -357 -243 14 -53 112 98 206 215 82 -115 69 62 -109 -27 182 -237 -347 -91 -113 255 121 187 118 -4
5242 -4 122 -14 51 127 -85 -114 -237 75 64 63 -17 -42 -221 2 -173 -441 -24 -81 -169 -92 -66 -15 44 -227 -44
5267 -44 332 206 209 -123 -43 -283 -266 49 94 179 -56 -124 183 40 24 230 -87 -187 54 -119 -51 174 -162
5290 -162 -165 -10 10 -17 157 92 129 89 276 102 241 -28 -165 -73 -131 -20 -3 52 -163 26 -362 -211 96 119
5314 119 86 193 -58 -30 160 289 -11 128 -2 -101 -342 -66 -39 -20 -6 -198 -166 -6 281 112 -33 -96 10
5337 10 -71 -1 -260 -93 178 -133 -62 22 180 285 279 -83 -132 153 48 27 146 54 -3 201 17 -183 159 -13
5361 -13 48 -32 116 363 130 291 -212 -33 -258 -83 187 130 -212 -14 -33 77 -156 -180 -94 54 76 -57 -61
5384 -61 156 162 -237 -85 77 -108 -196 133 -422 -317 -75 -124 -111 -169 -68 64 178 10 192 222 29 267 128
5407 128 95 -191 -21 -86 -333 -152 -176 -27 -125 -25 69 39 238 167 130 91 -30 -90 -6 17 5 -35 127 123 20
5432 20 -198 -97 239 -17 64 -126 21 170 89 50 135 103 122 22 -2 166 2 -18 163 150 -250 -85 -326
5455 -326 54 -177 17 -36 171 52 -214 268 25 -12 34 2 -111 -21 -85 38 48 72 -19 195 65 201 128
5478 128 -219 103 168 192 -34 103 -137 29 -126 12 -108 436 172 38 155 159 125 -110 -227 -175 -189 -204 198
5501 198 100 160 -111 -159 21 156 -3 -93 10 -101 68 91 -19 -38 184 -115 155 144 -62 -105 252 -310 -423
5524 -423 -208 -55 -83 -56 -191 -125 158 235 79 272 -230 -222 46 -41 11 -87 205 28 -109 -276 277 217 -119
5547 -119 325 162 69 -218 181 -149 19 -124 -294 -228 -122 241 219 90 218 -91 -19 461 109 175 -44 19
5569 19 -618 -262 -127 121 -68 -128 -114 76 13 260 64 31 -283 -25 83 -55 76 -177 196 -11 -24 -62
5591 -62 274 57 91 -275 -75 -111 53 6 463 97 53 -183 -80 105 198 -181 153 -93 -378 -143 84 80 213
5614 213 -49 -169 -314 116 193 169 370 -210 -1 -33 -306 91 133 221 55 57 82 -50 25 -115 34 -181 -169
5637 -169 84 -132 58 -100 234 137 -15 -92 354 538 66 4 336 -193 -224 -106 -18 -161 93 8 -187 139
5659 139 44 -20 -300 -22 -30 -38 -99 -14 -11 142 -86 -115 -11 -78 222 336 84 -208 -196 -182 -318 -32 149 53 -36
5684 -36 102 -106 13 97 317 191 -48 -66 -360 14 -237 7 -61 -75 -30 -42 150 274 104 82 -5 121 -19
5707 -19 -11 -116 -63 -233 -357 73 234 -23 -51 -30 -246 96 -324 216 58 -398 83 -151 -94 -5 412 -41 42
5730 42 94 8 -101 44 -51 -263 -56 -78 -456 49 174 21 14 -185 15 56 -61 270 -91 -195 -79 -149 141
5753 141 -110 70 155 -15 -265 -14 187 123 -1 -9 40 -117 -323 89 238 100 62 58 12 -201 8 1 161 8
5777 8 -1 219 -70 -311 -172 -102 -164 -138 -27 244 106 120 97 5 140 -32 179 51 210 -10 115 -87 5 76
5801 76 -115 294 188 4 -166 247 -136 -241 102 -28 80 33 -92 68 69 9 93 -26 -59 7 -94 -166 138
5824 138 -91 -160 -58 188 77 10 327 53 -59 -34 15 40 16 -134 -201 -24 -190 -32 -4 89 116 -253 -60
5847 -60 115 -116 -108 159 -196 -292 -35 -71 0 91 108 -67 -360 -19 228 123 -225 -55 193 59 62 41 206 0
5871 0 -8 5 -101 19 -18 -29 -2 -10 9 175 -40 155 73 59 -123 -38 -72 162 -122 20 -196 -70 188 -235 22
5896 22 -26 -89 224 -1 -71 -112 -194 -87 -18 -399 -43 29 160 105 -54 -92 -71 159 198 62 -104 -22 209 225 -14
5921 -14 -37 -46 -216 68 61 247 -63 50 171 -80 -159 97 71 -73 137 -427 178 -24 141 211 -45 -108 31
5944 31 -60 -111 -72 -245 65 120 -1 -37 194 158 111 -71 -101 -95 119 -216 -173 197 -29 -37 112 -18 -8 -195 70
5969 70 -98 -120 16 39 162 -84 -217 1 49 57 -27 45 147 -371 2 -111 134 -45 -145 155 -25 152 66
5992 66 142 193 76 105 -202 6 -39 -243 110 -51 275 27 7 -119 -233 -140 -149 236 453 216 -261 -169 219
6015 219 105 -28 132 38 -129 29 -63 -207 116 348 -33 -94 184 -82 -123 164 -1 -173 189 -75 -101 143
6037 143 135 -105 22 -268 -167 -8 19 34 -279 92 -79 45 -207 55 258 -40 -421 -133 106 44 -200 -234
6059 -234 -317 29 -114 31 89 -11 -116 -163 -91 0 -117 3 191 -244 153 -216 29 7 -100 -284 45 11
6081 11 28 -273 127 -117 -213 6 371 -108 10 59 32 -94 15 -78 -38 -259 -136 -262 205 93 -63 13 221
6104 221 132 -219 -126 -134 -9 -272 -55 -111 -86 40 -127 172 -268 -88 -68 17 -4 -148 -325 38 -65 -92 387
6127 387 84 -175 -349 31 80 105 175 123 130 -90 -244 163 -100 15 -83 -34 177 230 105 -212 -259 55 139 15
6151 15 5 62 -254 -84 -87 -11 34 80 4 43 -107 -131 -144 74 37 -245 -46 -283 -80 -5 -189 -19 -3 -296 123
6176 123 -9 62 190 -19 -329 -37 -91 86 -83 -6 178 100 116 96 138 64 206 31 -61 278 297 263 -207 195
6200 195 -211 143 -243 -148 3 54 -208 -231 189 67 -16 162 -123 -79 58 159 4 -198 -68 -105 -11 -108 19
6223 19 28 3 94 39 -160 -63 -49 68 95 293 -101 137 244 30 9 -82 -53 39 -81 -179 -120 -116 -176 380 -259 -258 91
6250 91 -108 9 -2 -11 161 128 220 -13 356 -130 -210 16 -13 -162 -39 -30 32 140 -223 -132 -41 65 -179 58
6274 58 -100 129 118 -113 168 79 97 23 -124 -173 38 42 25 -91 5 119 -61 -124 225 74 -176 -161 -209 258
6298 258 333 18 156 162 211 -17 12 -52 -189 -144 -63 155 74 -310 184 -19 36 246 -136 251 375 59 -12 4
6322 4 -42 202 -93 136 -114 -104 330 -29 43 75 -157 -76 32 -114 -65 -26 -162 130 34 76 104 -31 26 -9 111
6347 111 -89 -103 -41 -21 81 286 278 -130 56 205 -141 50 131 -327 -117 21 -31 55 99 -91 -85 -57 105 93
6371 93 -69 81 -83 -23 -289 -181 16 53 -66 487 59 -153 -11 73 313 164 -150 0 248 94 -119
6392 -119 311 47 70 -123 -204 -97 -173 -13 85 -149 211 211 -24 -1 -56 -168 -121 226 29 50 140 -79 104 -116
6416 -116 20 -123 216 -174 -147 37 -50 107 34 -35 -51 -47 -152 -92 186 18 146 -205 -133 -167 53 9 -89 274
6440 274 -157 -133 109 -87 -111 130 -13 96 -65 16 -225 53 -57 95 -205 -105 -30 -38 317 -227 -165 138
6462 138 -20 -280 228 18 65 -19 -180 -125 74 266 -74 30 165 -277 91 75 174 134 -142 -38 -168 220
6484 220 38 53 70 -10 238 239 28 22 -37 -119 394 57 -238 -281 -53 140 138 -14 -20 -56 -62 96 209 35 -207 47
6510 47 -53 5 124 -151 -106 -99 92 -5 13 -20 31 50 -173 21 80 170 -58 91 -23 237 87 -171 264 100
6534 100 193 -20 76 133 30 337 128 -7 -91 -208 44 98 178 7 -215 -140 -144 -34 94 167 -194 87 -170
6557 -170 -245 264 231 175 -63 123 87 -166 171 28 184 -17 116 -74 104 -329 -136 -73 32 -25 -202 246
6579 246 198 107 -67 24 45 214 -30 147 -53 27 87 27 96 296 39 147 -7 -235 -240 5 25 -217 56 -316
6603 -316 112 -6 118 -242 198 -18 -18 181 216 -142 8 115 -25 -60 146 -209 -66 -260 -156 67 -263
6624 -263 12 -16 -150 -42 292 259 63 7 260 68 229 -162 -90 126 93 -68 -405 -131 227 66 -200 93
6646 93 -123 -182 58 166 -5 -45 -368 28 28 230 181 163 62 97 -73 -92 98 128 -76 -6 176 -68 37 -249
6670 -249 -94 36 -102 -200 -178 26 192 -37 -38 33 -35 -135 -50 -24 -142 91 90 191 -121 30 246 -94 -120 -131
6694 -131 46 -44 -68 -215 -42 -76 87 -34 189 146 126 -94 -86 5 78 -120 -127 -17 -26 -96 44 -171 -60 -65 17 25
6720 25 186 79 -90 -131 28 117 119 253 59 207 158 139 158 121 42 156 33 137 -117 47 -27 -21 -69 89 -94
6745 -94 -37 189 -129 209 -5 205 -162 136 180 2 53 -13 138 143 -109 67 37 34 -34 248 -3 -39 151 64
6769 64 126 53 -65 117 -74 -234 -9 -198 -342 -190 -155 -246 246 50 -181 183 -72 -35 127 200 40 11 410
6792 410 -162 -96 -58 77 -43 -92 -185 68 -256 -74 5 36 -44 -115 -118 -15 335 322 240 -193 -100 -85 -33 33 -134
6817 -134 56 -23 87 -245 -324 7 -114 -92 83 -91 -92 59 113 234 34 -66 -11 -64 -209 248 60 90 -216
6840 -216 -145 95 181 42 48 166 148 129 -159 124 -28 -183 -119 67 28 -42 60 128 236 -215 -89 22 57 -72
6864 -72 199 26 -20 -104 64 -51 -42 89 169 94 -23 107 -8 17 -162 85 112 -314 -92 -325 93 252 27
6887 27 92 -95 140 62 83 -42 143 -122 282 63 164 257 -42 -100 262 -32 212 -43 100 -63 -127 -266
6909 -266 12 175 12 48 238 254 45 -264 152 91 20 -193 19 218 3 88 142 388 -56 260 50 -84
6931 -84 185 62 279 -158 32 -98 -194 -143 -7 -129 -152 -100 -50 170 186 127 16 11 -141 -27 129 -5 -37 66
6955 66 -31 407 27 37 -75 -70 -93 -103 -75 -48 -76 -90 128 -79 -40 -20 109 144 -103 8 -17 109 -116 249 -45
6980 -45 -42 133 -107 -199 51 -194 -114 307 -66 -120 142 91 85 91 -132 70 12 128 -62 92 194 -103 35 238
7004 238 -30 -185 72 184 -62 433 158 0 103 109 185 -168 -6 -143 -109 -152 -150 136 200 -83 40 302 -298
7027 -298 -16 2 130 93 328 300 -145 -120 -24 143 -263 -114 102 127 -28 -146 -2 41 51 -145 68 3 107
7050 107 -12 46 -1 -67 -46 -87 -148 -58 -106 227 118 12 129 254 28 186 -41 68 -40 202 1 160 70
7073 70 -37 142 123 83 -140 -94 110 -125 -135 264 -75 -86 65 160 41 25 49 131 -44 53 87 -32 -234 176
7097 176 -4 -6 -75 -71 44 -179 -8 -57 -66 -89 30 -73 1 -4 -61 36 153 -121 -17 -177 -152 -193 -21 -131 -110 -219
7123 -219 -143 -50 9 21 -158 -47 63 69 102 -131 154 -160 -107 78 -64 -32 136 -105 -208 -14 50 -418 -129
7146 -129 -181 102 -238 0 -176 -91 134 38 -318 0 240 -35 -25 -224 -83 -194 158 -94 -85 -228 -187 -133 -86
7169 -86 -6 238 56 -10 243 225 83 211 148 -78 164 200 -35 82 -305 -116 69 -170 -56 95 95 296 177
7192 177 3 -260 -94 146 -100 -125 -268 395 91 -153 38 -422 64 325 -213 -108 89 -141 40 -38 19
7213 19 224 116 59 146 181 128 75 -58 -61 -128 37 83 95 117 -76 -104 -52 -12 -155 52 50 -161 -11 -62 -62 236 2
7240 2 72 -187 -198 260 33 -107 37 79 -38 -69 203 88 -100 76 -48 496 243 9 245 223 -55 -59 50
7263 50 4 3 -29 -93 213 -153 -120 107 -170 15 109 -16 -120 41 -55 215 -181 73 -188 -111 -47 100 -77 -220
7287 -220 -162 -29 -63 -98 -72 123 -32 -103 233 24 70 179 180 258 20 12 -23 -66 -17 -163 24 -42 -45 -88 -143 -264
7313 -264 -15 -144 221 35 -109 155 -69 173 62 -292 162 -8 33 40 -134 134 110 -132 154 -423 -25
7334 -25 100 -223 -135 207 -162 128 77 -207 310 66 1 26 -148 120 -140 -159 -382 -26 -189 177 170 112 190
7357 190 -130 55 150 88 -57 16 99 121 -139 257 -69 26 217 69 -149 -43 89 63 -91 -43 238 -26 32
7380 32 -78 107 -44 50 168 -242 -209 -137 -255 37 136 23 32 145 232 -75 -158 320 107 -80 -46 17 170 -4
7404 -4 59 111 -167 -86 -155 -166 -267 -138 54 48 227 188 -130 31 39 57 185 166 -151 -225 -118 -109 -126 -76 -30 131 -165
7431 -165 -77 126 6 82 -186 52 -167 -186 -52 93 281 4 52 62 -157 -105 -214 -87 81 -27 20 52 137
7454 137 61 83 134 151 32 110 25 89 147 -96 99 -238 225 -35 -27 -190 -66 20 -149 181 -56 -76 -9 -25 -128
7479 -128 -15 -241 -144 169 -212 153 -31 38 245 -72 64 -272 20 74 -68 -265 -222 133 23 -212 14
7500 14 -30 201 137 125 -20 -82 -16 -192 33 1 65 153 -210 -17 9 -148 -236 127 507 -307 -202 137 -55 171
7524 171 -168 143 -54 43 0 -28 46 -7 12 -23 93 -101 -197 -76 -33 142 131 204 144 356 -20 -7 60 -73 400
7549 400 -14 107 -80 142 -169 167 146 223 -171 11 -117 -20 273 -6 55 16 139 -18 28 101 -10 107
7571 107 -168 -285 -230 160 -98 -60 -97 -23 -11 87 61 18 39 17 10 -135 -88 200 128 -15 -217 102 23 -28 -94 -24
7597 -24 -278 72 -229 98 19 177 -32 25 -303 112 4 -4 52 10 16 148 129 37 120 -24 166 -154 163 248
7621 248 366 30 126 -107 -31 152 -13 100 1 -126 -60 -309 -81 91 40 -73 86 72 122 23 46 157 -96
7644 -96 1 235 136 -69 228 164 19 -30 124 54 69 -21 123 279 -124 67 79 -106 129 56 157 24 -12 -50
7668 -50 59 -216 -60 -17 3 215 -176 -42 96 -23 -131 -18 228 -45 -81 76 -43 291 6 -203 179
7689 179 192 -152 17 -141 -161 145 -122 -87 -21 -77 39 53 -127 56 -156 178 -159 108 138 -114 80 18 -78
7712 -78 -175 187 -96 -147 199 80 13 -52 126 102 -196 177 -55 -154 318 -52 -4 -74 -40 82 36 132 -204 -21
7736 -21 31 125 -134 147 -72 58 96 19 -14 -261 -166 -79 148 -353 183 -35 -227 -163 -123 15 -33 -121 -110 -19 82
7761 82 197 -93 261 203 184 82 194 -72 -244 117 114 -292 65 193 56 -125 36 -295 178 -18 18 -83
7783 -83 101 -66 -166 197 119 89 -51 91 112 101 -33 -28 94 -39 189 31 -63 158 -384 -56 -147 254 40
7806 40 12 180 213 164 129 248 -141 110 -47 -92 -42 29 17 -66 226 -168 59 258 185 -40 22 187 111 137 -89
7831 -89 49 -84 -153 42 -73 30 -23 -258 133 -74 -121 99 132 -151 -152 52 106 -12 -70 66 149 69 13 -165
7855 -165 -96 262 277 -22 164 126 162 134 -169 -281 -328 57 -9 -198 -24 -75 112 159 122 212 138 242 39 120
7879 120 164 -139 132 -208 -133 176 -74 -152 -181 -119 181 254 225 -99 -169 -250 391 70 -142 114 -204 84 288
7902 288 262 -157 48 27 122 137 148 30 320 88 -76 31 265 82 -1 27 -7 -45 -99 -92 -4 -121 114 185 -69
7927 -69 -13 -213 295 -136 -56 -141 -86 127 -40 -126 -3 -45 -320 65 -27 -188 -106 165 238 151 -40 -25 -44 -5 -162
7952 -162 -105 16 -39 -99 -127 -62 -93 -139 -26 142 25 133 -147 50 225 31 12 -161 -46 -51 -134 -121 -139 90
7976 90 118 139 -58 -114 -308 -141 -57 20 -194 -230 57 36 -117 57 75 32 58 120 82 193 180 82 67 255 64
8001 64 169 -228 35 -219 -68 -32 -114 -83 -33 -6 75 109 44 131 -72 -3 153 142 -246 -31 -39 105 241 237 -76
8026 -76 -51 -105 -222 26 244 16 -32 57 66 65 11 250 395 132 -52 107 207 51 -229 0 13 271 -15 -266
8050 -266 39 115 64 230 -20 -21 357 -81 175 -3 58 -151 -41 -64 -127 -216 -60 -50 -297 16 -34 -27 65 79 5
8075 5 9 49 -86 72 66 -131 -243 23 -148 185 147 137 -178 -112 -97 34 114 56 -4 299 -331 71 -11 164 32
8100 32 223 38 20 26 -185 115 40 -1 -23 -360 -219 -343 -138 -38 -95 277 33 164 -47 278 364 -44 -17
8123 -17 196 -162 -191 -61 109 111 -8 -42 -212 -149 -104 -95 4 -88 -279 -76 392 54 49 81 269 -163 275 -136 68
8148 68 -145 -12 52 59 49 50 233 37 -213 -219 73 -169 -75 142 51 79 145 13 204 -116 481 116 -44 -110 113
8173 113 -96 -23 -189 -124 -58 138 287 159 244 -72 252 215 147 -4 203 58 208 256
8191B56
##END NTUPLES=NMR FID
##END=
