##TITLE=1H_CA-8417-11-1
 CDCl3, 8 sc, 
 6.2.2019
##JCAMPDX= 6.0         $$ Bruker NMR JCAMP-DX V2.0
##DATA TYPE= NMR FID
##DATA CLASS= NTUPLES
##ORIGIN= UXNMR, Bruker Analytische Messtechnik GmbH
##OWNER= root
$$ XWIN-NMR		Version 3.5
$$ Wed Feb  6 13:56:59 2019 Russian Standard Time (UT+4h)  she@DPX200
##.OBSERVE FREQUENCY= 200.1313
##.OBSERVE NUCLEUS= ^1H
##.DELAY= (6, 6)
##.ACQUISITION MODE= SIMULTANEOUS
##.ACQUISITION SCHEME= undefined
##.AVERAGES= 8
##.DIGITISER RES= 18
##SPECTROMETER/DATA SYSTEM= spect
##.PULSE SEQUENCE= zg30
##.SOLVENT NAME= CDCl3
##.SHIFT REFERENCE= (INTERNAL, CDCl3, 0, 15.7039)
##AUDIT TRAIL= $$ (NUMBER, WHEN, WHO, WHERE, WHAT)
$$ ##TITLE= Audit trail, XWIN-NMR		Version 3.5
$$ ##JCAMPDX= 5.01
$$ ##ORIGIN= Bruker BioSpin GmbH
$$ ##OWNER= she
$$ F:/spectra/data/she/nmr/H-F/1/audita.txt
$$ ##AUDIT TRAIL=  $$ (NUMBER, WHEN, WHO, WHERE, WHAT)
(   1,<2019-02-06 13:55:57.67 +0400>,<she>,<DPX200>,
      <created by zg, POWCHK disabled, PULCHK disabled
       configuration hash MD5:
       00 E9 B6 7A A2 85 ED C7 34 08 36 98 17 FE 4E 26
       data hash MD5: 16K
       57 ED A8 50 AB 45 2A 90 A8 4E CA C6 F7 50 17 37>)
$$ ##END=
$$ 
$$ hash MD5
$$ E4 53 9D 60 8D B7 3F A5 6C F0 F3 D8 7C ED 74 F0
##$RELAX= 
##$RELAX= 
##$RELAX= 
##$RELAX= 
##$RELAX= 
##$RELAX= 
$$ Bruker specific parameters
$$ --------------------------
##$DU= <F:/spectra>
##$EXPNO= 1
##$NAME= <H-F>
##$PROCNO= 1
##$TYPE= <nmr>
##$USER= <she>
##$AMP= (0..31)
100 100 100 100 100 100 100 100 100 100 100 100 100 100 100 100 100 100 
100 100 100 100 100 100 100 100 100 100 100 100 100 100 
##$AQSEQ= 0
##$AQ_mod= 1
##$AUNM= <au_zg>
##$AUTOPOS= <>
##$BF1= 200.13
##$BF2= 200.13
##$BF3= 200.13
##$BF4= 200.13
##$BF5= 200.13
##$BF6= 200.13
##$BF7= 200.13
##$BF8= 200.13
##$BYTORDA= 1
##$CFDGTYP= 0
##$CFRGTYP= 5
##$CHEMSTR= <none>
##$CNST= (0..31)
1 1 145 1 1 1 1 1 1 1 1 1 1 1 1 1 1 1 1 1 1 1 1 1 1 1 1 1 1 1 1 1 
##$CPDPRG= <>
##$CPDPRG1= <>
##$CPDPRG2= <>
##$CPDPRG3= <>
##$CPDPRG4= <mlev>
##$CPDPRG5= <mlev>
##$CPDPRG6= <mlev>
##$CPDPRG7= <mlev>
##$CPDPRG8= <mlev>
##$CPDPRGB= <>
##$CPDPRGT= <>
##$D= (0..31)
0 1.2 0 0 0 0 0 0 0 0 0 0.03 0 0 0 0 0 0 0 0 0 0 0 0 0 0 0 0 0 0 0 0 
##$DATE= 1549446957
##$DBL= (0..7)
120 120 120 120 120 120 120 120 
##$DBP= (0..7)
150 150 150 150 150 150 150 150 
##$DBP07= 0
##$DBPNAM0= <>
##$DBPNAM1= <>
##$DBPNAM2= <>
##$DBPNAM3= <>
##$DBPNAM4= <>
##$DBPNAM5= <>
##$DBPNAM6= <>
##$DBPNAM7= <>
##$DBPOAL= (0..7)
0.5 0.5 0.5 0.5 0.5 0.5 0.5 0.5 
##$DBPOFFS= (0..7)
0 0 0 0 0 0 0 0 
##$DE= 6
##$DECBNUC= <off>
##$DECIM= 32
##$DECNUC= <off>
##$DECSTAT= 4
##$DIGMOD= 1
##$DIGTYP= 9
##$DL= (0..7)
0 120 120 120 120 120 120 120 
##$DP= (0..7)
150 150 150 150 150 150 150 150 
##$DP07= 0
##$DPNAME0= <>
##$DPNAME1= <>
##$DPNAME2= <>
##$DPNAME3= <>
##$DPNAME4= <>
##$DPNAME5= <>
##$DPNAME6= <>
##$DPNAME7= <>
##$DPOAL= (0..7)
0.5 0.5 0.5 0.5 0.5 0.5 0.5 0.5 
##$DPOFFS= (0..7)
0 0 0 0 0 0 0 0 
##$DQDMODE= 0
##$DR= 18
##$DS= 0
##$DSLIST= <SSSSSSSSSSSSSSS>
##$DSPFIRM= 0
$$ [...]
##$SUBNAM2= <"">
##$SUBNAM3= <"">
##$SUBNAM4= <"">
##$SUBNAM5= <"">
##$SUBNAM6= <"">
##$SUBNAM7= <"">
##$SUBNAM8= <"">
##$SUBNAM9= <"">
##$SW= 20.0189088683792
##$SWIBOX= (0..15)
0 0 2 0 0 0 0 0 0 0 0 0 0 0 0 0 
##$SW_h= 4006.41025641026
##$TD= 16384
##$TD0= 1
##$TE= 0
##$TE2= 300
##$TE3= 300
##$TEG= 300
##$TL= (0..7)
0 120 120 120 120 120 120 120 
##$TP= (0..7)
150 150 150 150 150 150 150 150 
##$TP07= 0
##$TPNAME0= <>
##$TPNAME1= <>
##$TPNAME2= <>
##$TPNAME3= <>
##$TPNAME4= <>
##$TPNAME5= <>
##$TPNAME6= <>
##$TPNAME7= <>
##$TPOAL= (0..7)
0.5 0.5 0.5 0.5 0.5 0.5 0.5 0.5 
##$TPOFFS= (0..7)
0 0 0 0 0 0 0 0 
##$TUNHIN= 0
##$TUNHOUT= 0
##$TUNXOUT= 0
##$USERA1= <user>
##$USERA2= <user>
##$USERA3= <user>
##$USERA4= <user>
##$USERA5= <user>
##$V9= 5
##$VALIST= <valist>
##$VCLIST= <CCCCCCCCCCCCCCC>
##$VD= 0
##$VDLIST= <DDDDDDDDDDDDDDD>
##$VPLIST= <PPPPPPPPPPPPPPP>
##$VTLIST= <TTTTTTTTTTTTTTT>
##$WBST= 1024
##$WBSW= 4
##$XGAIN= (0..3)
0 0 0 0 
##$XL= 0
##$YL= 0
##$YMAX_a= 542646
##$YMIN_a= -368743
##$ZGOPTNS= <>
##$ZL1= 120
##$ZL2= 120
##$ZL3= 120
##$ZL4= 120
##$ABSF1= 10
##$ABSF2= 0
##$ABSG= 5
##$ABSL= 3
##$ALPHA= 0
##$AQORDER= 0
##$ASSFAC= 0
##$ASSFACI= 0
##$ASSFACX= 0
##$ASSWID= 0
##$AUNMP= <proc_1d>
##$AZFE= 0.1
##$AZFW= 0.1
##$BCFW= 1
##$BC_mod= 2
##$BYTORDP= 1
##$COROFFS= 0
##$CY= 11.3945322036743
##$DATMOD= 1
##$DC= 2
##$DFILT= <>
##$DTYPP= 0
##$F1P= 18.9103706918063
##$F2P= -1.10871071338519
##$FCOR= 0.5
##$FTSIZE= 0
##$FT_mod= 4
##$GAMMA= 1
##$GB= 0.15
##$INTBC= 1
##$INTSCL= 1
##$ISEN= 128
##$LB= 0.24
##$LEV0= 0
##$LPBIN= 0
##$MAXI= 10000
##$MC2= 0
##$MEAN= 0
##$ME_mod= 0
##$MI= 1.114404
##$NCOEF= 0
##$NC_proc= 0
##$NLEV= 6
##$NOISF1= 3.799351
##$NOISF2= 2.8
##$NSP= 1
##$NTH_PI= 0
##$NZP= 0
##$OFFSET= 15.70392
##$PC= 1
##$PHC0= -9036.929
##$PHC1= 13.60004
##$PH_mod= 1
##$PKNL= yes
##$PPARMOD= 0
##$PSCAL= 0
##$PSIGN= 0
##$REVERSE= no
##$SF= 200.130013532006
##$SI= 16384
##$SIGF1= 3
##$SIGF2= 2
##$SINO= 400
##$SIOLD= 16384
##$SREGLST= <1H.CDCl3>
##$SSB= 0
##$STSI= 0
##$STSR= 0
##$SW_p= 3612.71676300578
##$SYMM= 0
##$S_DEV= 0
##$TDeff= 0
##$TDoff= 0
##$TI= <>
##$TILT= no
##$TM1= 0
##$TM2= 0
##$TOPLEV= 0
##$USERP1= <user>
##$USERP2= <user>
##$USERP3= <user>
##$USERP4= <user>
##$USERP5= <user>
##$WDW= 1
##$XDIM= 8192
##$YMAX_p= 0
##$YMIN_p= 0
$$ End of Bruker specific parameters
$$ ---------------------------------
##NTUPLES= NMR FID
##VAR_NAME=  TIME,          FID/REAL,        FID/IMAG
##SYMBOL=    X,             R,               I
##VAR_TYPE=  INDEPENDENT,   DEPENDENT,       DEPENDENT
##VAR_FORM=  AFFN,          ASDF,            ASDF
##VAR_DIM=   8192,          8192,            8192
##UNITS=     SECONDS,       ARBITRARY UNITS, ARBITRARY UNITS
##FACTOR=    0.0002496,     1,               1
##FIRST=     0,             0,               0
##LAST=      2.0444736,     0,               0
##MIN=       0,             -368743,         0
##MAX=       2.0444736,     542646,          0
$$ Real data points
##PAGE= N=1
##DATA TABLE= (X++(R..R)), XYDATA
0 0 0 0 0 0 0 0 0 0 0 8 -8 8 -8 16 -16 24 -24 32 -40 48 -57 70 -81 97 -113 131 -154 178 -207 235 -270 306
32 306 -348 393 -447 502 -564 631 -706 788 -876 974 -1081 1197 -1324 1463 -1613 1781 -1962
49 -1962 2161 -2380 2623 -2892 3190 -3526 3905 -4336 4830 -5404 6087 -6902 7907 -9176
63 -9176 10838 -13117 16460 -21857 32052 -58312 282029 542646 212786 124240 25845 42264
75 42264 34339 34644 -93608 -226872 -310337 -266496 -226996 -191212 -140615 -42786 6898 52542
87 52542 113693 159645 122022 73890 59821 78375 75018 64697 65793 66667 12711 -46308 -51930
100 -51930 -29953 -39430 -50722 -56644 -86209 -129279 -129100 -77637 -18829 3393 12659 50839 105353
113 105353 139840 164819 162208 87069 -22813 -79242 -75124 -59968 -59150 -66891 -68930 -62193 -49981
126 -49981 -17016 30238 51559 47850 56699 61809 35390 1914 -10682 -8770 -5867 -11507 -22742
139 -22742 -26838 -26668 -23346 -797 21509 13325 171 10974 20105 7085 -17424 -38227 -36137
152 -36137 -11653 15895 39825 53859 42903 26107 30330 33210 11543 -16675 -39447 -57523
164 -57523 -65678 -67437 -65546 -52857 -33903 -7581 34046 64826 60149 49075 55063 62173 57854
177 57854 42173 12730 -17573 -36965 -45176 -39675 -34822 -50374 -65088 -52011 -31145 -14851 4694
190 4694 20391 25998 31297 37239 36184 30113 19683 17928 33090 37828 14956 -5244 -9924 -14096
204 -14096 -18866 -26623 -43121 -53303 -44137 -23594 -2800 3024 -12208 -17343 3648 25368 36903
217 36903 40868 32050 20853 26829 39304 39009 22347 -7995 -33440 -39530 -41534 -47498 -41640 -27362
231 -27362 -16448 -4396 4195 2255 3790 14204 25261 34863 35314 19063 4854 1560 -2520 -7064
245 -7064 -8308 -15477 -18085 -6321 5546 6449 -2909 -19107 -22079 -1086 20190 23159 17794 5458
259 5458 -8228 -9223 -5534 -10604 -15998 -17243 -11092 5841 18101 10611 949 -1235 -3147 568 7008
274 7008 4600 2526 12323 23779 26633 17320 -2257 -12061 -5865 -5383 -17819 -30065 -41364 -44117
288 -44117 -27652 -7007 1905 6424 13131 25147 41819 44786 28548 13491 7541 5816 13072
301 13072 16953 1941 -17276 -24942 -27410 -29062 -32106 -36905 -31582 -14297 -59 9955 19603 19627
315 19627 16632 21912 23890 14912 5601 -326 639 12959 21581 16653 6400 -6295 -16485 -15442
329 -15442 -15130 -28280 -37895 -32221 -18383 -1220 9525 8162 8504 16700 22499 24045 18792 3626
343 3626 -5929 1126 10406 12580 9609 172 -6928 -3094 -3099 -14607 -26919 -33615 -25803 -812 19510
358 19510 19815 12425 7303 4156 5924 2995 -10247 -17187 -12458 -3063 7976 15371 11864 7812 10065
373 10065 8280 4042 1602 -3737 -5324 747 829 -7704 -13490 -14406 -8445 4367 6000 -7392 -18741
388 -18741 -19417 -8441 11304 21432 13112 4290 3651 8273 16684 18172 3669 -11291 -12683 -2521
402 -2521 13969 22105 10525 -7152 -17072 -23169 -25092 -22812 -23620 -22024 -11202 321 8002 16428
416 16428 22264 26579 29722 22659 8288 3343 7215 9630 8968 -1503 -21975 -32101 -23729 -7878
430 -7878 3554 -2099 -21331 -26924 -10195 10949 22328 18222 -851 -14452 -7084 9392 19854
443 19854 20883 12595 7137 10478 11686 8124 4527 -3995 -16689 -20484 -18094 -17595 -15888 -11953 -9123
458 -9123 -4879 -3171 -1797 8923 21353 21078 13825 5998 -3477 -2740 10490 18540 10345 -6640 -19352
473 -19352 -16261 -1319 4487 1070 -4535 -13765 -14825 3321 19878 13426 -5664 -19222 -18822 -7047
487 -7047 2997 6579 8892 7299 6351 14738 19397 4572 -11912 -13301 -8762 -5093 1766 11380 18003
502 18003 13718 405 -8219 -11041 -15555 -10849 4922 7503 -8492 -17572 -10026 1392 7386 5409
516 5409 -2322 -8070 -7667 6805 27179 27696 6191 -3114 6371 14898 17018 16134 5758 -13595 -28657
531 -28657 -30847 -23744 -23149 -31404 -26612 -8015 4085 11198 22938 26803 17318 11870 16493 23409
545 23409 24966 23956 23603 15882 -10114 -37831 -41840 -32477 -27400 -18874 -8178 -7389 -10021 -1116 14453
560 14453 20234 9054 -4227 324 15748 23432 27168 28089 13608 -2658 -1922 4507 -1207 -14575
574 -14575 -22105 -19589 -16475 -21925 -24449 -17163 -10969 -4220 15066 34300 34508 27164 22883 16035 772
589 772 -16321 -23280 -14857 -5762 -3870 -2349 -4805 -16226 -17313 1698 18291 18960 15616 15457 15315
604 15315 9111 -3071 -11676 -17761 -26875 -28865 -14484 -2737 -3882 -811 11082 20015 21448 18017
618 18017 11788 4540 -2882 -5105 1827 706 -11658 -12974 -767 5230 2644 2713 3774 1511 -2275
633 -2275 -5724 -9794 -17794 -25017 -17417 3021 12888 10776 12491 16035 15029 15301 16089 10885 1412
648 1412 -4894 -2898 77 -7561 -19583 -18183 -9351 -8298 -8197 -4329 -2719 -376 7683 13521 9868
663 9868 -1788 -11373 -8910 691 4174 5119 10846 14203 15288 20085 18812 6191 -7803 -13989 -15048
678 -15048 -15297 -20839 -26826 -24260 -17339 -9878 2640 13006 14022 14588 18827 20030 18701 15481 10433
693 10433 6699 4034 -3030 -11260 -17164 -20183 -14233 -2764 766 -5105 -9636 -10137 -3820 6618 10218
708 10218 4190 282 349 2834 7581 8461 4629 3882 5537 7399 8384 2815 -10416 -17041 -13436 -8612
724 -8612 -5095 -442 2176 3539 6263 4241 -384 -3223 -3597 1731 8140 2788 -7024 -7146 -1729 1002
740 1002 2428 -348 -7214 -9131 -1663 11725 21956 18070 5109 -1477 -2594 -4785 -4272 -2849 -7407
755 -7407 -11953 -8429 -3204 -2497 -5788 -7948 -4338 542 932 2932 8928 9971 7675 10182 11861 7038
771 7038 4606 6683 8837 4051 -7360 -17461 -16785 -11711 -7004 -1417 -2267 -11199 -12501 -1277 7292
786 7292 6670 1974 -479 3518 10570 14834 17211 15442 6014 38 1622 -742 -9435 -13130 -10504
801 -10504 -6158 -3661 -5705 -9416 -10096 -8160 -3370 4961 4980 -1182 -455 7414 10840 9734 8691 7264
817 7264 6421 5610 2714 782 -2706 -7831 -6236 -560 -1781 -7270 -6625 -4225 -3177 -2899 -5458 -8538
833 -8538 -7670 -2733 5846 12609 8372 9 1270 8916 13175 12636 6011 -4372 -10344 -6130 2710
848 2710 8368 3764 -8922 -14983 -11901 -6888 -2058 2635 -211 -4603 -4004 -704 2267 6524 8960
863 8960 9315 6750 -851 -4491 2556 9332 8662 3112 -4948 -11169 -6679 3435 8291 3189 -9478
878 -9478 -19345 -15032 -1706 6084 6378 -114 -8807 -7605 4682 14015 13224 5798 -2288 -3953 2228
893 2228 8476 11462 10700 1748 -8921 -12310 -10181 -6326 -279 1460 -3416 -8571 -10523 -7476 1975
908 1975 8980 6717 1792 -2917 -4129 4296 14532 14319 5195 -4197 -7149 -841 8964 10287 2800
923 2800 -6970 -14081 -12965 -3843 341 -2332 -5456 -6690 -3665 3537 7180 4687 1866 -364 -690
938 -690 2754 5390 5796 7482 7210 1059 -4363 -5443 -3576 2759 7072 3407 -4055 -8271 -9432 -5466
954 -5466 -1407 -3279 -7934 -8325 -4406 2615 9648 9038 3886 2266 4387 7283 9743 6639 1085 -1364
970 -1364 -1866 -3067 -4195 -5848 -8017 -5505 -915 332 -909 -1594 -3192 -2937 -488 -9 -530 -503 -111
987 -111 3168 7600 6044 1801 1645 3270 5536 7653 5616 -131 -3191 -3814 -3524 -3842 -7554 -10847
1003 -10847 -8443 -3987 -2786 -1518 -24 -509 1919 5860 6609 4012 1087 1336 7026 12278 9520
1018 9520 3185 -824 -3489 -3861 -1047 -2741 -7367 -8924 -7005 -3783 -2646 -5522 -7605 -4130 -115
1033 -115 2514 6939 9003 6224 5942 8185 7231 3166 -702 -2256 319 2426 -536 -2868 -4291 -6935
1049 -6935 -7365 -3936 -4094 -6587 -4297 1181 5016 5342 1190 -1288 -580 547 4123 9532 8702 2080
1065 2080 -547 1106 528 -2615 -4195 -4564 -1571 1839 2396 2152 -1966 -7512 -6498 -1219 -1236 -3353
1081 -3353 -1506 2380 3311 3505 1479 -1059 -2252 -1743 3103 8429 6636 1828 3312 4841 1043 -3239
1097 -3239 -5820 -7126 -4415 252 3471 2102 -4728 -10288 -6985 -2061 -2064 -1349 1967 3215 3526 5182
1113 5182 5650 3355 1036 2290 6749 8798 4292 -374 -1090 -3907 -6767 -6368 -5953 -8317 -6899 -2424
1129 -2424 694 68 -2666 -2240 2481 4644 3905 4812 5083 2431 3507 7098 6146 483 -2965 -3318 -370
1146 -370 2152 1044 -1858 -4166 -6289 -5467 -3092 -5149 -7906 -5422 -251 2729 3900 3099 1970 3255
1162 3255 6133 7899 8665 5475 1734 1522 2266 -461 -3541 -5621 -7354 -6962 -4539 -5055 -6184 -5188
1178 -5188 -2013 1387 4043 2247 1202 3095 5445 6871 7146 3829 -565 25 1917 710 -1396
1193 -1396 -4250 -5789 -3927 -390 1331 1298 -2567 -5540 -2616 2068 1844 49 -444 -1987 -1266 1867
1209 1867 3287 1774 -186 -1284 149 2837 2370 2288 3689 2005 -1726 -1960 -1415 -2047 -68 3077
1225 3077 2670 -1987 -7486 -8599 -3650 53 -459 -1172 -1633 -1885 1892 6844 6191 997 -1274 1596
1241 1596 6575 9083 5999 2026 -2192 -5770 -5799 -1361 -2142 -6853 -8158 -5737 -3567 -1268 1040 2616
1257 2616 3531 1699 7 1929 3259 3090 5969 7475 2987 -1565 -919 1937 3371 1565 -1696 -4234
1273 -4234 -5987 -6645 -3705 -1050 -5062 -8674 -5010 1194 4916 5709 4148 1200 364 2752 7890 10720
1289 10720 6559 -79 -753 -428 -2911 -4476 -4262 -5653 -6536 -4613 -888 1007 258 -1625 -202 634
1305 634 -1783 -1474 2620 4668 3223 2155 579 -138 1203 4275 6064 3452 -3188 -5206 -1126 843
1321 843 -1590 -3014 -3701 -5100 -3423 1185 2967 -47 -5099 -5007 583 4372 4586 4664 3805 629 -775
1338 -775 2764 3001 978 -866 -874 -255 -1298 -2195 -859 1225 -1208 -4151 -3299 -3100 -4133 -1898 1493
1355 1493 1882 -767 -1416 1033 4595 5188 2601 1803 127 -1085 1739 4520 1456 -3525 -3815 -1487
1371 -1487 863 1015 -1147 -3357 -4895 -5403 -2460 1723 1596 -520 474 2260 1973 958 1325 1822 2636
1388 2636 2753 2374 2108 759 -735 1056 1246 -2571 -4826 -4310 -2706 -1421 -1057 -1962 -2077 -1457 -369
1405 -369 1998 3601 1317 -546 1205 3127 3372 2478 882 -1319 -845 831 1695 1586 -770 -2456
1421 -2456 -1206 -36 -1452 -1794 -1290 -1683 -1615 -1038 -1634 -2148 -2191 -1009 1912 3536 2247 1413 2455 3670
1439 3670 4164 3961 1935 -475 -773 -634 -315 -1507 -3789 -5089 -3276 -2152 -2836 -3041 -2583 -1588 1048
1456 1048 3549 3948 2887 1331 639 2441 3405 2042 1113 1496 1609 1155 899 -1355 -3236 -3000 -2153
1473 -2153 -1641 -2623 -4113 -4302 -2019 62 592 1378 1009 46 1683 3905 3923 3632 2477 2276 2650 2461
1491 2461 402 -1177 -2107 -3213 -2711 -1768 -3508 -4144 -3273 -1665 -409 592 -18 -16 1194 1679 1964 2457
1509 2457 1805 1693 3245 4259 3600 1888 -1045 -2734 -2591 -1963 -3379 -4516 -5247 -4033 -862 2147
1525 2147 1885 1049 638 14 1024 1771 1827 2134 2853 2105 915 -418 -2638 -3575 -1952 -264 688 942
1543 942 392 184 1517 2017 354 -1605 -2346 -2198 -680 230 -1285 -2507 -3156 -1941 1261 4033 3734
1560 3734 2835 1910 478 248 678 -488 -954 -788 80 1623 2097 674 -425 -1059 -2322 -3554 -3202
1577 -3202 -1984 -766 1408 1797 269 -1832 -2055 -675 2387 3654 3054 2640 2111 2035 2725 2801 -11
1594 -11 -2891 -3831 -3099 -2500 -2430 -3406 -3706 -2489 -485 1989 3187 2375 835 1096 1180 910 1267 1849 1823
1613 1823 2067 1249 513 -126 -625 -662 -141 -791 -2887 -3717 -2979 -1950 -878 108 -388 -452 568 1825 2018
1632 2018 1823 650 721 2541 3129 2686 1469 -472 -2392 -1999 -1268 -1647 -1914 -2014 -1099 438 1657 846
1650 846 -1059 -2306 -2506 -599 1021 1073 765 1087 594 674 961 1197 1402 1712 1860 1407 746 -852 -1823
1669 -1823 -1733 -1895 -2728 -2128 -1306 -552 310 132 -1425 -2308 -1006 1552 4618 4712 1483 -388 -1469 -767
1687 -767 697 1704 851 -816 -1104 -74 983 1277 -361 -1688 -1917 -1837 -865 513 386 -1009 -1809
1704 -1809 -1677 -1019 -111 1130 2283 2442 1554 857 1344 2546 2782 2282 850 -1828 -3475 -2599 -1160
1721 -1160 -920 -2337 -3254 -3334 -1443 385 1914 2172 -414 -1651 50 2791 3770 3534 2469 759 -195
1738 -195 -705 -220 200 -776 -1922 -1848 -1231 -1992 -1804 -915 -546 -1008 -992 -502 540 1143 1471 2728 2260 826
1758 826 799 2842 2616 258 -1466 -2039 -2261 -1895 -664 749 344 -1040 -422 1619 1225 -733 -1147 -1152
1776 -1152 -1432 -1265 556 1192 446 -163 462 1429 512 -209 418 2020 984 674 1006 287 -1302 -1404
1794 -1404 -699 -655 -1659 -2093 -712 32 -517 -528 1055 933 456 968 1785 239 -1908 -1789 -2 1251
1812 1251 1110 1261 2009 1699 667 838 576 -1599 -3083 -2142 -1055 -1334 -1693 -1318 -268 -263 -178 799 1467
1831 1467 626 340 1759 2839 1048 628 961 968 88 -538 -748 -1547 -2220 -1597 -514 -388 -1360 -956 236
1850 236 305 -365 125 73 -340 -63 943 2216 2052 1002 843 1851 977 -436 -915 -1138 -1817 -1564 -1050
1869 -1050 -829 -1084 -823 81 602 320 -437 55 283 -14 337 720 369 -29 46 421 1061 524 -394 -227
1889 -227 499 133 192 133 -316 -980 -835 -444 -1138 -1714 -1572 -574 213 563 507 879 1275 855 1181 766 518
1910 518 -320 -153 578 508 196 -500 -280 -104 -412 -125 -374 -1076 -1518 -779 -45 256 -102 -105 294 770 782
1931 782 196 658 618 351 1036 1105 841 111 -67 40 40 -197 -994 -956 -425 -827 -333 -555 -1011 -1050 -154 257
1953 257 241 256 243 957 1386 1331 1550 1283 225 -33 313 644 -644 -1006 -1646 -1077 -602 -755 -1111 -794 -655
1974 -655 -645 -88 -73 -201 100 1152 1597 1281 1049 737 1066 896 196 -25 -207 -1091 -1057 -407 -515 -1153 -1251
1995 -1251 -1198 -657 141 309 374 268 1002 1324 2021 1617 475 -156 -756 -895 -325 -75 -20 61 17 -176 82
2016 82 333 -132 -333 -295 -409 -900 -651 -629 -92 330 408 209 381 90 509 551 -85 -693 -611 -113 254 426
2038 426 640 -72 -61 155 504 799 132 -660 -605 -127 25 82 -365 -1077 -1671 -1377 -654 31 879 1480 1909
2059 1909 1909 1795 845 713 197 -363 -820 -1393 -1386 -1179 -767 -284 -252 -357 -370 89 621 246 -94 -366 -264 275
2081 275 1186 1301 1125 356 -61 -7 625 674 332 -530 -1072 -1513 -1137 -758 -806 -880 -1196 -680 31 402 738
2102 738 1085 1614 1344 975 1159 224 -221 -511 -649 -1088 -949 -662 71 260 168 -180 69 104 135 -57 -309
2123 -309 -667 -963 -229 192 563 572 134 79 321 608 863 703 16 -275 -318 -519 -485 -472 -440 -583 -418 -156
2145 -156 48 86 -6 -36 502 279 93 207 -254 -388 -182 -211 -1 137 909 745 711 309 -53 143 -42 115
2167 115 -49 -263 -809 -590 -186 -182 90 142 -225 10 129 498 527 310 32 117 320 372 374 -34 8 122 31
2190 31 136 225 108 -89 -156 -290 -535 -825 -932 -461 -264 -36 24 560 445 1067 896 308 265 17 320 475
2212 475 372 -175 -646 -783 -551 -717 -269 -99 -39 -158 106 101 7 286 218 677 169 178 311 191 -148 -241 -126
2235 -126 -2 110 -179 -85 21 -247 -562 -186 -550 -219 -14 143 242 -64 95 447 366 21 -435 116 246
2256 246 149 70 115 9 7 189 312 34 -22 -324 -58 -232 117 -109 -191 -399 -295 -262 -167 -159 164 -53 354 534
2280 534 370 466 383 218 -85 56 -111 -511 -361 -211 -102 -137 -246 -143 40 47 24 -15 259 -205 -151 222 332
2303 332 34 124 27 173 -56 -48 -222 -138 -91 97 244 16 -139 8 50 -126 39 32 18 -121 -222 -22 131
2326 131 164 -79 195 455 -59 135 39 -30 -35 -21 366 -71 -111 -194 -104 146 -235 -238 -124 -230 -197 76 368 59
2350 59 268 -44 128 487 85 -110 51 33 223 125 68 -323 82 269 14 -231 -294 -428 -78 -58 -399 108
2372 108 282 38 -57 -110 83 -83 83 286 -109 -148 -91 52 68 204 166 -33 -52 63 -365 283 33 -174
2394 -174 -125 -106 -24 304 -20 71 98 210 119 218 150 201 -3 375 5 -147 -31 -73 5 -68 -237 78 -211 -244
2418 -244 132 231 200 -77 53 -14 17 -59 191 237 -12 120 337 252 -245 -153 196 107 -97 97 -124 49 -58
2441 -58 173 17 35 25 -88 98 390 92 70 144 406 23 -218 -264 -124 -296 -63 -56 123 -106 39 -54 -14
2464 -14 -97 -39 15 -24 -103 102 24 110 116 -83 1 -160 -119 226 3 -1 64 -161 172 -15 -258 45 -134 128 -48
2489 -48 58 -188 116 -136 -333 -42 -96 50 -214 125 -202 118 -34 18 171 199 -152 -123 -202 136 139 55 -230
2512 -230 10 -77 55 -55 50 -27 45 -19 -20 135 298 68 45 70 -54 -136 126 -411 -146 -63 102 18 -133 -304
2536 -304 -133 51 -252 -46 121 -46 119 -49 58 5 85 35 185 3 169 -290 41 1 9 -75 -121 35 118
2559 118 59 175 11 -435 67 -135 116 85 227 178 93 136 62 142 -34 56 49 26 -156 -168 -79 -110 -189 29 307
2584 307 67 224 29 129 201 213 -90 -253 44 -67 54 34 13 -50 -19 -75 110 91 129 -398 -428 -251 -313 -116
2608 -116 60 -111 -143 -33 88 0 137 210 -157 73 244 -40 -96 -4 222 -299 -37 -155 39 194 314 -238
2630 -238 -131 -133 -73 31 10 -164 -432 171 -74 -14 -165 0 150 242 529 158 113 175 -168 -137 -352 -39 -183
2653 -183 -16 174 -20 -123 -326 -200 -87 -240 -142 49 -37 44 151 445 135 258 261 295 79 163 269 -154
2675 -154 -371 -66 -187 -242 -405 -230 -122 64 -64 -96 -142 106 231 148 99 55 -38 -71 11 240 131 225 -65
2698 -65 37 49 -29 238 -185 -348 -174 -241 -417 -433 -132 -93 130 362 283 150 28 30 -16 203 81 -89 57
2721 57 -39 -44 5 -11 -63 -79 6 -25 -125 -26 -4 -6 -3 -112 119 -236 -310 44 260 307 127 -153 -63 -223 371 114
2747 114 -75 127 -95 -15 -41 39 -182 28 -27 -132 -91 3 -486 -3 54 495 252 141 74 286 341 211 189
2770 189 75 249 122 -146 -198 -166 -213 -301 -180 -7 -405 -181 -186 -281 133 -75 -75 44 35 469 286 139 144 -197
2794 -197 390 40 2 -201 5 -163 -146 -25 28 71 -248 -376 -35 267 -63 -86 -431 -344 -212 4 271 -3
2816 -3 341 251 30 371 580 206 256 -386 -9 -183 -145 -209 -297 -664 -151 -405 10 -4 118 205 15 299 17
2839 17 -100 232 443 -149 488 154 406 175 84 -188 -145 -536 -499 -239 9 -534 -396 -79 16 -114 81 -226
2861 -226 125 -84 211 340 253 30 -351 -231 -135 -108 335 252 397 144 -350 -329 18 -250 -101 -77 -171 -499
2883 -499 -381 -198 209 309 201 303 144 547 742 88 -93 -217 -407 -290 -93 -534 -198 -284 -295 -15 96
2904 96 -75 -276 -25 -246 106 -233 117 202 138 -44 41 109 489 310 167 37 257 -119 24 -21 -237 -164
2926 -164 -188 -398 -628 -194 -22 89 111 111 380 155 585 489 39 -169 79 126 2 47 184 -86 -16 -202 59
2949 59 549 -291 -97 -318 -560 -338 -398 -38 55 -195 -90 213 332 200 127 505 158 -61 -37 66 53 2
2971 2 -196 6 -324 112 -289 -12 -167 -337 -109 -321 112 -258 -171 -342 -3 32 380 209 345 590 478
2992 478 316 359 355 211 3 -322 -110 -627 -607 -368 -142 -119 -18 -167 -74 53 55 -119 103 207 102 257 195
3015 195 232 656 29 86 -59 212 261 -51 30 -383 -231 -532 -24 47 -226 -57 -351 148 6 42 101 244
3037 244 11 422 439 -110 -70 102 141 17 -39 -114 49 73 -264 89 -86 -322 72 -195 -243 -453 -485 54 14
3060 14 -190 191 235 128 265 152 435 585 212 177 124 74 -18 -71 -425 -366 -404 -283 -178 -302 -167 -201 226
3083 226 148 -224 169 170 293 289 447 463 -24 -87 -18 116 91 -195 -165 131 -154 -96 -289 -60 -464 -487 -206 -37
3107 -37 -91 -305 100 103 32 110 507 317 346 612 519 190 -90 6 -62 -78 -226 -321 -256 -166 -518 -201 -189 -67 -177
3132 -177 390 177 267 210 54 219 315 33 36 354 101 132 37 -124 -257 -155 -329 -257 -209 -329 -88 -14 -50 -33
3156 -33 493 425 -31 92 131 203 91 79 -260 -275 -10 -209 344 348 270 58 -39 -153 -259 -209 -15 -57 -326 -543
3180 -543 -367 -275 -292 -157 200 281 426 487 539 553 340 420 169 222 188 175 110 -153 -210 -441 -424 -281 -252 -129 -336
3205 -336 -298 -339 147 -179 -37 172 189 439 184 280 521 468 286 180 39 54 -266 -22 -355 -366 -260 -330 -483
3228 -483 -309 -238 -106 253 275 115 160 145 -19 337 337 384 524 231 183 173 47 30 -254 -120 -193 -677 -213 -399
3252 -399 -403 -144 -225 -269 0 39 156 126 144 189 -67 417 640 553 113 -8 255 -104 163 191 -170 -58 -44 -130
3276 -130 -327 -124 -144 -277 -395 -147 -27 54 312 294 523 519 15 -24 -29 271 86 -8 -266 -338 -187 210 9
3299 9 -58 -351 -284 -357 -152 -101 -58 -412 -140 -261 507 249 640 235 -178 37 153 522 432 269 213 4 -416
3322 -416 -250 108 -226 -321 -425 -473 -286 -381 -76 269 297 -295 -35 114 439 271 328 134 -166 55 437 414
3344 414 15 -168 -483 -122 -67 -136 -319 -403 -344 -515 -196 35 -94 25 -33 -97 -166 514 409 426 338 448 383
3367 383 174 -140 -66 274 282 -80 -312 -462 -465 -315 -188 -391 -317 -393 -197 -42 338 -22 -295 424 317 696
3389 696 736 736 220 177 81 120 -253 -442 -471 -208 -523 -481 -128 -470 -518 -276 105 83 430 259 329 210 272 411
3413 411 -51 -45 106 336 237 -85 -16 -291 -96 -311 -363 -486 -288 -275 -354 -318 -91 140 -100 667 257 212 301
3436 301 468 196 246 89 262 56 -290 -48 76 -117 -288 -245 -123 -39 -213 67 -279 -236 -368 -355 106 180
3458 180 256 145 226 356 128 403 317 457 255 485 253 -450 -77 -334 -10 -330 -237 -16 117 -238 -51
3479 -51 -50 -29 -463 -98 241 398 295 100 204 -25 164 452 480 159 50 311 64 -169 -256 -191 -556 -399
3501 -399 -521 -517 -142 -435 -124 112 150 1 496 663 425 672 30 244 -208 -89 171 299 156 -183 -148
3522 -148 103 -213 -473 -570 -615 -773 -404 189 52 164 -50 126 287 15 221 401 478 325 197 186 74
3543 74 -132 134 -71 -125 -609 -571 -193 -415 -278 -238 -118 185 -171 419 310 117 107 -234 141 355 197 116
3565 116 530 -75 -499 248 174 -199 -103 -42 -3 -359 -351 -19 94 -349 -229 312 -161 -161 -239 42 325 184 330
3588 330 136 234 448 3 63 -29 78 -53 33 18 -311 -482 -263 -283 -346 -290 -360 -364 -208 -222 141 216 195 553 762
3613 762 522 127 209 60 -28 237 -4 4 -335 -724 -468 -452 -409 -284 -27 -343 -146 -80 115 365 387 233 163
3636 163 205 202 220 240 10 -67 -376 -269 -189 216 130 -353 -232 -315 -521 -197 -231 45 -61 -9 -255 -46 264 245
3660 245 224 73 104 475 440 126 50 -22 -137 -241 -152 83 -193 -225 -135 -558 -242 -92 -264 -9 43 -90 77
3683 77 275 534 288 284 553 309 118 33 238 204 -386 173 -58 -215 -74 -91 -423 -488 -406 -529 -223 36 29
3706 29 16 295 118 286 577 587 227 66 -18 307 219 70 -54 -50 -415 -229 -328 68 -402 -179 -565 -459 -233
3729 -233 -99 243 48 184 73 186 240 323 192 388 91 103 252 92 119 -112 -343 -493 -515 -337 -118 -2
3751 -2 40 -395 -339 273 12 42 -104 268 293 126 224 276 81 168 10 214 -100 -214 143 -132 -176 -540 -356
3774 -356 -358 43 -117 -263 -110 -29 -285 -108 98 -2 292 345 469 156 278 391 171 -73 -237 -44 18 -139
3796 -139 -133 -98 -180 -130 -170 -56 -129 96 -177 -232 65 217 162 140 243 500 342 -39 -149 250 -167 -112 256 266
3820 266 -86 -153 -290 -461 -443 -331 58 -245 -38 -26 -80 -124 22 258 392 200 85 178 168 239 249 167 1
3843 1 -51 116 -72 -202 -177 -494 -512 -529 -344 -167 -41 -393 -33 165 270 210 362 2 320 432 191 221 315
3866 315 161 39 32 -255 -349 -194 -419 -440 -358 -441 -297 -120 178 28 79 244 154 428 253 250 374 88 389
3889 389 158 49 -206 -126 -147 -718 -257 131 -455 -281 -151 -382 60 -224 -10 55 164 14 344 542 356
3910 356 289 195 -215 110 -207 -154 16 -364 -330 -272 -183 -213 -225 118 104 -367 -381 0 -46 -207 70 353 344 244
3934 244 16 99 136 288 17 99 40 153 291 10 61 -341 29 -4 117 -57 -180 -178 -212 -229 -165 111 85 -212
3958 -212 71 0 91 385 339 400 207 141 114 156 -30 -77 -282 -567 -211 -228 183 -330 -252 -126 -274 -349 24 243
3982 243 227 404 63 341 311 346 471 636 183 -243 117 166 -14 -255 -488 -186 -453 -530 -450 72 -333 -237
4004 -237 174 41 -45 237 556 554 212 13 106 282 105 -4 -90 -345 -230 -437 51 -340 27 -134 -98 -334
4026 -334 -86 -187 296 80 18 42 391 224 -93 410 -15 163 -74 -22 -45 92 -32 70 -138 -53 -261 -112
4048 -112 175 -348 -307 -145 -62 -73 -279 264 111 59 113 -136 -69 89 129 224 155 -51 59 172 -76 -144 -164 164
4072 164 64 -445 -392 -45 -160 -4 -575 -228 55 -228 223 333 375 191 -187 374 482 316 422 267 35
4093 35 -341 -234 74 -374 -361 -34 -172 -219 -218 108 514 207 78 19 113 203 418 568 242 110 -71 -43 30
4116 30 259 67 -85 -125 -360 -108 -79 1 -351 -184 -141 236 -117 42 -16 300 -19 205 533 297 151 339
4138 339 -215 -431 -37 97 158 -5 128 -164 -369 -185 -196 -145 249 -184 -367 159 -194 185 278 111 182 1
4160 1 64 294 528 245 -93 -90 -151 -31 -61 -4 21 -305 -520 -494 155 -69 -134 73 -204 114 -121 47 58 -3
4184 -3 104 132 341 489 298 264 149 25 -207 -236 -133 -267 -448 -246 -234 -251 -317 -29 11 167 -31 114 184
4207 184 166 57 286 442 172 53 260 56 14 -37 145 66 13 -77 -124 -329 -348 -176 -336 -154 -47 -35 -31 52
4231 52 132 1 228 205 50 153 156 124 77 29 -272 -42 -47 -285 -239 -343 -225 -137 35 -372 134 -79 -29 225
4255 225 236 123 253 182 132 64 237 -14 -107 55 78 -77 52 -206 -34 -394 -314 -125 -279 -106 -175 200 4
4278 4 -188 63 61 -35 358 90 62 220 442 20 526 163 230 -148 128 -235 -125 -213 -269 -356 -226 -63 -156 52
4302 52 -116 95 186 53 -37 -5 156 292 124 195 -37 -78 43 -180 76 -28 -118 -399 -220 -45 -230 -204 48
4325 48 -268 -77 123 100 135 121 368 256 180 -216 256 416 70 -36 148 -284 -347 -21 18 -318 87 -162
4347 -162 -106 58 -190 182 -50 -34 211 -71 252 242 266 29 -24 244 263 206 337 -257 -64 -94 -216 -118 -141
4370 -141 -341 -194 -133 -115 -140 212 110 149 160 140 59 123 330 160 68 138 27 -11 174 180 -5 52 -15 -108 -171 -215
4396 -215 -10 -147 -198 -200 -150 -170 14 -176 -28 90 74 489 254 148 608 242 25 107 11 3 -6 12 42 -146 -304
4421 -304 -251 -235 -183 -440 -177 -74 -41 -30 200 -26 45 159 322 483 303 106 152 -15 -84 -203 -283 -438 -317
4444 -317 -11 -267 -154 20 -124 -111 131 -66 17 -12 -113 -122 418 199 61 394 451 -65 137 110 338 -282
4466 -282 -89 -300 -24 -26 -70 -96 -25 -156 -248 -119 95 -49 207 63 346 282 253 291 187 369 -153 292 62
4489 62 279 -3 85 -49 -345 -412 -425 -17 25 -197 20 45 -60 129 311 84 200 -28 -14 158 277 112
4511 112 141 74 -219 -76 29 58 -75 -180 -305 -225 110 -212 -73 -231 -277 -178 -30 -53 196 256 271 103 -18
4534 -18 234 170 -34 -31 -53 -50 178 158 -93 -356 -178 -365 -87 -129 -48 273 -124 -102 -168 14 240 355 127 36
4558 36 177 127 145 72 299 -23 -126 -122 -335 -108 -109 -211 -106 -499 -156 103 -65 75 132 153 59 198 -172 112
4582 112 -92 0 -52 -65 236 156 3 165 171 -64 -17 62 58 -180 -189 -313 -464 -283 131 -129 79 -18 131 215 165
4607 165 127 141 49 -102 83 65 58 127 -104 39 73 -185 -20 129 8 -186 62 -217 -169 -176 36 110 -97 -148
4631 -148 -17 104 366 87 336 145 38 65 -88 -135 -143 -147 -267 36 120 9 -103 -52 -136 -256 -138 -62 125
4654 125 -75 26 317 308 193 310 298 180 -48 -102 117 95 38 39 -258 -85 -452 -437 -195 -151 -316 82 127 -69
4678 -69 -35 251 -169 316 118 204 266 -118 342 87 159 209 22 -270 -99 31 -82 -261 -33 -12 -66 -76 -38
4701 -38 -73 5 203 140 37 -152 288 164 161 316 158 -20 263 240 -191 -27 -62 -19 115 -556 -198 -278 -143
4724 -143 -56 63 -260 92 133 419 72 105 49 220 391 290 387 211 20 23 -171 -180 -35 -208 -157 35 10 -73
4748 -73 188 209 143 82 80 144 -83 312 26 -21 147 76 181 174 238 -264 -197 -177 199 -255 -89 -81 -445 -300 -158
4773 -158 46 40 0 39 -34 135 149 430 484 357 295 141 -24 163 89 109 -20 74 -321 -284 -193 99 -135 -186 -71
4798 -71 -59 -123 -77 -276 -98 -64 -6 191 23 275 154 30 173 -29 49 105 -88 10 -165 -102 -127 -168 10 -140
4822 -140 -111 -65 69 53 28 108 -132 -213 -187 -107 23 -24 310 -179 402 -32 46 33 164 -90 -231 -52 -214 -211
4846 -211 33 159 -241 3 -170 -61 -63 249 150 312 180 105 45 53 -70 10 -114 18 110 77 -137 -73 -341 129
4870 129 -289 -140 -213 -99 51 -187 211 -202 113 251 130 280 197 195 140 80 -83 -77 -310 -132 180 -49 -127
4893 -127 -180 -204 -163 -217 -141 195 40 29 -160 35 7 -57 -42 279 216 3 27 256 -80 -38 8 -20 72 -136 -221
4918 -221 -179 -175 -101 4 36 104 -102 39 94 138 302 52 -213 170 217 51 262 109 125 89 58 73 182 -59
4942 -59 40 -147 -138 -54 -204 -134 -33 219 -240 20 -357 124 -76 -15 42 57 0 138 89 115 94 -53 -58 -75 -189
4967 -189 51 9 120 -92 -2 -248 -70 -124 -42 248 -32 -54 5 92 240 572 85 173 237 211 129 173 -110 -6
4991 -6 -64 -281 -175 50 187 -253 34 101 158 -26 -5 70 63 5 306 93 24 325 295 95 39 18 229 24 -61
5016 -61 -113 -285 -148 -147 -99 -140 -138 -20 -33 8 233 12 322 -160 45 141 245 65 -42 -28 -18 117 97 0 -232
5041 -232 -234 -162 25 -255 -61 -19 -5 -233 -18 -23 153 37 -166 245 284 170 174 179 -87 66 -188 -101 139 -31
5065 -31 -210 -275 28 -64 176 29 300 111 139 -43 -172 128 154 159 162 -198 -4 -7 -55 346 -207 -164 -172 7 -124
5090 -124 60 -18 -389 -142 -269 -135 -124 7 68 272 -237 -203 149 73 109 77 54 -45 32 -36 228 80 34 47
5114 47 112 -246 40 -217 -125 -342 64 -1 -182 265 -72 -88 -154 -167 93 388 171 -22 108 122 232 122 91
5137 91 155 120 -23 192 -146 -247 -105 -112 -192 -313 -147 -271 -10 -7 -147 -11 156 140 181 472 -22 164 -88
5160 -88 -35 97 125 191 -97 -214 74 -135 161 -10 -476 -90 274 -49 -118 114 -103 141 -83 -15 74 66 -96
5183 -96 34 74 28 135 178 -10 -170 69 127 -90 -98 -224 -47 -332 -68 -91 316 -76 85 -117 35 6 336
5206 336 36 194 214 91 35 215 71 -130 -285 36 -112 -273 -6 74 169 -65 -37 64 -166 88 -55 -95
5228 -95 -42 12 177 -165 -4 186 203 156 120 -92 230 -16 -262 133 76 -107 -124 55 -9 -215 -80 -53 -292
5251 -292 12 89 115 137 92 -31 82 260 78 86 -85 -54 -72 20 -167 46 -186 -112 -226 -86 -186 -242 -66 36
5275 36 -52 -318 -30 192 243 33 15 71 79 235 209 225 84 55 54 89 -283 -331 49 -165 -74 97 0 128 193 307
5301 307 130 22 -128 184 88 -275 -70 142 128 140 -177 120 -15 77 117 38 15 -144 42 -155 -290 -176
5323 -176 49 128 52 -117 -33 -42 145 46 -223 -38 -126 217 164 -121 -270 -41 6 400 47 143 -7 -40 -143 54
5347 54 34 -227 -132 -60 9 -238 24 121 66 54 25 182 96 114 -240 -240 -205 45 -97 5 -172 -282 13 -115 -20
5372 -20 -110 13 -219 -304 79 -154 -63 -110 -282 260 -163 16 356 -47 -49 94 -207 -148 -118 -48 -142 -41 -55 -6
5396 -6 -287 98 -24 -160 166 23 -5 -40 108 -102 65 282 -3 66 -236 62 67 -30 116 -64 126 144 -167
5419 -167 117 -225 -146 -43 -79 28 -209 410 113 -158 73 -85 -23 156 -100 20 -8 -1 -123 -4 25 228
5441 228 -72 -349 40 -301 85 -118 -260 5 62 -126 122 -365 89 -84 -36 -117 -12 151 159 50 211 -209
5463 -209 -37 -54 -169 84 62 182 -183 7 9 -29 -100 -182 -49 116 39 -90 -197 6 -57 -51 70 193 123 134
5487 134 213 144 307 -17 -167 92 -152 140 -95 -249 -220 200 -95 27 46 -137 -146 -15 28 -71 -177 167 119
5510 119 -156 212 -29 13 -63 53 -63 89 -11 -291 -310 -160 169 37 191 136 203 -50 10 -72 -34 133 -47
5533 -47 5 -8 -109 -331 -55 147 201 41 52 74 -176 -23 72 -118 4 -52 -64 278 -40 78 -90 120 127 -167
5557 -167 -47 -48 246 -25 -193 61 -131 86 -255 331 -181 93 60 32 195 -72 5 -3 56 -72 -95 -97 28 103
5581 103 43 159 -171 -95 -4 55 29 59 -42 -28 -8 -7 -46 128 -39 57 133 169 31 -18 -57 -70 164 100 265 43
5607 43 196 -94 -68 -40 30 89 76 76 -13 161 99 -270 -160 -127 -72 102 284 -259 7 318 59 -9 -242 327
5631 327 188 24 161 78 86 44 180 -59 -42 -188 184 136 -103 55 -235 9 -338 -27 -198 -70 -31 56 -76
5654 -76 -127 -110 84 -120 36 264 -91 -302 -58 44 -25 74 -57 -99 -95 42 71 -125 -245 67 27 236 -109
5677 -109 166 82 115 -46 -123 -92 -51 73 2 80 -58 -69 -416 186 -119 138 -103 152 -108 -35 -154 83 226
5700 226 -71 -153 -151 -86 -20 -93 -111 82 14 -55 95 256 77 33 -9 -137 -88 -191 -161 -31 -316 -171 33 -162
5724 -162 -241 -116 -217 21 -173 133 -154 -7 -292 224 32 -137 43 -15 97 -358 -141 234 31 116 153
5745 153 -85 63 -30 13 61 -20 -225 -58 -105 -82 -166 93 185 -188 -55 285 17 200 -83 7 -143 -9 -71
5768 -71 29 -112 -82 0 49 40 214 -92 35 21 -135 153 150 159 -73 -23 78 31 -233 -20 194 -125 -354 215
5792 215 158 33 -13 -218 93 -328 -215 -102 197 -60 21 -83 154 285 99 10 227 -29 88 149 -4 -286
5814 -286 -122 197 80 106 -6 186 -114 14 121 -43 -52 -110 40 105 113 270 -53 -132 -74 361 61 202 -90
5837 -90 -53 57 24 329 69 -90 -61 -21 -117 -358 -298 -218 -34 104 -89 13 3 -29 110 128 -18 73 40 79 41
5862 41 203 -246 114 -146 101 63 92 -161 -60 -69 -94 -174 109 -26 108 -71 126 229 20 148 14 410
5884 410 61 9 198 -17 -146 -103 87 -108 88 -149 117 -157 -118 -163 -38 -176 -78 82 -187 -56 -10 93
5906 93 155 -91 63 -9 135 -161 47 -266 -74 66 140 303 15 74 23 -206 232 153 164 -35 -45 133 62
5929 62 21 231 -2 78 -305 -14 1 173 221 109 -174 208 198 -164 -325 -9 -51 218 -4 11 139 -65 -277
5952 -277 -30 35 3 27 -193 -51 111 96 -40 -194 -5 46 162 63 96 97 58 -42 -255 187 -90 -178 -12 87
5976 87 134 -10 233 91 148 133 270 39 162 -119 -58 -61 -256 -118 25 14 -113 251 -172 65 -57 -25 -115
5999 -115 -107 -16 -62 -85 55 65 20 73 -34 -45 -47 56 48 153 20 105 -5 -114 -434 -100 -88 -172 -78 -90 -114 -305
6025 -305 87 -153 58 -145 -164 12 289 108 -117 -168 36 235 -142 50 -156 -105 18 -189 -135 -139 -60 205
6047 205 -40 -136 -39 -92 -182 85 -207 -205 81 -293 154 -31 119 -18 166 15 235 106 198 163 94 12 -109
6070 -109 94 -106 -231 -16 195 102 121 166 -154 58 -143 1 -143 125 122 128 255 160 151 -99 -88 -21 -212 4
6094 4 -256 -64 -109 -334 -232 5 -10 40 -105 129 47 95 -70 103 97 64 -192 1 75 140 105 108 -8 46 46 0
6120 0 -92 125 -355 173 276 -327 -85 -133 -173 -231 -160 -1 -196 111 -112 -162 56 -77 -123 -173 158 -87 118
6143 118 123 -20 72 -28 -178 170 -196 -15 -94 -31 -15 -43 -183 70 4 125 -50 105 137 130 -256 -124 108 -153
6167 -153 82 -272 -118 -143 187 -222 75 -227 51 -260 -46 4 -170 90 -147 -249 201 155 -64 -38 -242
6188 -242 -99 28 243 -323 -333 -40 -88 -206 -134 71 -181 -119 48 260 142 -243 -60 159 166 -35 -90 129
6210 129 -27 -245 -69 -12 -137 36 -299 -33 -118 -194 -69 -93 -141 -265 -8 3 -53 128 67 167 376 198 194
6233 194 -49 19 219 -190 -47 53 57 5 33 193 -60 73 -63 -57 -53 159 191 -112 -117 -35 -87 191 100 52 21 86
6259 86 42 22 -2 -143 -261 45 -155 74 194 137 122 100 -304 27 -63 153 -76 -169 84 -321 -182 14 -260
6282 -260 -78 -219 21 -157 -15 358 -131 129 0 -167 12 -222 97 11 -260 -126 33 29 43 199 180 49
6304 49 -61 193 -83 -75 356 176 -198 5 282 -33 -16 -199 -298 -59 190 -181 -135 -40 -28 -130 -23 -168 -195
6327 -195 31 174 51 -36 29 14 -210 174 -71 -20 -73 -194 -27 69 47 -234 79 -241 -181 -59 -83 -135 -253
6350 -253 152 -95 -8 1 -83 277 21 30 121 100 207 -126 258 -46 0 47 -94 374 59 -111 -74 -44 -282 -76
6374 -76 -29 -326 215 -174 -31 -5 -13 -200 -268 -21 -260 0 290 272 65 -72 56 -134 -146 -107 -296 -5 -317
6397 -317 -344 65 47 -335 92 125 95 0 205 119 7 -190 106 148 -74 279 -207 152 -42 176 119 -215 -145
6420 -145 -137 -163 163 -78 50 27 -180 171 -177 26 29 154 -3 46 224 -202 144 -188 122 134 51 189 -90
6443 -90 -12 39 -387 -46 -237 -5 90 -67 -42 -134 84 -51 -87 -88 252 119 249 196 238 3 61 150 136 -48 -262
6468 -262 -6 -78 -205 13 139 -57 83 153 205 104 -179 -178 -131 154 155 -180 -24 -160 -79 22 60 160 -148
6491 -148 47 47 -29 -74 165 -34 -36 103 -280 123 -82 83 -88 59 -189 19 181 181 8 -40 -79 -192 66
6514 66 16 -60 140 -5 -140 -42 -165 76 -142 11 32 24 -320 -169 -117 133 -3 11 -23 93 -94 3 221 313
6538 313 -91 -100 27 -186 -76 31 11 -152 -153 35 184 -229 -79 -332 57 257 -28 -78 110 97 212 240 -106
6561 -106 315 -20 77 -74 126 129 -204 112 -35 149 42 -74 -52 312 -120 -30 -12 -145 -66 108 165 -31 221
6584 221 -67 -256 -62 -109 63 57 -321 -46 -7 -62 123 -52 -169 -85 -106 76 -114 10 9 -70 -22 -59 129 10
6608 10 119 -56 244 -91 -87 40 -127 -80 -38 179 -220 93 -123 80 40 -299 -82 31 -23 -139 176 -126
6630 -126 -11 -40 -25 205 268 39 -20 32 -13 -151 -110 1 130 -13 -12 -17 87 7 -152 -119 -25 150 -18 150 208
6655 208 84 162 45 264 62 -84 -126 232 -198 60 -142 38 274 112 38 140 -169 -67 -120 -185 -68 147
6677 147 -10 -152 185 189 -121 -90 242 -36 135 40 21 -134 -85 49 -134 4 -176 -7 61 -150 45 45 87
6700 87 -257 219 -165 17 85 -21 -58 74 381 -18 35 -262 103 52 90 -75 -85 -182 132 210 -23 -47 -240
6723 -240 -224 -44 207 57 45 25 -73 -5 350 21 168 -143 -20 -48 26 122 51 -213 -82 67 -157 190 160
6746 160 -148 -392 117 -1 -158 227 20 216 -7 2 -48 -36 199 -289 -69 256 -106 4 12 -5 11 -361 -152
6769 -152 -130 63 -231 15 -68 120 197 6 37 208 28 209 -42 -38 71 150 79 356 -11 80 168 -80 -127 -114
6793 -114 -121 -135 -48 -149 -61 -134 67 34 -23 43 141 81 185 -241 30 12 15 -51 179 314 -181 -228 -109 -227 18
6818 18 -55 40 -185 116 -44 -51 -141 -113 -164 171 194 -76 295 -58 56 -177 90 80 255 -35 259 86 -166
6841 -166 94 -28 224 128 99 202 18 30 113 -9 -53 -43 116 85 96 138 -128 -194 251 -213 235 -15 -77 77
6865 77 -200 -111 304 -70 -202 77 17 -94 -153 43 140 -62 -36 137 -56 -229 -197 2 62 -267 -199 -165 -75 -10
6889 -10 -116 216 196 -47 -41 -117 91 -10 157 -215 -38 24 176 -72 3 -213 -184 262 183 143 101 -148 -18 -215
6913 -215 270 -55 -91 152 -128 -239 -66 -58 -86 28 -90 -65 105 195 -175 179 -322 -102 -20 118 158 187 -125
6936 -125 -175 -163 -56 121 -32 266 -273 48 88 -12 -81 105 131 -4 233 85 130 -12 32 234 157 134 119
6959 119 63 -188 15 112 102 116 -39 127 180 172 2 38 -55 101 14 -26 -153 27 -95 273 -26 54 -130 -160
6983 -160 32 87 187 -141 -156 -44 -38 -52 54 -157 -386 177 132 -125 -45 -223 -42 57 -84 65 53 237 272
7006 272 95 -144 27 -59 305 -37 -266 176 -314 -81 285 177 138 -121 76 9 136 170 50 -91 -139 -160
7028 -160 197 190 124 293 210 53 -47 78 -273 142 178 146 -233 90 -78 -148 -162 -52 -251 117 37 -275 30
7051 30 67 -13 -4 228 62 115 -57 71 142 98 219 61 49 -11 -123 -227 -344 216 55 -88 -69 41 20 -216
7075 -216 -1 -22 -57 -279 -110 172 110 -152 -81 58 -100 -9 -172 -144 -127 90 -33 -100 -27 -83 -243 104 -235
7098 -235 -126 -175 -264 378 -149 6 -42 -203 65 -304 -189 77 254 -91 -79 -105 -8 106 -36 -231 -92 104
7120 104 90 -161 30 -157 -184 44 -60 -65 -34 37 -117 196 -49 -93 83 -24 65 33 62 -77 171 -217 -33
7143 -33 10 157 -64 -169 -44 157 -361 -247 -193 210 57 14 -124 210 -15 49 137 92 -237 -134 128 -125
7165 -125 86 24 106 -134 140 -42 -141 310 151 80 69 -93 243 72 281 209 -68 -11 59 247 106 2 153
7188 153 54 -25 141 -67 46 -109 -195 30 29 27 -56 169 -46 -121 29 -72 34 236 69 -82 -88 281 -65 144
7212 144 -22 -76 206 76 148 -46 21 -161 -96 -131 -45 -59 149 161 132 -155 -21 237 223 182 209 271 -310 131
7236 131 102 29 -163 169 -9 -42 -20 242 -21 -209 226 109 182 22 210 167 3 201 195 198 -91 87 28 16
7260 16 -110 -139 -15 88 -5 -208 -169 58 128 -188 32 -80 -74 -115 -16 56 -136 64 -12 4 42 -69 -8 -42 280
7285 280 164 150 2 32 -5 2 34 -33 -195 -41 -92 -260 -105 -133 -16 -189 22 35 -8 -67 -116 117 -247 221
7309 221 -94 226 38 173 -214 -110 -160 82 339 -234 304 97 82 -190 -121 -35 280 -82 71 8 124 69
7331 69 -156 169 117 11 88 -184 22 29 -185 67 -11 148 -169 -172 -141 149 151 36 -33 18 -237 -146 -17 58 65 241
7357 241 32 25 -206 -36 173 199 -69 -393 11 -14 -358 -83 -89 80 -188 72 190 182 8 -16 28 114 438 -30
7381 -30 66 79 128 -97 -349 -155 79 90 59 -303 65 -137 -107 -256 -305 -11 196 62 -122 -49 -197 18 29
7404 29 153 17 132 -5 293 19 77 41 -36 -29 -7 -139 63 -118 -45 -106 -47 16 14 74 -177 -124 225 55 57 -154
7430 -154 11 277 155 41 -53 132 75 -183 57 -137 144 171 84 -67 -267 200 -118 -131 -128 102 31 -426 190
7453 190 -201 87 150 -123 41 10 164 124 -27 -256 267 127 -24 -14 94 85 49 -135 203 176 -108 220 82
7476 82 217 -59 -121 -183 205 50 285 74 -45 -208 -22 -137 34 247 -47 128 -114 -55 -72 -29 -24 -144 -87
7499 -87 -392 261 28 13 -92 -146 -17 166 229 67 238 -138 -151 29 66 -323 -219 -12 -87 -283 129 -147
7521 -147 45 177 -99 199 137 135 134 98 152 -122 102 1 74 93 -182 -401 108 62 123 38 43 -172 37 -221 -158
7546 -158 -365 -67 -141 -25 63 -74 14 193 256 -116 274 344 149 -10 -74 -67 -50 147 -177 11 -116 193 -219
7569 -219 -141 196 -235 -58 -112 -138 -89 256 228 115 6 184 9 -221 -130 -106 -113 -22 -66 86 86 -72 -170 1 -171
7594 -171 -20 50 57 -31 -71 37 -259 -28 183 196 140 150 244 -88 -69 -12 144 352 -152 137 14 2 -245 -46
7618 -46 -101 -80 -113 -8 72 -103 273 -186 101 138 -78 -147 202 104 120 180 148 215 26 -17 87 7 25 -151 79
7643 79 281 -53 -54 125 -43 -87 -296 -216 167 -66 160 56 17 24 -28 22 -16 23 152 -457 -84 322 -139 -247
7667 -247 -245 -160 69 -84 -114 -319 -106 -114 -56 72 -144 167 280 226 106 -246 44 -149 217 -12 -90 56 139
7690 139 -141 246 99 87 -117 -14 -60 83 -100 7 40 -116 -4 -413 27 -4 112 -208 86 55 -139 -91
7712 -91 100 96 91 -80 93 26 24 -155 90 -241 -258 -58 -15 -152 48 53 -177 215 19 129 201 11 159 -156
7736 -156 -157 2 -68 61 84 -15 -298 -5 -74 -239 -109 -92 -50 101 10 -10 119 228 -72 -164 139 -179 82 184
7760 184 124 -14 -39 42 -143 176 -320 -38 -182 -45 -131 -161 -59 -333 -137 -76 252 64 177 69 52 325
7782 325 -59 211 -2 -234 151 -289 -61 -18 158 -82 101 177 58 -157 -101 -116 79 -286 -123 -235 -279 -15
7804 -15 217 292 200 -113 378 173 66 155 -85 -133 49 -71 111 -78 -150 178 59 56 -19 -157 137 75 -2 -230
7828 -230 82 113 115 -141 -36 53 -12 -161 202 147 59 -69 108 -57 -24 -128 1 14 19 22 -88 324 30 47 -233
7853 -233 -30 251 -3 -48 106 80 -19 147 -40 119 194 -23 35 -4 -142 -104 -68 82 -126 -15 -143 284 -196
7876 -196 36 106 -218 133 -248 56 33 -86 -92 92 125 3 -46 -20 -146 -365 -56 123 -59 105 -69 -180
7898 -180 77 10 -110 -22 -118 351 235 -96 43 -8 129 -10 47 -206 5 136 18 -127 -198 22 82 -137
7920 -137 49 -87 -326 -119 -194 -4 144 -225 21 24 177 215 109 137 -248 60 81 2 -63 55 281 -154 -57
7943 -57 254 -93 182 -102 -252 -67 195 283 13 -225 59 80 76 389 299 5 125 -77 170 -111 -59 -104 99
7966 99 54 -80 -212 -82 35 168 -291 114 199 -234 -295 -123 144 -210 144 17 -203 -50 57 65 201 -70
7988 -70 -100 -47 -111 130 -50 -107 48 -25 -16 296 -169 -30 47 -73 208 -242 -52 204 -107 -107 -61 -63 -33 -39 -76 -14
8014 -14 7 24 152 111 -84 -273 -23 -122 78 209 -150 -78 -310 -20 42 30 -33 46 -15 -54 -310 11 -81 -8 63
8039 63 -187 37 -81 7 -25 62 -50 145 -50 -152 84 -34 -208 120 -88 191 53 246 374 61 33 182
8061 182 -12 -187 -143 171 114 -209 -104 113 -171 15 -12 -115 -149 0 -56 39 37 -40 285 132 31 171 216
8084 216 -76 15 -16 -273 -11 -86 -276 -295 -52 -209 -34 253 -121 129 129 -320 331 54 -186 -83 196 143
8106 143 7 -131 -222 3 77 -25 -156 25 152 -119 -32 -90 15 -76 -99 -45 -211 -91 -10 -3 -44 212 208 117 -23
8131 -23 101 -125 184 -152 -51 95 0 -174 243 -109 57 20 -195 94 80 -70 -47 -49 -44 -38 -208 158 173 -21
8155 -21 116 -69 -245 -40 13 -46 101 -99 -64 -204 -61 -110 95 23 8 335 -147 34 26 -57 89 -163 64
8178 64 -41 -191 69 140 114 94 -89 -76 122 -159 68 -24 -212
8191b12
$$ Imaginary data points
##PAGE= N=2
##DATA TABLE= (X++(I..I)), XYDATA
0 0 0 0 0 0 0 0 0 0 0 0 0 -8 8 -8 8 -8 16 -16 24 -24 32 -36 44 -48 60 -71 80 -95 108 -124 141 -162 183 -207
34 -207 234 -264 295 -331 371 -413 461 -509 565 -626 694 -766 845 -932 1026 -1131 1244 -1374
52 -1374 1514 -1671 1845 -2045 2270 -2530 2835 -3193 3626 -4157 4831 -5718 6942 -8748 11692
67 11692 -17332 32144 -159457 -368743 -133877 90362 309873 430853 481719 372920 207827
78 207827 68452 20354 -27825 -88409 -134853 -141229 -175644 -191427 -140225 -68062 -67703 -85464
90 -85464 -57886 11135 63756 88622 89405 68604 18668 1809 62064 131454 121992 74397 43890
103 43890 16623 -20685 -44650 -60942 -91210 -131718 -142339 -101433 -48539 -26045 -4407 34957
115 34957 49743 39539 57932 99854 119382 105482 69765 16049 -45609 -93492 -95661 -57085
127 -57085 -34130 -46624 -49825 -29212 -7418 21133 54890 64243 44644 21524 10440 9336 -3127
140 -3127 -31135 -40270 -20063 -1888 9464 22507 18244 -5167 -17022 -10916 -5407 -11874 -29444
153 -29444 -36098 -19864 -5154 -1704 12456 33051 46528 63017 73210 52343 14449 -13875
165 -13875 -23399 -20029 -27028 -51789 -66379 -62717 -57851 -44692 -18923 -2433 7885 31108 59397
178 59397 74428 70571 54700 44694 42654 23122 -12242 -37896 -51737 -54867 -35927 -17200 -25622
191 -25622 -43719 -47099 -31437 -5646 10138 10895 15451 24505 28274 38590 49495 36405 13815
204 13815 7788 11934 13894 10199 -3677 -17760 -23115 -30500 -36020 -34605 -37934 -40955 -25831 -8054
218 -8054 -3219 4426 20133 36770 49884 48468 31404 17160 11601 11347 20409 20121 -6387 -36708
232 -36708 -45361 -38124 -23715 -14287 -19316 -22228 -10583 4650 15609 20153 12426 8680 22480 33531
246 33531 26035 8293 -12156 -26174 -24276 -17370 -12354 -951 11455 17513 23943 20298 -2057
259 -2057 -20266 -19995 -10210 1758 7008 551 -1867 6665 9498 6084 -3579 -23102 -32379 -17894
273 -17894 -579 6093 7042 3787 4090 14319 21965 22860 21163 12694 3717 8741 12623 889 -11320
288 -11320 -16926 -20260 -20296 -22562 -32758 -38739 -33248 -19734 3024 23844 29698 35050 46773 47869
302 47869 34933 16187 -5538 -18471 -13482 -3633 -684 -4415 -16299 -21180 -10277 -4951 -16427
315 -16427 -28308 -31808 -24379 -4008 14371 18712 19354 23589 27259 29864 22533 3644 -6046 -908
329 -908 3883 6644 6151 -3783 -12944 -11781 -10636 -14423 -20589 -29833 -29774 -13448 1964 8080 12613 16121
345 16121 19335 28040 28623 13586 -946 -8831 -10738 -3960 1081 -1090 433 4787 3015 -608 -6664
360 -6664 -18479 -22070 -12362 -860 7745 9907 2170 -2358 4130 8042 2287 -7279 -17179 -15170 4288
375 4288 19976 19600 11461 1389 -1262 9113 17460 11286 -549 -11630 -18179 -14009 -7729 -8711
389 -8711 -8161 -4263 -2392 199 1438 -4613 -6464 -38 2050 -1259 -2264 950 12924 28919 29638
404 29638 14850 1145 -6344 -2542 10605 12166 -4961 -22499 -30054 -26484 -13282 -6946 -14680
417 -14680 -21680 -18280 -4774 18541 33611 28082 16895 12109 12067 15118 17719 10487 -754 -9978
431 -9978 -17175 -17212 -9038 -4861 -5248 -4228 -9604 -17477 -16037 -7397 1672 9012 6447 -3576 -6484 247
447 247 13589 29221 29375 11271 -1068 3672 11595 12404 1635 -18354 -29255 -23412 -9257 3447
461 3447 3649 -12374 -22188 -11349 4188 12955 16527 11829 3151 1204 4729 7727 7344 829 -3491
476 -3491 1847 2590 -3123 815 9647 6473 -3977 -12584 -17440 -12623 -1839 8046 11890 3568 -10258
491 -10258 -8386 3533 3520 -5782 -9234 -8848 -3523 12837 26803 22783 1698 -17875 -15008 4685
505 4685 14069 10636 7619 651 -9512 -6119 5435 4073 -7787 -15240 -13280 -7846 -7382 -8265 -3226
520 -3226 -2305 -8754 -4836 8997 13641 14004 22602 26926 15428 -72 -3032 8194 16581 9474 -2916
535 -2916 -10779 -22155 -29324 -23542 -24228 -40461 -45538 -22110 13344 39788 47295 40521 27981 12945
549 12945 5297 14053 17837 2176 -10162 -6064 -4352 -12368 -18059 -19062 -19804 -21627 -20232 -10373 -1831
564 -1831 -1963 2112 13926 13600 2234 3869 17110 25077 25422 22012 13536 1193 -10573 -12521 -7049
579 -7049 -12750 -28187 -27625 -12191 -5110 -6232 -6064 -5655 -2250 11453 31175 43408 35001 10547
593 10547 -6976 -13815 -24683 -32728 -25758 -14424 -6055 6015 18937 20196 12292 6800 12193 18678
607 18678 9448 -7251 -10867 -7931 -10741 -11778 -10385 -15054 -19248 -10520 3905 10909 7132 3778
621 3778 11160 17632 10988 2121 -551 -6284 -9822 286 11028 7625 -1140 -3202 3080 7859 1973
636 1973 -6087 -7351 -11044 -16944 -14979 -12412 -17764 -15403 1502 18432 23922 20419 16692 16103 14064
651 14064 7761 4352 -1570 -14764 -19148 -8167 1216 -552 -3012 -3627 -2578 -1436 -3155 -5906 -8172
666 -8172 -10556 -7957 1973 3440 -4788 -4377 5406 13957 20435 22731 19163 14310 11266 7004 738
681 738 -11787 -26316 -28362 -19680 -15921 -18232 -18106 -13676 -2275 14777 23881 21275 13559 7127 7911
696 7911 13363 12659 5565 240 -3915 -7646 -6758 -6982 -9470 -7468 -2307 -1325 -1923 -5718 -11075 -9506
712 -9506 -881 5289 7383 5453 2385 5870 11700 9104 2567 -322 -2302 5 5699 4560 -5825
727 -5825 -14854 -15912 -8334 3252 8583 6608 4816 1874 1093 6378 7272 -2969 -11289 -10629 -7508
742 -7508 -4830 -2727 -23 3643 4476 1006 -258 305 -163 6030 17202 16788 5249 -2800 -4088 -2574
758 -2574 -1501 -3809 -9392 -13341 -13643 -6284 4377 2302 -9454 -11134 -1271 7524 12176 13291 8187
773 8187 3352 2576 6453 11071 9484 2271 1066 2141 -4125 -10859 -11283 -11480 -13087 -11438 -8702 -7216
789 -7216 -5196 -1312 7369 14601 9787 1091 1222 6306 8677 11949 11986 5315 -592 -1631 100 -364
805 -364 -6639 -12264 -10146 -5807 -6789 -6956 -5426 -6271 -4317 4783 10114 7096 265 -2712 2883 9888
821 9888 8723 4381 2890 1809 3196 8662 7750 -2472 -10809 -11406 -7034 -2845 -3436 -5989 -6248 -5267
837 -5267 -4655 99 3934 877 -752 2044 2874 1983 4583 10148 15363 13093 3039 -6772 -8102 -4530
853 -4530 2105 6940 496 -12397 -16400 -9305 644 6912 3164 -6460 -11639 -9278 -120 11806 13541
868 13541 3600 -2820 -200 5248 10322 11341 5350 -2383 -6868 -6602 -1520 4238 3726 418 -2788
883 -2788 -8679 -11302 -6197 -785 -423 -3310 -7876 -8390 -1116 9792 17260 16382 4481 -8583 -7572
898 -7572 5159 15282 15919 5503 -9129 -14245 -7565 722 3567 -1736 -11045 -13781 -7139 -538
912 -538 3518 4720 353 -4107 -2835 974 5335 9386 9543 6137 3367 -556 -2041 3010 6980 4624
928 4624 -888 -7729 -11598 -7436 -650 203 -3659 -8020 -9795 -2493 7817 10050 5844 -1661 -8219
943 -8219 -6141 3818 10134 9793 5541 448 -198 3475 4282 1838 -202 -2053 -2799 -1308 -2775 -6844
959 -6844 -7884 -7096 -7411 -5963 -3910 -2743 2586 8540 9874 8338 4082 371 1889 6020 5573 2189
975 2189 -1097 -3622 -2139 1947 872 -4552 -6658 -5090 -656 2161 -548 -5547 -6445 -5274 -3242
990 -3242 83 798 -1225 1004 6883 8948 8618 5613 2477 3523 5671 4202 1372 -3018 -7978 -7017
1006 -7017 -2390 -2503 -7114 -9014 -8409 -5351 -1141 733 1231 2618 2195 3173 6470 5867 3141 4925
1022 4925 8555 8888 6779 2759 -2724 -4960 -5502 -5250 -5203 -7916 -10829 -6526 369 173 -3277 -4243 -2939
1039 -2939 897 6399 9167 8458 5928 3739 5299 7408 2858 -3933 -4632 -2122 -552 1355 285
1054 285 -4780 -8326 -8197 -5055 -2512 -3041 -3059 3039 7337 4174 553 -472 -1436 115 4708 6705
1070 6705 4539 1074 -67 1694 2293 -2675 -5312 -2729 -730 760 4317 2994 -3780 -7852 -6338
1085 -6338 -2547 -1331 -3639 -3290 1736 4346 3625 3869 2264 -2614 -2651 3838 7563 6843 4504 2871
1101 2871 1658 -1056 -4636 -4918 -3546 -3924 -1462 2692 -166 -7846 -9701 -6024 -2027 -99 717 1859
1117 1859 4783 6164 7247 8203 4559 -668 1149 6227 5672 1794 -2034 -5748 -6570 -5511 -4746 -4252
1133 -4252 -6185 -7219 -1884 3490 2179 -676 115 1509 2127 3223 3875 3033 3980 5721 6513 5215
1149 5215 268 -2627 -967 652 -1035 -1646 -3441 -7155 -7684 -5390 -4038 -4622 -4809 -3097 1782 5736
1165 5736 5327 4390 4414 4407 6777 9274 6465 1232 -669 -1292 -1414 -1104 -4108 -7568 -8726 -7381 -4443
1182 -4443 -1087 -1169 -2552 -239 2883 4315 5154 4016 1115 1269 3748 3407 2001 65 -720 -61 -408
1199 -408 -2841 -3203 -1353 -455 552 2061 -663 -4029 -2977 274 1490 55 -3485 -4447 -1042 2493
1215 2493 4480 4472 -992 -5607 -2517 4332 6747 5385 2987 -69 -1568 -1470 42 1941 662 -2216
1231 -2216 -1900 -314 -3010 -5248 -4511 -4615 -5242 -3488 -85 2356 4256 4960 5521 5001 1983 1361 6109
1248 6109 8034 2950 -1995 -3744 -4938 -3611 -515 -773 -4750 -9555 -9995 -3124 3263 3327 1447 134
1264 134 -2048 -757 4568 7253 4876 1709 1510 4221 5239 2462 627 1007 -1422 -4020 -2652 -2548
1280 -2548 -5428 -7704 -6971 -6252 -5798 -3254 2118 7479 7451 3633 2357 3384 2424 4295 6109 3350
1296 3350 -2172 -3396 -270 2517 99 -4647 -6627 -5548 -4058 -1005 3382 1429 -3982 -4482 -817
1311 -817 2169 2606 1951 1263 611 238 1658 4760 4448 402 583 3373 2129 -840 -1330 -1352 -3652 -5347
1329 -5347 -5684 -2614 -88 -38 1208 1443 -2590 -4923 -527 4045 4062 1921 404 -179 902 3706 5908
1346 5908 5200 -989 -5239 -1988 2014 1032 -1245 -2398 -3828 -3855 -1875 -297 -423 -2654 -3251 -503
1362 -503 1873 1069 770 3339 2930 1534 2491 3516 2382 1231 1135 152 -1370 -3638 -2823 1355 2452
1379 2452 -870 -3284 -4172 -5014 -3158 451 960 -357 -1612 -580 2884 4602 3015 1954 1833 586
1395 586 1534 3751 2664 -479 -2096 -1331 -732 -1234 -3473 -4289 -2628 -1562 -1552 268 -30 -889 349
1412 349 2047 1634 891 317 1055 2650 2458 733 -526 -489 126 1921 3799 1173 -1879 -2628 -1266
1429 -1266 1 -624 -2565 -3783 -2474 -2336 -1696 -550 -1312 -1444 785 3328 3621 3519 3170 2923 4086
1446 4086 3963 2241 663 -1908 -3520 -2465 -837 -2239 -3676 -3529 -2718 -1943 -1738 -2234 -2078 190 1956
1463 1956 3330 4209 2296 266 1530 2923 2947 2371 1159 -3 361 331 25 -746 -2781 -4307 -3137
1480 -3137 -2407 -3888 -4497 -3598 -1610 914 2663 1931 1768 2239 3008 4204 4688 1993 499 1067 1036 955
1498 955 105 -1581 -3064 -2408 -1802 -2443 -2868 -4507 -4678 -1716 853 1160 1308 1540 1914 3040 3800 2587
1516 2587 2042 2220 1638 1833 1787 -145 -1472 -1549 -2305 -3311 -4193 -5571 -4615 -1208 2452 4207 4124 1949
1534 1949 -511 67 802 569 101 -625 -919 40 921 329 -47 -212 -414 922 2676 2066 714 -167
1552 -167 -1452 -1487 -1780 -2264 -1734 -522 96 -227 -1019 -2285 -2092 126 2757 3083 2087 1148 1161 2117 2107
1571 2107 73 -1542 -2754 -2515 945 3565 3226 893 -1358 -3330 -3644 -2901 -2735 -2495 -2084 -874 566
1588 566 1965 1234 1948 3553 3872 2924 2548 1862 472 695 -161 -1476 -2141 -2739 -2526 -1327 -1268 -3015
1606 -3015 -3272 -2803 -1346 1476 3143 2400 632 -104 587 2144 2824 1342 420 416 639 1141 1375 419
1624 419 -992 -1090 -1166 -1963 -2637 -3539 -3825 -2334 -566 967 2103 1892 1664 1825 2328 681 79 7 751
1643 751 1223 1306 471 -192 -24 -747 -783 -1253 -2352 -1628 522 996 551 -508 -2390 -3083 -1093 709 1658
1662 1658 1512 411 171 1657 2747 2057 1234 41 21 1309 1828 225 -1844 -3298 -4118 -2862 -686
1679 -686 907 896 316 -906 -1261 -154 244 984 2079 1892 447 50 -427 39 942 934 240 -473 -439 684
1699 684 2583 1925 -580 -3051 -3110 -1884 -455 270 -435 -2490 -3186 -1906 977 2931 1958 1055 724
1716 724 1351 2311 3222 2904 1088 46 -909 -502 -612 -1622 -2136 -2311 -3120 -3496 -2302 21 1296 1802
1734 1802 1552 215 -838 -326 1672 3545 2928 797 211 1075 930 1429 1076 -717 -3206 -3233 -1708
1751 -1708 -1080 -1388 -2069 -1792 -261 17 1025 2630 1578 22 222 1067 1319 563 398 751 683 -337
1769 -337 -1169 -644 -872 -1270 -128 952 -159 -570 1021 1271 273 -1695 -2305 -2317 -1539 -1172 792 1607
1787 1607 786 123 2219 3148 1355 221 53 249 -384 -591 -122 -831 -1939 -1545 808 1146 -585 -1166
1805 -1166 -110 -731 -1239 -892 187 71 -88 868 1426 714 -603 -277 1446 1519 736 1435 1976 594
1823 594 486 359 -424 -2138 -3354 -2530 -1083 -1457 -1630 -302 592 706 1429 2379 1519 313 -50 1089
1841 1089 1279 534 -294 315 758 86 191 394 -861 -2261 -1666 -942 -1036 -1785 -1352 -85 863 424 484
1860 484 886 505 717 1344 1816 1099 461 476 794 687 -282 -1311 -1368 -1340 -1266 -595 -71 -477 -866 718 837
1881 837 665 -131 -618 -46 -125 -356 465 673 370 754 1482 1614 789 -9 140 -80 -413 -687 -868 -1025
1901 -1025 -1206 -1221 -62 -136 -1141 -1262 -81 658 458 676 508 928 801 1016 1112 821 -3 -252 361 416
1921 416 -346 -513 -257 -172 -25 -195 -949 -1410 -1501 -948 291 346 -282 -92 360 634 776 542 401 375 594
1942 594 660 1023 646 -180 115 358 -80 -766 -945 -1355 -1321 -1213 -680 -793 -910 -807 30 798 756 645 968
1963 968 1363 1223 1325 834 463 -42 -59 -107 -23 -730 -1654 -1459 -801 -477 -430 -364 -737 -1066 -311 152 320 495
1985 495 463 1205 1923 1753 1375 1092 631 7 -61 -625 -1319 -1560 -1571 -1310 -555 -257 149 218 557 416 136
2006 136 12 -317 66 951 1114 197 -106 -522 -148 293 346 205 63 -289 -76 517 646 119 -617 -921
2026 -921 -762 -446 -59 -365 -338 -166 105 613 1055 547 266 -76 -362 -630 -729 -523 -149 351 780 897 1440
2047 1440 1340 1029 316 -287 -1301 -1649 -1411 -1105 -574 -485 -980 -891 -417 606 1071 1190 1019 780 1128 1116
2067 1116 745 588 -269 -808 -946 -789 -629 -698 -870 -839 -379 252 429 -36 118 -513 -390 -173 -224 490 804
2088 804 831 1125 924 745 737 760 314 -357 -1369 -1693 -1531 -1126 -583 -332 -576 -298 282 749 1178 1089 512
2109 512 345 362 711 424 363 -148 -757 -606 -153 -100 71 -31 201 -121 -135 214 -68 -323 -427 -835 -597
2130 -597 -431 -215 205 575 783 540 578 426 496 680 182 -452 -769 -684 -563 -140 56 -96 -29 131 402
2151 402 199 -109 -477 -497 -314 -282 171 179 -204 -496 -366 -104 565 674 335 190 427 191 -105 -129 -236 -357
2173 -357 -364 -579 -664 -278 -397 -79 173 46 -205 -102 254 138 -179 207 -375 -75 148 472 911 394 218
2194 218 152 141 -8 -55 -371 -678 -615 -511 -409 -565 -575 -354 -131 315 274 686 866 704 582 762 486 285
2216 285 -40 -76 6 -414 -571 -600 -474 -81 -385 -217 316 -15 -60 -8 182 127 -16 178 458 234 596 386
2238 386 89 -88 -150 -48 -49 -185 -199 -290 -499 -377 -336 47 -372 -53 -258 237 13 4 289 259 112 -67 -180
2261 -180 -121 -105 -4 234 308 267 55 543 253 394 -139 -133 -427 -429 -485 -395 -229 -732 -387 182 342 103 -20
2284 -20 225 237 71 225 273 275 -31 -185 15 -8 -442 -316 -213 -111 -400 -173 -229 -303 204 128 153 -181 -1
2307 -1 -318 24 -155 -57 -17 420 -109 11 144 234 13 -296 -167 -176 152 -72 -297 -219 -4 53 -297 125 -141
2330 -141 -474 183 56 -184 84 206 492 271 167 119 94 6 -41 134 252 -180 -14 -64 -365 -20 -83 201
2352 201 148 -130 106 23 148 -243 106 94 130 40 50 173 -103 75 -78 -148 -55 62 -243 104 -81 -259 -131
2375 -131 -76 196 41 40 -32 -20 -40 20 95 99 -154 47 -27 -16 -81 -116 19 172 -221 145 -167 -354 121 -88 -179
2400 -179 -268 -282 -26 108 -60 208 232 113 -109 253 210 -10 107 0 204 -50 -118 -195 44 -166 168 -127
2422 -127 -37 11 -194 -245 -130 125 143 -195 253 382 39 -100 65 41 244 173 -217 104 -87 -136 -167 -32 -181
2445 -181 -183 -187 -130 -288 404 260 -15 -49 -107 29 1 239 176 -159 -121 139 177 -95 -118 -182 -35 -189 81 83 -55
2470 -55 113 364 -93 147 -48 267 59 183 43 302 -68 -46 161 -16 8 -177 -106 -199 -131 69 -10 -230
2492 -230 125 273 43 142 -147 -3 -191 183 -219 115 -30 95 -2 143 20 -102 -168 -13 -129 -180 -112 -28
2514 -28 -75 214 -84 -164 -143 94 206 -222 169 -211 125 80 71 246 22 48 85 -165 13 155 161 4 -155 -177
2538 -177 -169 -152 -200 -82 7 61 55 236 278 70 196 139 302 135 105 73 196 238 -7 14 -178 -41 -34 47 -44 -164
2564 -164 -291 -8 7 32 -167 9 -56 27 103 412 118 -60 44 -149 -99 -73 205 133 -13 -53 -227 -226 142 -59
2588 -59 -84 -98 227 -210 86 75 -158 75 -342 45 22 95 99 83 -93 150 -68 29 285 47 59 -293 -122 11
2612 11 23 -4 -95 143 14 95 166 161 -163 -47 -66 -270 -118 70 -95 187 27 110 74 -327 407 34 190 -92
2636 -92 -269 -187 -131 -37 -333 -425 -291 31 65 389 125 -54 -22 -24 41 81 275 15 34 237 -112 -66 -250 -157 -280
2661 -280 -21 349 49 -249 -302 -170 -221 344 -52 -8 190 138 498 207 160 210 183 -124 139 -73 -159 -493 -111
2684 -111 -307 4 51 -205 -16 9 -8 159 131 -102 -309 93 35 206 114 212 83 237 366 243 2 -63 108
2707 108 -141 -197 -216 -135 128 -77 117 -28 72 271 42 199 34 -46 161 60 7 356 123 -353 -129 -163
2729 -163 210 4 -209 135 -265 -215 -25 -199 -42 -20 -8 55 -95 77 -25 119 74 -266 15 -25 93 176
2751 176 144 106 177 102 -6 -126 -24 -207 -283 -74 -443 -83 -146 -198 -65 -207 -9 -40 271 394 173 36 491
2774 491 321 38 377 -133 238 -88 -223 -87 -385 -319 -241 -134 -119 -112 -208 120 -185 16 289 89 -48 63
2796 63 -54 376 97 15 228 -42 88 52 230 79 58 91 102 -215 -56 -45 -240 -343 -297 -339 -38 -67 -115 71
2820 71 199 559 87 222 332 407 169 -123 36 -52 285 54 -267 -500 -191 -455 107 329 -257 -136 -64
2841 -64 -84 -236 416 561 85 166 148 274 35 234 99 236 -232 -261 -257 -279 56 -412 -84 -319 -384 48 72
2864 72 30 68 -20 -117 -28 -22 47 272 98 -164 -94 -1 206 423 173 -38 -191 -185 -99 -277 -357 -506 -188 -449 -20
2889 -20 315 91 272 14 20 179 114 71 309 418 100 -275 -90 -90 216 -34 -156 -261 -125 -89 41 102 -94
2912 -94 -233 -250 -74 -159 -52 140 -91 -76 172 237 498 439 402 117 54 71 -1 -227 -509 -264 -48 122 -203
2935 -203 34 -37 18 -175 -44 -32 -105 -185 -284 88 97 -24 -69 346 185 302 51 579 92 173 171 -235 -115 -379
2959 -379 -370 -213 -169 -234 101 103 -184 385 106 30 14 -24 176 146 231 -303 -113 114 161 265 206 347 67 199
2983 199 -80 -420 -640 -411 -305 -457 -414 -312 15 256 547 790 722 250 149 150 457 -192 -21 -233 -428
3004 -428 -309 -157 -142 -32 -215 -389 -106 101 -240 -104 -47 -43 -42 155 2 190 332 207 465 -54 102 291
3026 291 289 55 -88 -86 -402 -338 -179 -93 -180 -4 -263 -124 328 155 -105 -65 -20 9 130 305 84 57 136 131 407
3051 407 -46 330 201 -27 -144 -351 -7 -432 -186 -301 -349 -196 -378 -351 -45 5 -21 91 361 110 454
3072 454 197 508 348 -136 148 352 -292 -263 -199 -232 -579 -561 -265 62 -221 -347 56 156 363 14 182
3093 182 263 0 5 441 462 275 -340 362 148 -108 -239 -378 -78 -133 106 -277 -304 -297 -665 36 -96 -131 340
3116 340 291 314 335 301 618 547 527 406 29 -82 -459 -322 162 -142 -235 -43 -421 -22 -293 -298 38 -60 -281
3139 -281 -113 440 453 178 19 242 122 125 407 216 186 -38 -214 -138 -149 -242 -479 -211 -38 -165 129 123 -173
3162 -173 -275 2 -88 -18 -121 78 479 -49 -78 -43 314 175 653 527 823 387 -180 -81 -259 -104 -606 -504
3184 -504 -288 -490 -243 -365 -215 -1 -167 148 715 406 332 241 67 158 36 144 308 -7 69 -213 -241 -302
3206 -302 -318 -317 -362 -408 -295 -126 -28 -313 3 201 83 441 142 417 105 390 197 263 263 226 79 177 -370 -223
3230 -223 -231 -129 -230 -491 -311 -76 81 224 44 107 -134 -110 41 391 442 230 212 41 337 149 -30 -226
3252 -226 74 -50 -344 -179 -239 -685 -347 -299 -196 -327 72 52 33 4 -183 15 100 117 899 418 252 70
3274 70 -369 29 381 14 -337 -275 -576 -129 -63 -177 50 -165 -455 -301 238 21 -25 -33 134 -45 790 471
3296 471 303 -36 -80 125 -199 130 35 -400 -374 -605 -395 -50 180 -428 -215 -96 -713 -647 15 317 246 53
3318 53 194 196 -158 582 431 520 189 -99 -410 45 -59 -183 -228 -536 -335 -185 -221 -438 -24 -451 -168 69
3340 69 172 271 349 228 -178 148 264 193 255 176 216 -184 -182 -333 -136 -143 -294 -219 -367 -445 -126 306 51 139 29
3365 29 -202 97 330 78 194 -172 169 375 351 163 187 190 -46 -231 -245 -426 -428 -444 -499 -223 -226 -351 -220 234
3389 234 38 33 569 285 495 733 554 264 285 118 18 -152 -259 -225 -168 -134 -329 -265 -68 -50 -139 11 -232
3412 -232 151 165 161 -103 248 167 106 274 532 37 200 31 473 -99 -339 -378 -132 -25 -508 -310 -226 -446
3434 -446 -391 -328 10 604 28 349 7 -129 2 63 166 66 275 0 -49 128 257 -118 -304 -211 -248 -53
3456 -53 -238 -376 -159 -234 -602 -411 24 235 15 202 -175 464 51 489 605 392 200 -108 85 -23 -460
3477 -460 -416 175 -439 -124 118 -177 85 -154 -156 -514 -542 -136 -105 216 231 210 435 534 438 544 539 338 -236 -56
3501 -56 -82 -239 -284 -436 -345 -245 -654 25 191 -324 -435 -263 157 413 -3 568 624 394 113 214 379 -29
3523 -29 83 -52 -74 -98 -83 3 -274 -265 -663 -617 -162 -368 -243 420 238 -345 172 482 342 389 466 258 71
3546 71 -194 -217 117 41 -279 -212 -35 77 -385 -279 -277 -314 -388 -337 315 154 55 169 173 16 -371 138 509 424
3570 424 104 247 20 219 153 -12 331 28 -185 -322 14 -262 -256 -177 -129 -401 36 -81 -129 -355 -84 255
3592 255 291 -66 590 325 410 392 379 387 -5 -116 -41 -190 -158 -354 -424 -66 -268 -269 -88 -40 33 163 -94 159
3616 159 456 597 632 527 201 84 -9 330 121 -351 -97 -592 -489 -334 -360 -316 -239 -257 -190 -165 86 415 109
3639 109 365 126 453 268 550 415 388 -86 64 -8 104 42 24 -23 -507 -47 -198 -120 -187 9 -108 -201 66
3662 66 -125 167 106 -164 49 -114 25 424 517 307 131 -69 -311 -227 6 -174 -151 -118 -637 -562 -119 -337
3684 -337 -231 -72 -39 118 -221 253 391 265 247 122 624 393 467 -103 186 -245 -362 33 -281 149 -227
3705 -227 -98 -189 -644 -230 -33 -133 -361 -195 -51 486 220 532 467 93 79 194 461 235 201 -18 5 -400
3727 -400 -454 102 -56 -291 -282 -404 -289 -220 -55 -76 -142 -16 185 367 335 505 225 88 135 279 235 -54 -52 -211
3751 -211 -574 -613 -176 -322 -208 -273 -524 -194 -285 -3 311 502 75 -63 51 159 452 295 -49 46 -40 238
3773 238 261 170 -72 -372 -377 -386 -640 -403 -164 -188 -224 74 354 236 324 102 230 46 129 177 444 169 11 305
3797 305 55 18 285 43 -144 -1 -83 -51 -140 -35 -142 -448 -64 -334 110 -125 -50 168 308 289 359 584
3819 584 172 303 66 159 60 -40 209 -323 -303 -184 -309 -76 -176 -324 -316 -267 -349 -92 -38 318 329 238 255 327
3843 327 226 211 240 413 239 57 134 84 -289 -125 -464 -395 -419 -376 -461 -267 -338 -515 -117 23 131 668 460
3866 460 141 320 638 212 59 -75 291 -174 -206 -270 -137 -252 -430 -145 -191 -498 -290 61 69 53 100 165 262
3889 262 300 226 184 537 243 145 190 91 -116 -186 -75 -437 -126 -363 -501 -336 -327 -43 99 244 -279 336 256
3912 256 -113 95 193 25 -189 352 -59 52 47 177 -57 67 -396 -87 134 -199 -352 -41 -79 -207 -131 -221
3934 -221 -176 195 -114 -57 -136 243 419 197 407 184 55 87 47 253 216 -37 204 -111 64 3 -125 -539
3956 -539 -284 -113 -50 -380 14 -86 -155 76 234 519 383 247 352 205 15 244 522 376 -128 -226 -17
3977 -17 -286 -418 -169 -400 -214 -232 -462 -166 168 49 20 120 -464 -19 147 450 302 385 31 91 -297 -79
3999 -79 108 -30 -293 -751 -499 -348 -199 -58 36 22 -293 198 308 191 134 -31 244 234 262 351 396 120 -37
4022 -37 -176 -216 -242 83 -447 -317 -141 -467 -144 -111 -106 12 -171 91 11 476 344 280 100 171 1 70 -32
4045 -32 187 -90 267 -124 -490 15 158 -268 37 152 181 -63 -433 -131 -53 -9 115 117 23 -39 190 124 134
4068 134 154 311 112 81 6 -145 373 -114 -371 -313 -171 -308 -147 30 -51 -133 -89 -256 171 31 585 412
4090 412 447 57 203 377 98 303 170 -119 -307 -289 -322 -329 -297 -591 -776 -372 26 254 -54 145 5 -237
4112 -237 -285 16 -97 480 290 215 182 39 128 32 108 -22 -170 -186 -292 -381 -142 -46 -366 -106 -130 197 141 80
4136 80 410 -34 207 138 208 193 63 183 68 19 127 -333 108 17 -72 28 -60 69 -216 -232 -340 -210 -280
4159 -280 -133 157 -15 250 -25 169 197 331 49 219 75 -199 -114 -63 377 18 28 -73 -51 -162 -346 -266
4181 -266 -64 -98 -66 -73 112 -51 6 -353 235 195 197 256 53 262 356 187 -42 -53 -253 -261 78 -101 -106 176 -24
4206 -24 -48 -188 -37 -147 39 312 137 373 -11 -96 160 125 245 236 357 178 -80 59 -108 -215 -92 154
4228 154 -167 -183 -62 -83 97 -3 -282 -155 314 234 193 229 99 228 83 415 32 78 100 -306 143 -44
4250 -44 73 -197 -460 -255 170 -408 -271 -555 -177 -94 -31 186 46 283 328 292 -140 431 33 194 -178 57
4272 57 -100 65 -281 -227 -251 -234 -101 -148 -268 -297 -140 -47 70 -151 -264 262 371 211 263 229 299 112 328
4295 328 50 272 -42 -14 -187 41 107 -103 55 -432 -204 -283 -52 -208 -53 129 128 -149 329 405 228 304
4317 304 63 240 285 116 182 42 50 -194 -228 -173 -78 -163 -114 -169 -23 144 195 108 190 37 -183 168 230 69 148
4342 148 -151 285 -148 -99 -99 129 -4 -199 -163 59 -317 -267 79 -325 -173 -242 -28 -37 -92 284 308 266 273 168
4366 168 393 218 -132 -289 -74 98 83 -218 60 -137 -379 -261 -227 1 84 262 -232 -269 -131 56 413
4387 413 178 -2 310 382 167 208 123 -9 46 245 -107 46 128 -181 -56 -252 -407 -313 67 173 -96 -290
4409 -290 -107 -81 226 205 249 89 27 41 361 86 146 317 -59 -42 -58 -315 -73 -161 -180 -222 -193 -98 -93 -326 44
4434 44 -79 95 196 58 95 12 482 110 30 -56 196 77 -67 -331 27 45 -264 -159 -89 8 -118 -89 -303
4457 -303 -255 -14 53 -245 15 124 238 383 243 21 294 239 206 -186 79 -13 -143 -134 40 -240 -173 -198 -120
4480 -120 -184 -230 -14 92 213 -9 42 257 -94 208 48 157 211 188 162 59 -53 -337 -403 -109 -268 -183 -5
4503 -5 13 -127 -288 179 -32 52 306 10 40 62 39 224 13 175 299 92 167 171 32 261 -83 -363 -136
4526 -136 -145 -292 -29 -61 16 37 -55 182 -25 98 63 -116 -24 228 168 144 111 -59 -117 247 -98 -246 173 -90
4550 -90 -15 -187 -207 172 103 -58 -133 -56 53 -123 45 137 250 -66 526 242 342 -8 197 156 108 4 -10
4573 -10 -106 86 -144 -278 -95 -138 76 62 109 241 -86 114 36 168 -60 270 52 60 247 74 -34 293 116
4596 116 -64 111 -329 -255 -43 -335 -530 18 39 -256 -185 11 203 62 -283 111 366 176 42 -253 117
4617 117 194 -107 9 6 -106 -410 -40 126 32 -31 -6 -425 -318 52 -113 104 94 -155 -106 31 -49 89 144
4640 144 197 272 224 176 42 77 -160 155 -57 -184 -176 206 -90 -83 -111 98 -100 27 -192 -20 -152 -100 257 384
4664 384 95 55 -13 -24 274 133 -47 61 -78 -60 -182 51 -510 -428 51 -232 7 -30 51 115 37 229 -263
4687 -263 -54 187 169 337 201 149 -194 -211 -269 96 -39 -441 -417 -223 -302 -51 -55 -93 39 304 -301 261 -74
4710 -74 -15 155 103 262 336 402 256 216 48 192 -86 -267 -109 -226 -64 -289 -173 -25 29 -10 107 -43 239
4733 239 121 -94 93 195 33 -23 350 325 -50 197 158 -11 -60 -139 66 -182 -63 -71 -405 -63 -359 -135
4755 -135 -139 -3 -44 -57 218 82 180 72 189 205 36 71 -82 70 -2 13 175 192 -264 -144 -440 -255 -359
4778 -359 384 -244 98 -176 -124 -18 281 -77 221 451 134 -9 -12 6 111 -142 -37 -47 -221 26 115 179
4800 179 -336 -220 93 -32 -19 409 -216 117 -121 178 438 273 267 353 128 -8 113 116 250 17 -55 -249
4822 -249 -157 -118 -84 22 12 37 -164 320 -287 40 -293 -21 -32 -46 111 -59 122 73 -20 236 101 -26 -133
4845 -133 294 47 -350 59 -290 -338 -125 -11 -143 -98 -9 173 40 20 135 153 162 224 163 25 6 95 215 220
4869 220 -204 -265 -124 -71 -310 -75 -220 -308 -135 -327 -138 -74 223 -55 243 -74 178 221 -204 -239 207 0
4891 0 -25 -17 -67 178 -122 -1 -86 -134 -170 -166 -87 -143 -128 -174 -34 -157 -83 50 168 123 544 171 -10 168 142 39
4917 39 15 -26 27 -106 -164 -193 -161 -19 -150 67 -307 17 -68 52 179 -121 -18 172 114 123 -102 76 328 351
4941 351 159 158 -37 48 78 -188 358 47 -210 -205 -186 -290 26 242 62 -8 -61 -210 -146 191 -33 232 -35
4964 -35 -182 24 181 397 297 161 19 77 -115 -166 -74 -109 -93 -342 -233 -232 197 21 242 -129 -67 183 25
4987 25 101 324 253 211 211 101 248 -99 -181 -328 -154 -99 -5 73 -245 -352 52 -66 145 -92 184 41 38 -151
5011 -151 105 125 242 71 224 100 -224 -2 158 118 -114 27 -160 -36 -173 -193 13 -161 -192 92 -97
5032 -97 54 -82 -34 84 248 54 9 -146 201 119 -114 71 -184 -42 -213 -145 -11 -25 -98 89 -96 239
5054 239 89 -116 -62 -83 -4 61 194 79 12 -83 -119 -85 -80 0 19 -176 -172 -30 7 -218 113 -188 6 254 -214
5079 -214 -108 -133 7 40 157 6 8 -98 23 -31 250 -22 209 -59 393 -31 217 -62 237 -1 104 -145
5101 -145 -101 -319 -280 -245 -162 7 147 98 73 44 20 -18 304 81 -69 -150 14 69 -253 93 323 -163 -260 -114
5125 -114 -204 50 240 -42 -145 -50 -131 47 -47 100 -48 17 111 240 -19 210 106 -56 30 -163 90 -126
5147 -126 -156 146 -167 -72 -62 257 -201 -125 -78 -97 -2 -30 302 381 211 -35 120 122 309 -198 -145 -45 -94 9
5171 9 16 -61 91 -105 -152 -168 16 9 156 -62 -9 203 147 215 167 83 195 297 59 -6 -20 200 0 291 161
5196 161 88 9 99 -68 104 280 -37 54 -89 86 -74 -6 -50 -125 101 134 241 -63 114 34 126 -173 -134 36
5220 36 -85 -98 75 82 -20 -173 -12 -92 23 85 93 -36 -183 142 112 188 64 182 15 199 5 153 -77
5243 -77 113 73 -72 27 -182 -88 159 -57 -5 -101 -4 3 61 -289 210 -40 -101 -16 -162 286 248 -36 190 7
5267 7 -118 -28 -59 25 27 -417 -56 90 -179 38 125 95 -474 -483 283 361 -41 347 109 94 104 287 131 142 -215
5292 -215 132 -92 -140 -266 159 14 -27 -115 -340 -134 -169 46 204 -84 -239 231 196 -237 149 -106 68 97
5314 97 95 231 -75 35 78 -44 -35 -188 42 -67 83 30 -167 -165 -65 225 -115 -70 58 -199 -46 62 163
5337 163 -213 -17 -223 91 33 84 150 -146 -56 98 -102 -247 -83 -340 -80 -2 -221 -211 54 64 134 80 67
5360 67 115 -11 95 -344 -204 10 386 189 -20 14 43 47 22 -203 -18 -12 113 -104 -38 193 -51 -439 -14
5383 -14 -94 16 335 -146 -67 80 218 -51 168 -31 68 21 48 79 3 -75 61 -29 -249 -56 115 -185 -157 -119
5407 -119 186 -84 164 -122 -108 10 -77 -46 96 67 177 -101 -182 -146 -74 -140 2 -134 -67 -91 -257 -309 59 335
5431 335 -92 -163 26 117 35 82 9 44 -19 -91 180 70 -298 114 97 45 -23 -126 155 -415 -297 -97 127 -59
5455 -59 12 177 -207 41 -319 -114 -10 14 39 -18 -43 47 176 30 97 -36 45 18 -238 -267 42 221 -334 -112
5479 -112 -44 -85 -34 -55 215 228 81 4 113 91 75 -9 156 386 63 -144 -127 65 -35 70 -46 136 -269
5502 -269 49 -184 -150 41 -52 -10 -115 -326 -41 76 137 436 177 24 154 -142 -149 -17 249 -30 82 -321
5524 -321 58 -180 31 -138 -206 62 -53 -47 102 -273 241 96 86 151 -139 103 1 -118 61 -73 -28 401
5546 401 -240 -195 -124 1 175 -101 -142 -67 134 50 -113 -57 -194 -2 147 -71 167 -112 -88 251 -94 -37 -56
5569 -56 55 136 -173 313 111 -106 26 -84 239 -32 -129 -129 -189 -323 136 172 99 -55 87 137 77 316 119
5592 119 170 347 -166 69 -88 -115 -262 -192 -211 -36 -38 134 69 67 175 117 169 -104 113 134 214 -8 -53 174 232
5617 232 -60 41 103 59 -13 176 130 77 -320 4 94 -98 87 -69 113 -17 -13 -37 -79 -92 166 78 57 -126
5641 -126 -67 75 -166 188 54 -46 243 131 -52 9 4 76 -90 -241 182 113 -85 26 374 81 116 -3
5663 -3 201 -58 210 -85 -180 -69 0 -164 132 77 20 55 -62 -38 -44 168 -164 -78 135 132 -90 -111 190 29 -19
5688 -19 42 104 154 -69 -42 -81 -119 -369 -125 43 62 -35 56 123 -171 88 69 -94 179 -73 17 102 13 24 300
5713 300 -152 217 137 163 66 6 249 -133 55 -20 194 -17 116 154 -27 -98 -274 -282 -241 -58 214 16 17 264
5737 264 -85 -74 444 19 -95 127 59 -35 144 -4 -138 -33 -46 55 -173 90 -87 -251 -35 53 -206 88
5759 88 -61 270 -21 62 -194 140 -48 -114 -103 -99 -145 1 -41 10 216 -156 -20 -229 330 -102 -143 146 -319
5782 -319 82 109 -76 4 354 24 56 196 65 -168 -235 -349 123 42 -43 -133 173 63 -44 15 -10 345 -71
5805 -71 136 156 150 166 278 89 206 6 -311 179 137 -22 133 -47 -114 55 -1 275 7 120 40 -30 -202
5828 -202 -71 -87 -120 -85 -90 93 322 -13 -25 -132 208 208 -148 284 313 141 -265 -227 -420 206 8 -36 -115 -288
5852 -288 -8 -100 160 -48 60 -95 66 -214 -74 -287 176 -450 56 71 162 264 123 -170 -115 -253 112
5873 112 75 -179 72 28 -70 32 -75 -70 -125 52 77 201 74 148 277 182 -63 -16 387 -212 132 -81 28
5896 28 148 -23 -118 -34 30 -11 -196 -6 36 -75 -117 -128 70 43 -15 51 -109 193 -54 -33 -279 -127 78 74 -3
5921 -3 217 55 -129 30 102 -173 -125 -225 12 -22 -264 -124 49 1 78 190 -148 4 30 124 427 4 -257
5944 -257 106 18 139 155 -15 79 -133 -1 -1 273 -63 146 -87 -124 65 88 -195 -16 -304 -67 242 41
5966 41 -19 191 -249 188 12 -4 136 75 55 -134 80 -225 75 -148 152 -55 120 64 124 -318 21 197
5988 197 199 66 -97 71 296 21 172 228 -214 7 -165 -50 23 -78 -56 -243 164 -244 -173 92 9 -416
6010 -416 -49 12 -20 -90 334 -33 328 -63 14 145 -228 282 -44 42 -247 -240 236 -1 -25 -303 -196 -28 182
6033 182 197 172 -126 -165 -294 -98 -173 92 -146 77 55 -72 259 13 210 285 -33 157 -57 104 -156 -34
6055 -34 -149 -189 259 94 -44 78 218 47 166 176 -18 137 24 -10 345 156 -172 -264 162 -139 -257 -225
6077 -225 -283 -421 -72 -169 208 43 125 127 -8 -118 117 -8 41 133 133 138 419 -42 27 -105 205 0 -219 158
6101 158 -127 12 -248 21 -58 49 -32 -110 -109 23 33 141 1 -157 78 -49 20 -93 17 0 -117 -32 -85
6124 -85 -264 -106 -90 -111 134 4 -80 -195 45 -241 86 17 1 -103 95 79 108 45 29 93 -56 -13 -236 95
6148 95 171 -113 -171 0 -218 -334 226 -122 0 -123 81 -110 -344 66 -49 75 267 45 228 147 78 -31
6170 -31 64 -135 22 -157 -87 -299 -313 -89 -201 121 -207 2 93 107 28 -104 41 -75 4 -13 298 -6 -41
6193 -41 99 228 -82 150 54 -429 -57 17 -195 -264 127 -39 18 -148 130 -109 21 -194 47 -83 278 -81
6215 -81 323 -21 2 314 -6 -174 -3 -39 -72 1 -153 -104 68 191 -241 -192 -140 -45 -63 3 129 -18 215 -3
6239 -3 -1 270 10 226 202 11 -6 78 -78 148 33 -20 -149 44 -4 -122 2 171 -54 48 137 -14 -204
6262 -204 -120 29 -11 -59 -83 -81 -41 -273 113 281 -154 -208 -86 -249 -51 274 -44 -23 3 -20 -77 21 -122 -10
6286 -10 37 -101 25 118 -80 41 138 23 98 129 -23 -124 272 65 -226 -40 -49 -232 -39 -147 125 -5 -129
6309 -129 -14 -234 -193 -24 -165 92 194 106 119 244 31 240 -60 19 -239 67 -180 -60 -86 -240 113 -6
6331 -6 -59 89 541 36 -3 14 386 -135 -64 -26 138 33 -22 -119 144 123 186 69 226 -208 -70 -21 -226 104
6355 104 -39 -84 -193 -42 -118 -155 35 238 91 288 136 164 314 203 -355 154 -98 -24 128 -345 -182 -74
6377 -74 -317 -236 -188 -209 -67 102 89 38 -162 34 -110 228 252 105 -241 247 -64 -15 96 -97 182 174 -168
6400 -168 -143 -229 -13 88 343 -115 82 -67 -48 -62 -123 20 7 65 128 230 161 12 43 -54 94 30 4 31 -119
6425 -119 -346 -152 -228 -208 -178 -40 -281 -242 -199 -14 21 -116 -114 64 134 172 51 -150 52 0 -275 -66 146 -162
6449 -162 -26 -151 77 -101 -222 -71 18 -208 158 292 161 122 119 173 113 83 -68 33 -81 -58 305 173 -131
6472 -131 -133 -162 -297 -98 -206 -292 131 -65 12 -9 -175 46 33 -50 144 16 -42 30 -105 292 79 65 46 -174
6496 -174 -47 -99 -120 14 84 275 -263 -91 -92 -91 50 -254 -191 -100 181 51 -126 -270 20 76 -213 -67 297
6519 297 0 6 0 91 -204 -403 -92 -95 -261 -151 61 15 -139 50 258 94 54 116 -42 -84 207 150 -7 26
6543 26 -50 93 -14 7 -69 -87 -98 -72 -191 -287 -74 -317 -12 -327 67 90 -248 -88 226 -49 299 56 -67
6566 -67 214 106 257 -75 104 261 18 -88 -87 2 -135 -91 -227 62 -46 90 58 22 -33 99 89 -29 114
6589 114 41 154 -41 39 -111 133 69 223 -18 -121 -236 -17 53 -52 288 -174 215 -237 -137 168 222 65
6611 65 8 -9 8 -198 43 20 181 -78 51 75 200 -20 -20 120 -315 100 0 -204 87 343 -253 -203 -23
6634 -23 -1 2 -185 -12 132 43 79 -52 -80 -136 -263 140 146 10 -270 -186 118 -105 -186 -111 -133 -232 181 134 99 5
6660 5 91 337 -56 -44 50 -7 51 113 -59 -9 134 -132 -92 232 -238 -98 -160 -178 -283 -48 -86 -53 -291 133 -180
6685 -180 55 28 76 193 156 190 59 21 147 259 143 -102 -13 -68 -14 -180 74 181 -260 213 43 95 152
6708 152 10 -93 391 219 -75 83 204 -269 -10 -245 89 -54 18 -183 224 -65 -350 -112 -28 -64 202
6729 202 -32 -42 150 -13 -24 -54 174 195 193 -147 182 50 -81 -153 30 45 -58 -103 -259 -251 -36 79 79 -196
6753 -196 177 169 30 -115 28 -72 -220 156 67 -116 53 -127 165 -60 -96 83 25 -64 -3 145 -228 95
6775 95 38 -309 -253 -82 -50 154 3 -9 104 292 108 166 49 -97 -19 58 55 -163 -40 31 -239 -123 118 -138
6799 -138 -258 -94 -310 -221 111 -99 -104 -128 232 -156 1 228 85 55 392 164 -66 152 -188 136 238 15
6821 15 -23 331 -174 157 29 -142 164 -5 -12 -213 -262 78 -16 213 132 -258 204 143 -12 110 -123 -152 34
6844 34 197 -113 -173 -405 -13 9 -44 -216 -89 -81 -117 -236 -241 -155 -270 -252 80 131 -26 -12 94 128 -63 84 275
6869 275 55 -177 -90 -33 -181 -48 180 -240 55 -25 272 230 -144 -225 -72 78 -48 192 -61 26 -90 -157
6891 -157 96 220 -3 -61 -41 -23 -62 210 -6 -224 66 -155 -54 -29 97 123 411 123 236 36 81 253
6913 253 -79 -227 209 50 59 58 60 35 126 -180 24 273 -98 -192 130 -30 140 229 -41 52 -69 54 163 97
6937 97 -30 -291 -50 118 76 -156 -8 2 182 -193 -35 -85 -363 -154 -251 435 -283 53 100 145 -352 -147
6959 -147 130 48 173 101 205 87 103 -145 -166 295 15 143 -28 -114 52 3 -214 -173 179 28 78 102 -177
6982 -177 136 -209 7 -132 27 -161 -225 247 35 -20 151 -29 -52 22 56 34 -87 -143 3 -219 -294 -82 -131
7005 -131 -68 101 -137 145 48 -141 31 362 -152 225 3 95 -263 92 32 -233 29 -57 181 153 97 -84
7027 -84 17 -32 -192 -17 166 7 -149 -92 -109 136 96 49 131 -66 115 88 -41 -87 -287 -222 -224 124 82 -229
7051 -229 -86 -308 36 41 -238 113 28 -45 235 277 163 -157 9 228 -156 -12 -20 11 -92 49 -7 -56 48
7074 48 -322 -53 -119 -76 -113 -234 68 -98 70 -15 234 -1 -32 265 -123 -274 -22 119 53 -170 173 -172
7096 -172 -152 43 -84 112 67 -271 181 -45 82 27 -38 115 6 231 317 -47 416 7 94 -12 24 110 -115
7119 -115 -179 -44 -133 -107 -82 120 33 -12 71 -4 209 -63 44 -151 -135 -76 -112 17 36 2 132 179 237 -3 251
7144 251 -114 -78 169 -294 -46 -269 -186 -206 -154 -93 -14 -60 115 44 114 -22 -114 48 127 113 100 267 47 174
7168 174 38 -168 61 -30 29 135 -41 -110 128 -192 -163 -78 -52 -139 -281 68 -34 195 -77 165 106 -43 45
7191 45 -146 55 16 118 -395 -29 33 -87 -220 -301 -42 70 -4 -70 42 -58 56 45 -33 39 2 226 131 180
7215 180 105 -95 139 -242 -96 73 312 70 -131 52 -22 -74 -14 142 -9 -18 -180 160 -186 -161 -7 94
7237 94 -45 60 179 408 94 -53 -98 -103 -118 -142 -62 -277 -156 24 105 -170 -518 -289 -9 134 109 172 38
7260 38 -291 -214 33 -83 -41 -105 14 -20 -83 105 -50 -30 107 65 1 -169 -364 -138 -174 -413 67 -50 -117 231
7284 231 -55 -76 66 92 57 -83 37 88 188 -150 218 37 124 -146 -75 183 28 9 -349 -251 -112 -178 -57
7307 -57 75 169 217 -95 169 192 -169 121 -78 -17 24 -7 135 -21 -129 -15 -302 4 -56 38 -66 -53 -299
7330 -299 -18 26 56 -105 -33 137 135 -118 270 160 85 90 -36 181 -65 -106 129 -326 -91 34 72 75 146 -35
7354 -35 96 166 4 20 245 -263 67 161 41 -49 -158 18 -74 189 -107 -287 -14 106 24 51 248 -222 -366
7377 -366 -321 -158 175 6 -78 -126 -7 -121 125 105 -30 76 78 -83 8 207 -69 -148 30 -62 -72 -244 -214 -31
7401 -31 -203 -84 -320 140 -98 -152 5 101 230 194 305 -129 49 107 199 -73 -43 114 -29 153 -260 -152
7423 -152 -168 123 -44 -116 -44 -70 -133 51 -259 -116 -38 155 -200 -39 6 -104 -233 -73 139 -46 183 56
7445 56 152 -276 -324 -160 -77 -33 -66 -50 -28 174 -33 -20 45 -67 -41 60 140 32 78 116 -113 189 -143 -15 46
7470 46 -150 -252 -32 -91 -29 -172 -102 257 212 171 2 1 307 124 -58 49 20 180 22 -5 19 -91 -90 65
7494 65 35 -186 -84 -64 188 -71 135 -63 122 33 20 -60 -85 7 -273 114 90 -140 -9 49 206 -71 -100 236
7518 236 -279 -152 -34 35 15 -127 -49 -223 -73 142 -6 -72 -93 -85 -123 -263 122 39 -67 109 261 116 160
7541 160 124 55 -200 -156 126 -74 196 110 178 21 -29 -9 42 -101 141 -12 118 -29 -30 -3 -17 153 -30 186
7565 186 -22 -7 173 73 -156 10 -130 -127 -178 -14 -156 -145 -187 -64 11 86 -138 -119 -27 -114 24 38 -40 -92 104
7590 104 101 71 74 -128 -157 185 174 -145 41 45 -88 64 -95 -114 -101 -85 -245 187 66 -245 -41 37 -122 222
7614 222 180 111 -17 -52 -195 23 -63 31 -50 -230 -82 -222 -13 -95 -3 149 -77 -1 -17 9 196 182 43 -121
7638 -121 124 -35 -138 -56 65 -236 -131 -120 90 -25 -54 -30 -213 112 291 151 145 104 195 -46 5 -75 142
7661 142 63 -200 -35 209 -18 -159 116 1 160 40 -19 15 -167 -70 -104 -8 32 -70 251 -123 92 -24
7683 -24 -88 -118 11 134 -261 268 39 237 -4 -213 88 161 -124 -135 40 304 2 7 47 -4 -5 -130 5 229
7707 229 -16 96 -77 4 -87 97 46 -162 52 289 -73 38 75 -61 -236 -293 191 -232 370 14 -371 -133
7729 -133 -108 -216 114 57 131 44 189 -18 21 253 50 -106 85 -102 -33 53 -205 204 36 -114 225 -218
7751 -218 -339 -228 3 -80 -35 -71 -174 242 0 93 162 54 43 -66 -34 -143 -53 -202 15 -112 16 -16 183
7774 183 -131 57 -111 12 376 -55 -5 130 148 -232 -52 102 311 48 1 15 -116 90 -40 -29 197 -99
7796 -99 -205 40 -125 -318 -23 -56 20 -5 -116 94 63 -134 -15 155 27 223 -83 117 -108 -205 17 138
7818 138 -125 -31 26 -140 17 6 -415 -31 -141 86 -161 -91 -227 138 -130 -134 142 -170 -164 -230 92 21 187
7841 187 -63 140 -21 -199 96 23 -108 218 193 99 16 229 159 91 -69 30 43 -171 170 -137 -221 413 -79
7864 -79 68 118 -171 205 145 194 288 64 -74 78 -49 -37 -126 -51 137 -237 -52 -12 15 84 -119 -2 10 319
7888 319 101 132 25 -250 106 -38 57 71 -31 -39 -116 61 176 -124 41 -111 121 25 12 28 -71 118 236
7911 236 -21 106 -69 -126 366 -54 -147 -68 28 108 -290 -149 216 66 -456 -142 28 -49 108 -96 -90 186 264
7934 264 165 44 3 -115 -230 96 34 54 104 16 128 -74 0 -17 -14 -139 -137 -76 -148 -406 97 -98 148 -85 -143
7959 -143 225 -126 77 80 21 -49 -45 -42 1 27 -212 88 42 -37 -264 188 69 -73 75 14 21 -83 53 217 -140
7984 -140 107 230 -5 96 76 16 164 -107 3 87 -36 42 -83 -194 1 50 100 39 -207 158 -147 -193 -96
8007 -96 -21 216 22 213 -156 200 57 99 -19 -196 138 32 -99 -166 -63 -200 -14 8 -81 -109 218 117
8029 117 58 -100 -99 169 108 -13 220 108 320 -199 -22 -149 41 -127 -269 7 236 -66 46 -286 -76
8050 -76 58 -57 -86 85 38 -8 169 -16 -86 -80 255 45 0 -55 -10 -25 34 123 145 -119 -11 131 85 4 -117
8075 -117 114 56 -171 98 59 37 -154 -21 -59 -41 -51 -56 103 286 -54 50 215 272 -76 37 -98 22 38
8098 38 -31 47 -162 -112 -44 -252 -62 -86 25 -76 171 218 19 141 333 -13 -161 202 -178 -211 -74 13 -148
8121 -148 -80 -91 -222 47 -213 -139 112 109 -4 31 -210 -119 -5 -51 145 -127 -162 80 194 -5 -90 72 -27 -17
8145 -17 -1 -199 -52 -43 36 396 -185 -149 -193 87 -152 74 35 -19 72 8 46 67 20 91 -57 -285 115 63 108 97
8171 97 94 -281 107 -23 202 -171 -158 29 154 -128 18 -27 15 38 26 -58 -50 -80 72 178
8191A78
##END NTUPLES=NMR FID
##END=
