##TITLE=1H_CA-8416-8
 CDCl3, 8 sc, 
 15.1.2019
##JCAMPDX= 6.0         $$ Bruker NMR JCAMP-DX V2.0
##DATA TYPE= NMR FID
##DATA CLASS= NTUPLES
##ORIGIN= UXNMR, Bruker Analytische Messtechnik GmbH
##OWNER= root
$$ XWIN-NMR		Version 3.5
$$ Tue Jan 15 15:04:58 2019 Russian Standard Time (UT+4h)  she@DPX200
##.OBSERVE FREQUENCY= 200.1313
##.OBSERVE NUCLEUS= ^1H
##.DELAY= (6, 6)
##.ACQUISITION MODE= SIMULTANEOUS
##.ACQUISITION SCHEME= undefined
##.AVERAGES= 8
##.DIGITISER RES= 18
##SPECTROMETER/DATA SYSTEM= spect
##.PULSE SEQUENCE= zg30
##.SOLVENT NAME= CDCl3
##.SHIFT REFERENCE= (INTERNAL, CDCl3, 0, 15.7039)
##AUDIT TRAIL= $$ (NUMBER, WHEN, WHO, WHERE, WHAT)
$$ ##TITLE= Audit trail, XWIN-NMR		Version 3.5
$$ ##JCAMPDX= 5.01
$$ ##ORIGIN= Bruker BioSpin GmbH
$$ ##OWNER= she
$$ F:/spectra/data/she/nmr/H-F/1/audita.txt
$$ ##AUDIT TRAIL=  $$ (NUMBER, WHEN, WHO, WHERE, WHAT)
(   1,<2019-01-15 15:03:53.71 +0400>,<she>,<DPX200>,
      <created by zg, POWCHK disabled, PULCHK disabled
       configuration hash MD5:
       00 E9 B6 7A A2 85 ED C7 34 08 36 98 17 FE 4E 26
       data hash MD5: 16K
       37 04 F0 47 B9 BD 5E 49 AF 84 DC E9 47 91 CB 5F>)
$$ ##END=
$$ 
$$ hash MD5
$$ 5E 3D 65 A7 6C E3 9F 8B 25 94 DB 04 4A 62 04 EF
##$RELAX= 
##$RELAX= 
##$RELAX= 
##$RELAX= 
##$RELAX= 
##$RELAX= 
$$ Bruker specific parameters
$$ --------------------------
##$DU= <F:/spectra>
##$EXPNO= 1
##$NAME= <H-F>
##$PROCNO= 1
##$TYPE= <nmr>
##$USER= <she>
##$AMP= (0..31)
100 100 100 100 100 100 100 100 100 100 100 100 100 100 100 100 100 100 
100 100 100 100 100 100 100 100 100 100 100 100 100 100 
##$AQSEQ= 0
##$AQ_mod= 1
##$AUNM= <au_zg>
##$AUTOPOS= <>
##$BF1= 200.13
##$BF2= 200.13
##$BF3= 200.13
##$BF4= 200.13
##$BF5= 200.13
##$BF6= 200.13
##$BF7= 200.13
##$BF8= 200.13
##$BYTORDA= 1
##$CFDGTYP= 0
##$CFRGTYP= 5
##$CHEMSTR= <none>
##$CNST= (0..31)
1 1 145 1 1 1 1 1 1 1 1 1 1 1 1 1 1 1 1 1 1 1 1 1 1 1 1 1 1 1 1 1 
##$CPDPRG= <>
##$CPDPRG1= <>
##$CPDPRG2= <>
##$CPDPRG3= <>
##$CPDPRG4= <mlev>
##$CPDPRG5= <mlev>
##$CPDPRG6= <mlev>
##$CPDPRG7= <mlev>
##$CPDPRG8= <mlev>
##$CPDPRGB= <>
##$CPDPRGT= <>
##$D= (0..31)
0 1.2 0 0 0 0 0 0 0 0 0 0.03 0 0 0 0 0 0 0 0 0 0 0 0 0 0 0 0 0 0 0 0 
##$DATE= 1547550233
##$DBL= (0..7)
120 120 120 120 120 120 120 120 
##$DBP= (0..7)
150 150 150 150 150 150 150 150 
##$DBP07= 0
##$DBPNAM0= <>
##$DBPNAM1= <>
##$DBPNAM2= <>
##$DBPNAM3= <>
##$DBPNAM4= <>
##$DBPNAM5= <>
##$DBPNAM6= <>
##$DBPNAM7= <>
##$DBPOAL= (0..7)
0.5 0.5 0.5 0.5 0.5 0.5 0.5 0.5 
##$DBPOFFS= (0..7)
0 0 0 0 0 0 0 0 
##$DE= 6
##$DECBNUC= <off>
##$DECIM= 24
##$DECNUC= <off>
##$DECSTAT= 4
##$DIGMOD= 1
##$DIGTYP= 9
##$DL= (0..7)
0 120 120 120 120 120 120 120 
##$DP= (0..7)
150 150 150 150 150 150 150 150 
##$DP07= 0
##$DPNAME0= <>
##$DPNAME1= <>
##$DPNAME2= <>
##$DPNAME3= <>
##$DPNAME4= <>
##$DPNAME5= <>
##$DPNAME6= <>
##$DPNAME7= <>
##$DPOAL= (0..7)
0.5 0.5 0.5 0.5 0.5 0.5 0.5 0.5 
##$DPOFFS= (0..7)
0 0 0 0 0 0 0 0 
##$DQDMODE= 0
##$DR= 18
##$DS= 0
##$DSLIST= <SSSSSSSSSSSSSSS>
##$DSPFIRM= 0
$$ [...]
##$SUBNAM2= <"">
##$SUBNAM3= <"">
##$SUBNAM4= <"">
##$SUBNAM5= <"">
##$SUBNAM6= <"">
##$SUBNAM7= <"">
##$SUBNAM8= <"">
##$SUBNAM9= <"">
##$SW= 24.933730806125
##$SWIBOX= (0..15)
0 0 2 0 0 0 0 0 0 0 0 0 0 0 0 0 
##$SW_h= 4990.01996007984
##$TD= 16384
##$TD0= 1
##$TE= 0
##$TE2= 300
##$TE3= 300
##$TEG= 300
##$TL= (0..7)
0 120 120 120 120 120 120 120 
##$TP= (0..7)
150 150 150 150 150 150 150 150 
##$TP07= 0
##$TPNAME0= <>
##$TPNAME1= <>
##$TPNAME2= <>
##$TPNAME3= <>
##$TPNAME4= <>
##$TPNAME5= <>
##$TPNAME6= <>
##$TPNAME7= <>
##$TPOAL= (0..7)
0.5 0.5 0.5 0.5 0.5 0.5 0.5 0.5 
##$TPOFFS= (0..7)
0 0 0 0 0 0 0 0 
##$TUNHIN= 0
##$TUNHOUT= 0
##$TUNXOUT= 0
##$USERA1= <user>
##$USERA2= <user>
##$USERA3= <user>
##$USERA4= <user>
##$USERA5= <user>
##$V9= 5
##$VALIST= <valist>
##$VCLIST= <CCCCCCCCCCCCCCC>
##$VD= 0
##$VDLIST= <DDDDDDDDDDDDDDD>
##$VPLIST= <PPPPPPPPPPPPPPP>
##$VTLIST= <TTTTTTTTTTTTTTT>
##$WBST= 1024
##$WBSW= 4
##$XGAIN= (0..3)
0 0 0 0 
##$XL= 0
##$YL= 0
##$YMAX_a= 567837
##$YMIN_a= -647068
##$ZGOPTNS= <>
##$ZL1= 120
##$ZL2= 120
##$ZL3= 120
##$ZL4= 120
##$ABSF1= 10
##$ABSF2= 0
##$ABSG= 5
##$ABSL= 3
##$ALPHA= 0
##$AQORDER= 0
##$ASSFAC= 0
##$ASSFACI= 0
##$ASSFACX= 0
##$ASSWID= 0
##$AUNMP= <proc_1d>
##$AZFE= 0.1
##$AZFW= 0.1
##$BCFW= 1
##$BC_mod= 2
##$BYTORDP= 1
##$COROFFS= 0
##$CY= 11.3945322036743
##$DATMOD= 1
##$DC= 2
##$DFILT= <>
##$DTYPP= 0
##$F1P= 18.9103706918063
##$F2P= -1.10871071338519
##$FCOR= 0.5
##$FTSIZE= 0
##$FT_mod= 4
##$GAMMA= 1
##$GB= 0.15
##$INTBC= 1
##$INTSCL= 1
##$ISEN= 128
##$LB= 0.24
##$LEV0= 0
##$LPBIN= 0
##$MAXI= 10000
##$MC2= 0
##$MEAN= 0
##$ME_mod= 0
##$MI= 1.114404
##$NCOEF= 0
##$NC_proc= 0
##$NLEV= 6
##$NOISF1= 3.799351
##$NOISF2= 2.8
##$NSP= 1
##$NTH_PI= 0
##$NZP= 0
##$OFFSET= 15.70392
##$PC= 1
##$PHC0= -8874.349
##$PHC1= 13.60006
##$PH_mod= 1
##$PKNL= yes
##$PPARMOD= 0
##$PSCAL= 0
##$PSIGN= 0
##$REVERSE= no
##$SF= 200.130013532006
##$SI= 16384
##$SIGF1= 3
##$SIGF2= 2
##$SINO= 400
##$SIOLD= 16384
##$SREGLST= <1H.CDCl3>
##$SSB= 0
##$STSI= 0
##$STSR= 0
##$SW_p= 3612.71676300578
##$SYMM= 0
##$S_DEV= 0
##$TDeff= 0
##$TDoff= 0
##$TI= <>
##$TILT= no
##$TM1= 0
##$TM2= 0
##$TOPLEV= 0
##$USERP1= <user>
##$USERP2= <user>
##$USERP3= <user>
##$USERP4= <user>
##$USERP5= <user>
##$WDW= 1
##$XDIM= 8192
##$YMAX_p= 0
##$YMIN_p= 0
$$ End of Bruker specific parameters
$$ ---------------------------------
##NTUPLES= NMR FID
##VAR_NAME=  TIME,          FID/REAL,        FID/IMAG
##SYMBOL=    X,             R,               I
##VAR_TYPE=  INDEPENDENT,   DEPENDENT,       DEPENDENT
##VAR_FORM=  AFFN,          ASDF,            ASDF
##VAR_DIM=   8192,          8192,            8192
##UNITS=     SECONDS,       ARBITRARY UNITS, ARBITRARY UNITS
##FACTOR=    0.0002004,     1,               1
##FIRST=     0,             0,               0
##LAST=      1.6414764,     0,               0
##MIN=       0,             -647068,         0
##MAX=       1.6414764,     567837,          0
$$ Real data points
##PAGE= N=1
##DATA TABLE= (X++(R..R)), XYDATA
$$ [...]
2268C408o32j825p17J51j674j842M35J477j679j207J562K269m32j257J514K200
2284A751o05n57R75Q70j187n92N53o20j883O56J755m66k498P16J990J19j259P74
2302D92J818l48j540KK83j610l69P21L67k237j113J442L33j388l32K830J700m17
2320F34l0K019J102l91J03Q54o45k036K87J66k309k444L71N51j946j692R87J168
2338c251p8O9J589J550M16O40J843O18r83M84J186r26k553M4J275o61k260o32
2356a630J107m05j250O03J517R5j38J456O00j448n94J673M50j949j403J345R3
2373A22k550p72J342L68o02K01J305M44n19J614J541j12q32R18J040j668k224
2390c84K73N98j927j761L41P74r13j56J219M91k57R36K047Q25p27J093K286k37
$$ plain form
2268 3408 2776 951 234 385 -1289 -3131 -2696 -1219 -2898 -4105 -2543 -274 -706 -1963 -449 1751
2284 1751 1146 589 1564 2434 1247 655 1208 588 -1295 -639 1116 650 -1848 -1132 858 977 -282 492
2302 492 2310 1962 422 424 707 -903 -1272 -551 -184 -2421 -3534 -2092 -1759 -3147 -3479 -649 1051 634
2320 634 604 2623 3725 3334 3437 4291 3646 1610 1897 2063 -246 -2690 -2319 -1768 -3714 -5406 -4419 -3251
2338 -3251 -3329 -3260 -1671 -121 295 935 2778 3396 2413 2897 4083 3157 604 648 1923 1262 -998 -1630
2356 -1630 -523 -928 -2178 -1575 -58 37 -101 1355 1955 507 -87 1586 2036 87 -1316 29 122
2373 122 -2428 -3200 -1858 -1490 -2092 -1891 -586 -142 -661 953 2494 2382 1550 2468 3508 1840 -384
2390 -384 -111 487 -1440 -3201 -2860 -2086 -2999 -3155 -1936 -1445 -1702 -766 1281 2106 1379 2472 4758 4521
2408D521j663j95P81j071k172m31M06j064j568M40N17q68L42K207M44j162o04
2425a140J654Q96j327p53J409Q4j726j062M87o68j024M16J009o92l20J238K142
2442F23L4l49K102J857n57j069Q77K71j613j564J00n27k074k59R71l50j460N11
2460b476J456n0j062J241K206P82m89Q27J471l77q93Np9j843j267j8o13j964q14
2479c957J887P83r47o84J652O42j006K69J241O10k98N69J019r49r24O57R59j181
2497C42j558Q29Q05p76q08J421J376q6J54R35M37j703n37Q06j057j861l93P82
2515h92l43j500r2J719j91j415Q72J132j34R1J358J579J86k52J242O25j306p16
2533A963L62o96k408j531O89k7j399K62J639Q5o04L41Q73L63o97J104J336l50
$$ plain form
2408 4521 2858 2663 3444 2373 201 -230 176 -888 -2456 -2016 -1499 -2367 -2025 182 626 -536 -1140
2425 -1140 514 1410 83 -670 739 823 -903 -1965 -1478 -2146 -3170 -2754 -1745 -2437 -2757 -1519 623
2442 623 657 308 2410 4267 3710 2641 3518 3789 2176 612 712 185 -1889 -2148 -1177 -1527 -2987 -2476
2460 -2476 -1020 -1070 -2132 -891 1315 2097 1608 2435 3906 3529 2636 2641 2562 719 -548 -566 -1179 -3143 -3957
2479 -3957 -2070 -1287 -2234 -2918 -1266 -624 -1630 -1361 -120 490 192 761 1780 831 -93 564 1523 342
2497 342 -1216 -387 418 -358 -1166 255 1631 1545 1699 2634 3071 1368 831 1637 580 -1281 -1674 -892
2515 -892 -1235 -2735 -2827 -1108 -1299 -2714 -1842 -710 -844 -753 605 2184 2370 2118 3360 3985 2679 1963
2533 1963 2325 1629 -779 -2310 -1621 -1648 -3047 -2785 -1146 -1061 -1665 -1324 -451 -88 -785 319 1655 1305
2551A305p15R78J073q51j260Q63J15j680j422J44K35j324K24J847O2p88O12J154
2569E72k74j457R2J159l99p41N08J463Q6j34P58N15p39j000N58R25j564k5J426
2588A729M90j063j13Q81k96j435j456M80j072j398P4J251M04j81Q99J251l46j054
2606i55J158R01r14n80Q15N13o60m65J234M90j598m98M13m23j730l02J483O9n93
2625a642J097K054Q4p95Q51R56j167j174L93L30k35o40J146J115p64p58P01k18
2643A334j525p66O59p1j102k28J461K85r74O46O17j130j796R6O54m37l88J432
2661a233J748J42p37J299Q32p57q72O32L0j184k91Q85N16o06O2Q54o36j209q05
2680a330M88m01j015O50J487M27l51J619R49m32j059K48O12j402r73Q17N22p80
$$ plain form
2551 1305 590 1568 2641 1790 530 1393 1508 -172 -1594 -1450 -1215 -2539 -2315 -468 -406 -1194 -582 572
2569 572 298 -1159 -1067 92 -307 -1048 -540 923 1009 875 1633 2148 1409 409 967 1892 328 303 1729
2588 1729 2219 1156 1043 1924 1628 193 -1263 -783 -1855 -3253 -3179 -1928 -1524 -1705 -806 445 99 -955
2606 -955 203 1104 190 -390 425 938 278 -187 1047 1537 -61 -559 -146 -569 -2299 -2601 -1118 -1049 -1642
2625 -1642 -545 1509 1593 798 1649 2605 1438 264 657 987 752 112 1258 2373 1609 851 1552 1334
2643 1334 -191 -957 -298 -369 -1471 -1699 -238 47 -927 -281 336 -794 -2590 -2494 -1840 -2277 -2665 -1233
2661 -1233 515 657 -80 1219 2051 1294 422 1054 1084 -100 -391 494 1010 404 466 1320 684 -525 -1330
2680 -1330 -842 -1243 -2258 -1608 -121 306 -45 1574 2523 2091 1032 1280 1892 490 -483 334 856 76
2698G6k66J016J09j378n39N17p49j385J01J346l77o94J408J293K17l35q8N79q58
2717gj057Q20J038m63l04J385O83r13l20Q30p9j840n37L08k25j125M92J139J38
2736c7k59k2J026q06j498N82N71q89j3J270J220K42l78J185M57j282r09M14o25
2755B49r51k62J069J6j015K82P24k70j585j8R62r33m94L62J366O08o9J671R00
2774B612m75j335J019K5j536n83J010L42j108m16R55j01j119k69O72n93j130l34
2792b364Q26k90J40J368J461l77l06P59N76j035p24P32N84p30m80J295L36o48
2810A123j57J86p39j786k91K71k04r82M60J552j86k69Q58R75l88n04K21N17o80
2829b3J53Q39R11j74m33Q95k20j633o24M44m94j692m1Q03l2n15Q01R69L9o56O20
$$ plain form
2698 76 -190 826 935 -443 -982 -465 -1214 -2599 -2498 -1152 -1529 -2223 -815 478 695 360 272 851 -7
2717 -7 -1064 -244 794 331 27 1412 2095 1182 862 1692 1613 -227 -764 -456 -681 -1806 -1314 -175 -37
2736 -37 -296 -318 708 -98 -1596 -1014 -443 -1332 -1345 -75 1145 1387 1009 2194 2651 1369 460 874 249
2755 249 -702 -964 105 121 -894 -612 112 -158 -1743 -1761 -799 -1732 -2226 -1864 -498 110 41 1712 2612
2774 2612 2137 802 1821 1846 310 -273 737 1079 -29 -445 510 409 -710 -979 -307 -900 -2030 -2364
2792 -2364 -1538 -1828 -1688 -320 1141 764 458 1217 1793 758 34 766 1350 620 140 1435 1771 1123
2810 1123 966 1152 413 -1373 -1664 -1393 -1597 -2579 -2119 -567 -753 -1022 -164 811 423 -81 140 657 -23
2829 -23 130 969 1880 1706 1273 2168 1948 315 -309 135 -359 -2051 -2092 -1289 -1321 -1836 -1035 -66 -27 -683 -63
2850f3P27n97q60R35J383m67l92R08N38j356o48J46k10j127o50J034q3l47L54
2869g75J240j1q10N37P69n67j005K4P72j03o34M65N25k05m07P43J49q31n67J082
2889C91K28q97L40J204N61j068J37L96n51j081l31J06o62q61M32P03m53j06J111
2908d01J008m80n42J104P20n54k43R72M62q24n48L83q69j008l06K12n36j064L48
2927b166J134J66l68P25J680N8k96N85Q32n66q87M54j4j319m32O94l24j420n48
2946b012R77j44q10o0J295R04L2M59J012M8k32L78J69o72p51k67L24j377j263
2965a990M31N03m61o47P84M85k74M54Q33N48j5K37J050l14n97Q4O11n91j532j8
2985d19L64r85o10L68Q54n44l61R33Q33k57J50P42M18q96o51Q65j71j007n39J085
$$ plain form
2850 -63 664 67 -793 142 1525 1058 666 1574 2112 756 108 254 44 -1083 -1733 -699 -782 -1129 -775
2869 -775 465 454 -356 181 950 383 -622 -598 174 71 -563 -98 427 222 -185 558 707 -124 -691 391
2889 391 619 -278 62 1266 1827 759 896 1292 741 -340 -671 -565 -1227 -2088 -1656 -953 -1406 -1512 -401
2908 -401 607 127 -415 689 1409 855 612 1584 2046 1222 674 1057 188 -820 -1126 -914 -1450 -2514 -2166
2927 -2166 -1032 -866 -1234 -509 1171 1229 933 1518 2350 1784 897 1351 1337 18 -414 280 -44 -1464 -2012
2946 -2012 -1035 -1179 -1989 -2049 -754 150 182 641 1653 1701 1469 1847 2016 1344 593 326 650 -727 -1990
2965 -1990 -1559 -1056 -1517 -2164 -1380 -895 -1169 -715 118 666 651 888 1938 1624 1027 1111 1722 1131 -401 -419
2985 -419 -55 -1040 -1650 -1282 -428 -972 -1333 -400 433 176 326 1068 1486 590 -61 804 633 -374 -913 172
3005A72n74j091L7P75j17q0N98J185l66m8Q54M24l75n73P46J89j047j295M79j09
3025b16j468l91L73K67o09N61R91O1j38R80J332R1q47M18J064o25p98q3J31m88
3045F06j426L98q1q71n46R57J93j059L68J231P12n91K32J285j31j048L95L79j73
3064H30r59o1Pl77n20P36Q36n90M3N21M44l27r32Q36P43m51o17M99l19j360k79
3085a297O46l82q10J00P11O6o57J026J561J31l20Q06P82j09j126Q1K4p69o18O
3105a48k62q98p79O20K53p30j49J204N74k10J24J431N70m30J14Q81l51q56m0M
3125I22r37j157J54J75n64n87J088J105p64n69J263K94K2K52O94k17m85j7M30
3144A102o57j043K08J14k63j157K57Q84j90j83P00J184k66j43O51K17k76l39K78
$$ plain form
3005 172 -402 -1493 -1456 -681 -798 -878 -280 905 539 491 1345 1769 1394 821 1567 1756 709 -586 -107 -216
3025 -216 -1684 -2075 -1702 -1435 -2044 -1483 -492 -431 -569 411 1743 1834 987 1405 2469 1844 1046 963 1094 606
3045 606 -820 -422 -503 -1374 -1920 -963 -770 -1829 -1461 -230 482 -109 123 1408 1277 229 624 1003 830
3064 830 -129 -190 -183 -560 -1080 -344 492 -98 -55 466 910 583 -349 487 1230 779 162 661 342 -1018 -1297
3085 -1297 -651 -1033 -1843 -1743 -1032 -966 -1623 -597 964 1095 775 1581 2363 2254 1128 1209 1233 464 -154 -148
3105 -148 -410 -1308 -2087 -1467 -1214 -1944 -2093 -889 -315 -525 -401 1030 1600 1170 1284 2165 1814 958 918 922
3125 922 -15 -1172 -1018 -843 -1407 -1994 -906 199 -565 -1134 129 423 445 697 1391 1174 689 672 1102
3144 1102 445 -598 -390 -276 -539 -1696 -1439 -555 -745 -928 -228 956 690 547 1198 1415 1139 800 1078
3163A078k32j018l64O17k96j008J5N85j79q96O59P47J40k4O86M89j11n61R12L10
3183A549q00o25l7j30n50q40O28L04m24k05N54M01l03M00R47R0n79L87P19l77
3203A109r85L58O25q45o84J33j28o61m12M91O33n52k6R19K19j78L6R31K76q32
3223D27nQ00j46m63l90O61n91j002L06J53n20k22L39O34p75l30O67N24m90j41
3243e64O02P70o07n3N00R4n21J46R08o23n72j91O96o97m16L74N39l52r74K3R66
3264D8n99j70K18L39k81J97O29K96q41R8Q48k7m02m66N75p5l20k31O28j32p42
3285d10M91K95o01j59J62N13l28m42O36O77m99p43O27K93r68l16N77r1j91p6N14
3306c9Lk89M00O87j98n70J61K88k64l48M5O29j12m08K0J67o86n36K37M27o33K27
$$ plain form
3163 1078 846 -172 -536 81 -215 -1223 -1208 -623 -802 -1698 -1039 -292 -152 -176 510 999 888 327 1239 1549
3183 1549 749 124 87 -43 -593 -1433 -805 -501 -925 -1130 -576 -175 -478 -78 869 959 380 767 1486 1109
3203 1109 124 482 1107 262 -422 -289 -417 -1078 -1490 -999 -366 -918 -944 -25 194 16 52 983 1259 427
3223 427 422 1222 1076 613 223 884 293 -709 -403 -250 -770 -992 -653 -19 -794 -1124 -457 67 -423 -564
3243 -564 38 808 201 148 648 742 221 367 1275 652 80 -111 585 -112 -528 -154 385 33 -941 -918 48
3264 48 -551 -721 -503 -164 -445 -248 381 677 -164 -66 782 755 353 -113 462 387 67 -164 464 332 -410
3285 -410 81 376 -225 -384 -222 291 -37 -479 157 834 335 -408 219 512 -456 -772 -195 -286 -477 -553 -39
3306 -39 -36 -325 75 762 564 -6 155 443 179 -169 -124 505 393 -15 5 172 -514 -1050 -813 -386 -1019 -792
3328g92N06N47l46J18J334j06k0n63N39n61m86j32M94m82j71K07K49o51n92K03
3348g05M5o23o4O14M04J99J09R14L36q47j56M03j67o90P8K79m49l76l0Q07j55
3369g4m70L63L62m57l86J49M81o5J4P03M19p42J53K90j99q64k27L19k26n42N78
3390d21N00O4l25O00N29o52m20J17o5m91j36L77M05j65J11M1L18m67k89J55Km92
3412g04K99O42O44k04Q9O08k08o84l26J30o90o55R0N67k55m5O79L39l92j21L52
3433A55l13n10q4Q06J02L3L18M86m08l0J19j14o14p08K41M8k62J51M53N25N7l01
3455A50L16P8p02m60L06J37l13L00P17M64j62L34J26m31p71l16K56M9l88L62O24
3476F76j35l16L00l09m67o76j46k51n41j21N23P27K12K87P57O90q65j00J35r2
$$ plain form
3328 -792 -286 261 -85 33 1367 1261 1241 678 1217 656 170 38 532 50 -121 86 335 -316 -908 -705
3348 -705 -660 -1283 -1347 -733 -329 -130 -21 893 1229 382 226 629 462 -228 -150 129 -320 -696 -726 81 -74
3369 -74 -544 -181 181 -276 -662 -513 -32 -97 -83 620 1039 297 450 740 541 -323 -550 -231 -457 -999 -421
3390 -421 79 143 -182 418 947 295 -125 -8 -73 -564 -700 -323 82 -83 28 69 387 -80 -369 -214 -212 -704
3412 -704 -405 237 881 677 766 1374 1166 482 156 286 -404 -1059 -969 -402 -657 -702 -23 316 -76 -197 155
3433 155 -158 -668 -752 54 156 189 507 993 585 555 674 560 -54 -762 -521 -473 -735 -584 -131 394 451 150
3455 150 466 544 -158 -618 -312 -175 -488 -188 529 993 831 1165 1291 860 89 -227 29 78 -310 52 676
3476 676 541 225 525 216 -251 -927 -1073 -1324 -1865 -1986 -1463 -736 -524 -237 520 1210 345 245 380 288
3496B88k57J13R59%k93K39L73o58n43m55jn95q71J19R00K02K60Q12P79n56J92
3517A007L23l85o69j33L63j59k78L41N09j17q89m3k43p76n20j53K76j38L02O19
3537g63P11K47j85N51K88n30n68P1kj55q7Q25M30k96O9M28n91o61K27J23m88n8
3559d14K75Q42k27J04J23N15o72p08k7j54q28j0Q52oK0N29J89M37o43j46L03k26
3581A28r63M75M15J57k70P35j40n51k14l55j44p29m70P04L95J59R9P77Q73p5K84
3602A290j15j27n51J7N1qP0K33K77o67l51o6j93o01q67P0L49M7J03O84N46N96
3624G87J85N24o31l74k29m5l2r38O15L52K34n59N3O1l42k80k53J47k2j27R03L28
3646C57o5K03N95L12o43p35j67L19j049j28L95M91l08L57M81J52n42J74J30n60
$$ plain form
3496 288 31 144 1103 1103 810 1049 1422 764 221 -234 -235 -830 -1701 -1582 -682 -480 -220 592 1371 815 1007
3517 1007 1330 945 276 143 506 347 69 410 919 802 -87 -130 -373 -1149 -1669 -1822 -1546 -1684 -1382 -763
3537 -763 -52 195 10 561 849 319 -249 -178 -180 -335 -422 403 833 537 606 1034 443 -218 9 132 -356 -414
3559 -414 -139 703 476 580 703 1218 546 -162 -189 -343 -1171 -1181 -329 -335 -315 214 403 840 197 51 354 128
3581 128 -835 -360 55 212 -58 677 537 -14 -228 -583 -727 -1456 -1926 -1222 -827 -668 -569 208 1081 1006 1290
3602 1290 1175 1048 497 514 565 557 627 860 1137 470 119 53 -140 -741 -1608 -1538 -1189 -1142 -1039 -355 191 787
3624 787 972 1496 865 491 262 217 185 -753 -138 214 448 -111 -58 3 -339 -619 -872 -725 -747 -874 29 357
3646 357 292 495 1090 1402 759 24 -143 176 -873 -1001 -606 -115 -423 -66 415 567 25 199 329 -231
3666b31J4L17L33j15O6m9J49l66l80j74j20p13K1M85j23J66M88Q49L68l98n1M45
3688I81k27p29M3K07j59m71K70L45j73k59r3N0l93m64O78K78k7j50N92M35J76
3709I10l44K7O8n51j19M1n15J1J15M73j72j96J81O29l81m91Q8M12ql85J90N8j64
3732a23M25O5j94k62j50L40l95l42J85K80L16l7N2N43M62n70k67l1j85l26k0K4
3754b10k70J19K20J67M2m48M67o2l22l2L51K17N9O2mL95n35K24l6m24l42l70L44
3777c88M0n78P58M54j09j29k22O28J09k48O7r2j70R9Jr2l90j53L75j22o03M3K70
3800d52J89j34J73K45N5O13J66J64n26l68K39L67p56m42O00o9l89k20P8N78p05
3821e94K42j37N94l35M16K94k77k57P30K11k15m31J18Pl58m11k91M56n2j56L9
$$ plain form
3666 -231 -217 100 433 318 384 335 484 118 -262 -436 -556 -1269 -1248 -763 -886 -720 -232 617 985 587 536 981
3688 981 754 25 68 275 116 -355 -85 260 87 -172 -265 -215 -608 -1072 -394 -116 -143 -293 299 734 910
3709 910 566 593 661 110 -9 32 -483 -472 -357 116 -56 -252 -71 558 177 -314 -226 186 178 -207 -17 41 -123
3732 -123 302 367 173 -89 -239 101 -294 -636 -451 -171 145 108 160 703 1165 595 328 297 112 -214 -234 -210
3754 -210 -480 -361 -141 26 68 -380 87 25 -297 -329 22 239 298 360 356 751 216 440 404 -20 -362 -732 -388
3777 -388 -348 -926 -168 286 177 48 -174 454 563 315 382 290 120 219 220 128 -262 -415 -40 -162 -765 -722 -452
3800 -452 -263 -397 -224 21 76 689 855 1019 493 125 364 731 -25 -467 133 64 -325 -545 -467 111 -594
3821 -594 -352 -489 105 -230 186 480 203 -54 676 887 672 241 359 366 8 -403 -694 -238 -290 -446 -407
3842d07L32j26J20K56J33L3m8K08j33l96n9l4L84o08N9N84n43l23N36L9j33O0
3864f6M36k84J8N0K70K90m23l21L91j86j59j52q3p1k05J87J0J58m2J1K60o8k74
3887b53N55qr3j31K3L26Rj72j53j30n06L06K40m8l65Q2K38j37j85L74L90j49l11
3910i8K10L06k75l89K29J04k95R0N11k06m17O9N09M3o0m90K81q9o8l18K43pJ5
3933a02l72M49Ol47M57q6k49n6N54o4L77m12L22O8l99k91R8j09L02m51J26o1q9
3956c29k43M67N1l10J76K31O5k73J65L40K58l69K95m9k40o5j49L39p18rj87M32
3978a22l02J65K57J11J23l05M32k91m2K01l42M78q9n1J33k23k23j36P69n07k38
3999b02j97L02p6P1J03L39j65K39k79J35l33j25K75l89j58M9K86J0QM4P9Q1j48
$$ plain form
3842 -407 -75 -201 -81 175 308 341 293 501 368 -28 -87 -121 263 -345 -286 298 -245 -568 -32 7 -126 -66
3864 -66 370 86 104 154 424 714 291 -30 361 175 16 -136 -219 -290 -495 -308 -298 -140 -182 -171 89 21 -253
3887 -253 302 294 201 70 93 419 428 256 103 -27 -533 -227 13 -35 -400 -318 -80 -217 -402 -28 362 213 -98
3910 -98 112 418 143 -246 -17 87 -208 -118 393 187 -230 -161 348 391 331 -159 122 33 -35 -353 -110 -117 -102
3933 -102 -474 -25 -19 -366 91 5 -244 -300 254 190 567 155 477 545 146 -145 -47 -156 146 -305 -179 -240 -329
3956 -329 -572 -105 -54 -364 -188 43 108 -165 0 340 598 229 524 475 235 170 21 360 -358 -367 -554 -122
3978 -122 -424 -259 -2 109 232 -73 359 68 26 227 -115 363 274 223 356 133 -90 -226 543 36 -202
3999 -202 -399 -97 -173 -102 1 340 175 414 135 270 -63 -188 87 -302 -460 -411 -125 -115 -107 -63 16 97 -51
4022e1R9K78P3m81L88J54j40j08K50k03m80q2K17J71n15P3K32j96P3J6L12j48
4044f8L57J33k06L33o92M89P3j68l6qn6j80K0j92q5j34l23L56K57k62n0M53j21
4067a10J4J31jR5j20R3M7N5j24m8n7J22m1L03l3n22N7m6L16o3n23Q28j71k80K55
4092A77O0j36m82K12K99n9q6P9J55m25j25M53K7k82j09lK02k02l02K72J43k7o6
4115b25L6J72m2L53k29l9j19L63j14r7J81m54M19k18k47M39K69l59l4K61J75l39
4137A52j24K52J5k79J66O9j85k16K70P4m65j15M24k40J87k89j2K42K14k48J30
4158B2J19J18j77R0K41m24L22k31J70l67l22J41J7N6q6J56l9l18L51K97L6j71
4180An7K71K99j79J26l8k73P5J65l83k1j76M39j44j36J82k42M8J48k68k9pKm9
$$ plain form
4022 -51 48 326 399 -82 306 460 320 212 462 259 -221 -303 -86 85 -430 -357 -125 -321 -248 -232 80 -68
4044 -68 289 422 216 549 -143 346 419 251 215 207 151 -29 -9 -201 -286 -420 -743 -387 -130 -392 -442 11 -110
4067 -110 -96 35 34 129 9 102 149 204 80 32 -25 97 56 359 326 -196 -139 -185 131 68 -455 373 202 -78 177
4092 177 237 101 -381 -169 130 71 -15 64 219 -206 -331 122 149 -133 -242 -245 -43 -245 -547 -275 -132 -159 -225
4115 -225 -189 -17 -59 294 65 26 -93 270 156 59 240 -214 205 -13 -260 179 448 89 55 316 491 152
4137 152 28 280 295 16 182 251 66 -150 120 194 -271 -386 38 -202 -15 -304 -316 -74 140 -108 22
4158 22 141 259 82 172 413 -11 311 80 250 -117 -439 -298 -281 -225 -311 -155 -194 -512 -161 136 172 1
4180 1 -56 215 514 335 461 423 150 225 390 7 -14 -190 249 105 -31 151 -91 -43 105 -163 -192 -199 -197 -246
4204b46k8K09k93M27J68j43l61J82K17j62J69n3J39j2k27K49K3j6l06P4J53k31
4226f8l55K16J16r8l92N22l15L59r8j00N7n9L05L7%n6L05L81n38q0R4n0l49j45
4250c11J58j28L0J73Q9p0j32J3L65k52k57M47J33m35K79k60N99j26r6Lj84Lk20
4273a79l7J08pK2N5j7J40q2K87j52l16K2P5k45k23J92m4J84j97K42K30k3j69L47
4297B13lj79j3K49J19j30P4m4k17m6l44K31r7j31N5N3qk52L08K8K27l40M16K6
4321A95j65N3J9oL09k0j09k26K23k82J62k0j99j73J1j97K08q8L8O93k37J06k41
4344E4K52j53J86k57j64j5K17J49k04O4j35P0j56m2n7K4j33L58l34J84k28K83
4366c7K58m37J22j61K4p6L6j51J05K12O1k0L95l8p5p0J53j06J21J8M77l70k24
$$ plain form
4204 -246 -274 -65 -358 69 237 94 -267 -85 132 -30 139 86 225 213 -14 235 258 242 -64 10 163 -68
4226 -68 -423 -207 -91 -189 -581 -59 -374 -15 -113 -213 -156 -215 90 127 127 71 376 757 219 139 233 183 -166 -311
4250 -311 -153 -281 -251 -78 11 -59 -191 -178 187 -65 -322 125 258 -177 102 -158 441 315 219 222 38 41 -179
4273 -179 -216 -108 -115 -93 -38 -55 85 3 290 138 -178 -156 -81 -326 -549 -357 -401 -217 -414 -172 58 35 -134 213
4297 213 210 31 18 267 386 256 330 286 69 23 -321 -90 -187 -318 -263 -210 -218 -470 -162 -134 93 -247 169 195
4321 195 30 83 102 96 405 385 276 50 273 -9 153 133 -66 -239 -228 -425 -217 -305 -267 426 189 295 54
4344 54 306 153 339 82 -82 -97 120 269 65 129 -6 64 -92 -134 -191 -167 -300 58 -276 -92 -320 -37
4366 -37 221 -216 -94 -255 -231 -307 -271 -422 -317 -105 -44 -64 331 293 218 148 301 195 316 334 811 441 217
4389B17L24l71l71K91r9p7k73K8r8J15Q4l6M17j1P3j93N8m9j34M4L57k74P8k29
4413a29%j12L60r0m87K25k4j34J40J4K77l26O21j29NR6J2n5j55R3n5L2N4J74j77
4438B30k3K43j13k57j23Q5k1j88M9J47J39p0l44J73K00k75J5j04J14k02Q8K57
4460B0k37M1O5L15k23j09K19qo5j7q6J96L2J82j43J42l67j33J33k48J6J68n2M9
4484a10K9J26J86p3Q6j21J04k49R1J61r6m30L91q6l7K12k77k09M39l51n1o7K74
4507e8j26J71j13K78j78J26K01n52K68l5J67k89J80R7k2lk32L55j29K5j71N1J17
4530A28j75P2K85l11l71M69rk95l0K63j10k32J0L7n9K78Q1j1J51j85K09r3J40
4553B42j16K00o4j53j09Mp1j4J02k10J26q3K8K89m31j0J99mQ6k40L54k41M19m41
$$ plain form
4389 217 541 170 -201 90 -9 -86 -359 -331 -429 -314 -230 -266 151 140 213 20 78 29 -105 -61 296 22 100 -129
4413 -129 -129 -241 119 29 -458 -233 -257 -391 -251 -237 40 -286 335 206 211 307 319 264 109 202 147 179 233 407 230
4438 230 207 450 337 80 -43 42 21 -167 -118 29 168 98 -246 -73 127 -148 -133 -237 -123 -325 -237 20
4460 20 -217 -176 -111 204 -19 -128 91 83 18 1 -85 111 143 325 182 324 -43 -176 -43 -291 -275 -107 -159 -110
4484 -110 -81 45 231 158 244 123 227 -22 69 230 134 -296 95 9 -28 184 -93 -302 137 -214 -265 -332 -58
4507 -58 -184 -13 -126 152 -26 100 301 -251 17 -18 149 -140 40 137 115 112 -120 235 106 131 -40 11 128
4530 128 -47 25 310 -1 -372 97 88 -207 -237 26 -84 -316 -306 -269 -328 -50 31 20 171 -14 195 102 242
4553 242 126 326 262 109 0 4 -67 -81 21 -189 -63 -146 -118 171 -260 -270 -71 -75 11 -229 125 -116 303 -138
4577a38J35O3J12p3j99L71l22K53l68K33l6r2J64l10K03k05K46J29j32N1j50J2
4599e3Qj66L7J14r8K18n1j1j46J45J40R1k12M7J02k09Q1L30r5Ml36J4Q5O1n6j29
4625h5k33J93K0R2J8J53j25j58L38l9j66mJ62O4Nn50N0R7L72J9l61J57J58J0j16
4650G1r0O6N6j32Q6J42o13N59k53K24K0j88P1j20K21p2j08R4K7J66j67k9p9J67
4674A19K11l38j09M00R9m70J40j51K92j46k44R6J96o8J43j91%J39m6K11l36J08
4696E5qP6K7P0k39r9J37j14K40n6J0P5k50J97p3j77j9K51l45L74Q6n07L62%k7
4721D6o8L6k41N8L12j22N5k57J84J84l37j31J95j24M87k91pj27J42R8M7j75J18
4744H2q4M42n55J41J64l17j15n0j9K60j07l0N3K6N2J79k87K03m3p9L12k03K61
$$ plain form
4577 -138 -3 60 172 99 -100 271 -51 202 -166 67 31 -61 103 -207 -4 -209 37 166 34 85 -65 -53
4599 -53 -45 -211 -174 -60 -158 60 9 -2 -148 -3 137 228 16 63 165 -44 37 367 272 276 -60 -46 39 100 44 -85
4625 -85 -318 -125 -105 -13 5 158 33 -125 213 174 8 4 166 230 235 -315 -265 -168 204 223 -138 19 177 187 71
4650 71 -19 47 103 -29 57 199 -414 145 -108 116 136 -52 19 -101 120 48 -60 34 61 227 60 31 -48 119
4674 119 330 -8 -117 283 382 -88 52 -99 193 47 -197 -101 95 27 170 -21 -21 118 72 283 -53 55
4696 55 47 123 150 220 -19 -118 19 -95 145 89 99 174 -76 121 48 -129 -148 103 -242 132 218 -289 73 73 46
4721 46 -22 14 -227 -169 143 21 76 -181 3 187 -150 -281 -86 -210 277 -14 -21 -148 -6 92 139 -36 82
4744 82 -2 440 -115 26 190 -127 -242 -292 -311 -51 -158 -188 -135 -109 -57 122 -165 38 -5 -84 228 25 286
4767B86j12Lk49L47k47L00o14L00j64r6N6j59K66K68k67l61M63O9J7J00O7l66
4789i3K57k61j1K92j49K03q2l02p3N6j3k55K69J1L13P7l03n1K71l32K09Q1J81
4812B95k12j90K97j55j64k6Q1J75j15q7j68K08p4K17j82K95r7o3J17j89J04p5
4834hl8O1j03j1MJ5R4m9r6J63j20J85k07O56l43J75m0j17k22P1Jj52j30r5K93
4859a3k25K23j99r0O2J78k0kJ52M2k23Q6K80J18l31J89nl36K31q4J44j66j25j52
4883b66Jq7J05L34k06j23JK50n4P4K71Lm82p2L57j14K1K68k20k24K52j00o6L01
4907B24j6j52O7J03j00P5n2o6j8J28j39l41P5M9L7j36K2Q3K10j00L9n7L84j29
4931A90lp7o6Pk13K22k13j25K71k41j70k18L70jJ4M6m6K14J9n1L99j16n0R2j68
$$ plain form
4767 286 174 177 -72 275 28 328 -286 14 -150 -246 -190 -349 -83 185 -82 -443 20 89 106 206 273 -93
4789 -93 164 -97 -108 184 35 238 156 -146 -219 -163 -176 -431 -162 -151 162 239 -64 -115 156 -176 33 114 295
4812 295 83 -107 190 35 -129 -155 -74 101 -14 -101 -269 -61 -135 82 -100 195 98 35 152 -37 67 -8
4834 -8 -46 15 -88 -99 -95 -80 14 -35 -131 32 -88 97 -110 546 203 378 338 221 -1 70 71 -81 -211 -306 -13
4859 -13 -238 -15 -214 -304 -242 -64 -84 -86 66 108 -115 -29 251 369 38 227 222 -114 117 33 177 11 -114 -266
4883 -266 -265 -352 -247 87 -119 -242 -241 9 -45 29 300 303 -179 -251 106 -8 13 281 61 -163 89 -11 -77 224
4907 224 208 56 123 226 126 201 149 83 65 193 54 -287 -212 -163 -126 -262 -240 -157 53 -47 -8 -65 319 190
4931 190 187 110 44 51 -162 60 -153 -278 -7 -248 -418 -636 -266 -267 -253 -207 -253 -39 -20 -71 328 212 162 254 86
4956H6J86j60L99q3l0k67J07j07r3N7pn6k69N30k10J2j73k08N31r1k56j23J6K50
4980D1l42K28n4k4o5J57j71o8K98J86K0O4j52K96j33j33j40J8k36j06J77p2l2
5003b43J61n3J72j64K84j72J27J2K00j56K23J6k04j08L91k23K48k77K2k99q0j07
5025b30J03l07J45L3j56j42K51n4J27P3n6K59K25m59K25q2QJ66M4l3k17J43m7
5048A9J52k33M5J25KN6k61K39k58p9qL25J4p00O24Rj65j13R0J50J66l68K16M98
5072E45l91j69K53q2NQj19L4j99j41O1N8k74M5K35lk10J80o2j70J81J11L29k62
5096c7K82j41J75NK5Q8K2k60k36M06k0k49r2R4R4k28n05N25l39J42J99QJ27l52
5120b67M62L59n43p3K18J11J21m82L74j86l13L20j39J61m37J39J23o2j01Q9Qn0
$$ plain form
4956 86 272 112 511 428 398 131 238 131 38 95 88 32 -237 293 83 95 -78 -286 245 154 -102 -225 -209 41
4980 41 -301 -73 -127 -151 -216 -59 -230 -298 0 186 206 270 118 414 281 148 8 26 -210 -316 -139 -211 -243
5003 -243 -82 -135 37 -127 157 -15 112 124 324 168 391 407 203 95 486 263 511 234 256 -43 -123 -230
5025 -230 -127 -434 -289 -256 -412 -554 -303 -357 -230 -157 -213 46 271 -188 37 -45 -37 129 173 140 -77 66 19
5048 19 171 -62 -17 108 110 166 -95 144 -114 -193 -201 124 138 -562 62 71 -94 -207 -117 33 199 -169 47 545
5072 545 154 -15 238 156 161 169 50 84 -115 -256 -195 -137 -411 -366 -131 -134 -344 -164 -226 -396 -215 -104 225 -37
5096 -37 245 104 279 284 309 397 419 159 -77 329 309 60 -32 62 156 -72 -577 -52 -391 -249 -50 -42 85 -267
5120 -267 195 554 11 -62 156 267 388 -94 280 94 -219 101 -38 123 -314 -175 -52 -114 -215 -126 -118 -168
5142a68M1j96M95k24O5J10j5k0j14J74j48k9M3oq0m4J7K76J06k43J78L7j12k05
5166f2j2j43L56l75J69p5J23l90L24N0j57k01L63r5K08l4J7O25j29j32J3n0q3
5189C10l28o3L61n43L8k6r4l03K01L32l6J16o5k20K66n5K88n2K12j78L10k10j96
5212F5j28K86k71k34M1J37M0l7n2N28l50k7M4k2o0N5Q1L8j69j71L14N0l37K8k16
5237c67K83l39K72NJ73q1mM46J5l84j48O17j1n6m05K2k6n75L59p0K92k07j57J47
5261a99K03J6M6L25j83l47L84K5J5R2m09J46k94M8J27k29j2P5P8J42L0k1M5k82
5285a79q4J54J80j6j40J12j06j08J41k97J36p4pR0j3k62J71M8L44j87K03l4L47
5308D19k05k10L52o8j89j52J87k54J70k65J83pM6j89J24j85L23n4K04j84L4Q5
$$ plain form
5142 -168 -127 -323 172 -52 13 123 108 88 -26 148 0 -29 14 8 -72 -116 -99 177 283 40 218 255 143 -62
5166 -62 -74 -217 139 -236 -67 -142 -19 -409 -85 -35 -192 -393 -30 -125 83 49 66 691 562 430 443 393 310
5189 310 -18 -81 280 -263 -225 -251 -345 -648 -447 -115 -151 -35 -100 -320 -54 -109 179 127 339 161 471 261 65
5212 65 -63 223 -48 -282 -241 -104 -64 -101 -153 375 25 -2 42 20 -40 15 96 134 -35 -206 108 158 -179 -151 -367
5237 -367 -84 -423 -151 -146 27 -54 -58 388 403 19 -129 488 477 421 16 38 12 -563 -204 -274 18 -189 -346 -199
5261 -199 4 20 66 391 208 -139 245 270 285 377 -32 114 -180 -132 -5 -234 -246 -171 -93 49 79 58 103 -179
5285 -179 -263 -109 71 55 -85 27 -79 -187 -46 -343 -207 -281 -288 -198 -211 -473 -302 -254 90 -97 106 72 419
5308 419 214 4 356 288 99 -53 134 -120 50 -215 -32 -39 7 -182 -58 -243 80 26 230 46 80 165
5330A65J82l41K3p3J46l59m4J02j29j32M98j6j37j88M18r5L8n7L5N6J51j41J16
5353B18j51l03L16M5l75K04p5K14R1k96K95n0K6k74N5J91Q9K54j52m43J46k61
5375b36J28J89k14m15K92K20k51N2r7L04n3K18Mm7j37P8J8J88k31L05k62J86l08
5398f9q4L41m29K19R2m6l15J44J07J92j60J84K18k76k44rJ49l7Rj4J82l4l57J15
5422a22J62J50l00J61K8j99lJ96L04l34q5j24N5j22J3N4J98q4m9k05N55n05K08
5445d8R4J04k33P1JJ30k71N8J84n7l7L5K01n00K46k67K69m04K87q7K29j22J16
5468aq7l1J39J24K16k28J19j84K97k48l26K63K39n18L00K6qj61k16K35J08r4k76
5491c12O9J75j75j86O30j73j16N8K85j14j28j11M89m14M6qq9J70l84K75r2p4j60
$$ plain form
5330 165 347 6 29 -44 102 -257 -301 -199 -328 -460 38 22 -115 -303 115 20 58 1 36 92 243 102 218
5353 218 67 -236 80 125 -250 -46 -121 93 184 -112 183 133 159 -115 -60 131 220 474 322 -121 25 -236
5375 -236 -108 81 -133 -548 -256 -36 -287 -235 -332 -28 -81 137 141 94 -43 35 53 241 10 315 53 239 -69
5398 -69 -153 188 -241 -22 70 24 -291 -147 -40 152 -8 176 394 118 -126 -135 14 -23 -14 -28 154 120 -237 -122
5422 -122 40 190 -110 51 79 -120 -123 73 377 43 -42 -166 -111 -233 -220 -166 32 -52 -101 -306 249 -256 -48
5445 -48 46 150 -83 -12 -11 119 -152 -94 90 33 -4 31 232 -268 -22 -289 -20 -424 -137 -224 5 -117 -1
5468 -1 -88 -119 20 144 360 132 251 67 364 116 -210 53 292 -226 74 100 92 -69 -285 -50 58 -36 -312
5491 -312 -243 -68 -243 -429 201 28 -88 -30 255 141 13 -98 391 -23 23 15 -74 96 -288 -13 -105 -179 -339
5514c39J07J66j32L08r9q0j04PL8K63l25K32L94k14j32r1J37M4k8P2J11k20j97
5537h2j23L04k0l57K92L8q8j11nj4o5p7J56J54j55J26q0l3nK86n4L14m10M55j51
5562B95l70K30j00M52l32j38j62K22j33l75j32L30N9r5j08J51q3J42J24M22n03
5583a04J27J48L4o7J25QJ42m92J75J00j83m7J96k77k62l5J76N4j22J33R3J20j83
5606a41l0K4K29J20q5J38j85K9l8k1M1N5k24L46p3j25l01J47J96l13L24R9k41
5629b9j10J20J38l62j30K28r0k48R7Q4K92J08J6J22KJ46k03J61k84j9P5K0j64
5652c0k84K77K1l45r6L65p1q9oK74J45j64n9J25L18m05R6K46j13m7Jp3j87k10
5676c11K82K02j64k25P7r6p4M30r0L5j12k97K42K82j46j96K56K2m32J64J40k33
$$ plain form
5514 -339 -232 -66 -198 110 11 -69 -173 -166 -128 135 -190 42 436 222 90 -1 136 180 152 224 335 115 -82
5537 -82 -205 99 79 -278 14 52 -36 -147 -152 -166 -231 -308 -152 2 -153 -27 -107 -140 -145 141 87 401 -9 446 295
5562 295 -75 155 55 507 175 37 -125 97 -36 -411 -543 -213 -154 -249 -357 -206 -289 -147 -23 399 -104
5583 -104 23 171 205 138 263 271 413 -79 96 196 13 -34 162 -115 -377 -412 -236 -182 -304 -171 -78 42 -141
5606 -141 -171 -147 82 202 117 255 70 99 61 40 81 136 -88 258 185 60 -241 -94 102 -211 113 212 -29
5629 -29 -139 -19 119 -243 -373 -145 -235 -483 -386 -302 -10 98 114 236 238 384 181 342 58 39 114 134 -30
5652 -30 -314 -37 -16 -361 -457 -92 -163 -252 -258 16 161 -3 -62 63 381 -24 72 318 205 158 159 86 -101 -311
5676 -311 -29 173 9 -216 -139 -235 -309 121 31 66 -46 -343 -101 181 35 -161 95 117 -315 -151 -11 -244
5698b44J22Q5J33m12O7K42p9m5L96R1K9j60o23N81j70l65L53p8m3m68L15J81r6
5721a88J9qJ64p2j71K42K97L2j75L63j33j07k48J93j17M1l69j45K70j24j6J67
5743h5Q7k13p7L75j77j48K19L5k5j76M17Pk61j73L55r1m8n7n0%L73n01L72L24
5767D82o95J53n3K83k36Q3J02K8j81k82K33j76j05K43J84J82m76J58J78%LK06
5789C14M5j09J07O6q7j46J0J01k36k78K6K14l82M8l64N30J83l03qL29K1k14L89
5812B56j5O7o0r2L6J87l20J44J5l66k4K7P2k27K24p2l4o5j34K89K9J4n1N97j68
5837C29l91K57m3O5n3J97Rj76r7L44j78l74K19q0J19l86L15l72J51j25MJ45j33
5860b54k22K60J91j43j36O4J84M2k03J77K90j78j56M20l5p9j43J46J17m80pJ03
$$ plain form
5698 -244 -122 -37 96 -316 -249 -7 -86 -131 265 356 385 225 -398 183 13 -352 1 -77 -120 -588 -273 -92 -188
5721 -188 -169 -177 -13 -85 -256 -14 283 315 140 503 370 263 15 208 91 132 -237 -382 -112 -236 -252 -85
5743 -85 2 -211 -288 87 -90 -238 -19 16 -9 -185 232 239 -22 -195 160 69 21 -36 -86 -86 287 -214 158 482
5767 482 -213 -60 -113 170 -66 17 119 147 -34 -316 -83 -259 -364 -121 63 245 -231 -73 105 105 108 314
5789 314 359 250 357 423 336 190 200 301 65 -213 -187 27 -355 -307 -671 -141 42 -261 -269 60 81 -133 256
5812 256 241 308 248 156 192 379 59 203 218 -148 -172 -145 -73 -300 -76 -148 -182 -247 -381 -92 -63 -49 -100 497 329
5837 329 -62 195 152 217 164 361 370 194 97 441 263 -111 108 28 147 -239 76 -296 -145 -270 -266 -121 -254
5860 -254 -476 -216 -25 -168 -304 -240 -56 -14 -217 -40 250 72 -84 336 301 222 79 225 342 -138 -145 -42
5882d2L8m53L13J30Pl88N2L89m52L96k7J76J87k6k7L6P0j4Q3P2l20l07%K25l54
5907b36k98J05K99m15Q9J98o0L02n28P89k12j96R8M17k58j14Q8K84l17j04K5K4
5929b0k19q1L70Q9k8k21J11K89o59O23r8K98k02j82J82k28J90r6p2o5k49J50J39
5952B1l42J33J85Q4k57J94L1N4Po9J69j72j88j86K54j19l32L41M8q2j73K43L75
5975B19o9j37K23l5O7K29M4l32j97R8j4k26r6k6R4p0n85L21J46K10l1J13K11P3
5999B30j36K82j6k0r4j54K27j68k29O2P0n67L15l56K87j05k4K16K25j25l6M13
6021B97L5o6j04J74j98O5n3o1J0k48J24k7j40r9L41K7m04L63M5q3j61J40N37j96
6045C18n54MK59j98k10JK87J1J85j64R5K78j46L81m5l73J73QJ33j2l91pl9k04
$$ plain form
5882 -42 -4 -457 -144 -14 -7 -395 -343 46 -406 -10 -37 139 326 300 273 309 379 365 448 520 200 -107 -107 118 -236
5907 -236 -534 -429 -130 -545 -456 -258 -318 -16 -544 245 33 -163 -65 352 94 -20 68 352 35 -69 -44 -20
5929 -20 -239 -320 50 139 111 -110 1 290 -369 254 156 454 252 70 252 24 214 118 46 -19 -268 -118 21
5952 21 -321 -188 -3 81 -176 18 49 103 110 41 210 38 -150 -336 -82 -201 -533 -192 -144 -226 -399 -156 219
5975 219 150 13 236 201 268 497 541 209 12 110 96 -130 -226 -252 -158 -228 -813 -492 -346 -136 -167 -54 157 230
5999 230 94 376 360 340 246 92 319 151 -78 -16 54 -513 -198 -554 -267 -372 -396 -180 45 -80 -116 297
6021 297 332 266 162 336 138 203 150 89 99 -149 -25 -52 -192 -291 50 77 -327 36 81 -2 -163 -23 514 318
6045 318 -236 -232 27 -171 -381 -380 -93 -82 103 -61 34 312 166 547 502 129 302 310 443 431 40 33 -6 -210
6069b10o6K18j05l78j54O07l83J93M04k39M49k93L94R8m6k05j39J05m2k68q6L4
6091a12l96J14j9J71m02K82J13L03k95O1O41m38J07K43l4k47l05M04J48k60k29
6112a50J06j09rK0K94K2j58RM5M5k54Q2J74j92j85K11j12n4j27R6q9l0k8K26J58
6137ij23q3N88Pn4l74N15j11l13K1L8l06k78M6L81k58k64L11J85j72j26L18J98
6160A37K13n61O24K35j68k52L75j56j77l8pj04l6l04L67l21k74L77J5rk84L3K81
6183c4j9P2O7N9J75j9j31PJ9k38J09K19k85N4m6K28o5k22K7P5j49J45j01n3J54
6208D8m41K84K18n90J99K73J04m66N09O4j60Kq2J97J14p4J66M1n42J96J73o3k01
6231c1l61L31j97k96J11L79R5k58K71J00j42p1K45kO5j66J84n1J91l58J66rr5
$$ plain form
6069 -210 -276 -58 -163 -541 -695 -88 -471 -278 126 -113 336 43 437 535 489 284 145 250 208 -60 -146 -112
6091 -112 -508 -394 -413 -242 -644 -362 -249 54 -241 -180 461 23 130 373 339 92 -213 191 339 79 -150
6112 -150 -44 -153 -162 -142 152 174 16 25 70 115 -139 -57 117 -75 -260 -49 -161 -215 -342 -246 -335 -365 -393 -167 -9
6137 -9 -132 -215 373 380 326 -48 467 356 43 64 102 -204 -482 -436 -55 -313 -577 -266 -81 -253 -379 -61 137
6160 137 350 -211 413 648 480 228 603 447 270 232 225 121 85 -219 148 -173 -447 -70 -55 -64 -348 -315 -34
6183 -34 -53 19 86 145 320 301 170 177 196 -42 67 286 1 55 9 237 172 -50 -23 52 -97 48 -53 -106 48
6208 48 -393 -109 109 -481 -282 -9 95 -371 138 202 42 44 -38 159 273 199 365 406 -136 60 233 170 -31
6231 -31 -392 -61 -258 -554 -443 -64 31 -227 44 144 2 -69 176 174 239 73 257 206 397 39 205 196 101
6254A01l41K41m4J29k90P7M10p35j8K16L75o26N30O6j40j17J2M15k39K03R9K21
6276E45k69k54M0L12k02J72j90r0k41j98K48j98j94J11R9J91l07K40J33J53q9
6297A2j7M60k51j38P7M74m37lj84L48m68J57j01J9m66L05K14j84l38M69k01P4
6319a79m6K62K9J82l64k1L39q2m11L01J01k99O0L33J00l89K3J51K57o43K42j0
6341f4O4j00n5J95o7k93J11J55j29OKM62m52J12K37J9j30j65K96P7j19j90j40
6364a68L30l9l88J82o5q3J8K70k98Q9k8j5J37q7K40J56j66j02K27j07j27l23L93
6387D6j16r8j24L44k19Q7J54P1j0l44J77K32K30m33J65j58K42l23P8N7j3N5O5
6410A65j66j61j25K46K32j9j60J58j76k1o0K49l44n8K41J14l98n4K92K30l76l
$$ plain form
6254 101 -240 1 -43 86 -204 -127 283 -452 -470 -254 121 -505 25 91 -49 -166 -154 261 22 225 324 545
6276 545 276 22 62 374 172 344 154 64 -177 -375 -127 -325 -519 -408 -309 -118 -425 -185 -52 101 12
6297 12 -5 455 204 66 143 617 180 177 -7 341 -127 30 -71 -52 -518 -213 1 -183 -521 -52 -253 -179
6319 -179 -225 37 66 248 -116 -137 202 120 -291 10 111 -188 -128 205 305 -84 -61 90 347 -296 -54 -64
6341 -64 0 -100 -155 40 -27 -320 -209 -54 -183 -177 -175 287 -165 -53 184 203 73 -92 204 281 162 -28 -168
6364 -168 162 123 -265 -83 -148 -231 -213 57 -241 -152 -180 -195 -58 -145 95 251 85 -17 210 103 -24 -347 46
6387 46 -70 -168 -292 52 -167 -80 74 145 135 -209 -32 200 430 -3 162 4 246 -77 1 58 45 100 165
6410 165 -1 -162 -287 -41 191 172 12 170 -6 -27 -87 162 -182 -240 1 115 -283 -337 -45 185 -191 -194
6432a94J38J68j88%Q4N5L4j70J46j28PO5k68J47K34m45N10j83l7j07K18l9j19
6455g2R5L38k40j66K26J20j25j14q1K91m05K3K14N9j69k01L12K56n88J49K61j53
6477C0m1j06J13J0l21J64J79j26k1o5K74k90J25j18K02j18J54j29J83k57J4M00
6499B56J7m44j03K41J31q3j12kL12m04K92j74J70P9k88O39l67j86QL91l62j69
6521a58K65J46k25j55M34l26k58P5N1J79j38J15J11K37n07j96N71j94k08pm8J99
6543c7j24K86L93l59k23R9K07n17J5J77k1m7n4J5Q6K17k30J19k5k26KL25k49M
6567a67J92J38M6k63K89J83l19l51L42l1l64O8K41k20L6j05M35k86J30k95K85
6588a6K06j77L3L09o4J0o0K8m0m06J27l10K02k89J45K48j56l3K71L59q9k82J35
$$ plain form
6432 -194 -56 112 -76 -76 8 63 97 -73 73 -55 -48 17 -251 -104 130 -315 195 12 -25 -132 86 47 -72
6455 -72 23 361 121 -45 181 301 176 62 -19 272 -133 -110 104 163 -6 -207 105 361 -227 -78 183 30
6477 30 -11 -117 -4 6 -315 -151 28 -98 -119 -184 90 -200 -75 -193 9 -109 45 -84 99 -158 -144 256
6499 256 273 -171 -274 -33 98 15 -97 -99 213 -191 101 -73 97 176 -112 527 160 -26 -18 373 11 -158
6521 -158 107 253 28 -127 307 -19 -277 -202 -151 28 -110 5 116 353 -154 -350 221 27 -181 -188 -236 -37
6543 -37 -161 125 518 159 -64 35 242 -275 -260 -83 -104 -151 -205 -190 -104 113 -117 2 -23 -249 -247 78 -171 -167
6567 -167 25 163 209 -54 235 418 99 -252 90 59 -305 -237 4 -216 -180 -285 150 -136 -6 -301 -16
6588 -16 190 13 46 355 291 301 241 269 229 -177 -50 -360 -158 -447 -302 -54 -210 -243 28 387 298 16 151
6611A51J82J25l50K16j10l65K4K04q2k30J49l30rm3Q2N78j78%NQ7l1l6K25N3l85
6636f8l23M10m3n17K23M6L37m20L05P0M4j80K72J32l6l58L56K82l35j0J62l6n40
6659b27j95J50J35k21j16K12J32l48M69M97k37J23lJ0r2j21M0J60k75l16J45o7
6681a45N9l38N01k19n70P83N1n1k7J48K08L37k78o1L48l86n62ON2N0k86m2J54
6704b68q4k01K95M4L04l43K90L28j56KKL84j49l12q3J98l56k4j57Lk29l1L61J61
6728b1k16J17K56J7p2N8j23J97j57j74J27j13L2j6K29p05L59J09J25l84J37N62
6750C44j52L9j82L45M3n15J72k29j05j92J9J11J5j65K13L69k46r0L44J64k96J74
6772A80L67J83m41K31n2j62l95o1M44m02m24J39k67K90m05L66K22L68l63P9M91
$$ plain form
6611 151 333 458 108 324 214 -151 -127 77 -5 -235 -86 -416 -425 -468 -386 192 14 14 19 106 75 39 264 317 -68
6636 -68 -391 19 -24 -541 -318 -272 65 -355 -50 20 64 -116 156 288 252 -106 250 532 197 187 349 313 -227
6659 -227 -422 -272 -137 -358 -474 -262 -130 -478 -9 488 251 374 371 381 289 168 208 368 93 -223 -78 -145
6681 -145 -86 -424 77 -142 -712 71 122 71 44 192 400 737 459 398 746 360 -202 -196 -144 -94 -380 -422 -268
6704 -268 -352 -553 -258 -214 90 -253 37 365 209 211 213 597 448 136 53 251 -105 -129 -286 -283 -512 -543 -182 -21
6728 -21 -237 -120 136 153 81 139 16 213 56 -118 9 -104 -72 -88 141 -564 -205 -96 29 -355 -218 344
6750 344 192 231 49 394 437 -78 94 -135 -240 -432 -413 -302 -287 -452 -239 130 -116 -206 138 302 6 180
6772 180 547 730 289 520 468 306 -89 -150 294 -108 -532 -393 -660 -370 -775 -409 -187 181 -182 -103 388
6793C88q3j9j52K30p7j49K61k48n93N2K35J21m10L4M50j52k27K94L06k58l5K05
6815A73l1j96k28M33l4l38n8l8L07j30j82L63J5O6N5M56j96l6j73K92k53m91K64
6838D0J31m2m88k23R3j95k48M38l0L21n3K35L51k07P9M56j3k99R2L28jm82q1K0
6862B22j94k38L1j55J19m04K45Q1j2k08M72K14l00J43L98q4o5k01q7O82o10N8
6884A07j87N55k07j70L3r0j19k10M21k89J7j28L41M0m34k6K69ol47M39k19J37
6906g3J71j74M86n28K83J68j96j65J11L62j87k51R6J30q8o17M5K77j95k68K97
6927c16L5R0o36O19M4j48P1N06J16k22q6M13N4l78J45l6K70n52J58K76m45m35
6949d57L89J46n86q5L53J4J19m13K50M17m69o0L41K63J3o5M59r1k80J41J84l44
$$ plain form
6793 388 305 286 134 364 287 138 399 151 -442 -390 -155 -34 -444 -410 40 -112 -339 -45 261 3 -32 173
6815 173 142 -54 -282 151 117 -221 -279 -317 -10 -140 -322 41 56 122 177 633 437 401 228 520 267 -224 40
6838 40 171 129 -359 -582 -489 -684 -932 -494 -524 -203 -256 -21 330 123 202 658 645 346 438 766 765 283 202 222
6862 222 28 -210 -179 -334 -215 -619 -374 -293 -305 -513 -41 173 -127 16 414 330 265 64 -23 659 49 107
6884 107 -80 475 268 98 131 41 -78 -288 133 -156 -139 -267 74 114 -320 -346 -77 -83 -430 9 -210 -73
6906 -73 98 -76 410 -118 165 333 137 -28 83 445 258 7 103 233 145 -472 -427 -150 -345 -613 -316
6927 -316 -281 -191 -827 -208 -164 -312 -241 265 381 159 73 486 540 162 307 271 541 -11 147 423 -22 -457
6949 -457 -68 78 -508 -593 -240 -226 -107 -520 -270 147 -322 -382 -41 222 235 170 629 538 258 399 583 239
6971B39l97j48L03r2n12J21Q1J47j50k5M12l73j40M21N49m88kN87J34l40J3J95
6993E35J29n82k0J77K4l88N8O3J24m49j48N74l43R5j02j5l2j2L13j52j3qL49P7
7017B54Ml20K75k53J76R5N5M3m56J96M24k71j8m39K61n31J52j14k0M7O8J29K37
7040fqk99K73K96Q3o3l7M15m21J20Kj8j64j11K05k02m47J35R1o6l20K37M42k60
7064a23k83M06L60n27l07N11O3l21k02M67Q5k25j71K30Q0r4r6L71j09k49p8K54
7086D2L60m93J58J58k81l9J34K8k77k80L81K30n29K63K65M2L1l63O71m82j49O6
7108f4L15j85n1J9J79J81p63K40J94o8j51l0L05k98M28k67J86j83k33N17j25k40
7130i4Nl4L77m44J23N4J80r4l29M20k07j61L45N0m03J42N9L47l95J48J76j91N6
$$ plain form
6971 239 -158 -306 -3 -95 -607 -486 -405 -258 -408 -433 -21 -394 -534 -113 436 -52 -54 533 667 327 340 535
6993 535 664 82 62 239 263 -125 -67 -4 120 -329 -477 97 -246 -151 -253 -268 -300 -312 1 -151 -164 -172 177 254
7017 254 258 -62 213 -40 136 231 286 329 -127 69 493 222 204 -235 26 -505 -353 -467 -487 -440 -372 -243 -6
7040 -6 -14 -313 -40 256 339 276 239 654 233 353 355 337 173 62 267 65 -382 -247 -156 -222 -542 -305 137 -123
7064 -123 -406 0 360 -167 -474 37 100 -221 -423 44 129 -96 -267 -37 43 -51 -147 224 115 -134 -212 42
7086 42 402 -91 67 225 -56 -95 39 67 -210 -490 -109 121 -408 -145 120 162 193 -170 501 19 -130 -64
7108 -64 251 66 15 34 213 394 -369 -129 65 -3 -154 -184 121 -177 251 -16 170 -13 -246 271 146 -94
7130 -94 -89 -123 254 -190 -67 -13 167 73 -256 164 -43 -204 141 191 -212 -70 -11 336 -59 89 265 74 130
7153A30j63P1lk42J20J09K11p06M96L0n4k1j97M63k87j67R8N69k97l10N13j10
7175B53j77r3J16J53k95j49qM00l25j94M57j65l92M11j91K3k63K55L41J87k31
7196A13J23J3K4k44L47j33l12l3o7r7k66J39L83k46N0n4K42N1r7J9O7M96m60k2
7220C6K08K13q50P85J34l49m91P4K67j39l33L80J16M9l46M59L47j77k33K59k1
7241C88m45j91O4K89l06l9o9K17l17N2L63k03j24K26L33l0j00J41K68%k00J88
7263E05k31l74J3K24n28n2k29M21Ll51K97J48L22j36K8M18n3j34j4L18k24m26
7285e5M2L33m79k80L38l62J45n3K89l7l7j73K09N77l43M3M14N7l91l2J92j29l32
7308f4k99L07l16k83K04L62j96l12O98J82r1l01M62L00k39j49J26J08m16k05J91
$$ plain form
7153 130 -33 38 35 -207 -87 22 233 -473 23 53 -1 -22 -219 244 -43 -210 -112 457 160 -150 363 253
7175 253 76 -17 99 252 -43 -192 -200 200 -125 -319 138 -27 -419 -8 -199 -176 -439 -184 157 344 113
7196 113 236 249 273 29 376 243 -69 -102 -169 -266 -532 -393 -10 -256 -206 -260 -18 33 -64 -45 22 518 58 36
7220 36 244 457 -393 392 526 177 -314 -240 27 -112 -445 -65 51 100 -246 213 560 383 150 409 388
7241 388 -57 -248 -184 105 -201 -240 -309 -92 -409 -357 6 -197 -321 -95 238 208 108 249 517 517 317 505
7263 505 274 -100 -87 137 -391 -443 -672 -251 -248 -599 -302 -154 168 32 60 478 425 291 277 595 371 -55
7285 -55 -13 320 -159 -439 -101 -463 -318 -371 -82 -119 -156 -329 -120 457 114 157 571 628 237 205 397 268 -64
7308 -64 -363 -56 -372 -655 -451 -89 -285 -597 101 283 192 -109 353 653 414 265 391 499 83 -122 69
7329F9j15m22j95J07M2m4M55K91k0k20K63L70n8n20P28O4l46m24J42J3o25j20
7351e65K63k8m84K48L24J37l37K52P92j90R3j13L69k67m11K38j83l63Km5j28o3
7373d59k83K96L69o75M85J77r1J01K82L46p9k93o4M33l65pj32km49k85P7N16l74
7396d76kM64J08j54R2N42N6j63j9K27k57l43m7j84K72p08L88m9k40k03q8O51o9
7419b02j51M86J85K7k41M72Ml88j7q5J45n52J45K15j73k57k63M81j58j81K62L66
7441A20M1l48J82M23k82J8L30nm41k42K14J43m78o8L21K50k78j38L46L55l45J76
7463B94P4Om29K20j81J27j44m6k06K9p62K37N33k17j27J43M33k39J98M32K75J50
7485H00k16J69K44p61Jp3r8k46m5O4k19n78J91J66O7q8K33L47j48L4L49J95j1
$$ plain form
7329 69 -46 -468 -663 -556 -514 -558 -103 188 168 -52 211 581 523 3 731 795 449 25 167 180 -445 -565
7351 -565 -302 -330 -814 -566 -242 -105 -442 -190 602 412 505 392 761 494 83 321 138 -225 -223 -268 -396 -459
7373 -459 -742 -446 -77 -752 -267 -90 -181 -80 202 548 469 176 112 545 180 173 41 39 -410 -695 -618 -102 -476
7396 -476 -478 -14 94 -60 32 574 630 467 448 675 418 75 28 -156 116 -592 -204 -253 -493 -696 -784 -133 -202
7419 -202 -353 133 318 345 104 576 580 192 175 90 235 -317 -172 43 -130 -387 -650 -169 -327 -508 -246 120
7441 120 161 -187 -5 418 136 154 484 479 38 -204 10 153 -325 -393 -72 178 -100 -238 108 463 118 294
7463 294 368 374 -55 165 -16 111 -33 -79 -285 -256 -1018 -781 -248 -465 -592 -449 -16 -255 -57 375 650 800
7485 800 584 753 997 236 237 164 66 -180 -225 -161 -380 -958 -767 -601 -534 -622 -389 -42 -190 -156 193 388 377
7508C77m4P44%q65J33K1o0m41J02O5j23m21J32L37k13k44K64K93k24j32M44K47
7530C92M8l84J50K41l58J5J45L15m23j46L28m37Q0j25M25m9k48o9n3K98k51K15
7552A09k50Q5j09j7k2o5j79M41J02n25n5N94L6j53l3N05j96K00o4N5J25m31o5
7575H8M28m18j85j17J71n80j89L42k1K45l70K79J00k42K21N64J97J18n21M33J70
7596G13p44M62J10l81n68m8M86k74k87K01o8Q5j17K36K86j88k9L84l2k17j54L77
7618B33J31m83r8L38j4j02l85M96l03J37r7N35j78k64L40j36O6J32q9J51l24m34
7640c48k3J88j72k31O38m14J44j57K60L52j35q8K71L61n45p5O36l2m90p7K37l16
7662a6k95j7Q9L7n91L37J92k14k12L42K39j52J19M68K08j57L0L1L59q86J34J38
$$ plain form
7508 377 333 1077 1077 212 345 366 306 -135 -33 32 -91 -512 -380 -43 -256 -500 -236 57 -167 -299 145 392
7530 392 440 56 206 447 89 104 249 564 141 -5 323 -114 -34 -159 266 217 -31 -100 -153 145 -106 109
7552 109 -141 -56 -165 -182 -204 -269 -448 -7 95 -430 -485 109 145 -8 -41 464 268 468 404 459 584 153 88
7575 88 516 98 -87 -204 -33 -613 -802 -460 -481 -236 -606 -327 -227 -469 -248 316 513 631 110 543 713
7596 713 -31 431 541 160 -408 -456 30 -244 -531 -330 -398 -313 -430 -194 92 -96 -125 259 227 10 -144 233
7618 233 364 -119 -217 121 107 5 -380 116 -187 -50 -147 388 210 -54 286 150 216 348 259 410 86 -348
7640 -348 -371 -183 -355 -586 52 -362 -218 -375 -115 237 102 14 285 646 101 26 662 630 140 63 300 -16
7662 -16 -311 -328 -239 -202 -793 -456 -264 -478 -690 -348 -109 -261 -142 326 534 377 407 438 797 -89 45 183
7684A83j72k8j07P5k9n57J49M14j20k30M87J14N1l94k1M08o7j24J01L91n42J9
7706AK89k52m1j93J39M23o82J83L86l8n88M92J75j51l82m0N44l83m38M64J14k27
7728b05q5p7P51k91l83J61N23j84l80O37o9j65l08M71k24k56j64K14R7l15j90
7749d42L82l01k28K85L30j16k46K34M65l15q4O37j90j04l00J56j10n0J19R6j95
7770B3m10K55j06K09n43K09O00o01n2K67K48L0j19K27L39l30l44L28J75l44k8
7791C3M18j32n00J32K05j89k45K37R5m7j80j08N89l74j21K45M20p20J23Q6J24
7812I1n42M01R4j86l36J95K85j2k99J48O59k98j6j38K70J45l59L34k5k49j03j52
7834i3K8P3m42K06L45k58k71K03J11n1K77k5M69m71J16M9J49l71J66k34k9k64
$$ plain form
7684 183 11 -17 -124 -49 -78 -635 -486 -72 -192 -422 65 179 230 -164 -185 223 156 32 133 524 -18 1
7706 1 290 38 -3 -196 -57 366 -316 -133 253 215 -373 119 294 143 -239 -279 265 -118 -556 -92 22 -205
7728 -205 -290 -367 384 93 -290 -129 394 210 -170 467 398 233 -75 396 172 -84 -248 -34 63 -252 -442
7749 -442 -60 -361 -589 -304 26 -90 -336 -102 363 48 -36 601 411 307 7 163 53 3 122 218 23
7770 23 -387 -132 -238 -29 -572 -363 237 -364 -416 -149 99 129 10 237 576 246 -98 230 405 61 33
7791 33 451 319 -181 -49 156 -33 -278 -41 54 7 -173 -281 308 -66 -187 58 478 -242 -119 -33 91
7812 91 -451 -50 44 -142 -478 -283 2 -10 -309 -161 498 200 184 46 316 461 102 436 411 162 59 -93
7834 -93 -65 8 -434 -228 117 -141 -412 -209 -98 -149 128 103 572 101 217 266 415 44 210 -24 -53 -317
7856c17j17L44j53j90M2L90j43l88N39J59M0l9L60p3k99j65L93o4n97J51n4j3
7878a94l28L3L29r4M10n4n0K54k48K92J89j20k71N33j58n24j21P0j24k38k48K29
7900d33J43k30j99N76o0j08J53N71K8k16K72m3j17k44l0N17p02k90J36J3q7l71
7922g21K39O93m85l2N47k49L13o1L35L0m17l0J14k74k31M2M37l56l09k92M91J7
7944a99m6J87L30p6k33N20N5l67l0J14K64m86m19M42J9o58K88J48l61q7Q5L17
7966a93K00j64J50L94j77n3O86j89l61l5l16K31n06J94j45k9k46j62L98m2N1q2
7988c96N77O3l36N7O02j70k54O7L95l70p55M92J45m99L5K9J41j65o5J17M45r1
8010F4m03O80j66j03J2L45n0m92k2K68R7m88LJ45j52j17L58Q4l03k2K12O42k81
$$ plain form
7856 -317 -434 -90 -243 -433 -391 -1 -144 -532 7 166 206 167 527 454 155 -10 383 319 -278 -127 -181 -194
7878 -194 -522 -489 -160 -254 156 102 52 306 58 350 539 419 148 681 523 -1 -122 -52 -176 -414 -662 -433
7900 -433 -290 -520 -719 -143 -203 -311 -158 413 441 225 497 454 337 93 63 580 -122 -412 -276 -263 -350 -721
7922 -721 -482 211 -274 -306 241 -8 305 244 579 609 192 162 276 2 -229 -187 250 -106 -415 -707 -216 -199
7944 -199 -245 -58 272 196 -37 483 538 171 141 255 519 33 -386 56 75 -583 -295 -147 -508 -595 -510 -193
7966 -193 7 -157 -7 387 210 157 843 654 293 258 -58 173 -333 -139 -284 -313 -559 -721 -323 -365 -314 -396
7988 -396 181 244 -92 -35 567 397 143 210 605 235 -520 -28 117 -382 -347 -318 -177 -342 -407 -290 155 64
8010 64 -339 341 175 72 84 429 379 -113 -135 133 230 -258 -255 -110 -262 -379 -21 63 -240 -262 -50 592 311
8033C11k54K95R4k95j90J82J62l27L2k75O8l08L95K08j70k39K33K51q2k08K28
8054A11M54o29L04l2M4l53k67N23O1o41j19L75K23j27j11L17m7j38O7K27Jr3K71
8077D21n0k3k31j60N13k64l97l1L32l51M7J19j15J09k27N30k96j89J7L81L40n52
8099g7j87Q63l48k79j62K97L59o47J49J01k51l5J92J73k80k28O75l1j27l00M74
8120C31m4n81n4M30k48K37m97L48j16M4J64J07n9k92M37J74k28l42K51K15N1l10
8142A8L06j60k02k42J16P6k51k70M96L5j59l71O49P4m63K98N90m35j57J46J09
8163B03N9k70L24m7l03j2J9N8j49K0R0J68n04J95M21m35k4J02J91L82n81k5K96
8186A78K18m43j65M98k14
$$ plain form
8033 311 57 352 446 151 -39 143 305 -22 10 -265 -197 -505 -110 98 -72 -311 -78 173 91 -117 111
8054 111 565 -64 240 208 252 -101 -368 155 216 -425 -544 -169 54 -73 -184 133 86 -52 15 242 243 150 421
8077 421 371 348 117 -43 470 206 -191 -222 110 -241 -194 -75 -190 -81 -308 222 -74 -263 -246 135 475 -77
8099 -77 -264 599 251 -28 -190 107 466 -181 -32 69 -182 -217 -25 148 -132 -360 315 284 157 -143 331
8120 331 287 -294 -348 82 -166 71 -426 -78 -194 -150 14 121 62 -230 207 381 153 -189 62 277 328 18
8142 18 324 164 -38 -280 -164 -88 -339 -609 -113 -78 -237 -608 41 115 -348 -50 540 105 -52 94 203
8163 203 262 -8 316 269 -34 -46 -27 31 -118 -98 -8 160 -344 -149 272 -163 -187 -85 106 488 -93 -118 178
8186 178 396 -47 -212 286 72
8191G2
$$ Imaginary data points
##PAGE= N=2
##DATA TABLE= (X++(I..I)), XYDATA
0@%%%Qj6J6j6J6k4L3m1N6p2Q9j06J30j56J87k25K63l08L60m19M84n58O38p28Q29
28D40r41J065j201J351j515J697j897K115k351K615k905L220l567L951m375M843
44B545n364N948o605P350q202R189j0348J1728j3409J5506j8219K1873k7100L5266
58B0158m9955Q4797l21572l80496K35059J36501J98987J55933K16060J10691N4688
69D60851k2797l8738j11011j00865q8203p5830j07198m3622K6891K9756n0229
80a20995m9554p570l943n6451l6901K5516O6142O6764R5142J08773Q2683N4816
92B24422O3221K7730n8718r7392m3811j1408m4772m9332K1479O4149K8566j0171
104A13963r108k5526o7121p8654o5853p7366p5944q684O0275N0641K6496O6061
$$ plain form
0 0 0 0 0 8 -8 8 -8 8 -16 17 -24 32 -40 49 -57 73 -83 104 -121 142 -166 194 -225 259 -299 339 -389 440
28 440 -501 564 -637 714 -801 896 -1001 1114 -1237 1378 -1527 1693 -1874 2077 -2298 2545
44 2545 -2819 3129 -3476 3874 -4328 4861 -5487 6241 -7168 8338 -9881 11992 -15108 20158
58 20158 -29797 55000 -266572 -647068 -412009 -275508 -76521 79412 295472 406163 460851
69 460851 438054 399316 288305 187440 99237 23407 -83791 -127413 -100522 -70766 -120995
80 -120995 -170549 -178119 -182062 -238513 -275414 -249898 -183756 -116992 -21850 86923 169606 224422
92 224422 287643 315373 256655 159263 115452 104044 59272 9940 31419 95568 124134 113963
104 113963 104855 79329 12208 -66446 -132299 -209665 -285609 -294293 -234018 -183377 -156881 -90820
116i0820J02009M4964l4631l5821l43n207j4844K2434N7621N2699M8181N4417
128B00659J7002n0011o0711l0419n2690j05190q3525M87L2752J2219K5404O7008
140b7015N6515P913j0458j2435l6518m0100M698L3343J1917J5044P1843Q7183
152A61930K1167k8845j3468j2511o4741q8796m8208j2877r344R717M0319K8780
164a6877J087J2421K6534k0208o8453m0847O776m434k3739K2404P9276O8753L1347
177G4040K5664J7694k1912m2935k3832j9683l5669r316M5758M5260p18j243L3335
190H6443J3800n2149o9157l7773l1983m4701j7500K8133L7428L6543N9194N9304
202F7582R084k2940Q18P926l6595n0924J430L7491J2775j535K4783K7842j2749
$$ plain form
116 -90820 11189 56153 21522 -14299 -14642 -19849 -34693 -12259 45362 98061 146242 200659
128 200659 217661 167650 106939 76520 23830 -81360 -164885 -164398 -131646 -119427 -94023 -27015
140 -27015 29500 37413 26955 14520 -21998 -62098 -57400 -24057 -12140 2904 74747 161930
152 161930 183097 154252 140784 128273 63532 -25264 -73472 -86349 -95693 -85976 -45657 -16877
164 -16877 -15790 -3369 23165 2957 -65496 -106343 -99567 -104001 -127740 -105336 -26060 42693 74040
177 74040 99704 117398 95486 52551 28719 9036 -26633 -35949 9809 55069 54351 53108 86443
190 86443 100243 48094 -21063 -58836 -90819 -135520 -153020 -124887 -87459 -50916 8278 67582
202 67582 76666 53726 54544 62470 25875 -25049 -23619 13872 26647 25112 49895 77737 64988
215F4988l4769k5846l5687n1786k2795K0237J4587P10L6828P4011M2189r488n491
228F7688J1131k3275o0688m2479r476p198J240L5886M3139J1013P78J9238R2m5819
242A270l9980R756J7564j3691m093L8091L7436K112m243N700j7616m5609l3656
255d6959j5252k5380j8297L2554N9934K8184N316L1447L5869j1391l9718j6664
267A9643m603k5192k4053R282J8133K373J0740K5977N24l4400j8915J1785m492
280a3198k9688j762L5223K1766l794J3187L1711N015k2638j8477j8746m1580l4925
293g7906P937J9931p85Q279M5777L9529l615r239J8500J1934k2635k1724L295
306A9278k174j8907k244J5711m693k2424k570O906k5149l9569j481K3989N331
$$ plain form
215 64988 30219 4373 -31314 -83100 -105895 -85658 -71071 -70361 -33533 40478 82667 73179 67688
228 67688 78819 55544 -5144 -47623 -57099 -64297 -63057 -27171 15968 26981 27759 46997 47089 1270
242 1270 -38710 -28954 -11390 -25081 -29174 8917 46353 48465 44222 49922 32306 -13303 -46959
255 -46959 -62211 -87591 -105888 -73334 -13400 14784 20100 51547 87416 76025 36307 19643
267 19643 15040 -10152 -34205 -24923 -6790 -4417 6323 32300 32824 -1576 -20491 -8706 -13198
280 -13198 -42886 -44648 -9425 12341 8547 21734 53445 58460 35822 17345 -1401 -42981 -77906
293 -77906 -69969 -50038 -50823 -42544 3233 42762 39147 29908 48408 60342 37707 15983 19278
306 19278 17104 -1803 -4047 11664 6971 -15453 -18023 -11117 -36266 -75835 -77316 -53327 -47996
319d7996J326L6859N1062K0890L211J4654N641k5631k7820p721j8662l7661j6346
332d8194J7751O058j9420k440K2750M439k0196o75K4140J0260k677J7675K9816
345C9287R825J521K0044J2540k6820l7657j3310j3082l6370k4933J5720J9326
357c3909o730k721K1497J6509k530R212K5517N812j3997L267J8413l928j8036
370A8376N174J5669j5240l3191j0777j25k0996k3893O082J4924k308L468L0088
383a2749K6282J479P112K6375R326j9802q076J3783k736k5836j0623P906r608
396B833k5265n977P912j1784j9732N466J4569n527m168K7340L2609P188L096K2557
410E1117J2060j9323j7379N725j475k2605j2664O005q763k7530r187J1870k095
$$ plain form
319 -47996 -46670 -9811 41251 62141 65352 80006 85647 60016 32196 24475 5813 -31848 -48194
332 -48194 -30443 -24385 -43805 -46245 -23495 -19056 -39252 -39927 -15787 -5527 -8204 9471 39287
345 39287 49112 50633 70677 83217 56397 18740 5430 -7652 -44022 -68955 -53235 -33909
357 -33909 -40639 -43360 -21863 -5354 -7884 1328 26845 32657 18660 21927 40340 36412 18376
370 18376 23550 39219 23979 -9212 -19989 -20114 -41110 -65003 -58921 -43997 -46305 -42837 -12749
383 -12749 13533 15012 22124 48499 57825 38023 29947 43730 40994 15158 4535 12441 2833
396 2833 -22432 -28409 -20497 -32281 -52013 -46547 -31978 -37505 -41673 -14333 18276 25464 28560 51117
410 51117 63177 43854 26475 32200 30725 8120 -4544 1461 -7302 -34832 -44019 -32149 -34244
423c4244j4073P507K2386K592o478J8428K9326O944j337J5740J2603j6455k0282
436B2657J167j935k5470k0597K970k526k1581q168J5562P334p296J0035K8623
449G75J3416k057J5249K6012J629j5532R71O848j7329k5522m332o63k3910k5416
463d9861j509K153j3389j165K6313K1697P87R825L0171J7532l258Q407K3484K361
477G3548k2328j3989m301k1720l0053p986J341j8787k2705L203J2054m857L13
490e6267K9200L0791O151N172K4964J8423n407l884R041m762k5984j5911j442
503A0085j5846k8506p959Q998p334j5494J0443K7329R423o79J6027K1227J34n174
517B2674J1015P694j5869j5044Q82q239k7841j5374J0647M916j1753J518K3933
$$ plain form
423 -34244 -48317 -40810 -18424 -15832 -22310 -3882 25444 32388 31051 46791 59394 42939 22657
436 22657 23824 21889 -3581 -24178 -21208 -23734 -45315 -53483 -37921 -30587 -37883 -27848 775
449 775 14191 12134 27383 53395 55024 39492 40463 47311 29982 4460 128 -535 -24445 -49861
463 -49861 -51370 -49217 -62606 -63771 -37458 -15761 -14974 -5149 25022 42554 39296 47703 71187 73548
477 73548 51220 37231 32930 11210 -18843 -26829 -25488 -44275 -66980 -63777 -51723 -56580 -56267
490 -56267 -27067 3724 9875 15047 40011 58434 53027 49143 58184 53422 27438 11527 10085
503 10085 -5761 -34267 -42226 -33228 -40562 -56056 -45613 -18284 -8861 -9540 6487 27714 27848 22674
517 22674 33689 41383 25514 10470 11352 3113 -24728 -40102 -29455 -24539 -36292 -34774 -10841
530a0841J3534l029R188K3632J0669k863O846P634j6070k4822o878l573k5133
543b1706k5316M36L587j7669j3963J4517K2875R809J5082L1024K1678L522R331
556E3207J8649k21j7724o599J496k1296l6414j5046J635j4685k4314l135J1568
569e2879J298Q74K0778K3805P783R305K2777J3745q320r86J5484n59k9058k3119
583I28j418o833k0811p480J1864M885n388Q252J6024M069Q19J6980J5647j1194
597B6344j6978K604L404k0369k2669N12N039j4377j4789L663N755r30J0698K6355
611e738J7597Q037K1913K9516N766j4368j030P553j6133l5142k0931q277j9905
624c1142k4380o599K360m749J159J9508J6605K156J2764L2216K0559l703L659
$$ plain form
530 -10841 2693 -336 8852 32484 43153 40290 47136 54770 38700 13878 7000 3427 -21706
543 -21706 -47022 -46586 -42999 -60668 -74631 -60114 -37239 -27430 -12348 18676 40354 43876 53207
556 53207 71856 71635 53911 47312 48808 27512 -8902 -23948 -22313 -36998 -61312 -64447 -52879
569 -52879 -51581 -50707 -29929 -6124 1659 10964 33741 47486 39166 38180 53664 53105 24047 928
583 928 -490 -7323 -28134 -35614 -23750 -18865 -24253 -16001 23 4092 4911 21891 37538 26344
597 26344 9366 11970 15374 -4995 -27664 -27152 -22113 -36490 -51279 -47616 -41861 -42791 -32093 -5738
611 -5738 11859 19896 41809 71325 77091 62723 61693 69246 53113 17971 -2960 -11237 -31142
624 -31142 -55522 -62121 -59761 -64510 -63351 -43843 -27238 -25082 -12318 19898 40457 36754 40413
637D0413K4130J2702j3145j4081m329j6362l1467k2925j1388j6415j3469P866
649e8470J3437k616k97K5425K9541L527m297J3155J2391j0652j5033K597N592
662A4300n802l461L623q068j8943m546Q321n057j2923J1631L0288J4589r98J3184
676C6138K4549N465j3214j0554j0316k3366k2431q250q526j8761n230J5687Q792
689c0017j0613j187K1128J3876p700j928J8674J8402P573J2181J7318K641r864
702E0484n779j0448k9450k9077m264K594j6641j6605J1435K2190N031k48J3666
715g112J3006l572o021J704j400n576R876K2298O305q047N736J4923o927k5157
729A0036j0657O457k772j1512K304J3933O299J683P004j661j9693j7367k953j0537
$$ plain form
637 40413 64543 77245 64100 50019 45690 29328 -2139 -25064 -36452 -52867 -66336 -58470
649 -58470 -45033 -47649 -47946 -22521 7020 10547 6250 19405 31796 21144 6111 8708 14300
662 14300 8498 5037 8660 592 -18351 -22897 -14576 -19633 -32556 -20925 9363 23952 22954 36138
676 36138 60687 66152 52938 42384 32068 8702 -13729 -21979 -30505 -49266 -54496 -38809 -30017
689 -30017 -40630 -41817 -20689 -6813 -14513 -16441 2233 20635 28208 40389 57707 60348 50484
702 50484 44705 34257 4807 -24270 -28534 -25940 -42581 -59186 -47751 -25561 -20530 -20778 -7112
715 -7112 5894 2322 -3699 -1995 -3395 -8971 905 23203 29508 21461 27197 42120 35193 10036
729 10036 -621 5836 3064 -8448 -6144 7789 14088 15771 22775 21114 1421 -15946 -18899 -29436
743b9436k6466j1809J7687J8746J014O538K4906J9263R40o25N339k190o043O500
757B4364J1088j634l315J1823P429k1048l0572j0653l768j9894k2259o00J0037
770d9002L341O009J8290J7328P740J1805J2470p255k0090k952J4193K394r608
783D663O383K1328N837j0555m640K480q808j5530p317n745j2093k426J5884R238
797a301q722m877J0786Q77k1835j8051L381N532m269M425K1917K2357J7455K1257
811D8932J7145l889j3343j861k755k1732k3235J47Q480r993j7247k567J872j1839
825c1885j5026m371j757m978O818K1006J5862J1104K6292L5232J3143j0603n298
838E5539K092j4487k8672j5935K69k692p172R78K662p356n822M455k506j8257
$$ plain form
743 -29436 -55902 -67711 -50024 -31278 -30264 -23726 1180 20443 21383 20758 26097 23907 17864 24364
757 24364 35452 33818 30503 42326 49755 28707 -1865 -12518 -16286 -36180 -58439 -59039 -49002
770 -49002 -45661 -39652 -21362 -4034 3706 15511 27981 20726 636 -2316 11877 14271 4663
783 4663 11046 32374 38211 27656 23016 25496 16688 1158 -6159 -11904 -23997 -26423 -10539 -1301
797 -1301 -10023 -14900 -4114 -3237 -25072 -43123 -39742 -34210 -38479 -34054 -12137 10220 27675 48932
811 48932 66077 62188 48845 46984 44229 22497 -738 -591 7889 -2104 -19351 -21918 -20046 -31885
825 -31885 -46911 -51282 -53039 -58017 -51199 -30193 -14331 -3227 23065 58297 71440 60837 55539
838 55539 57631 43144 14472 -1463 -1194 -3886 -11058 -10080 -7418 -14774 -20596 -16141 -18647 -36904
852c6904j0089J1186J1210k230O104K5142K0840j13m923K140m975j4665q703k122
866h102o717l824J5208K0985M662k650J0749Q522j5276k4743p399K874o411p016
880a9138O300Q629J26L409R590l46j1666l080O619m666j4444M175K3703J4193
894B3404L94O167J1437m117j9332j5262j1396j8079j3130K245L674n605J957J9769
908a7874J3632p430o695Q352M709j0688o041J2117J3463O759J1294J4976K603
921C9177o899q06k017j8554k1712j804Q048l477l742J4374K0401K967p959j412
935A6585j898j1529r487J582r87o188M399J5119M012q549R46J0308m362k0201
949a0250j1587J978j922o273O224J4137N629O40N577L38j3524j2203L540J512
$$ plain form
852 -36904 -46993 -35807 -24597 -26827 -20723 4419 25259 25146 20223 22363 17388 2723 -5980 -8102
866 -8102 -14819 -18643 -3435 17550 22212 19562 30311 38833 23557 -1186 -8585 -5711 -12122 -19138
880 -19138 -12838 -4209 -4083 -674 8916 8570 -3096 -6176 443 -4223 -18667 -14492 9211 23404
894 23404 23798 29965 41402 37285 17953 2691 -8705 -26784 -39914 -37669 -33995 -39600 -37643 -17874
908 -17874 -4242 -11672 -18367 -10015 -5306 -15994 -22035 -9918 3545 10304 21598 36574 39177
921 39177 32278 31472 29455 10901 -10811 -12615 -4567 -8044 -11786 2588 22989 25956 17997 16585
935 16585 14687 3158 -6329 -4747 -5734 -11922 -7523 7596 11608 3059 4005 14313 9951 -10250
949 -10250 -21837 -19859 -21781 -28054 -21830 -7693 -2064 -1424 4153 4491 -9033 -21236 -17696 -16184
963a6184j1442m537J4927J5187P68L452J5133R791n333n198L53n352q489L851
977F927J0657m46m362R028J1610p427j6229m290m47j3992j6097R77R235L738N254
992e864J3202O626n815k897M540m664j5337m597Q050j68r659K483J5709N938o488
1007A059k960n65j0504j3060Q4N567o98L865J7194J3924k428l012R053M028j2433
1022I114j0002L163K754o304j86R264M878l555K238N374o870j3055j440M540n920
1037f007q154P083J4370J651m002N101N717p259j0650j494l113j0480l407R637
1051a1007N217m788K846J2047K493r250j498R070L04r203q82P339J051k073P504
1066I170R248m421r197j023k919j4221r470O990R017l730p91J1526R092l132j63
$$ plain form
963 -16184 -27626 -32163 -17236 -2049 -1281 2171 17304 27095 21762 16564 16917 11565 3076 6927
977 6927 17584 17138 12776 21804 33414 25987 9758 5468 5021 -8971 -25068 -24091 -14856 -11118 -5864
992 -5864 7338 13964 8149 5252 9792 5128 -10209 -14806 -6756 -6924 -16583 -14100 1609 7547 1059
1007 1059 -1901 -2466 -12970 -26030 -25946 -20379 -21077 -17212 -18 13906 11478 8466 17519 21547 9114
1022 9114 -888 2275 5029 -1275 -1461 7803 12681 9126 11364 16738 9868 -3187 -4627 -87 -6007
1037 -6007 -14161 -7078 7292 8943 4941 10042 15759 8500 -2150 -3644 -6757 -17237 -20644 -11007
1051 -11007 -5790 -10578 -7732 4315 6808 -2442 -3940 5130 5434 -3769 -4651 2688 3739 1666 9170
1066 9170 18418 13997 4800 3777 858 -13363 -22833 -15843 -6826 -10556 -11347 179 9271 6139 5976
1081E976O794L12r647l262M400k623o999L957R221k837j0195J75M462p731j0442
1096a8439J908O777j547o32J1758J1679P14R21P297M25j1335o323M067j123j0025
1111c878k669P048k90q124j81P384o46o578K448O108l533n180P041R189j195k093
1127D851O990L563j0720r803J098L14r151l885O851K886n401J875J0344L725m270
1142g33L569Q012k358r015Q57P226k856o263L931N636n525p277K812L151p352
1157f185m900O022N650l292J845J2207N789n074j742N609k982j0936k912L947
1171C046m267j0104q07N528l536n458M801P867k473n604M959N744k712r6J0215
1186G103P449l539k695M349j460j0691m562M923n86q523j479O320m90n217L642
$$ plain form
1081 5976 12770 13082 3435 173 4573 1950 -5049 -1092 8129 5292 -4903 -4728 -266 -7997 -18439
1096 -18439 -16531 -9754 -11301 -11933 -175 11504 12218 13139 20436 20861 9526 3203 7270 6147 -3878
1111 -3878 -6547 501 211 -7913 -8094 -710 -1356 -7934 -5486 622 -2911 -8091 -1050 8139 6944 4851
1127 4851 11841 15404 4684 -5119 -4021 -3707 -12858 -16743 -9892 -7006 -12407 -10532 -188 3537 -733
1142 -733 2836 10848 8490 -525 332 7558 4702 -1561 2370 8006 2481 -4796 -1984 1167 -6185
1157 -6185 -11085 -5063 587 -2705 -860 11347 17136 12062 10320 15929 12947 2011 -901 3046
1171 3046 -1221 -11325 -12132 -6604 -10140 -15598 -10797 -2930 -5403 -11007 -6048 -304 -3016 -3112 7103
1186 7103 14552 11013 8318 12667 11207 516 -4046 877 291 -8232 -9711 -3391 -3881 -9098 -5456
1201e456Q581r70n683L117N217m231m705O184O188n199n229N214L577o507m182
1216d084N286K456n640j085P745K640m797J203O401l205r811m4N812l354q401
1231h878M65M119n062p298L730P114r10q09Q032N929l445m8Q486M053n494r75
1247I009O963m26j0506m990L664k169q746j663L469m316p195K137N649j133j593
1262a1846R115Q482k456m002O689N795m754l712N123K785o093l385M276L1o914
1277h66j634M001l015p726K124Q473j288p551J735O344k721n837L475O163k655
1292i78m035L043K702m067k78R420M169o199k054O895J785p507j064O976L64p924
1308A248m147K250l405o217J408M951l698m051M973N512m646m101P619Q310k648
$$ plain form
1201 -5456 3125 2155 -3528 -411 4806 575 -4130 2054 8242 3043 -2186 3028 6605 98 -4084
1216 -4084 1202 3658 -1982 -3067 4678 7318 2521 3724 10125 6920 -2891 -2935 2877 -477 -8878
1231 -8878 -8413 -4294 -9356 -16654 -12924 -5810 -6720 -7529 503 6432 2987 2939 11425 15478 9984 9009
1247 9009 15972 15546 5040 50 3714 1545 -7201 -8864 -5395 -9711 -16906 -14769 -9120 -10253 -11846
1262 -11846 -2731 5751 3295 -707 5982 11777 7023 3311 8434 11219 5126 1741 6017 6048 -866
1277 -866 -2500 1501 -1514 -9240 -7116 1357 69 -7482 -5747 597 -2124 -7961 -4486 1677 -978
1292 -978 -5013 -1970 732 -3335 -3613 5807 9976 3777 1723 8618 10403 2896 1832 8808 9172 1248
1308 1248 -2899 -649 -4054 -10271 -8863 -3912 -7610 -11661 -6688 -1176 -5822 -9923 -2304 6006 3358
1323C358k523O604N349l799l354L071o18o422j712L982k540p426J334O407k645
1338i34q294J391O839j628o256K539O328q63l043M169M089k907q60N343P57q066
1354a396j941P667L903n823j371O603K90q614m060L352k24l703J834L888l941
1369c536n115L877M897m447l702O706O712m353m802N681O441k794k738L247N86
1384F660n664j444L262k195o376J508O548k213p568J762Q312q27o482J443N697
1399B423k98l507L032K918l257k962L162K38o944j076P845K667p255k315O634
1414A305L352n140l49O721K382m100o97J358l804m442L269L925n637o334L314
1429d877M051n675n531N478O705k017k434M566L540j857N61M561j90n068R92N130
$$ plain form
1323 3358 835 7439 12788 8989 5635 8706 8088 1666 -46 3936 1396 -6030 -4696 1711 -934
1338 -934 -9228 -7837 -998 -2626 -8882 -6343 -15 -878 -3921 248 4337 1430 570 5913 6670 -1396
1354 -1396 -3337 4330 8233 2410 1039 7642 7932 -682 -4742 -1390 -1614 -5317 -3483 405 -3536
1369 -3536 -8651 -4774 123 -4324 -8026 -1320 5392 1039 -3763 1918 8359 5565 2827 6074 6660
1384 6660 996 -448 2814 619 -5757 -4249 2299 86 -7482 -5720 2592 1765 -4717 -3274 2423
1399 2423 2125 -1382 1650 4568 1311 -1651 1511 1749 -5195 -6271 1574 4241 -3014 -5329 1305
1414 1305 4657 -483 -832 5889 8271 4171 3474 4832 1028 -3414 -145 3780 -1857 -8191 -4877
1429 -4877 -826 -6501 -12032 -6554 151 -1866 -4300 266 3806 1949 2510 7071 6881 1813 2805 7935
1445G935l566q250K80O360k485p805L15O015J25l774J853L622j495r23M753K364
1461E324m587j027O659J343p851l228O245K938n521k692N304R28m219p13L994
1476B897o35j931L232K952o369o520K746L765n469n689L935M599m427n787L069
1491i632L876j84J737O099J698k608K951P118l51n570J742O180l011q842j407
1506b04M552k821o540r77J969k367j896M129K662k740N03P467L606m286l00Q237
1522A0994K991o777m210K989L68n140j753J645k438m845J59J039m816m082N351
1537h525N592l805m245M697N563k825l589L783M854j279j153K939J92k827K128
1552A500O063l81m592J954O332j950p243O85N574l29n821o23J608k703l616J428
$$ plain form
1445 7935 4369 -3881 -3601 2759 274 -7531 -7216 -1201 -1076 -4850 -2997 625 -870 -1793 2960 5324
1461 5324 737 -290 6369 7712 -139 -3367 2878 5816 295 -2397 2907 3835 -384 -1097 2897
1476 2897 2262 331 3563 6515 146 -6374 -3628 137 -5332 -11021 -7086 -2487 -6914 -12701 -9632
1491 -9632 -5756 -5940 -4203 1896 3594 986 3937 11055 10704 5134 6876 13056 10045 1203 -204
1506 -204 4348 1527 -5013 -5990 -4021 -6388 -8284 -4155 -1493 -4233 -3730 3737 7343 3057 2757 10994
1522 10994 13985 7208 2998 5987 6355 1215 -538 1107 -1331 -6176 -6017 -4978 -9794 -13876 -8525
1537 -8525 -2933 -6738 -10983 -6286 -723 -3548 -7137 -3354 1500 221 -932 2007 2199 -628 1500
1552 1500 7563 7182 2590 4544 10876 8926 1683 2368 7942 7613 1792 1169 2777 74 -3542 -2114
1568b114Q57m098j507N262K040m754j27P401L051n336k382N784K884l635j611
1583A715J561j651m672o95J517l646l855L307L710n155n522M780O438p79k278
1598e225M720M614j291j654L064K442j556J183L521k144o006j27M639k527o359
1613b706P7N295m02n885n91M158m07k222J817K169k259r74M708J474m842k053
1629b643N489J781o040k707M423J888m242k430K573O17k544R35L196j875k554
1644d133K904L666l452k988N073N652k769m604K271K981k528k549K731J882l214
1659I23j330J899k049m809J048N608j338n268Q13N124n50m693O80M837J56k127
1675a076J346K166j856j326M287J214m109q72M677J440n577k404M576J834m798
$$ plain form
1568 -2114 -1257 -5355 -6862 -1600 440 -4314 -4441 2960 6011 675 -1707 4077 6961 3326 1715
1583 1715 3276 1625 -3047 -3742 -2225 -5871 -9726 -6419 -2709 -7864 -13386 -8606 -2168 -2947 -5225
1598 -5225 -505 4109 2818 1164 4228 6670 5114 6297 9818 7674 1668 1541 6180 3653 -2706
1613 -2706 -2629 2666 2264 -3621 -4212 -54 -461 -2683 -866 1303 -956 -1930 2778 4252 -590 -2643
1629 -2643 2846 4627 -1413 -4120 303 2191 -2051 -4481 -1908 -1291 -3835 -2900 296 -1579 -4133
1644 -4133 -1229 2437 -1015 -4003 1070 6722 3953 -651 1620 4601 2073 -476 2255 4137 923
1659 923 -407 1492 -557 -5366 -4318 1290 -48 -5316 -4503 621 71 -4622 -3942 895 1051 -1076
1675 -1076 270 2436 580 -746 3541 4755 646 -226 4451 5891 314 -2090 2486 4320 -478
1690d78k338K731J25k636L27K065j923k694K407L641k138k285M144M546k956l876
1706a338K903M114j434k579J834P53m322k287J125q66l354J64L544j699n763N06
1722h699N371M27k688J822N384O21k213K860L195n02j112K961Q93l974k495K719
1738D570N44n718k609L303J019m953j887L116Q96l330L81L218k4j277K641L869
1754C759j933k764K396L717l065l868L011L544k600l213J669J122k978j075K600
1769C22P02l293m77K773j304m012J185M981j9l566P09L268j029l170K307L455
1785B832m12j518K187J157k687j651L415J478m070k331K193M07m150j783L242
1800a691N44l138n99K874K38k246J924L467j478j792L009M166j523k152K889K541
$$ plain form
1690 -478 -2816 -85 40 -2596 -2269 -204 -2127 -4821 -2414 1227 -911 -3196 948 5494 2538 -1338
1706 -1338 1565 5679 4245 1666 3500 4253 -69 -2356 -1231 -2097 -5451 -5287 -1743 -3442 -9205 -8699
1722 -8699 -3328 -2901 -5589 -3767 1617 2238 25 2885 6080 5578 4466 7427 8320 4346 1851 4570
1738 4570 5114 -604 -3213 90 1109 -3844 -5731 -2615 -1719 -5049 -4668 -1450 -1474 -2751 -110 3759
1754 3759 1826 -938 1458 5175 2110 -1758 1253 4797 2197 -1016 653 1775 -1203 -2278 322
1769 322 1024 -2269 -2746 27 -1277 -5289 -4104 877 858 -2708 -1999 1269 240 -2930 -623 2832
1785 2832 2420 902 3089 4246 1559 -92 3323 4801 731 -1600 593 1000 -3150 -4933 -1691
1800 -1691 -1147 -4285 -4884 -2010 -1772 -4018 -2094 1373 -105 -1897 1112 5278 3755 1603 4492 7033
1816G033k791l446K101J770k349j662J589m60l877j385L071l57l140N41L229j096
1832a229l832N29L953r2k381K232K957j631k222J537K094k135j433L182J179l426
1848g18k026K884J207l242n25L351N07k829n84K766j74k250J104L057j250k293
1864a015J949K929j697k457J722K061k391j917K328K146k089j763K306M99k660
1879d9k18K853K0l553q82J957j447l591N57K842o90l187M83J819j362j724L048
1896c124L499o70q79L098K210j936l45L379J271k467j612J628l93l660j169K000
1912H30p21l391k28J907j270k598J536L326n39j734K804L035r92j535K580J534
1928D544k854j663K264P26k238j224K511k38l278j012K564K24k344O80K244j191
$$ plain form
1816 7033 4242 796 2897 4667 2318 656 2245 1785 -2092 -3477 -406 -763 -3903 -3362 -133 -1229
1832 -1229 -5061 -4532 -579 -671 -3052 -820 2137 506 -1716 -179 1915 -220 -1653 1529 2708 -718
1848 -718 -2744 140 1347 -1895 -2420 931 1438 -1391 -1975 791 617 -1633 -529 2528 1278 -1015
1864 -1015 934 3863 2166 -291 1431 3492 1101 -816 1512 3658 1569 -194 2112 2611 -49
1879 -49 -267 2586 2606 -947 -1829 128 -1319 -4910 -4353 -1511 -2201 -5388 -4905 -3086 -4448 -6172 -3124
1896 -3124 375 -295 -1174 1924 4134 2198 1853 5232 6503 4036 2424 4052 3659 -1 -1170 830
1912 830 109 -3282 -3510 -1603 -2873 -5471 -3935 -609 -1148 -2882 -78 2957 1965 430 3010 4544
1928 4544 1690 27 2291 3017 779 -445 2066 1828 -1450 -2462 102 326 -2018 -1338 906 -285
1944b85k952J071K320j136j827R88J807k014k175J875K896j098J43L092J974k002
1960B677m69K495O63k294r3K094j259m038j477J451k326l650n31J754j466k102
1976h571J708K830J13P6L869L395m50K09L349K304k151j476K144j11l888j985
1992A365P58j268l646j318N47j426j888J183L257l68j082K460L079q45q75K396
2008B329K971j725k195N72L39k713r18K122N21k729j46J748m37k741P56L193j33
2025H14k276P19J733q76k252L76Q70j650j760J507J449j318N2L294K185p99k64
2042A804L180K134k307n14J578k35k642j327M17j567l839q33O14l012k423J727
2058g245K567q9n99L566L676J2l49K345J999l26m38J023l04l360j786K98j548
$$ plain form
1944 -285 -3237 -2166 154 -982 -2809 -1821 -14 -2028 -4203 -2328 568 -530 -387 2705 4679 2677
1960 2677 2208 4703 5366 3072 2979 5073 3814 -224 -1701 -250 -2576 -6226 -6757 -5003 -6469 -8571
1976 -8571 -6863 -4033 -3920 -3844 25 3420 2970 3179 6528 8832 6681 5205 7349 7238 3350 1365
1992 1365 2123 855 -2791 -4109 -3562 -4988 -6876 -5693 -2436 -2804 -3886 -1426 1653 808 -67 2329
2008 2329 5300 3575 1380 1952 2291 -422 -1340 782 1303 -1426 -1572 176 -261 -3002 -2246 947 814
2025 814 -1462 -743 990 114 -2138 -1762 -892 -2542 -4302 -2795 -1346 -2664 -2612 682 2867 2068 1804
2042 1804 4984 7118 4811 4297 5875 5640 2998 1671 2088 521 -3318 -4151 -3537 -6549 -8972 -7245
2058 -7245 -4678 -4767 -5366 -1800 1876 1888 1539 3884 5883 5557 5119 6142 5838 2478 692 990 -558
2075e58l473n51J764r93l060Q23K860J169o05K517K449J20j129J896J312j474
2091C067j179J930L1l397k052J623N36k308j448J943Q69j002qK573J16j155P04
2108H43J318j282j944J248J440k150k760P45J733j698j422J845K344k98n08K244
2124A698P84k61L02K388j48k471p06J169j525l738q52J867q32k413L7J546m35
2141c590m20K365J917L43L47K571J617j888m60J884O33l146k018Q82j48k835j438
2158c384N30j06j448R62J712l24n90K388K805r14j559K069K278j200j966M96O40
2175B389k364j599K72J62j635J48K104l44k140J113K884N64j383J214K690p10
2191C365k189l64R11o53j750o1L94k034j376J337J092j524Q4K529J662j845o18
$$ plain form
2075 -558 -4031 -4582 -2818 -3811 -6871 -6048 -3188 -2019 -2624 -107 2342 2462 1333 3229 4541 3067
2091 3067 1888 3818 3849 452 -1600 23 559 -1749 -3197 -1254 -385 -1387 -1395 1178 1294 139 843
2108 843 2161 879 -1065 183 1623 -527 -3287 -2542 -809 -2507 -3929 -2084 260 -38 -546 1698
2124 1698 2482 2221 2523 4911 4763 2292 1586 2755 1230 -2508 -3360 -1493 -2325 -4738 -4701 -3155 -3590
2141 -3590 -4010 -1645 272 615 962 3533 5150 3262 2802 4686 5319 2173 155 1037 889 -1946 -3384
2158 -3384 -2854 -2960 -4408 -3446 -1734 -2058 -2648 -260 2545 1631 72 2141 4419 3219 1253 1749 2389
2175 2389 25 -1574 -1302 -1140 -2775 -2627 -523 -867 -3007 -1894 990 1554 171 1385 4075 3365
2191 3365 1176 812 1723 1070 -680 -741 -347 -2381 -3757 -2420 -1328 -2852 -2768 -239 1423 -422 -1040
2208a040K839J288j033n87J404j51j957m48N46j151j981P96J331j760j669J961
2224a612K413j077j447J313J855o46n42J131N79j280n46L96j020j827J8K551o52
2241c93k014K73K623L75j648J077K269K9r20M89O29j016j282R26m33k256j388
2258b660J189m4l017n80K508J361q13m6K190J409r18J069J810l07p75P71J026
2275D173j697k164O63P76k399k358N95R06p86j357J482J009o40P4J590N98p40
2292b75P26J970n13j974P9K020k66j733P3J362l32j972M52J074M2m52J372L33
2310A986j857j165J289M64k161r83J615M38k200j024J196J298q95L41J385N49
2326B76l68J278J984m30r35J317J091j493k460P92Q72j570k320N88L27j541n44
$$ plain form
2208 -1040 1799 3087 2054 1467 2871 2720 763 315 861 -290 -2271 -1475 -144 -1904 -3573 -1612
2224 -1612 801 -276 -1723 -410 1445 799 257 1388 1967 687 141 537 -483 -2310 -2292 259 -393
2241 -393 -2407 -2134 489 864 -784 293 2562 2591 1671 2160 2789 1773 491 1417 984 -1272 -2660
2258 -2660 -1471 -1515 -4532 -5112 -2604 -1243 -2056 -2102 88 1497 579 1648 3458 3151 2376 3147 4173
2275 4173 2476 312 975 1751 -648 -3006 -2411 -1505 -2291 -3648 -2166 -1157 -1797 -1723 -133 465 -275
2292 -275 451 2421 1908 -66 13 2033 1767 34 107 1469 1137 -835 -383 691 733 281 1653 1986
2310 1986 129 -1036 253 717 -1444 -2427 -812 -374 -2574 -3598 -2402 -1104 -1999 -1658 -273 276
2326 276 -92 1186 3170 2740 1805 3122 4213 2720 260 1052 1924 354 -1966 -1378 -1051 -2592 -3136
2343c136J004J46p19O32J960M25r60J195K479O9j918L57J064l92j629o9P85o81
2361F12j466K33P5j507l85K143P94j732k36J530O76j706o37J463L99j348p41J097
2379g36l62r83Q00J202j92p10J487J515q15q33J315K003q45j071O03M28j073r33
2397H00k35l98j378m46J012m18j311O59J846m43j425L82J817J39r51O82Q10n23
2415F19j112O23K33q83m03Q62N3j888p31J578J105r92L8J759K32j064k76Q24K8
2434F05j022P6Q96j197j146N75J795r36p98J658J324n64q80J081J076m28o36J157
2452B636K29j164n0N42r91k184p49Q76j135j885M22J628L19j301P83J463k4j095
2470a680J376R28p18n87J126P34j090p6J620L70j798m87R36n9j082j65J470N26
$$ plain form
2343 -3136 -2132 -1986 -2705 -2073 -113 312 -648 547 3026 3095 1177 1534 2598 2206 577 508 1293 612
2361 612 -854 -621 -546 -2053 -2438 -295 499 -1233 -1469 61 737 -969 -1606 -143 256 -1092 -1833 -736
2379 -736 -1098 -2081 -1281 -79 -271 -981 506 2021 1206 373 1688 3691 2846 1775 2378 2806 1733 800
2397 800 565 167 -1211 -1657 -645 -1063 -2374 -1715 131 -312 -1737 -1355 462 601 -350 332 1142 619
2415 619 -493 130 363 -520 -923 -61 -8 -1896 -2627 -1049 56 -936 -898 861 1093 29 -247 577 605
2434 605 -417 -341 555 -642 -1788 -1213 582 -354 -1152 506 1830 1266 386 1467 2543 2115 1479 2636
2452 2636 2865 1701 1651 2193 1202 -982 -1731 -855 -1990 -3875 -3453 -1825 -1506 -2807 -2024 -561 -585 -1680
2470 -1680 -304 624 -94 -681 445 1179 89 13 1633 2003 205 -282 654 595 -487 -652 818 1344
2488A344q71L91R10q16j471N89M32j212j216L94R76j071k77J186J534k49m27J194
2506A340P89j074O3J216K40j374P4Q53n16j846n64N27j278k247j21P37K78l20
2524c223J305J364m5P54J690R34m73l92J238m0j423r74J485j59j552k91k37m20
2542d59k063k10M16k26k50Q61J558L2l77J402J346q14o53K6N02j413j130P44N56
2561a52l19J0J199P31j318J7J230j06j318L47J341p6j118L96J325j094j849n8
2579h12Q1j416j012O38J261o72K06J913J388p10J57J704J39j432j122Q36o68j299
2597h20K74O72p12j507j6K30j022j257R40J316K5O4J973J774L3J94J679O72j394
2616C118j324N06n64k022J40Q91j61j161K77J162o79j653K27Q22l67o13N34J627
$$ plain form
2488 1344 473 864 1774 958 -513 76 508 -704 -1920 -1526 -550 -1621 -1898 -712 822 573 146 1340
2506 1340 2129 1055 1118 2334 2574 1200 1274 2127 1611 -235 -799 -272 -1550 -3797 -3918 -3181 -2903 -3223
2524 -3223 -1918 -554 -599 155 1845 2779 2306 1914 3152 3112 1689 715 2200 2041 489 198 -39 -459
2542 -459 -2522 -2732 -2316 -2542 -2792 -1931 -373 -341 -718 684 2030 1216 563 589 1091 -322 -1452 -708 -152
2561 -152 -471 -461 738 1469 151 168 1398 1292 -26 321 1662 1586 468 864 2189 1095 -754 -812
2579 -812 -731 -2147 -3159 -2521 -1260 -1932 -1726 187 1575 865 1022 2726 2865 1433 311 1147 479 -820
2597 -820 -546 126 -586 -2093 -2109 -1879 -2901 -4158 -3218 -1902 -1877 -1813 160 1934 1967 2161 3840 4512 3118
2616 3118 1794 2300 1736 -286 -146 745 584 -577 -300 862 183 -1470 -1243 -421 -788 -1401 -867 760
2634G60m57j58J155M57j306j188J96J17j489q74J384O46n48J83J801P21r64j89
2652B47R18q31j684K12Q75k28m98R56J047o94j443N80M62q63k96Q04J128k40K25
2671F77J583J175o34o97Q71q66j551j154O49q48r47K41J366n45j149O61L12o75
2689a531q07M99J105o67j1J959R11l59J32P54j53j451p03M92j80j181k50J674
2707B33l1n01N28J230n37j391l5K34r56r09J568J004n43l44J236N83j289n49P67
2726B98L40j258k9J063M22n38P70J487p8j333o40J02j431j438J47N98n31l73J330
2745a092Q94j84j166J302J65p72j77R91J098l23R05J302L21j053o24P56j078k052
2763g87n38O74q69j690R99J194K16m96N58O47p26o63J120O24k67j36K031Q51j259
$$ plain form
2634 760 303 145 1300 1757 451 -737 -541 -424 -1913 -2787 -1403 -757 -1305 -1122 679 1400 436 247
2652 247 1165 334 -1350 -1138 -263 -491 -989 -33 1014 320 -1123 -543 -81 -944 -1240 -436 692 452 677
2671 677 2260 3435 2801 2104 2975 2109 558 -596 53 -795 -1742 -1501 -135 -680 -1829 -1168 -856 -1531
2689 -1531 -2338 -1839 -734 -1401 -1412 547 1458 1099 1231 1985 1832 381 -322 170 -10 -1191 -1441 233
2707 233 202 -299 229 1459 922 -469 -504 -270 -1226 -2135 -567 437 -106 -450 786 1369 80 -469 298
2726 298 638 -620 -649 414 836 298 1068 2555 2477 1144 504 606 -825 -2263 -2116 -1518 -2049 -2422 -1092
2745 -1092 -198 -382 -1548 -246 -81 -853 -1030 -39 1059 736 1641 2943 3264 2211 1587 2343 1265 -787
2763 -787 -1325 -651 -1520 -3210 -2211 -1017 -801 -1297 -739 -92 -818 -1481 -361 263 -4 -140 1891 2742 1483
2782A483j42R64l16j485m81K43j104j218K92J221l62k18J296N65o38j313O93L39
2800a81o59p19J071P66j09n25J176O62r52k54M85n45j273M68J048M52j070R10
2818G51J077m96j533P28J13j013j507M8N06l18k13J088Q58n13k74J230J31r81
2836c18n5J446O23m96J27R24K67j273k45M39j007j917P1j03p45p19J033J023k30
2855a155l03J393J019q44m55J161P13m04j94R43J60p54K71J98q29j366l28K5o40
2874a389o54j18J405n1o10J132Q86J39p31Q70J10r57o45J380K07p82N3O90q4j438
2894e87m21R72n21p20L16P13L48p64O07J049q9r75P01L59j080r15N34O86q72r4
2914g53P03Q94p81l59N68J27n57K2P51q3n51K10J402n17j235J66R00r01q11J36
$$ plain form
2782 1483 1341 2305 1989 504 23 266 -838 -2056 -1764 -543 -905 -1123 173 738 100 -1213 -520 -181
2800 -181 -840 -1559 -488 278 169 -356 820 1482 530 276 761 216 -1057 -589 459 911 -159 751
2818 751 1828 1332 -201 527 640 -373 -1880 -1832 -1326 -1644 -1857 -769 89 -424 -698 532 663 -318
2836 -318 -373 1073 1696 1200 1327 2251 2518 1245 1000 1439 432 -1485 -1414 -1517 -2262 -2981 -1948 -925 -1155
2855 -1155 -1458 -65 954 110 -345 816 1529 1125 931 1874 2034 1280 1551 1749 920 -446 -774 -749 -1389
2874 -1389 -2043 -2161 -756 -807 -1417 -285 601 740 9 879 989 32 -613 767 974 192 245 935 851 -587
2894 -587 -1008 -36 -557 -1277 -961 -248 100 -664 -57 992 903 -72 629 988 -92 -1007 -473 213 -659 -753
2914 -753 -50 844 63 -296 272 399 -158 -136 615 532 -19 191 1593 1076 -159 7 907 6 -805 -669
2934f69P64n18p01Q05M90l48k12J239p5j095p0O17J12j043J67P94M44r56k72N64
2954C7P1o87L01L66k10o28N72J143q89l91R01O25q20p36M55M83r37k85P74J97
2974C42q56n6P57k69n65L23R62m76r14o4J285m74o83M25O64j92l23K84O59p37
2994I2k64R97l35n03k60J140j94j107k01O96p4j072l37R81k98m79P22N35l41o46
3014i48R72J164p43k53J242M32o25q38O37K21r61o49L46n3p92l85P37l76n83K87
3034a168J118m41o81O37J220j55k78M57N26j97m45N4M33p57n40O51l07o65q4Q87
3054B65Q3q23l11J013k6q91K80N40p1m93j47O36m16q8M26L67n75m03P02N07p04
3075a29n3Q11P57l52n94M47J71p92k55J48j85j049L2R00n29r24N63P57j0n50M74
$$ plain form
2934 -669 95 -423 -1124 -319 171 -177 -389 850 775 -320 -390 227 339 -704 -537 257 701 -255 -527 37
2954 37 108 -579 -278 88 -122 -750 -178 965 76 -315 586 1211 391 -345 110 593 -344 -629 145 342
2974 342 -514 -570 187 -82 -647 -324 638 162 -752 -816 469 -5 -688 -263 401 209 -114 170 829 92
2994 92 -172 825 490 -13 -273 867 673 -434 -635 61 -13 -1085 -1422 -441 -739 -1218 -496 39 -302 -948
3014 -948 24 1188 445 192 1434 1866 1241 403 1040 1261 300 -349 -3 -56 -848 -1233 -496 -872 -1455 -1168
3034 -1168 -50 -491 -1172 -535 685 530 252 709 1235 1038 593 647 1080 323 -217 434 127 -538 -622 265
3054 265 348 -475 -786 227 201 -690 -410 130 59 -434 -581 55 -361 -449 -23 344 -231 -634 68 575 -129
3075 -129 -182 629 1386 1034 440 887 1058 266 11 159 -26 -1075 -1043 -143 -672 -1596 -1033 -276 -286 -836 -362
3096c62N70J10n93O53N86j49l0J36K56q78q7L71j32j382l52Q88N0m68j09N85L30
3117go46M36N59l37k57N39L65p69p03R57M67o49m81M69O18j181k00N66N29j64
3137A11Q5Q71l20n03K8L50r7j097p1N33m74q12K03P81j6k70N71Q40m94P7N37M37
3159A270o46l41O06Q7q00k01J96Q3j023o87O95J36j035O32O85PO1O69P85m35J71
3180I15M93N46j130n48R7Lq30n55L44P1o40k01M54Q0j42L22J148M54l28P35Q62
3201B150o64o02K69K38o46q57k71j52o14m38J85M20j09m84R36N95l53L07J156
3220A066K31o55J02N44ko78m59N15n93j181J60K03N3m45M54P86l40l29J195O14
3240A241o06l3P02j72p13k99J85j03q78m08L60j34q51J97P24M02j70O73O26J04
$$ plain form
3096 -362 208 318 -275 378 964 815 785 921 1177 299 212 583 451 -931 -1283 -395 -345 -813 -922 -337 -7
3117 -7 -653 -217 342 5 -252 287 652 -117 -820 137 604 -45 -526 -57 561 -620 -820 -254 275 111
3137 111 196 1067 747 244 272 622 525 -572 -643 -110 -584 -1396 -1193 -412 -428 -698 -127 713 219 296 833 1270
3159 1270 624 283 889 976 176 -25 171 254 -769 -1456 -761 -625 -1660 -1028 -343 -336 -275 394 1179 744 915
3180 915 1408 1954 824 276 373 376 -454 -1009 -665 -594 -1234 -1435 -981 -901 -1043 -721 427 881 553 1288 2150
3201 2150 1486 884 1153 1391 745 -112 -383 -535 -1149 -1587 -1402 -982 -1091 -1575 -639 -44 -397 -90 1066
3220 1066 1297 642 744 1288 1286 608 149 664 71 -1110 -950 -747 -694 -1139 -685 101 -239 -568 627 1241
3240 1241 635 602 1304 1132 419 120 305 202 -676 -1084 -724 -858 -1709 -1512 -788 -386 -556 117 743 847
3260H47n55M66P74j20p82L13r7o94m87J14j35q12o87P04J17p81M29R49L59o1L16
3281A77R44J95o71O33J60m90k15M0J75p60q07N04j23o23n54J60N15l11j50P38
3301d63O65n45L63N62J31k64K33K72m01p15k21M53j85l85M32N07j09n15J22L86
3321C23p69j18N61K34l85R9N42O5m28k3N94l26r19k99M67O4m30K34R22k96j07
3342EL63M28o52q81O47L97q20j00N97L85l91j54L02mo04l6J5M49m70n3P54L30
3364E07q62R24O47l91n42j55M86n52n97O01K55k77R7M64J00p23n01L06p7o19J9
3385h90N12M29k77K39L99M21n79J02J83m61m85L34M07l88j60R71O9l02k49m4k55
3406b4o73n03N15K28k63M84P01L40n14K67K74l39q91K46J31l4m65O17M29k00k55
$$ plain form
3260 847 292 758 1532 1412 630 943 846 152 -335 -221 -356 -1168 -1855 -1151 -1034 -1815 -1386 -437 -78 -139 177
3281 177 1121 1316 645 1278 1438 948 733 773 948 188 -619 -115 -238 -861 -1415 -1255 -740 -1051 -1201 -463
3301 -463 202 -343 20 582 713 449 682 954 553 -162 -383 70 -115 -500 -68 439 330 -185 -63 323
3321 323 -446 -564 -3 231 -154 -55 487 552 124 101 695 369 -550 -849 -382 -318 -748 -514 408 112 5
3342 5 368 796 144 -737 -90 307 -513 -613 -16 369 -22 -176 126 122 -482 -518 -503 -54 -524 -577 177 507
3364 507 -355 569 1216 825 283 128 614 62 -535 66 321 44 141 605 705 -18 -519 -213 -290 -909 -890
3385 -890 -378 51 -226 13 412 833 254 356 539 78 -407 -73 334 -54 -214 757 826 524 275 231 -24
3406 -24 -697 -1200 -685 -457 -720 -236 465 805 291 558 832 493 -398 -152 -21 -55 -520 97 526 326 71
3427G1L29J74q62k95k66L02q05J58P77Q48m59J15M26j47k76l32K81L1l74J54P86
3448F36J98R8L56L23k40n45m72j16p24m70L01l6o9K17K96K68m05k79K50l53j69
3469i35j01J005J21K0N63O36p6p17M8qo27p79j78o9Q1j12O99M37j11L2L40Q8m86
3492a29k14M83L54k49N29O00J07m75J66Q0p17q10m4K05o43r1O36O99J76j63O25
3513A125l60q38m69j65k15m51j69P01M07n48N95O49m71m51k33L67N5q4R99N76
3533A020L29J66J84M7k95j025k85m18r90m90O37J25q3L36P19L96pl18L51J16l00
3554B15M96N56J50o4L15K9n58j146J87o21o99j024k2J92l4L88O76N77L56O91J47
3575H07j55o54K32J84o7k02n1N99J3l18M1k80k17r75R6K68j88L7J015N09Q5K64
$$ plain form
3427 71 400 574 -288 -583 -849 -547 -1352 -1194 -417 431 -28 87 513 366 90 -242 39 70 -304 -150 636
3448 636 834 932 1288 1611 1371 826 354 238 -486 -956 -655 -691 -760 -543 -247 21 -384 -663 -413 -766 -935
3469 -935 -1036 -31 90 110 673 1309 1233 516 564 556 -71 -850 -1028 -1097 -1016 -1128 -429 8 -103 -71 269 357 -129
3492 -129 -343 140 494 245 774 1374 1481 1006 1172 1252 535 -275 -319 -114 -757 -848 -212 487 663 500 1125
3513 1125 765 -73 -542 -707 -922 -1373 -1542 -841 -434 -982 -387 262 -209 -660 -893 -526 -471 -555 444 1020
3533 1020 1349 1515 1699 1746 1451 426 141 -277 -1267 -1757 -1120 -995 -1078 -742 -23 373 366 48 399 515 215
3554 215 711 1267 1417 1353 1668 1697 1139 -7 180 -441 -1140 -2164 -2186 -1994 -2028 -1640 -964 -387 -31 660 807
3575 807 652 -2 230 414 347 145 94 693 706 388 429 149 -68 -1043 -947 -679 -867 -830 185 694 779 1043
3597A043N43L8q54o59j6l83m58j09M22M1M71OK43j39n72L6K85k5k90M49M75M03
3619I50m19J85K42m48n56n42o07o46N6N75L07M2N20J023K77k93jO81o99m67j48
3640C2N21l9j44J62O9l97m77K89n59n60m19P34m9J91L93K43O94r3J21J49j38q65
3662a42mR8l16j29N47N58l64j78o5M66n32n04J74K16j17PL06N22m04K12J72l58
3684A65p02j33L31m67j45L85N10L63J40J29K12k07j68m7jm97j14J9J89k29j00
3705c67O09J69k89q02N55k04l21O4L65L92J15M36L46k98n02J0O5n93l36oM77j71
3727b86k30L66P16k08l64O19j40j26m96J49J25l91J01M90J58p74K76K65m29m06
3747e85o3Q4j06m3N31N36k17L24O32j9m68m87K55J23m93m23J76K44m12r9K96L
$$ plain form
3597 1043 1586 1624 770 111 95 -288 -746 -855 -433 -392 79 85 328 189 -383 -347 -62 -87 -377 72 547 950
3619 950 531 716 958 510 -46 -588 -1195 -1841 -1785 -1210 -903 -861 -341 682 959 666 665 1346 647 180 32
3640 32 553 514 370 532 601 204 -273 16 -543 -1103 -1522 -788 -837 -646 -253 -10 684 591 712 861 723 -142
3662 -142 -146 -48 -364 -493 54 612 248 70 5 471 -61 -565 -391 -175 -292 -285 21 543 139 351 523 165
3684 165 -537 -670 -339 -806 -951 -566 -56 307 447 576 788 581 413 366 365 -132 -246 -227 -38 -267 -367
3705 -367 242 411 122 -680 -125 -329 -650 -586 -221 171 286 722 1068 770 268 278 343 -250 -586 -592 -115 -286
3727 -286 -516 -150 566 358 -6 613 473 347 -149 0 125 -266 -165 325 483 -291 -15 250 -179 -585
3747 -585 -648 -564 -670 -713 -182 354 137 461 1093 1074 606 119 374 497 4 -419 -243 1 -411 -510 -214 -211
3769b11m16J97K12j0j45J51N21K24l55O21L07o19k82k70oN6n30L55K2k93K06J85
3791h0k74n7M57K50K55p93k36O56K86m72J50L3K09k85k24P1n00j38M15L7Q8m02
3813e54N47P85o48r8N04j52P6l88j9L66m07j35J07j69m60L51K96n01L4K31L20
3834H6L8n37Q1Q11l3q3j18J1J8k72K13O8o41M51j05rk50J60P3M45m86p4O44k17
3858B74m03Q2l4j52j0K41J75k51l60Q93k08n19L58O2J79k07l7o4K12p2k18j19
3880a78j23J36O3N7l11j66Q4M35m14J38L31j48K39k39M39J67k16JJ92m16N3l60
3902b36O35n90j79K64j86%O8l79M35q7k62N91K92n5n19M63J8L8m79L92M4m41j98
3925c71M46j50p5j65M45J47j54m69L49J79l97j12O74j43l10J91l0j46k07L04r
$$ plain form
3769 -211 -627 -430 -218 -228 -373 -222 299 523 168 789 1096 477 195 -75 -81 -25 -555 -200 -178 -471 -265 -80
3791 -80 -354 -411 46 296 551 -242 -478 178 464 -8 142 175 384 99 -125 -54 -554 -692 -277 -240 -152 -554
3813 -554 -7 778 130 32 536 384 460 72 53 419 12 -123 -16 -185 -645 -294 2 -499 -465 -234 86
3834 86 124 -413 -332 479 446 363 245 256 274 2 215 283 -358 93 -12 -21 -271 -111 -38 407 -79 -153 491 274
3858 274 -129 -47 -81 -233 -243 -2 173 -78 -438 455 247 -272 86 148 327 120 83 19 231 159 -59 -178
3880 -178 -301 -165 -102 -45 -356 -522 -438 -3 -417 -279 52 -96 143 -96 343 510 294 295 487 71 124 -236
3902 -236 399 -191 -370 -106 -292 -292 -224 -603 -168 -255 -517 74 366 311 -208 255 273 311 -168 224 268 -173 -371
3925 -371 75 -75 -150 -315 130 277 123 -346 3 182 -215 -327 347 204 -106 85 55 -91 -298 6 -3
3946cJ7k51J22L1K51j78O4L09k03r8K26j64o9J12L50l43n48N3J27J28jk77L58
3969A3m80j33M93R3k05J93O12k66j39j4N39M2k10r2k28j05k68j52j48J96l33K22
3991c70l1J15l79L78L95j28N4J40K91k5k2J19J38j2n93K9o6l63j09K95l8k75J19
4014c38L13Q0o10M19L82P9l35N7m9O0M4J62J37k10k12lO5k88j50K85l0k17j17
4037d76K55L48r2J66j06J97m78L7J45k75J27JL50l73k40K12J80j45K0l4J08j31
4059b04l3O36r2N9Nj13j07K1M4L0k39%l55N36j33m20K39L64j13j39K07J09m72
4082a70K25K48K47Lk55j08K04m71j05j11q8j61J31J71j06o3n3K25J40j14lL98
4104A84k41q4k12N66k15L21k54K56l83l6J54n5k08J17K89N0l19K8K93k4j50N1
$$ plain form
3946 -3 14 -237 -115 -84 167 -11 53 362 159 61 287 123 54 166 516 173 -375 -322 -195 -67 -68 -345 13
3969 13 -467 -600 -107 -14 -219 -26 586 320 181 167 706 748 538 446 218 113 -155 -307 -455 -259 -592 -370
3991 -370 -401 -286 -665 -287 108 -20 34 174 465 440 418 537 675 663 70 99 33 -330 -439 -144 -182 -457 -338
4014 -338 -25 55 -555 -136 246 325 -10 47 -2 58 102 264 401 191 -21 -24 41 -247 -397 -112 -142 -359 -476
4037 -476 -221 127 35 201 95 292 -186 -149 -4 -279 -152 -151 199 -174 -414 -202 -22 -167 -147 -181 -73 -204
4059 -204 -237 399 307 366 371 258 151 172 216 246 7 7 -348 188 55 -365 -126 238 125 -14 193 302 -170
4082 -170 55 303 550 553 298 190 394 -77 -182 -293 -381 -542 -411 -240 -346 -409 -462 -237 -97 -211 -214 184
4104 184 -57 -141 -353 213 -2 319 65 321 -62 -98 56 1 -207 -90 199 249 -70 -42 251 227 77 128
4126A28r1m1L4j45J75k71Q3j03L86q2m74M04J43k72K63pl0n6k19K03J28j23j60
4149a27O3l87N7o1K76N6k44L10j85L56j41R3J86k69M40k67L82j10j55K3o3m78
4171b45K50J7j46r2J13J62J3J06l08M49j93J21n83M38j88j83L44p7J27k62Q6j55
4193b06j63K95L12j58j21K15K20j84k15J65K22k51j61j72J86k79k52L47k0k40
4213d60M9J57K67O3k89O78q6p4K00l8j56n7RM8J4k43k37r9L31m17k07J54J65M
4237b24m4J46k65J86L59jJqk41N7K17q0o2K23o42L87K14j87O4p8j1L8l62J15K37
4262C9J28p7k49M93j35l33j20J73j33p0J57j3Q7K3L50n6R8Qj11P5j24k4J75l14
4286D7r5J99J4j20k44j52J70n56k3M39J20n9M84O9K9p5M22k77p3J08k58j32j78
$$ plain form
4126 128 37 -4 30 -115 60 -211 -128 -231 155 73 -401 3 146 -126 137 130 100 44 -175 28 156 33 -127
4149 -127 -64 -451 -394 -455 -179 -123 -367 -57 -242 114 -27 66 252 -17 423 156 538 428 273 296 233 -245
4171 -245 5 22 -124 -216 -103 59 72 178 -130 319 126 247 -336 102 -86 -269 75 -2 125 -137 -51 -206
4193 -206 -369 -74 238 80 -41 174 394 210 -5 160 382 131 -30 -202 -16 -295 -547 -200 -220 -460
4213 -460 -411 -254 13 76 -213 465 379 305 505 467 311 254 263 311 325 82 -155 -254 77 -340 -547 -393 -228 -224
4237 -224 -268 -122 -387 -201 158 157 158 150 -91 -34 183 103 41 264 -378 9 223 36 100 22 11 49 -313 -198 39
4262 39 167 90 -159 334 199 -134 -254 -81 -214 -284 -127 -140 -53 -30 320 264 362 370 259 334 210 186 361 47
4286 47 -48 151 165 45 -199 -351 -181 -737 -760 -321 -201 -260 224 293 322 247 669 392 319 427 169 37 -141
4309a41j7M1J13k78M07k72J15j31J40k01J67j33L7K27L3L88j59j30k92M89p01
4330b98M13j14j9k16L14l7Q2k27N26o5j84r9m5J34j05j66k64K02m10J77K25k14
4352c90j69P8L09rk63L91j1M82j43K96K8j71K30p6l49j16j75k03q4J92L9l58M88
4375A6j40k17L81N8j5l3K08k1J85L04j02l23r8j28m14J07k17m8R6j31J91r9K46
4398a94j47J5K56Jj41K25J6m6j58K81J02m46J66j33J43J23m18J72K81kJ72k59
4420IM50K28k26L07j57k29k02J25m71n9J7O4j46M1L2j65K42k7L59l88J44j01M36
4443B83K82m36k1K72L2l80k65K90l08J20l04k6K0J64J30J23k52j9O61j35J43k34
4465A40r3L53j68m0l9L25m95Q9R9n2k71K07O7k67L96m13K13j7Q4K1R0k89J40R
$$ plain form
4309 -141 -158 -117 -4 -282 125 -147 -32 -163 -23 -224 -57 -190 -153 74 107 495 336 206 -86 403 -298
4330 -298 115 1 -18 -234 80 43 125 -102 424 359 175 76 31 165 60 -106 -370 -168 -578 -401 -176 -390
4352 -390 -559 -481 -172 -181 -444 -53 -64 418 275 571 599 428 658 582 233 117 -58 -261 -345 -153 -114 -472 16
4375 16 -124 -341 40 98 83 50 258 237 422 726 624 301 203 75 -339 -232 -449 -497 -401 -532 -341 -440 -194
4398 -194 -341 -326 -70 -69 -210 15 31 -15 -173 108 210 -236 -70 -203 -60 63 -355 -183 98 96 268 9
4420 9 459 687 461 768 611 382 180 305 -166 -225 -208 -144 -290 -249 -217 -382 -140 -167 192 -196 -52 -153 283
4443 283 565 129 108 380 412 32 -233 57 -251 -131 -435 -461 -441 -277 -147 -24 -276 -295 366 231 374 140
4465 140 47 400 232 192 153 478 -17 72 171 119 -152 55 122 -145 251 -162 51 34 118 139 229 -60 80 89
4489H9j48j00j99N4R3r6K45k15J81n2j92K94JJ8K49q1j69K89j30P6J64l61q7k2
4513i9l07P0L6J09j66J47K66J52j86J37M6J77l52K89k27O3Mj21L2J15l19J72O4
4536A02r0l92K35J39j33l01K72m8K33M17l49j9p6p1j7k3l07K78K68J10l77N9K58
4559A68j17k56K70r7J78K29j06q5j46P2N9j09l50j11M59j77L3r5j5K51k52K96
4581I9J05m21K77L8J8O8j78K08J11k52lJ63m0j68k09j8L82n15O30k00k38J01j71
4604b13P7p7K39p3K11J1m38K52k4K08J1k43J40o0k17R1J49j42R4J37j26l06J35
4627a64L36j27R3k39J20j15O8N6O3p0K6%J47k85K29n8J16k15j2J36j26K7k11K96
4651I1Q1O0j02j74J1O2j28M78k47K4k25L71l18j21K00kj98k57M01k72K71J40k90
$$ plain form
4489 89 -59 -159 -358 -304 -211 -307 -62 -277 -96 -148 -340 -46 -45 -27 222 141 -28 261 131 207 371 10 -77 -99
4513 -99 -406 -336 -300 -191 -357 -210 56 208 22 159 205 382 30 319 92 155 159 38 70 185 -134 38 102
4536 102 12 -380 -145 -6 -139 -440 -168 -216 17 434 85 66 -10 -81 -98 -121 -428 -150 118 228 -149 -90 168
4559 168 51 -205 65 -32 146 375 269 184 38 110 169 60 -290 -401 58 -119 -86 -181 -196 55 -197 99
4581 99 204 -217 60 98 116 184 6 214 325 73 70 233 193 25 -184 -202 180 -335 295 95 -143 -42 -213
4604 -213 -136 -213 26 -47 164 175 -263 -11 -35 173 184 -59 81 21 -196 -105 44 -98 -4 133 7 -299 -164
4627 -164 172 45 138 -101 19 -96 -28 28 91 21 47 47 194 -91 138 80 196 -19 -31 105 -21 6 -205 91
4651 91 172 232 130 -44 -33 29 -99 379 132 156 -69 302 -16 -137 63 61 -137 -394 7 -265 6 146 -144
4674a44J95k93M46p2j80k46J38J91J25j09j28J04j74L1j43J83K84k09J28j76M5
4695dJ43r9n5j8K19M6k42Q7P1k91K47r4k14K48r8j6K2M59n07O9KL11j15j11L28
4720C88k90M52o65K07l51K29j49m5R2k51O5J81qJ70r2P8J81J1k21J5J53m9J7q
4744A10r7l0J38k32J4j54K25o8K7ok35M16l13K04K00j4k84J87J0j95L14p7j43
4767cq5R9kK21k28n1k37l0J67J89j53M63j39Q5n1j01m8q6r9L7q1R1j21M2M1NK16
4794A41o36N29J20j41N9j43L59j95j20K46p7P8j39j49j98Kk7PJ99n08K22O7J01
4817b03L0M2J17J73l05L09QL9k35j04J09M4o8j25K20j07J32j45j05l6J95j58O5
4840a08j40L48n0jj37K09Klk08J25LQ1R7k38Q2K5j43k17N28j12jR3o41M02K08
$$ plain form
4674 -144 51 -242 204 132 -48 -294 -156 35 160 51 -77 27 -147 -116 -259 -76 208 -1 127 -49 -4
4695 -4 139 40 -15 -33 186 232 -10 77 148 -143 104 10 -204 44 -54 -70 -48 411 -96 -27 -25 286 171 60 388
4720 388 98 550 -115 92 -259 -30 -179 -224 -132 -383 -318 -137 -145 25 -67 11 192 203 -18 -3 150 101 118 110
4744 110 13 -17 121 -111 -97 -251 -26 -94 -67 -73 -308 108 -205 -1 199 185 -99 88 98 -97 217 140 -3
4767 -3 -88 11 9 230 2 -49 -286 -316 -149 40 -113 350 211 296 245 144 96 10 -89 -52 -133 -42 -163 -121 -80 -75 141
4794 141 -495 34 154 13 72 -71 288 93 -27 219 142 220 81 -68 -266 -264 -291 -284 -85 -593 -371 -304 -203
4817 -203 -173 -131 -14 159 -146 163 171 210 -25 -129 -20 24 -44 -169 51 -56 76 -69 -174 -210 -15 -173 -108
4840 -108 -248 100 50 49 -88 121 123 120 -88 37 40 121 218 -20 62 87 -56 -273 255 143 142 235 -406 -4 204
4865B04j60L2j64k8J70l10K91r1r1J64jP4n9j83K62J50m31K60Q0j37K4L35k81
4888A10J12l7mk12l44J53k1Q4L4j26K4J2O7O5n2K98l29O33j14l9K6l47J55J40
4912B88k24J12k12k5J77n4m21l1M01l01n2L21n6l90K26J36K0Q1j43lK71j88R4
4935B7K69k33j6P0J71l20K47j35p0L04j81J8j85R2q0N8J04j06j75M1j83O1k4N29
4959B83o95J93nL83l00L57j81J90o9j15K34J1k52M3j53p2k40j38K56Q9k84%N7
$$ plain form
4865 204 44 76 -88 -116 54 -256 35 -56 -147 17 16 90 31 -152 110 260 -171 89 169 32 56 391 110
4888 110 222 185 181 -31 -375 -222 -243 -159 -125 -251 -227 -215 -148 -83 -135 163 -166 467 353 314 340 -7 148 288
4912 288 64 176 -36 -61 116 62 -359 -390 11 -290 -342 -21 -77 -467 -241 -105 -85 -4 -147 -150 121 -67 27
4935 27 296 63 47 117 288 -32 215 80 10 314 133 151 -34 58 -22 36 140 34 -141 -100 -283 -222 -246 283
4959 283 -412 -219 -224 159 -141 216 35 225 156 41 275 286 34 77 -76 -148 -388 -526 -270 -181 -465 -465 -408
$$ [...]
8191a94
##END NTUPLES=NMR FID
##END=
