##TITLE=1H_CA-8416-7
 CDCl3, 8 sc, 
 11.1.2019
##JCAMPDX= 6.0         $$ Bruker NMR JCAMP-DX V2.0
##DATA TYPE= NMR FID
##DATA CLASS= NTUPLES
##ORIGIN= UXNMR, Bruker Analytische Messtechnik GmbH
##OWNER= root
$$ XWIN-NMR		Version 3.5
$$ Fri Jan 11 15:33:15 2019 Russian Standard Time (UT+4h)  she@DPX200
##.OBSERVE FREQUENCY= 200.1313
##.OBSERVE NUCLEUS= ^1H
##.DELAY= (6, 6)
##.ACQUISITION MODE= SIMULTANEOUS
##.ACQUISITION SCHEME= undefined
##.AVERAGES= 8
##.DIGITISER RES= 18
##SPECTROMETER/DATA SYSTEM= spect
##.PULSE SEQUENCE= zg30
##.SOLVENT NAME= CDCl3
##.SHIFT REFERENCE= (INTERNAL, CDCl3, 0, 15.7039)
##AUDIT TRAIL= $$ (NUMBER, WHEN, WHO, WHERE, WHAT)
$$ ##TITLE= Audit trail, XWIN-NMR		Version 3.5
$$ ##JCAMPDX= 5.01
$$ ##ORIGIN= Bruker BioSpin GmbH
$$ ##OWNER= she
$$ F:/spectra/data/she/nmr/H-F/1/audita.txt
$$ ##AUDIT TRAIL=  $$ (NUMBER, WHEN, WHO, WHERE, WHAT)
(   1,<2019-01-11 15:31:42.59 +0400>,<she>,<DPX200>,
      <created by zg, POWCHK disabled, PULCHK disabled
       configuration hash MD5:
       00 E9 B6 7A A2 85 ED C7 34 08 36 98 17 FE 4E 26
       data hash MD5: 16K
       33 D4 4C 2C 41 21 4F EA 54 70 E9 3F 61 3E E9 3A>)
$$ ##END=
$$ 
$$ hash MD5
$$ 23 92 2A AA AE 9F 7F DD 42 DD FF 3C 51 D9 35 6E
##$RELAX= 
##$RELAX= 
##$RELAX= 
##$RELAX= 
##$RELAX= 
##$RELAX= 
$$ Bruker specific parameters
$$ --------------------------
##$DU= <F:/spectra>
##$EXPNO= 1
##$NAME= <H-F>
##$PROCNO= 1
##$TYPE= <nmr>
##$USER= <she>
##$AMP= (0..31)
100 100 100 100 100 100 100 100 100 100 100 100 100 100 100 100 100 100 
100 100 100 100 100 100 100 100 100 100 100 100 100 100 
##$AQSEQ= 0
##$AQ_mod= 1
##$AUNM= <au_zg>
##$AUTOPOS= <>
##$BF1= 200.13
##$BF2= 200.13
##$BF3= 200.13
##$BF4= 200.13
##$BF5= 200.13
##$BF6= 200.13
##$BF7= 200.13
##$BF8= 200.13
##$BYTORDA= 1
##$CFDGTYP= 0
##$CFRGTYP= 5
##$CHEMSTR= <none>
##$CNST= (0..31)
1 1 145 1 1 1 1 1 1 1 1 1 1 1 1 1 1 1 1 1 1 1 1 1 1 1 1 1 1 1 1 1 
##$CPDPRG= <>
##$CPDPRG1= <>
##$CPDPRG2= <>
##$CPDPRG3= <>
##$CPDPRG4= <mlev>
##$CPDPRG5= <mlev>
##$CPDPRG6= <mlev>
##$CPDPRG7= <mlev>
##$CPDPRG8= <mlev>
##$CPDPRGB= <>
##$CPDPRGT= <>
##$D= (0..31)
0 1.2 0 0 0 0 0 0 0 0 0 0.03 0 0 0 0 0 0 0 0 0 0 0 0 0 0 0 0 0 0 0 0 
##$DATE= 1547206301
##$DBL= (0..7)
120 120 120 120 120 120 120 120 
##$DBP= (0..7)
150 150 150 150 150 150 150 150 
##$DBP07= 0
##$DBPNAM0= <>
##$DBPNAM1= <>
##$DBPNAM2= <>
##$DBPNAM3= <>
##$DBPNAM4= <>
##$DBPNAM5= <>
##$DBPNAM6= <>
##$DBPNAM7= <>
##$DBPOAL= (0..7)
0.5 0.5 0.5 0.5 0.5 0.5 0.5 0.5 
##$DBPOFFS= (0..7)
0 0 0 0 0 0 0 0 
##$DE= 6
##$DECBNUC= <off>
##$DECIM= 24
##$DECNUC= <off>
##$DECSTAT= 4
##$DIGMOD= 1
##$DIGTYP= 9
##$DL= (0..7)
0 120 120 120 120 120 120 120 
##$DP= (0..7)
150 150 150 150 150 150 150 150 
##$DP07= 0
##$DPNAME0= <>
##$DPNAME1= <>
##$DPNAME2= <>
##$DPNAME3= <>
##$DPNAME4= <>
##$DPNAME5= <>
##$DPNAME6= <>
##$DPNAME7= <>
##$DPOAL= (0..7)
0.5 0.5 0.5 0.5 0.5 0.5 0.5 0.5 
##$DPOFFS= (0..7)
0 0 0 0 0 0 0 0 
##$DQDMODE= 0
##$DR= 18
##$DS= 0
##$DSLIST= <SSSSSSSSSSSSSSS>
##$DSPFIRM= 0
$$ [...]
##$SUBNAM2= <"">
##$SUBNAM3= <"">
##$SUBNAM4= <"">
##$SUBNAM5= <"">
##$SUBNAM6= <"">
##$SUBNAM7= <"">
##$SUBNAM8= <"">
##$SUBNAM9= <"">
##$SW= 24.933730806125
##$SWIBOX= (0..15)
0 0 2 0 0 0 0 0 0 0 0 0 0 0 0 0 
##$SW_h= 4990.01996007984
##$TD= 16384
##$TD0= 1
##$TE= 0
##$TE2= 300
##$TE3= 300
##$TEG= 300
##$TL= (0..7)
0 120 120 120 120 120 120 120 
##$TP= (0..7)
150 150 150 150 150 150 150 150 
##$TP07= 0
##$TPNAME0= <>
##$TPNAME1= <>
##$TPNAME2= <>
##$TPNAME3= <>
##$TPNAME4= <>
##$TPNAME5= <>
##$TPNAME6= <>
##$TPNAME7= <>
##$TPOAL= (0..7)
0.5 0.5 0.5 0.5 0.5 0.5 0.5 0.5 
##$TPOFFS= (0..7)
0 0 0 0 0 0 0 0 
##$TUNHIN= 0
##$TUNHOUT= 0
##$TUNXOUT= 0
##$USERA1= <user>
##$USERA2= <user>
##$USERA3= <user>
##$USERA4= <user>
##$USERA5= <user>
##$V9= 5
##$VALIST= <valist>
##$VCLIST= <CCCCCCCCCCCCCCC>
##$VD= 0
##$VDLIST= <DDDDDDDDDDDDDDD>
##$VPLIST= <PPPPPPPPPPPPPPP>
##$VTLIST= <TTTTTTTTTTTTTTT>
##$WBST= 1024
##$WBSW= 4
##$XGAIN= (0..3)
0 0 0 0 
##$XL= 0
##$YL= 0
##$YMAX_a= 765074
##$YMIN_a= -476282
##$ZGOPTNS= <>
##$ZL1= 120
##$ZL2= 120
##$ZL3= 120
##$ZL4= 120
##$ABSF1= 10
##$ABSF2= 0
##$ABSG= 5
##$ABSL= 3
##$ALPHA= 0
##$AQORDER= 0
##$ASSFAC= 0
##$ASSFACI= 0
##$ASSFACX= 0
##$ASSWID= 0
##$AUNMP= <proc_1d>
##$AZFE= 0.1
##$AZFW= 0.1
##$BCFW= 1
##$BC_mod= 2
##$BYTORDP= 1
##$COROFFS= 0
##$CY= 11.3945322036743
##$DATMOD= 1
##$DC= 2
##$DFILT= <>
##$DTYPP= 0
##$F1P= 18.9103706918063
##$F2P= -1.10871071338519
##$FCOR= 0.5
##$FTSIZE= 0
##$FT_mod= 4
##$GAMMA= 1
##$GB= 0.15
##$INTBC= 1
##$INTSCL= 1
##$ISEN= 128
##$LB= 0.24
##$LEV0= 0
##$LPBIN= 0
##$MAXI= 10000
##$MC2= 0
##$MEAN= 0
##$ME_mod= 0
##$MI= 1.114404
##$NCOEF= 0
##$NC_proc= 0
##$NLEV= 6
##$NOISF1= 3.799351
##$NOISF2= 2.8
##$NSP= 1
##$NTH_PI= 0
##$NZP= 0
##$OFFSET= 15.70392
##$PC= 1
##$PHC0= -8856.461
##$PHC1= 14.40006
##$PH_mod= 1
##$PKNL= yes
##$PPARMOD= 0
##$PSCAL= 0
##$PSIGN= 0
##$REVERSE= no
##$SF= 200.130013532006
##$SI= 16384
##$SIGF1= 3
##$SIGF2= 2
##$SINO= 400
##$SIOLD= 16384
##$SREGLST= <1H.CDCl3>
##$SSB= 0
##$STSI= 0
##$STSR= 0
##$SW_p= 3612.71676300578
##$SYMM= 0
##$S_DEV= 0
##$TDeff= 0
##$TDoff= 0
##$TI= <>
##$TILT= no
##$TM1= 0
##$TM2= 0
##$TOPLEV= 0
##$USERP1= <user>
##$USERP2= <user>
##$USERP3= <user>
##$USERP4= <user>
##$USERP5= <user>
##$WDW= 1
##$XDIM= 8192
##$YMAX_p= 0
##$YMIN_p= 0
$$ End of Bruker specific parameters
$$ ---------------------------------
##NTUPLES= NMR FID
##VAR_NAME=  TIME,          FID/REAL,        FID/IMAG
##SYMBOL=    X,             R,               I
##VAR_TYPE=  INDEPENDENT,   DEPENDENT,       DEPENDENT
##VAR_FORM=  AFFN,          ASDF,            ASDF
##VAR_DIM=   8192,          8192,            8192
##UNITS=     SECONDS,       ARBITRARY UNITS, ARBITRARY UNITS
##FACTOR=    0.0002004,     1,               1
##FIRST=     0,             0,               0
##LAST=      1.6414764,     0,               0
##MIN=       0,             -476282,         0
##MAX=       1.6414764,     765074,          0
$$ Real data points
##PAGE= N=1
##DATA TABLE= (X++(R..R)), XYDATA
$$ [...]
2212b942O40q69Q75K083P8k008q7K737J555m8J039P30j867k168Q29K278m25j537
$$ -2942 -2302 -3171 -2296 -213 -135 -2143 -2230 507 2062 2014 3053 3783 1916 -252 577 2855 2430 893
2230H93n36p81k721q86K368K335j292j379M93k67p23J809L428J092k924j758R68
$$ 893 357 -424 -3145 -4031 -1663 672 -620 -1999 -1506 -1773 -2496 -687 2741 3833 909 -849 119
2247A19k59l69J874J472k204l637J36K269J041N53J406K55l472j718K531L305
$$ 119 -140 -509 1365 2837 633 -3004 -2868 -599 442 995 2401 2656 -816 -2534 -3 3302
2263C302n71n31p56k206l027K86L300J492j579j945p24o10l43L012M026j71k416
$$ 3302 2731 2200 1444 -762 -3789 -3503 -203 1289 -290 -2235 -2959 -3569 -3912 -900 3126 2955 539
2280E39n22J027K89J099K802L71l729l341l14J131M26n2N11j623l396p72K950
$$ 539 17 1044 1333 2432 5234 5605 1876 -1465 -1779 -648 -222 -274 237 -1386 -4782 -5554 -2604
2297b604K948L49m0k3j676j300K428L643Q77k191j588p98j500J92K587J768k085
$$ -2604 344 693 653 630 -1046 -2346 82 3725 4602 2411 823 25 -1475 -1283 1304 3072 987
2314I87k903n35P09J17J513K104j00l187j758J962J645J79Q79J78j963k811M98
$$ 987 -1916 -2451 -1742 -1625 -112 1992 1892 -1295 -3053 -1091 554 733 1612 1790 -173 -2984 -2486
2331b486K907J029j037k72m40j644j35L006K283m20k154m98k2r72R58K357L55
$$ -2486 421 1450 413 141 -299 -1943 -2078 928 3211 2791 637 139 117 -855 103 2460 2815
2348B815k745k029O15K74j08J168J302j642k689l99K647J089L74O84j71j798j096
$$ 2815 70 -1959 -1344 -1070 -1178 -10 1292 -350 -3039 -3438 -791 298 672 1356 1185 -613 -1709
2365a709J915K276r7j582k87r70j777L79K243J129j471j642J0j32k16J725K431
$$ -1709 206 2482 2385 803 516 -454 -2231 -1852 391 1520 49 -1593 -1583 -1715 -1931 -206 2225
2382B225r3j725p67Q88O59l73J130M42j770j923L16J500k47k06N6j01j954o9J696
$$ 2225 2132 407 -360 528 1187 814 1944 2386 616 -1307 -991 509 262 56 112 11 -1943 -2012 -316
2401c16J461m20l22L22j85j031O84J518l3k601l35N46o83m50Q31J469j225j169
$$ -316 1145 725 403 725 540 -491 193 1711 1678 -923 -1258 -712 -1395 -1845 -1014 455 -770 -1939
2419a939N52J209l51M95J117M42j519l08J279N01r90l34L63m42j192M62J673L0
$$ -1939 -1387 -178 -529 -34 1083 1525 6 -302 977 1478 488 154 517 75 -1117 -655 1018 1048
2437A048j113N5Q35o71m81J022Q83j239j268N93N60q42K0J102j21j038j001R13
$$ 1048 -65 -10 825 154 -327 695 1578 339 -929 -336 224 -618 -598 504 383 -655 -1656 -743
2455g43M51o18M45J337O0o92J27J269k68j250k72O64o97j941J81P90J33r71J036
$$ -743 -292 -910 -465 872 932 240 367 1636 1368 118 -154 510 -187 -2128 -1947 -1157 -1024 -1995 -959
2474i59J007n90m20R59R09p60r3J283O48q75j72R91r9j054m31N24o68j794O35
$$ -959 48 -542 -962 -3 906 146 53 1336 1984 1109 937 1928 1829 775 344 868 200 -1594 -959
2493i59J066p4j112M84O08r83k52J001R55o49q00M57J01q98N5J469M92r86m27
$$ -959 107 33 -1079 -595 13 -970 -1222 -221 734 85 -715 -258 -157 -1055 -1000 469 961 -25 -452
2512d52Q29L57o17N40R86p16j170JN96Q2o86j6L90j270p94N48J270j32m20M35
$$ -452 377 734 117 657 1643 927 -243 -242 354 436 -250 -266 124 -1146 -1940 -1392 -122 -254 -674 -239
2532b39l73m43M34J564R78m21q52M89m68q40N41J098r36j181m16O44o9L33K72
$$ -239 -612 -1055 -621 943 1921 1500 648 1137 669 -171 370 1468 532 -649 -1065 -421 -490 -157 115
2551A15M08j116j402L22R62N02j10O34K42r47P8J313P25q84n62lq84m64J258J687
$$ 115 523 -593 -1995 -1673 -711 -209 -319 315 557 -390 -312 1001 1726 842 280 277 -607 -1071 187 1874
2571A874M73j002n90J38n28j74N90N98j533j513M2R38L68K68P08k38j916j092
$$ 1874 2347 1345 755 893 365 191 781 1379 -154 -1667 -1625 -687 -319 -51 657 419 -1497 -2589
2589b589O56P64L90L17L19k76m46Q51J610P55p07n00j021r07n69P72J312l32j598
$$ -2589 -1933 -1169 -779 -462 -143 -419 -865 -14 1596 2351 1644 1144 123 -784 -1353 -581 731 399 -1199
2608a199k24j31J70n3J346Q30j206q71P13J216N09J122P33m27r65p38O66M04m72
$$ -1199 -1423 -1554 -1384 -1437 -91 739 -467 -1338 -625 591 1100 2222 2955 2528 1563 825 1491 1895 1423
2627A423l09n88j566j024O02J362j89m70J35k05l98M14J264P27n19q52K22o9m60
$$ 1423 1114 526 -1040 -2064 -1462 -100 -289 -759 -624 -829 -1227 -813 451 1178 659 -193 29 -40 -500
2646e00P56O70k79j522p39O66m39K03O26K50n54m01M87J151P51J98o3l68j276
$$ -500 256 926 647 -875 -1614 -948 -1387 -1184 -558 -308 -862 -1263 -776 375 1126 1324 1261 893 -383
2665c83n90P20P77l10o58K16K3q4L39J112L15r05q83J54L1J68J085N96j09j112
$$ -383 -973 -253 524 214 -444 -228 -205 -289 50 1162 1477 572 -311 -157 -126 42 1127 1723 1614 502
2685E02m64M0n84m40M4L33j138j75R58Q12L30M20J39K55r67l63M63K61k59l35
$$ 502 38 78 -506 -946 -902 -569 -1707 -1882 -924 -112 218 638 777 1032 65 -298 165 426 167 -168
2705a68N64k67q0O6N34k86r96m85J83l80J07O15Q77J07n13O99J48k60j13L67n10
$$ -168 396 129 49 115 649 363 -633 -1118 -935 -1315 -1208 -593 284 391 -122 577 725 465 352 719 209
2726B09m32j62M59K92n03L76P31o31m84m75N11M4n62K32M73l89m84N74O03l14
$$ 209 -223 -385 74 366 -137 239 970 339 -145 -620 -109 -65 -627 -395 78 -311 -795 -221 382 68
2746F8r7m3Km1m84P41M55r44R3P48k6o09M08M19J31n62j4M9l15p30M73K56k39
$$ 68 -29 -72 -70 -111 -595 146 601 -343 -250 498 472 -137 271 690 821 259 245 294 -21 -751 -278 -22 -261
2769b61k36k28L55L5K36J13K65o42p1L02P80m68M72L53k73l23k20M47k23o45k24
$$ -261 -497 -725 -370 -335 -99 14 279 -363 -434 -132 648 180 652 1005 732 409 189 636 413 -232 -456
2790d56O8j85m03M67O65J73l21j40K32m68j14K3R36l68k85O20k11J70QL97l57
$$ -456 -388 -573 -976 -509 156 329 8 -132 100 -368 -482 -459 477 109 -176 444 233 403 411 808 451
2811D51n03p47N16n02J65L18N55pl42j25N25j9j51K3l28k17m26O46P48j64r5j42
$$ 451 -52 -799 -283 -785 -620 -302 253 246 -96 -221 304 285 134 157 -171 -388 -814 -168 580 416 321 179
2833A79k8n80m7L17J04n00P1J75K16k23M00O23k63m63n68L62j45L01p8M88k15
$$ 179 151 -429 -476 -159 -55 -555 -484 -309 -93 -316 84 707 444 -19 -587 -225 -370 -69 -147 341 126
2854A26k60k09M84J11k54K05O1o45j16L97L2L09l30l5m26k91M07Q48j69j28o0
$$ 126 -134 -343 141 252 -2 203 264 -381 -497 -100 -68 241 -89 -124 -550 -841 -434 414 245 117 57
2875E7ok83P3O80M7jo29J99q7J0o2O80l82p96j33k02O34j04M30r6j34j68R7L71
$$ 57 51 -232 -159 521 568 567 -62 137 50 60 -2 678 296 -500 -633 -835 -201 -305 125 29 -105 -273 -176 195
2899A95Q9N8j57k47Q9l06L94P6K65m93j28N9J06k88P17l19l29k77J57O84l71L85
$$ 195 284 342 185 -62 27 -279 115 191 456 -37 -165 -106 0 -288 429 110 -219 -496 -339 345 -26 359
2921C59j44n9k64n52L96L54k81M2L40j9k08N9J55N21m93Q9n48J18J44K61K24j37
$$ 359 215 156 -108 -660 -264 90 -191 -149 191 172 -36 23 178 699 206 295 -253 -135 9 270 494 357
2943C57m97k1Q9m87k03N39k8j40K64o5K07j93M04M04k64k51n9K23j58j2K19O6
$$ 357 -140 -161 -72 -559 -762 -223 -251 -391 -127 -192 15 -178 226 630 366 115 56 279 121 109 328 394
2965C94m18l72Q8N26k71j54J08mj38m39Q22P9m6J00k91K37l8L8J25l9J50n32L11
$$ 394 -24 -396 -308 218 -53 -207 -99 -103 -241 -680 142 221 175 275 -16 221 183 221 346 307 457 -75 236
2988B36Lk95L4L39o02k15M49M2Rk76K13k9J64n36L25J73l21K1M58K5k22j03L03
$$ 236 239 -56 -22 317 -285 -500 -51 -9 0 -276 -63 -92 72 -464 -139 34 -287 -266 192 217 -5 -108 195
3011A95j88p7j2M7j13N4j10L16k7j86J17rO7j67q8L93l50k77L08j92J49k04L73
$$ 195 7 -70 -82 -35 -148 -94 -204 112 85 -101 16 7 74 -93 -181 212 -138 -415 -107 -299 -150 -354 19
3034A9L18j39j92R0q2j36ML22l3m4m40J19j8nK0K71j63J56n2J50m1n1L7J21J0
$$ 19 337 198 6 96 14 -122 -118 204 171 127 -313 -194 -212 -217 -197 74 -89 67 15 165 124 73 110 231 241
3059B41m46M79j04J96l34J93n28K52l51L51J02k30j8L11q2k11K56K57k63k53J92
$$ 241 -205 274 170 366 32 225 -303 -51 -402 -51 51 -179 -197 114 32 -179 77 334 71 -182 10
3080A0o9qk3p3J69L7l03P6N61M3l57J86P5j90l50L18m6j25J35Pk35J09m98M09
$$ 10 -59 -67 -90 -163 6 43 -260 -184 377 420 63 249 324 134 -216 102 56 -69 66 73 -162 -53 -551 -142
3104a42r4J78p5J2J02j49K49K75J39m12j35N91p43J53n2M00r0k65n61L52J14k11
$$ -142 -236 -58 -133 -121 -19 -168 81 356 495 83 -52 539 -204 -51 -103 297 207 -58 -619 -267 -153 -364
3126c64M95R5m00J77r6L05L0k34J80J6n71KP23k90j34K59J45l16l65J75N30m91
$$ -364 131 226 -174 3 -93 212 242 8 188 204 -367 -365 358 68 -66 193 338 22 -343 -168 362 -129
3148a29Q9J16j55K63l4j86J76Lm78j05M25n39O80qj80n94N44K09K39K06l43P0
$$ -129 -40 76 -79 184 150 -36 140 143 -335 -440 -15 -554 126 118 -62 -656 -112 97 336 542 199 269
3170B69k95k9J81M52o8m47k11J80m55K16J70J47l74o8k34J96N12l06P78k63J4
$$ 269 -26 -55 126 578 510 63 -148 32 -423 -207 -37 110 -264 -332 -566 -370 142 -164 614 351 365
3191C65l44J68p6K18k20L90l77n41L03j7J17k24j33j8l4l27M76K97J53j70L70
$$ 365 21 189 113 331 111 501 124 -417 -114 -131 -14 -238 -371 -389 -423 -750 -274 23 176 6 376
3212C76l39j22NN15J97n11O1m42R8J7j37M15o1l24j51O64j66j85J66K97l02k43
$$ 376 37 -85 -80 435 632 121 182 -260 -162 -145 -282 133 72 -252 -403 261 95 -90 76 373 71 -172
3234a72J4J89L01l44K74k24p9j08J87%R7k23OJ59n11L20M19L08n36k9m6rj99J23
$$ -172 -158 31 332 -12 262 38 -41 -149 38 38 135 -88 -82 77 -434 -114 305 613 77 48 2 -7 -206 -83
3258h3J54m09j7M4J59J32k97P38p0m12J70j7M8k03J16k6j24m8J11lK84l48j67
$$ -83 71 -338 -355 -311 -152 -20 -317 421 351 -61 109 92 140 -63 53 27 -97 -145 -34 -37 247 -101 -268
3281b68O05m62j16p6L72k60N54m25L48j97j54K91r9j84j88l5K97j30L59l7l6k78
$$ -268 337 -125 -241 -317 55 -205 349 -76 272 75 -79 212 113 -71 -259 -294 3 -127 232 195 159 -119
3303a19K41oK48J5k76L53j25l30m02O38k99k02q8K51n0k85M96l5j03m9O10j68
$$ -119 122 116 364 379 103 456 331 1 -401 237 -62 -264 -352 -101 -151 -436 60 25 -78 -127 483 315
3325C15l49n4K62K35k63J39J84j2o04O2j55O0m17k8j6K00j8J61Q00n00j72K37
$$ 315 -34 -88 174 409 146 285 469 457 -147 -85 -240 -180 -597 -625 -641 -441 -459 -298 502 2 -170 67
3347F7Q0o6l3L28J22m25L0K35j59j43l48M37R2j021J14L17L88j01L36L97j83l64
$$ 67 147 81 48 376 498 73 103 338 179 36 -312 125 217 -804 -690 -373 15 -86 250 647 464 100
3369A00j56L43l16p2O6J15k09L88J8J64k41n04J39l25J31J54K61Q0l37j84Q43
$$ 100 -56 287 -29 -101 -35 80 -129 259 277 441 200 -304 -165 -490 -359 -205 56 136 -201 -385 458
3390D58J36k30LJ5o10n58N45L17j57N8l17O32n71J13K27j86L25l44L59j53j92
$$ 458 594 364 367 382 -228 -786 -241 76 -81 -23 -340 292 -279 -166 61 -125 200 -144 215 62 -130
3411a30L99J28Jk46o6Q6K8m37J92j66L64r22K08K96m5k76M31P64m95j85N5M14
$$ -130 269 397 398 152 86 172 200 -237 -45 -211 153 -769 -561 -265 -310 -586 -155 609 114 -71 -16 398
3433C98j12j93m2j26l90j01J072k69k07L19O6m29k39j54N12k96k52M54K2L61j77
$$ 398 286 93 51 -75 -465 -566 506 237 30 349 415 -14 -253 -407 105 -191 -443 11 33 394 217
3454B17M94P5o50k91j11j33m0M46K07M14j43k61M56j3n82j18q4k79l87Q2N53N9
$$ 217 711 786 136 -155 -266 -399 -439 7 214 628 485 224 680 667 85 -33 -117 -396 -783 -701 -148 -89
3476h9k22L63L8o53q8k45K73m3o5J78L85J25M46N99l75k61k90J1N6k63RL40l56
$$ -89 -311 52 90 -563 -651 -896 -623 -666 -731 -553 -168 -43 403 1002 627 366 76 87 143 -120 -111 229 -127
3499a27k96L81O56j46m43M30m91j32n87N12Q60K67k70M18j21j52r5K59j79o10
$$ -127 -423 -42 614 468 25 455 -36 -168 -755 -243 617 884 614 1032 911 759 664 923 744 134
3519A34o90K49m9l80J19O33j60l37j03K25j98j46N87j66n36o6K73L32N16n69M61
$$ 134 -556 -307 -356 -736 -617 16 -144 -481 -584 -359 -557 -703 -116 -282 -818 -884 -611 -279 237 -332 129
3540A29J52n28j70J43J67n1j81QK37k83M20P55r4k68K77j32l46Pj37J97l10m82
$$ 129 281 -247 -417 -274 -107 -158 -339 -331 -94 -377 43 798 704 436 713 581 235 242 105 302 -8 -490
3562d90O30R0j07P2j44K07o69k30K70K4L27K69O62J65n74K86L34n69n39l66j14
$$ -490 140 230 123 195 51 258 -411 -641 -371 -347 -20 249 911 1076 502 788 1122 553 14 -352 -466
3583d66l60k23m9M73K6p9N77J0l06l6N9N45j85k9M71N80J16k88K6o0p18p08Q4
$$ -466 -826 -1049 -1098 -625 -599 -678 -101 -91 -397 -433 -374 171 -14 -43 428 1008 1124 836 862 802 84 -624 -540
3606e40K62o80M80K92N0J83Q6M70r1m70M59m33k95k78N49L39l0j46J57L07o37
$$ -540 -278 -958 -478 -186 -136 47 133 603 512 42 501 68 -227 -505 44 383 353 207 364 671 34
3627C4m09L46l36r9r6M51L92n57N38N02Q9n90l28L12l73n73L81K46m83M4N7L77
$$ 34 -375 -29 -365 -464 -560 -109 283 -274 264 766 855 265 -63 249 -124 -697 -316 -70 -553 -509 -452 -75
3649g5K24q0K07L11o20j68K23L43J11k09k67j83J44j78N29n5j99j71K54n09j89
$$ -75 149 69 276 587 -33 -201 22 365 476 267 0 -183 -39 -217 312 257 58 -113 141 -368 -557
3670e57K82P80l08k67K55p1l7Q6L05k03m11l88Q5K15m3K03L85k87K28o4K51M9
$$ -557 -275 505 197 -70 185 114 77 163 468 265 -146 -534 -449 -234 -277 -74 311 24 252 188 439 488
3692D88n41J59k37k59l66M15J40L66j54J70l10l60j39P17J57k54o4O96k81N7J93
$$ 488 -53 106 -131 -390 -756 -341 -201 165 11 181 -129 -489 -628 89 246 -8 -72 624 343 400 593
3713E93j1o1o86m27J46K8l24M92N44j17p57K07P71m97K61M3j87n21J91O15K29
$$ 593 582 521 -165 -592 -446 -418 -742 -250 294 177 -580 -373 398 -99 162 205 18 -503 -312 303 532
3734E32l3j67p9J07r47J69N20Pm64q0M72k23j2L89P06n21o35N5n6j25M1O50J70
$$ 532 499 332 253 360 -587 -418 102 109 -355 -435 37 -186 -198 191 897 376 -259 -204 -260 -385 -344 306 476
3757D76m58k20M50R1rm1M46k24p56j95M07Qk02M22J31l12o51L23K16K70k4N0j24
$$ 476 18 -202 248 339 330 289 735 511 -245 -440 -33 -25 -227 195 326 14 -637 -314 -98 172 148 198 74
3780G4k16m22M00K01k39K00j5K10j41p5M37l33o08K73K62j60k50N16N01k72k95
$$ 74 -142 -564 -164 37 -202 -2 -17 193 52 -23 414 81 -527 -254 8 -152 -402 114 615 343 48
3801D8j89L27J5j33j61J96n07k87O44O09o42R5N14n06n69K97M66k0l55j43K66
$$ 48 -141 186 201 68 -93 103 -404 -691 -47 562 -80 15 529 23 -546 -249 217 197 -158 -301 -35
3822c5K4l02L38O24k50m23l24K67J55ML41j88j8p55L19Lj21k4N30Q9n45j00Q42
$$ -35 -11 -313 25 649 399 -24 -348 -81 74 78 419 231 213 -542 -223 -220 -341 -365 165 254 -291 -391 451
3845D51L7k50J90o4q8l73n6L86N9l85K37L04o16j68L29M00n26j7L9K69k12j87
$$ 451 488 238 428 364 276 -97 -153 233 292 -93 144 448 -168 -336 -7 393 -133 -150 -111 158 -54 -241
3867b41O39K16p64K39j13m7o4j01L37j61n22J54L29J82n9K9K17l85k90N26Q8J15
$$ -241 398 614 -150 89 -24 -71 -135 -236 101 -60 -582 -428 -99 83 24 53 270 -115 -405 121 209 324
3889C24m40O39j94m86l28M99R8l07J81k98K95k56L02K46m34j81l9N69k13j63L72
$$ 324 -116 523 329 -157 -485 14 112 -195 -14 -312 -17 -273 29 275 -159 -340 -379 190 -23 -186 186
3910A86O0N7o31N26K69m34p1L82Q4p19J3N77l6j65k00L11k32o2n5M9K42o48J20
$$ 186 246 303 -328 198 467 33 -38 344 428 -291 -278 299 263 98 -102 209 -23 -85 -140 -91 151 -497 -377
3933c77L17k75K26N15m9J22o00N62k54j42k79P21l15m61j59O2M21m84L88j76J59
$$ -377 -60 -335 -109 406 357 479 -121 441 187 45 -234 487 172 -289 -448 -386 35 -449 -61 -237 -78
3954g8m94K74M24n1j63L39J65j86m38M25L53m12L4k46J29p40J14K38J01n4j45
$$ -78 -572 -298 126 75 -88 251 416 230 -208 217 570 158 192 -54 75 -665 -551 -313 -212 -266 -411
3975d11L65N7q9LO01L7o21K4O58j99k51q2N22m52m46j93N78n04l86M66J58n63
$$ -411 -46 11 -78 -75 526 563 -58 -34 624 425 174 92 614 162 -284 -477 101 -403 -789 -323 -165 -728
3997g28N01L49O12p41p1O53J32p14j1M52j03o65M9M87k07q4j02J96om20K68O3
$$ -728 -227 122 734 -7 -78 575 707 -7 -18 434 331 -334 -285 202 -5 -89 -191 5 -1 -421 -153 -90
4019i0J66j08M04K54k15o03L13M38m28k82J10k04m87J54L78K88l93K04L50j13
$$ -90 76 -32 372 626 411 -192 121 559 131 -151 -41 -245 -732 -578 -200 88 -305 -101 249 136
4039A36m08P87k9m3p00N73j23j76n1L78r8j63o27K44J45k92M78k40M47o60M7R09
$$ 136 -272 515 486 443 -257 316 193 17 -34 344 246 83 -544 -300 -155 -447 31 -209 238 -422 -375 534
4061E34J8l92K77M32j84p97J26K66m30l82O07q0rn15J20N67k59j5o1N9k12j92
$$ 534 552 160 437 869 685 -112 14 280 -150 -532 75 -5 -14 -529 -409 158 -101 -116 -177 -118 -330 -522
4083e22O33J51p30K41K09J98m27M23L38n7q20L58L28l28j93M40M23n22l84M03
$$ -522 111 262 -468 -227 -18 180 -247 176 514 457 -363 -5 323 -5 -198 242 665 143 -241 162
4103A62M74p35O9K54J29o56j58M45J8j71j4K73k21l79M27M36r1m47K30K16j45
$$ 162 636 -99 -30 224 353 -303 -461 -16 2 -169 -183 90 -131 -510 -83 353 262 -185 45 261 116
4124A16j25K99L33p46l29J43L55l43m3O14l99l70j70N42j17j5J62L94k19k37p3
$$ 116 -9 290 623 -123 -452 -309 46 -297 -340 274 -125 -495 -665 -123 -240 -255 -93 301 82 -155 -228
4145b28N24L94o67L36K0m01j62J05L57m44K44L04m09j60j73Q77j90m51m95Q91
$$ -228 296 690 23 359 379 -22 -184 -79 278 -166 78 382 -27 -187 -360 517 327 -124 -619 272
4165B72k67n88M13P16m43k85m34O48L6n3J10M85o48l62M58L51k34k61J81o2p42
$$ 272 5 -583 -170 546 103 -182 -616 32 68 15 125 610 -38 -400 58 409 175 -86 95 33 -709
4186g09m4O13k00k0m52N17K0l2J49M69j25K4l0J49j13m0M81J84m04o46L25K88
$$ -709 -753 -140 -340 -360 -812 -295 -275 -307 -158 311 186 210 180 329 216 176 657 841 437 -209 116 404
4208D04m24NM78j02n86l48P46l82j63p2O21n64n09M23O32j74k67L11O64m33M6
$$ 404 -20 -15 463 361 -225 -573 173 -209 -372 -444 177 -387 -896 -473 159 -15 -282 29 693 260 306
4229C06K83K83m82m02L78k69n1j88M73K4n82m44O43P1n36L72J75j74p38m5R04
$$ 306 589 872 390 -12 366 97 46 -142 331 355 -227 -671 -28 43 -493 -121 54 -120 -858 -903 1
4250AK23k93J73M05k25j79K10M48m98j62J93K58p44K70J91L51o91l96M47l72m59
$$ 1 224 -69 104 509 284 105 315 763 265 103 296 554 -190 80 271 622 -69 -465 -18 -390 -849
4271h49j03K94K69k19q1O35r9J76J72M14l63l02L72L74l15j39J39L64o20m85K71
$$ -849 -952 -658 -389 -608 -689 -54 -153 23 195 609 246 -56 316 690 375 236 375 739 119 -366 -95
4292i5L12q49J69J2L15n83J28K88M19n26K82N01l28p7J69L44l52m75N46K85k31
$$ -95 217 -632 -463 -451 -136 -719 -591 -303 116 -410 -128 373 45 -32 137 481 129 -346 200 485 254
4313B54l58L87L49m93K2K71K2m75K5J76p6l34k29N50k28n35N36Kj95n77L07L76
$$ 254 -104 283 632 139 161 432 454 -21 4 180 104 -230 -459 91 -137 -672 -136 -134 -329 -906 -599 -223
4335b23RK3P30J52l03m14M47L00n33l19K77R6p65j44L69L44p39k18P52k04m24
$$ -223 -214 -191 539 691 388 -26 421 721 188 -131 146 242 -523 -667 -298 46 -693 -911 -159 -363 -787
4356g87K29Q99r8n91L91R92l61o2L85J73m08m78K32J72p40k71K80K80r91M93L52
$$ -787 -558 341 243 -348 43 1035 674 612 997 1170 762 284 516 688 -52 -323 -43 237 -754 -261 91
4377I1j57j81L04J81j26l92J22L15%P1k28K24o11q5L52P6m60n23L05K91l69N51
$$ 91 -66 -247 57 238 112 -280 -158 157 157 228 0 224 -387 -472 -120 -44 -504 -1027 -722 -431 -800 -249
4399b49J68K04l87RK08M2j77k4N40m54m90K28K61J49m56K84L27j36m0J42M48L59
$$ -249 -81 123 -264 -255 -47 -5 -182 -206 334 -120 -610 -382 -121 28 -428 -144 183 47 7 149 597 956
4421I56m95M22k95N4m4J61L42q91m77L11P3p64q4P29j25q12K63M44J43K37m5L42
$$ 956 461 883 588 642 598 759 1101 210 -267 44 117 -647 -731 -2 -127 -939 -676 -232 -89 148 103 445
4443D45m30o60P01N35m10k31J31p6p64K37O67l74o34K89K88j68J15Q6Q35l21l28
$$ 445 15 -645 56 591 181 -50 81 5 -759 -522 145 -229 -863 -574 -286 -454 -339 -253 582 261 -67
4464f7L57J95j17J4n6L80o78k42R7K41k63J76K84M0n71k5P64pn78J34J90K72o99
$$ -67 290 485 368 382 326 706 28 -214 -117 124 -139 37 321 361 -210 -235 529 522 -56 78 268 540 -159
4487a59M1Q26o57L0k98j01J94k20j66M46K1n29J99O06m33L08L16q4j93o02M63
$$ -159 -118 708 51 81 -217 -318 -124 -344 -510 -64 -43 -572 -373 233 -200 108 424 340 147 -455 8
4508HO0l13J75K69k44l77K50l4K31k27o5P04p18j12L64L73j87p09L50M28j53k90
$$ 8 68 -245 -70 199 -45 -422 -172 -206 25 -202 -267 437 -281 -393 -29 344 157 -552 -202 226 73 -217
4530b17J06N19o91j83M78n9j92J59L49o6l23k48O19l3O1j19K74m03l15J56L34
$$ -217 -111 408 -283 -466 12 -47 -239 -80 269 203 -120 -368 251 218 279 160 434 31 -284 -128 206
4551B06r4k60k48M06m80k35O44p9o7j53M69k89pj6L71J35o23M22K78Jk93K91K31
$$ 206 112 -148 -396 10 -470 -705 -61 -140 -207 -360 109 -180 -187 -203 168 303 -320 102 380 381 88 379 610
4574F10m50j12r9K57l00n03O62k8m29k15M95J30l73J17N26k52l02P6O13k30j36
$$ 610 160 48 -51 206 -94 -597 65 37 -392 -607 -112 18 -355 -238 288 36 -266 -190 423 193 57
4595E7P0M81k88n42K26L98n22m91O79k6k46K3N8J65%n73M10O2k14m4K88M08n94
$$ 57 127 608 320 -222 4 402 -120 -611 68 42 -204 -181 -123 42 42 -531 -121 -59 -273 -317 -29 379 -215
4618b15j43L14p0M2k50P79r9n76L51nn6k39M23N66o19m13L70j44R9m44O47j41
$$ -215 -358 -44 -114 -72 -322 457 358 -218 133 128 72 -167 256 822 203 -210 160 16 115 -329 318 177
4640A77p93L1M15J40m02M10m7K30n80J94O44k9j61J87L96q64M0L81K62l10m02
$$ 177 -616 -585 -170 -30 -432 -22 -69 161 -419 -225 419 390 229 416 812 -52 -12 369 631 321 -81
4661h1K0J54n05k0L87j16m07j28K84N64o12J60P86o13J49l41R88k00o04O12p0
$$ -81 -61 93 -412 -432 -45 -161 -568 -696 -412 152 -460 -300 486 -127 22 -319 669 469 -135 477 407
4682D07m87j40J19M20m56m2n1K95n10j34O17K42l75m33M28j1j37J45P20l12q25
$$ 407 -80 -220 -101 319 -137 -179 -230 65 -445 -579 38 280 -95 -528 -100 -111 -248 -103 617 305 -520
4703e20p3Q83k02j36K16K65m92l45L83M68n74M6J84Ol15Q7K36K46m69k41M41j75
$$ -520 -593 290 88 -48 168 433 -59 -404 -21 447 -127 -81 103 109 -206 -119 117 363 -106 -347 94 -81
4725h1l79J39N15l25j85JL22J34l27L05J79j97j97J21L92j80n41L14m03M97o85
$$ -81 -460 -321 194 -131 -316 -315 7 141 -186 119 298 101 -96 25 417 237 -304 10 -393 104 -581
4746e81Q10M8n42K57j22o5k27q1P01J39m05k12K46K06n39N85K61k2j048O26M32
$$ -581 229 277 -265 -8 -130 -195 -422 -503 198 337 -68 -280 -34 172 -367 218 479 457 -591 35 467
4767D67l42n07P53k58k14n20N18L85m92J94MK35p44M42Q3M88o99K79M7j53k58
$$ 467 125 -382 371 113 -101 -621 -103 282 -210 -16 -12 223 -521 -79 4 492 -207 72 119 -34 -292
4788b92J12N18l05k14J21M08l95n64P75k00m25n9M49J03k88M33J36k42l64O0K66
$$ -292 -180 338 33 -181 -60 348 -47 -611 164 -36 -461 -520 -71 32 -256 177 313 71 -293 -233 33
4809C3K0j53K03J96k71m69J70L40j9m24L67L70j94j85K33r4k41J19M29l13j21
$$ 33 53 -100 103 299 28 -441 -271 69 50 -374 -7 363 169 -16 217 123 -118 1 430 117 -4
4830dj35L67N5p17M00L40j23r7n03L05rl88L74P9L80o39L87K42m15J22K90n3J2
$$ -4 -139 228 283 -434 -34 306 183 86 -417 -112 -121 -509 -135 -56 324 -315 72 314 -101 21 311 258 270
4853B70o41M05J08m87N46J7j26o61J54O65j20k63L17L45m78m3J99K39m01l25J51
$$ 270 -371 34 142 -345 201 218 92 -569 -415 250 130 -133 184 529 51 8 207 446 45 -280 -129
4874a29J90l05j94L94K38m76M9K48L07k13m2M46M1l96p2J14J19m21o0L26n36l22
$$ -129 61 -244 -438 -44 194 -282 -233 15 322 109 67 513 554 158 86 200 319 -102 -162 164 -372 -694
4896f94O25K35n87O2q7L48j87J2M91J51k23l01N78J08n99L87M79l70l35n4L84
$$ -694 -69 166 -421 -359 -446 -98 -285 -273 218 369 146 -155 423 531 -68 319 798 428 93 39 423
4917D23o77m1J77j16Q5l16L37K36J07n23N22k86Ll80O79O3k96l93L52L99l25j53
$$ 423 -254 -295 -118 -234 -149 -465 -128 108 215 -308 214 -72 -69 -449 230 293 -3 -396 -44 355 30 -123
4939a23L13J74o81J47N00l58p0J88k88J92l08L52K0O0m46L55j58m31L33J34O0
$$ -123 190 364 -317 -170 330 -28 -98 90 -198 -6 -314 38 58 118 -328 27 -131 -562 -229 -95 -35
4960c5j74M4J35j60J96K99J15k29Q7P8J94j26n39M37J71n83j64K13K22k69m59
$$ -35 -209 -165 -30 -190 6 305 420 191 278 356 550 424 -115 322 493 -90 -254 -41 181 -88 -547
4981e47M53o5l37j62L45L31k98m3M87j82r5P7M82k80j37j37L73k31j80JN18m27
$$ -547 -94 -159 -496 -658 -313 18 -280 -323 164 -18 -113 -36 446 166 29 -108 265 34 -146 -145 373 -54
5003e4n21M53L1j50l3N1M75n27J79J77K80n13L94J63o37N69rK7J36k59m41N26
$$ -54 -575 -122 -91 -241 -274 -223 252 -275 -96 81 361 -152 242 405 -232 337 328 355 491 232 -209 317
5025C17l88J17K63j36J5m29K43P4k6l2J52J16n63p3J61K22j66j89J42J2l64M01
$$ 317 -71 46 309 173 188 -241 2 76 50 18 170 286 -277 -350 -189 33 -133 -322 -180 -168 -532 -131
5047a31K40K7k18K0l9K47l22P78l35r3K6k3q4k5l80N08k80j11n6N35N5o66NL17
$$ -131 109 136 -82 -62 -101 146 -176 602 267 174 200 177 93 68 -312 196 -84 -195 -251 284 339 -327 -322 -5
5071eJ57n35J93N25N0n13K02K15o4p5k2J28k25m93M16L3P4k21J60M29o87r4L20
$$ -5 152 -383 -190 335 385 -128 74 289 225 150 128 256 31 -462 -46 -13 61 -160 0 429 -258 -352 -32
5094c2Q4N2p6j33O8l35O7M12ml58K41L2p0l65M55N61m13k45K74J45o0j47J71P5
$$ -32 52 104 28 -105 -37 -372 -305 107 103 -255 -14 18 -52 -417 38 599 186 -59 215 360 300 153 324 399
5118C99l57j84L91p5k52j66M12m04k03J81J56r8k99O86j86J37j19J06K68o3k99
$$ 399 42 -142 249 174 -78 -244 168 -236 -439 -258 -102 -200 -499 187 1 138 19 125 393 330 31
5139C1J53J95j73n02K51q1j86L8J65O5k74P9M00J74m18O3l6J75n12O42j68J8l3
$$ 31 184 379 206 -296 -45 -126 -312 -274 -109 -44 -318 -239 161 335 -83 -20 -56 119 -393 249 81 99 66
5162F6j6L3K62j92p5j50J31l63L22J90l69K80k81J9j85M93j59l5m36L54K86l80
$$ 66 50 83 345 153 78 -72 59 -304 18 208 -161 119 -162 -143 -328 165 6 -29 -465 -111 175 -205
5184b05r8K79K0l26p8N19K15m96J83J09N8J77n25P23k57k28j07M1J12L4k73K92
$$ -205 -303 -24 -4 -330 -408 111 326 -170 13 122 180 357 -168 555 298 70 -37 4 116 150 -123 169
5206A69n90J8j99N02J04j89J04J08k77j52N13j25L97k20L33k33k84J00J46J5r3
$$ 169 -421 -403 -602 -100 4 -185 -81 27 -250 -402 111 -14 383 163 496 263 -21 79 225 240 147
5227A47k64J99l6k70M33K68m73k95Q5J37K34l63K75q7r5k14L84M26p3k31o1J58
$$ 147 -117 82 46 -224 209 477 4 -291 -206 -69 165 -198 77 -10 -105 -319 65 491 418 187 126 284
5249B84q9l02K27L12n83K55P4j09m63J76L08k88j93J32K88m20K3L36p8J63l57
$$ 284 195 -107 120 432 -151 104 178 69 -394 -218 90 -198 -391 -259 29 -391 -368 -32 -110 53 -304
5270c04J82L79k86R9n8L38j98l04N20m5k85J67q3J50n23L37J00L82o85K19k3o9
$$ -304 -122 257 -29 70 12 350 152 -152 368 323 38 205 122 272 -251 86 186 568 -117 102 79 10
5292A0j16J36K50p08M85n3J74l55J6L5J23j17j73K84L21k04N1O9l26q8J48Q4k12
$$ 10 -106 30 280 -428 57 4 178 -177 -161 -126 -3 -120 -293 -9 312 108 159 228 -98 -186 -38 46 -166
5315a66J94j56j21m7J28r4J44j62j56M17K13k31K12J54j17j83j60N60l5l86n2
$$ -166 28 -128 -249 -296 -168 -262 -118 -280 -436 -19 194 -37 175 329 212 29 -131 429 394 8 -44
5336d4M7j77l52K03L24Ok82J20N39l15j74K03J3K98m66K9M29j55k95K56k00k68
$$ -44 3 -174 -526 -323 1 7 -275 -155 384 69 -105 98 111 409 -57 -28 401 246 -49 207 7 -261
5358b61k68N99k32j13j36K37J26k47j4N08J68n4l19K03J14o06N13j83k77K05j58
$$ -261 -529 70 -162 -275 -411 -174 -48 -295 -309 199 367 313 -6 197 311 -295 218 35 -242 -37 -195
5379a95K67l37J82M72l36k07p9L9L48k79J63L36k73k88J27K33p6k36R5j57o9k52
$$ -195 72 -265 -83 389 53 -154 -233 -194 154 -125 38 374 101 -187 -60 173 97 -139 -44 -201 -270 -522
5401e22O02J74l08NJ82j93j1K00N39j33m78j1K16n3l24J34K00j06p77N40M56k71
$$ -522 80 254 -54 -49 133 -60 -71 129 668 535 57 46 262 209 -115 19 219 113 -664 -124 332 61
5423F1j37j73J04j77n9K83L12J24m53K85j45m8Q0L99k71j34qj25m33K64L8N1j99
$$ 61 -76 -249 -145 -322 -381 -98 214 338 -115 170 25 -23 57 456 185 51 43 -82 -515 -251 -213 -162 -361
5446c61k38N91R0n8k96L19j80J3M02K70k31k31k50M41j04l03o2K61Q8M3m33K88
$$ -361 -599 -8 82 24 -272 47 -133 -120 282 552 321 90 -160 281 177 -126 -188 73 161 204 -229 59
5468E9o1q1K94K2j36k68n9N87l31p8K01r1k0j20M2K9k9j58K6J92j26k10M28K69
$$ 59 -2 -83 211 233 97 -171 -230 357 26 -52 149 58 38 -82 -40 -11 -40 -198 -172 20 -106 -316 112 381
5492C81k69j16K33k94K7lJ47K6k03n26O31k34j95J56K99J33n95M97N8J02j65K97
$$ 381 112 -4 229 -65 -38 -41 106 132 -71 -597 34 -200 -395 -239 60 193 -402 95 153 255 90 387
5514C87M0l15k9J38n8j61N6m23p7P0l67P33k87j29K4N06l03K15J24J97j38l02
$$ 387 427 112 83 221 163 2 58 -365 -442 -372 -739 -6 -293 -422 -398 108 -195 20 144 341 203 -99
5536i9L84J70n36j99P93m82n1Q9j02K23l9o28L81j9K9j30N05o50J68K45J2j88
$$ -99 285 455 -81 -280 513 31 -20 69 -33 190 151 -477 -96 -115 -86 -216 289 -361 -193 52 64 -124
5558a24j82N80J07k70l54M41j17Q5k62M00L1m37K15K18m2L9m47M05l24k92k5M04
$$ -124 -306 274 381 111 -243 198 81 166 -96 304 335 -102 113 331 289 328 -119 286 -38 -330 -355 49
5580D9K37o20M4J20j01J31P2J48k68L20qJ29J52l10L31m2l81J37L14j9n02J49
$$ 49 286 -334 -290 -170 -271 -140 -68 80 -188 132 124 253 405 95 426 384 3 140 454 435 -67 82
5602H2j7k28N2kk8K38l27K39j1k4m2K0r7K09o6k23M45j74J47P4k7l67l7J41j75
$$ 82 65 -163 -111 -113 -141 97 -230 9 -2 -26 -68 -48 -145 64 -2 -225 220 46 193 267 240 -127 -164 -23 -198
5627a98K01o0M4q2l88N90M2k25J05N2l42J06k67K84K71j50j60K69j35k19J37K76
$$ -198 3 -57 -13 -95 -483 107 149 -76 29 81 -261 -155 -422 -138 133 -17 -177 92 -43 -262 -125 151
5649A51L1k87R9Q1k7O9J05L67p66l38N27o0M2r8K68j39j44Q3kK07j09k07M8j68
$$ 151 182 -105 -6 75 48 117 222 589 -177 -515 12 -48 -6 -104 164 25 -119 -36 -38 169 60 -147 -99 -267
5673b67L21j57K00r8j23K88j27J89k97Q7J85j32j57q7J81J9K82p8k01n8m8k20
$$ -267 54 -103 97 -1 -124 164 37 226 -71 16 201 69 -88 -175 6 25 307 229 28 -30 -78 -298
5695b98K76J44l29R6J76k45J47K96K37o32j96K64L38j64j75L66l80qm6K93n59
$$ -298 -22 122 -207 -111 65 -180 -33 263 500 -132 -328 -64 274 110 -65 301 -79 -87 -133 160 -399
5716c99K73J03n5j17j53n5M86j19j14M28k98L2J05L4J49j63n90L52L66l97K00
$$ -399 -126 -23 -78 -195 -348 -403 83 -36 -150 278 -20 12 117 151 300 137 -453 -101 265 -132 68
5737F8o3J12k97k3L45l05Q2p1M69m28J33K08m7j20o0m4j31R6o0K71J91o15L07
$$ 68 5 117 -180 -203 142 -163 -81 -152 317 -111 22 230 183 63 3 -41 -172 -76 -136 135 326 -289 18
5760A8k34J03j38M53Lq4m41N09k45J80k7q0J47r2l63J50J01M6k78K03M7K0q9J64
$$ 18 -216 -113 -251 202 205 121 -320 189 -56 124 97 17 164 72 -291 -141 -40 6 -272 -69 -22 -2 -91 73
5784G3L93k30j41K43q4l88J66L17j23k87r7J38P1l24Q1K71N8k01L55k01q4p2p5
$$ 73 466 236 95 338 254 -134 32 349 226 -61 -158 -20 51 -273 -192 79 137 -64 291 90 6 -66 -141
5807a41J77m75K34L76M4l6j29P7k02j38J45R9n9j59k37M96N1n9j0M65l26k42n0
$$ -141 36 -439 -205 171 215 179 50 127 -75 -213 -68 31 -28 -187 -424 72 123 64 54 519 193 -49 -99
5830i9K89j4q3M2k93M8m2L43P5m10J34jj6p7J41j41Q8j8n0R4J92j06p2J89k56
$$ -99 190 176 93 135 -158 -110 -152 191 266 -144 -10 -11 -27 -104 37 -104 -16 -34 -84 10 202 96 24 213 -43
5855d3j71J74j9l6J04q4J20k3m47O50k62J63R0k0r3l44L35J51j52k2m6j7P5jM8
$$ -43 -214 -40 -59 -95 9 -75 45 22 -425 225 -37 126 216 196 103 -241 94 245 93 71 25 8 83 82 130
5880A30k14K82j92K16q9q3J15j92ML9m1K70j34k57J27j46O8J65n97Q87l58R8j01
$$ 130 -84 198 6 222 133 50 165 -27 -23 16 -25 245 111 -146 -19 -165 -97 68 -529 358 0 98 -3
5903ck31L58k74K44K02k18P1o9k93K53L4j62R2m4j97K35L4j10J37J52r5l45K01
$$ -3 -234 124 -150 94 296 78 149 80 -213 40 74 -88 4 -40 -237 -2 32 -78 59 211 116 -229 -28
5926b8J87or7j83K03R9j67O8J87l44k28L87j58K16n3J05m38j41R3K95j14J50k3
$$ -28 159 153 56 -127 76 175 8 76 263 -81 -309 78 -80 136 83 188 -250 -391 -298 -3 -117 33 10
5949A0j8j00j17N3J40j10Q3J53J50k46m28N45K08K4l11k34J89j94J38L02k05l06
$$ 10 -8 -108 -225 -172 -32 -142 -59 94 244 -2 -430 115 323 347 36 -198 -9 -203 -65 237 32 -274
5971b74N6L78N1q0j3Q5k58k6J91K26m47k2J73J38k29J46J05L17r16M45r7K86m81
$$ -274 -218 160 211 131 118 203 -55 -81 110 336 -111 -133 40 178 -51 95 200 517 -399 46 -51 235 -246
5994b46L59k3K27k70m02O33%L3j47r8j36j44M32j44j90K95j33L0k78Q9N21l37
$$ -246 113 90 317 47 -355 278 278 311 164 66 -70 -214 218 74 -116 179 46 76 -202 -113 408 71
6016G1K21l57M71j67l20M7J47J71m53k85M11m8j58J87j5J29k0l6N4k32J57J87
$$ 71 292 -65 406 239 -81 -34 113 284 -169 -454 -43 -91 -249 -62 -77 52 32 -4 50 -182 -25 162
6038A62O6k73j14J32P4l53J45K4Q0k62NN67k47j63q1L46l42K88o2K47k32K05j46
$$ 162 228 -45 -159 -27 47 -306 -161 -137 -57 -319 -314 253 6 -157 -238 108 -234 54 -8 239 7 212 66
6061F6l24L89l08O61k54m87J05J54L7J62m10M39k04l8q1L21k3l09J35p1k38J07
$$ 66 -258 131 -177 484 230 -257 -152 2 39 201 -209 230 26 -12 -93 228 205 -104 31 -40 -278 -171
6083a71m7L68n0j36%k45J73J04L04j0j84J3J73k97J28l0%k9l5n45O09j12j11j53
$$ -171 -218 150 100 -36 -36 -281 -108 -4 300 290 106 119 292 -5 123 93 93 64 29 -516 93 -19 -130 -283
6107b83K57m2K18l64M17k47L97q9J07l71J12R0j97L22j27l04K81j08k56M9L57
$$ -283 -26 -68 150 -214 203 -44 353 264 371 0 112 202 5 327 200 -104 177 69 -187 -138 219
6128B19o45L51j40K54L5j79J44M5j42K08k52Q9J81k80L72j61K3K2L04m88l8L09
$$ 219 -426 -75 -215 39 74 -105 39 84 -58 150 -102 -13 168 -112 260 99 122 144 448 -40 -78 231
6150B31k91J00J26j61L93m20m8K70m63J09M04k90k16J24J20J06j03j08J45j68
$$ 231 -60 40 166 5 398 -22 -70 200 -263 -154 250 -40 -256 -132 -12 94 -9 -117 28 -140
6170a40K71R4k51N63m28J1L7N7k56j25K58k1k85L3n0J30p1J54j51J08j07J87J83
$$ -140 131 225 -26 537 109 120 157 214 -42 -167 91 70 -215 -182 -232 -102 -173 -19 -170 -62 -169 18 201
6193B01l66K73n8K1J90l08L79J43m77j21M9q9L01l7K2M4j15K18k35Q8l78j03M81
$$ 201 -165 108 50 71 261 -47 332 475 -2 -123 -74 -163 138 101 123 167 52 270 35 123 -255 -358 123
6216A23l67j33M87j13J40L3k11J19l4K7r6L0k5p1j9p0N6M02l01K37m46M00j5k3
$$ 123 -244 -377 110 -3 137 170 -41 78 44 71 -25 5 -20 -91 -110 -180 -124 278 -23 214 -232 168 153 130
6240A30l61n1M56k32k0J2L86l18o3J8l0M9n1K86k43K2k23Q10m30k61J26J76j81
$$ 130 -231 -282 174 -58 -78 -66 320 2 -61 -43 -73 -24 -75 211 -32 -10 -233 577 147 -114 12 188 7
6263Gl47J13K89j33j56K48J18O1n2j46Q2j83j6J29J5n3M8Q8jM4j68k09M6K85q6
$$ 7 -340 -227 62 -71 -227 21 139 200 148 2 84 -99 -115 14 29 -24 24 112 111 155 -13 -222 -176 109 23
6288B3N80m99j67Q0k9N7j80j44M14l24L0q4l7J24o7M28k41n3m6L78o5k54K37k08
$$ 23 603 104 -63 17 -12 45 -135 -279 135 -189 -159 -243 -280 -156 -223 205 -36 -89 -135 243 178 -76 161 -47
6312d7K3Q6o3L02m49K4N1n5l23M63J54o6l49J47k19J43K13j03q5K17mJ43j68J6
$$ -47 -24 62 -1 301 -148 -124 -73 -128 -451 12 166 100 -249 -102 -321 -178 35 -68 -153 64 60 203 35 51
6336E1k04Q6J74J51j91j3J50l5n6R2n4l52n2J71K20q9M3j34m7J47J8k08M0J53
$$ 51 -153 -67 107 258 67 54 204 169 113 205 151 -201 -253 -82 138 49 92 -42 -89 58 76 -132 -92 61
6360F1m7J79n1m7l00lL86j56j26L37j76N6j06J81j50k06J53K19k68j64KK39P8
$$ 61 14 193 142 95 -205 -208 178 22 -104 233 57 113 7 188 38 -168 -15 204 -64 -228 -226 13 91
6383I1k44L07R5m21M04j31j53j3o9J76l0j48p6M24k11L18l24Q9k80M7J9L27l64
$$ 91 -153 154 249 -172 232 101 -52 -65 -134 42 12 -136 -212 212 1 319 -5 84 -196 -149 -130 197 -167
6406a67J11p3j36R3J93L94l83j89j62M01l82N51m05L02Lk50P3Q5K3p3J02N31n93
$$ -167 -56 -129 -265 -172 21 415 32 -157 -319 82 -300 251 -154 148 151 -99 -26 59 82 9 111 642 49
6429D9j24J63K12k9k96K90j17%m75K50J56L6M9j10L15n13J38J14j47J52j9Lk81
$$ 49 -75 88 300 271 -25 265 148 148 -327 -77 79 115 164 54 369 -144 -6 108 -39 113 94 97 -184
6452a84J54L8Q5k13J5P8L93n57J97k0j75j24J34J54J65q5l6J50K06l22Q4n54M23
$$ -184 -30 8 93 -120 -105 -27 366 -191 6 -14 -189 -313 -179 -25 140 55 19 169 375 53 137 -417 6
6475Fk29J06N4o8J60l5P1k93J39K24j80q0J17l3J14k64M9J41J41l44K77k08L79
$$ 6 -223 -117 -63 -131 29 -6 65 -228 -89 135 -45 -125 -8 -41 73 -191 -142 -1 140 -204 73 -135 244
6498B44l94K16l8J98n82K48O3K77k40k35K21Q8j34pK95j71k03J51j01j65L6L95
$$ 244 -150 66 28 226 -356 -108 -45 232 -8 -243 -22 66 -68 -75 220 49 -154 -3 -104 -269 -233 162
6520A62p3l27j24N34j48L6K93l41k9K00l09K8K64M8j3j85q4J54l5R9j43j52J24
$$ 162 89 -238 -362 172 24 60 353 12 -17 183 -126 -98 166 214 201 16 -68 86 51 150 7 -145 -21
6543b1l6J5Q5K29K9l03qQ0k14J10K98p3Jr0j40l3k19N34P9k74j0j47K73k17p8
$$ -21 -57 -42 43 272 301 -2 -10 70 -144 -34 264 191 192 102 -38 -71 -290 244 323 49 39 -108 165 -52 -130
6568a30M8J98j62m4kq3j18K50k3R2j52Q1J40L99l88q3M7p1l9p8L60j28l29Q9q1
$$ -130 -82 116 -46 -90 -92 -175 -293 -43 -66 26 -126 -45 95 494 106 23 70 -1 -40 -118 242 114 -215 -126 -207
6593b07k8L38j0L1j96n2k6J6N99m13j52N2k79K03J09O7R4j74N2l63Q8L52J59k25
$$ -207 -235 103 93 124 -72 -124 -150 -134 465 52 -100 -48 -327 -124 -15 52 146 -28 24 -339 -251 101 260 35
6617C5K54k75k07K29J72k90K23k54J07n8K0p6NJ62j18k62K84J45K16k54m3J6J04
$$ 35 289 14 -193 36 208 -82 141 -113 -6 -64 -44 -120 -115 47 -71 -333 -49 96 312 58 15 31 135
6640A35j91P1K2L02k46j30K18l00J76qJ24k96K02j87J6k3J37K09j03m5j04L05
$$ 135 -56 15 37 339 93 -37 181 -119 57 49 173 -123 79 -108 -92 -115 22 231 128 83 -21 284
6662B84m47K28J02j39k0m20M90N0k9o5k77K56Q1j6k13L56j70j61Q2q6L53o50L45
$$ 284 -163 65 167 28 8 -412 78 128 99 34 -243 13 94 78 -135 221 51 -110 -28 -114 239 -411 -66
6685f6j95J8J30K73k94j17L90l43J77M7R0Q0q7L1k52J58j66j93L3M03l6j50P8
$$ -66 -261 -243 -113 160 -134 -251 139 -204 -27 20 110 190 103 134 -118 40 -126 -319 -286 117 81 -69 9
6708Il25L31J3K14m7l37m5j0J28L47j00R3m26P7M9J33k34J16l7K05k44L6k51K40
$$ 9 -316 15 28 242 195 -142 -187 -197 -69 278 178 271 -155 -78 -29 104 -130 -14 -51 154 -90 -54 -305 -65
6732f5Q8k79J38J78j60K6L70M2j89j53M9j17L86j25r3k64L5J31k79N56j94j10
$$ -65 23 -256 -118 60 -100 -74 296 338 149 -4 45 -72 314 189 96 -168 -133 -2 -281 275 81 -29
6754b9N8J57k90J93j01k50J65j39J30J0J00J44J9l76K65J24j64L75k41j28q4j67
$$ -29 29 186 -104 89 -12 -262 -97 -236 -106 -96 4 148 167 -209 56 180 16 391 150 22 -62 -229
6776b29J22M01k2j75k0j76k19M41j95L8Ml85K63o4P7J8K33K7l50J26mN4K51j76
$$ -229 -107 294 272 97 77 -99 -318 123 -72 -34 -30 -415 -152 -216 -139 -121 112 139 -211 -85 -89 -35 216 40
6800D0L22n00j89M17J7k29J02K4k31J20j34J6K75j94NJ69k51j98J96N14r4l74
$$ 40 362 -138 -327 90 107 -122 -20 4 -227 -107 -241 -225 50 -144 -139 30 -221 -419 -223 291 197 -177
6822a77K2N7J51r6o2L56mj44k53N8J47J80j23j8j37l07J55N40j25n52J50K26L30
$$ -177 -155 -98 53 -43 -105 251 247 103 -150 -92 55 235 112 94 -43 -350 -195 345 220 -332 -182 44 374
6845C74r33M18K73l42Qj01L89J29j28m0J71k00j20K65pl46J36N3j84K61K81j71
$$ 374 -559 -141 132 -210 -202 -303 86 215 87 47 218 18 -102 163 156 -190 -54 -1 -185 76 357 186
6867A86l18Q9J9rm6j58jL96j75K41l24J79Pj79pJ22lk11l9L56m01J60L42j33l76
$$ 186 -132 -43 -24 -33 -79 -237 -238 158 -17 224 -100 79 86 -93 -100 22 19 -192 -231 125 -276 -116 226 93 -283
6892b83L24K5L3j75K7J85l01K2K16pp6p2K26m40K61P8O4J49q5J84j66j03q6O59
$$ -283 41 66 99 -76 -49 136 -165 -143 73 66 -10 -82 144 -296 -35 43 107 256 171 355 189 86 0 659
6916F59l31k63k88O9J01J87j94j96J42j54P0K06q9p4J97o8M0l75M97J66k14k35
$$ 659 328 65 -223 -154 -53 134 -60 -256 -114 -268 -198 8 -81 -155 42 -26 14 -361 136 302 88 -147
6938a47R4m5o7l7L72M3j92l91K05Q7J63k22MM19n51J95k06K05p6K89J24k99l45
$$ -147 -53 -98 -165 -202 170 213 21 -370 -165 -78 85 -137 -133 286 -265 -70 -276 -71 -147 142 266 -33 -378
6961c78L08M7K49m28R1M91m28K7j88O26k32l42J30K0P4k7k3K33m29J42L15k49
$$ -378 -70 -23 226 -202 -111 380 -48 -21 -209 417 185 -157 -27 -7 67 40 17 250 -179 -37 278 29
6983B9j37j65l1p9L10P6j1J09n3j25L45j44J9n1P5j07k62K20J12kl22J76L59l10
$$ 29 -108 -273 -304 -383 -73 3 -8 101 48 -77 268 124 143 92 167 60 -202 18 130 128 -194 -18 341 31
7007C1K4J36j59K4nJ60j27n9k50L72j0J0j26j17K2j98N0q1M7K17j28K33k39J13
$$ 31 55 191 32 56 51 211 84 25 -225 147 137 147 21 -96 -74 -272 -222 -303 -256 -39 -167 66 -173 -60
7031f0K57l58J86o2O3o6j08J5L74n28L60j41K61m33k66M84j40M29l78K93j9j74
$$ -60 197 -161 25 -37 26 -40 -148 -133 241 -287 73 -68 193 -240 -506 -22 -162 267 -111 182 163 -11
7053a1l1K47J1l35L27r2j00j48j62L35m37K02N02l9k67j59k32N27j46j90J67J18
$$ -11 -42 205 216 -119 208 116 16 -132 -294 41 -396 -194 308 269 2 -157 -389 138 -8 -198 -31 87
7075H7j55J08j04J69q2j1k40M05m10J39J81J71j63j43O2j54J57k09J92K48m50
$$ 87 -68 40 -64 105 23 12 -228 177 -233 -94 87 258 95 -48 14 -140 17 -192 0 248 -202
7096b02N8M94j04m97LJ40P2o2K04l5J27l76J35j1k2J87j45J89j64K89n2r4L36
$$ -202 -144 350 246 -251 -248 -108 -36 -98 106 71 198 -178 -43 -54 -76 111 -34 155 -9 280 228 134 470
7119D70j45m42M34n01J36p4M27l70K08n35L03J69k33N04n25M00k08L7j12k7M11
$$ 470 325 -117 317 -184 -48 -122 305 -65 143 -392 -89 80 -153 351 -174 226 18 55 -57 -84 327
7140C27j60n7j32NO4J94Q0k45q5J22k52K42l1m15J47J40r6k93J21R6q4M30K8M
$$ 327 167 110 -22 -17 47 241 321 76 -9 113 -139 103 72 -343 -196 -56 -152 -445 -324 -228 -312 118 146 150
7164A50j73n0K87j13l5j02O0K7J04k21K60m7m98O20j09P8m38O1j00J86J28l31
$$ 150 -23 -73 214 101 66 -36 24 51 155 -66 194 147 -351 269 160 238 -200 -139 -239 -53 75 -256
7186b56L56j35O0J82j1l36J21j2k5K82m11K42q4L0J04K92k48m0k04N5N1l93P05
$$ -256 100 -35 25 207 196 -140 -19 -31 -56 226 -185 57 -27 3 107 399 151 111 -93 -38 13 -380 325
7209C25j76j10J57k92n4R5K75j43l3m7j49J90k39J18p4K86j02l48J21L23J60k94
$$ 325 149 39 196 -96 -150 -55 220 77 44 -3 -152 38 -201 -83 -157 129 27 -321 -200 123 283 -11
7231a1k14K07n4j26J85K35m10M16k62k75J16K27m2M8j35o3J70K53o6o6m9p9P8
$$ -11 -225 -18 -72 -198 -13 222 -188 228 -34 -309 -193 34 -8 40 -95 -158 12 265 199 133 84 5 83
7254H3q8Q2J65m93M15j14j28j46L39N0m35L54k9j61N3o0J38J23ll4j38J17P3k40
$$ 83 -5 77 242 -251 164 50 -78 -224 115 165 -270 84 55 -106 -53 -113 25 148 145 111 -27 90 163 -77
7278g7rK35l06J13M1K0k45J54O0l6j43R0M02q6p90K97J95K32PP8j49j31J04J83
$$ -77 -86 149 -157 -44 -3 17 -228 -74 -14 -50 -193 -103 299 213 -577 -280 -85 147 154 232 83 -48 56 239
7302B39J05n65N52k76M5n98O24Pl3j63j10Q3j54K9K62l2J52l69J06K60r9k9k85
$$ 239 344 -221 331 55 100 -498 126 133 100 -63 -173 -90 -244 -215 47 15 167 -202 -96 164 65 36 -249
7325b49K56P1l37L66J43j78r5l1P6j42NJ60J94o1j49M8j42l47L09j5o2O7k16K60
$$ -249 7 78 -259 107 250 72 -23 -54 22 -120 -115 45 239 178 29 77 -65 -412 -103 -118 -180 -113 -329 -69
7349f9j1L10l53L85k70m2K32j03q2M98l05n77q2J96P0J88K9Rq2k82K79j61M36
$$ -69 -80 230 -123 262 -8 -50 182 79 -3 495 190 -387 -469 -273 -203 -15 14 23 -59 -341 -62 -223 213
7372B13N0j18K05k90k6k10K97k9l32J15oJ29q6J13R6j74k55J56J37K42j85J70
$$ 213 263 145 350 60 34 -176 121 92 -240 -125 -131 -2 -88 25 121 -53 -308 -152 -15 227 42 212
7394B12K2k87k54L82J50n50J88p7mn3l32N06K63j61j75J78J74j48k38J12K91m57
$$ 212 234 -53 -307 75 225 -325 -137 -214 -218 -271 -603 -97 166 5 -170 8 182 34 -204 -92 199 -258
7416b58K75r5L88l29j49K97k40L2j36M29m64j6M00k84k5J50J13J30r7n0j4l30
$$ -258 17 -78 310 -19 -168 129 -111 -79 -215 214 -250 -266 134 -150 -175 -25 88 218 121 71 57 -273
7438b73K35J47K04k02q2k03K7J01k25K67m5L7k95J96K09l65N03R2r5m27J79J2
$$ -273 -38 109 313 111 29 -174 -147 -46 -271 -4 -49 -12 -307 -111 98 -267 236 328 233 -194 -15 -3
7460cJ5R9l24%K22l39R8K64J17l15PJ50k29M98l77L94Q4k42k60K74l09L30m6J50
$$ -3 12 111 -213 -213 9 -330 -232 32 149 -166 -159 -9 -238 260 -117 277 361 119 -141 133 -176 154 108 258
7484B58k11p3n2P5J82l92M35l87L45K09k90M0k67J62P6K57l72j06J93n5l65K3
$$ 258 47 -26 -78 -3 179 -213 222 -165 180 389 99 139 -128 34 110 367 -5 -111 82 27 -338 -315
7506c15L55n3m4j58M8J31k42J44N45m96M55j33j22k08J74L05o55K69k0j21l9P5
$$ -315 40 -13 -57 -215 -167 -36 -278 -134 411 -85 370 237 115 -93 81 386 -269 0 -20 -141 -180 -105
7528a05J8N7Qm03L89O0M8l55L49j56j93J06K93M2o4j19R3M0l80J29k1K57j91R8
$$ -105 -87 -30 -22 -425 -36 24 72 -283 66 -90 -283 -177 116 158 94 -25 68 108 -272 -143 -164 93 -98 0
7552@P4K00m30J87K26k99N1M2J27q6j38L17j02l37K94j02L54k99k9J72k47M0k99
$$ 0 74 274 -156 31 257 -42 9 51 178 92 -46 271 169 -168 126 24 378 79 50 222 -25 15 -284
7575b84O1L24l14N30j33k57J7j7L61n00K24J68K4l60m2M49k83n2J65q5r6pK13
$$ -284 -223 101 -213 317 184 -73 -56 -73 288 -212 12 180 204 -156 -198 251 -32 -84 81 -4 -100 -107 106
7598A06j1l4k17L56P5j27p7J2j14j44M7n2K77k09j69L48L10m05k81M23ml54J56
$$ 106 95 61 -156 200 275 148 71 83 -31 -175 -128 -180 97 -112 -281 67 377 -28 -309 114 110 -244 -88
7621h8j3J5L46j37K25j02l26r4L29j76J05J71l72K19k2m95L78J81l55K80j71j60
$$ -88 -101 -86 260 123 348 246 -80 -174 155 -21 84 255 -117 102 80 -415 -37 144 -211 69 -102 -262
7643b62L36o2L28n44M65r6l03OO4M48m22p3L58k27j06R2J04ko03M67k07K32k28
$$ -262 74 12 340 -204 261 165 -138 -132 -68 380 -42 -115 243 16 -90 2 106 104 -499 -32 -239 -7 -235
7666b35K68J26k73r4J62kM05l61k17j67L53J59M1J55n96m9M86k01J03K05n6M5
$$ -235 33 159 -114 -208 -46 -48 357 -4 -221 -388 -35 124 165 320 -276 -325 161 -40 63 268 212 257
7688B57l78M5K53k55J40K65m62k19K76R5j23k3j32P3Jj18K40L5J36j46R6k13L45
$$ 257 -121 -76 177 -78 62 327 -135 -354 -78 17 -106 -129 -261 -188 -187 -305 -65 -30 106 -40 56 -157 188
7711A88m82K59N8J15j54o1n1r9J69j81M00J28m95R3o1K84Q4m54N76m44J66j36
$$ 188 -294 -35 23 138 -16 -77 -128 -227 -58 -239 161 289 -206 -113 -174 110 194 -260 316 -128 38 -98
7733i8M59k95n7J24J25j65K1RJ29k62p2J78J38j57n8O2K53l57k3K23J40n79J63
$$ -98 361 66 9 133 258 93 114 123 252 -10 -82 96 234 77 19 81 334 -23 -46 177 317 -262 -99
7756i9L09l88m4M9K99j59K09l4l22l6J15L09p4k9k92J43K45k23m1jrM01j79m01
$$ -99 210 -178 -222 -173 126 -33 176 142 -180 -216 -101 208 134 105 -187 -44 201 -22 -63 -64 -73 328 149 -252
7780b52J72l86M31P1O5l77L72l75J84o8J65K57n13J72K67n2N1p8K1K5l92L24q0
$$ -252 -80 -466 -35 36 101 -276 96 -279 -95 -163 2 259 -254 -82 185 133 184 106 127 152 -240 84 4
7803DJ97l00j53q8M64k24j87L92J35k59l7K26l57J33K9J82m38J67J32J21j37J43
$$ 4 201 -99 -252 -340 124 -100 -287 105 240 -19 -56 170 -187 -54 -25 157 -281 -114 18 139 2 145
7825A45j79L3O9J13k62N2l03M68m43K58N8j25K05m2j5j52J40k05K27j80K0Jk84
$$ 145 -34 -1 68 181 -81 -29 -332 136 -307 -49 9 -116 89 47 32 -120 20 -185 42 -138 -118 -117 -401
7848d01J50K99k59L4k5M34r5m02J94K83j61q0K24j25N9n9K07l3l51p1K81K74j17
$$ -401 -251 48 -211 -177 -202 232 137 -265 -71 212 51 -29 195 70 129 70 277 244 -107 -178 103 377 260
7871B60j15l0j19J0K9J19k5R0l11K52j24q9J82k47J6J79r7M5K62l42j28R4P8l57
$$ 260 145 115 -4 6 35 154 129 219 -92 160 36 -53 129 -118 -102 77 -20 25 287 -55 -183 -89 -11 -368
7895c68N06k14P2j64J61Q7j88J87J75J2k00p1j67K51m26K48k1oJ89j73k68M85
$$ -368 138 -76 -4 -168 -7 80 -108 79 254 266 66 -5 -172 79 -347 -99 -120 -126 63 -110 -378 107
7917A07m6O1k76q4NK73q4J89m4k53m8m3K83J10n6p7L38l69R6j36N2L28l77J0J37
$$ 107 61 122 -154 -238 -233 40 -44 145 101 -152 -200 -243 40 150 94 17 355 -14 82 -54 -2 326 -51 -41 96
7942I6J7m3k20O03n87J62j67J3L7j08L67j85k21m3J67K55k24j78M67M8k06J84
$$ 96 113 70 -150 453 -134 28 -139 -126 -89 -197 170 -15 -236 -279 -112 143 -81 -259 208 256 50 234
7964B34j54j53n5K05j07q8q2q5M41o3l95P2L54k09Q3K33j27J25l37KL55l40m9
$$ 234 80 -73 -128 77 -30 -118 -200 -285 156 93 -302 -230 124 -85 -2 231 104 229 -108 -106 249 -91 -140
7987a40N76m56l9r7R0J44k19j5%J51k15J97p9Q5J28l94J44o2K80N8j46Ok96L83
$$ -140 436 -20 -59 -156 -66 78 -141 -156 -156 -5 -220 -23 -102 -17 111 -283 -139 -201 79 137 -9 -3 -299 84
8011H4J24k95q3J85J53l7l5J76k61M6j1J40j85J59l71M24j7m9j06q5K10n75L13
$$ 84 208 -87 -170 15 168 131 96 272 11 57 46 186 1 160 -211 213 196 147 41 -44 166 -409 -96
8034i6L32m41k6j50K33N0J4p9L04k59k41L15k21J69K48M1k13j98N45k51o4R5o7
$$ -96 236 -205 -231 -381 -148 -98 -84 -163 141 -118 -359 -44 -265 -96 152 193 -20 -218 327 76 12 107 40
8057D0j77P9k7K29J49j79j79K58l14J39k08M1K75l0l22j84N03k84Q1Q6k02L4J10
$$ 40 -137 -58 -85 144 293 114 -65 193 -121 18 -190 -149 126 96 -226 -410 93 -191 -110 -24 -226 -192 -82
8080h2P3j2J59l23N40l83k00K72K24j55k79K00j14J24j10K49j9k46K00J07l50
$$ -82 -9 -21 138 -185 355 -28 -228 44 268 113 -166 34 -80 44 -66 183 164 -82 118 225 -125
8101a25J9M4K17n7k28J27j59o1J96k9J32j19n2o1J17K12l21J50M5q3%j07J83k83
$$ -125 -106 -62 155 98 -130 -3 -162 -223 -27 -56 76 -43 -95 -156 -39 173 -148 2 47 -36 -36 -143 40 -243
8125b43K71K7k9Q5L5M9mj22k49M81l22j43J52J49J02Pl54OM17o41M51J70l43J84
$$ -243 28 55 26 111 146 195 191 69 -180 301 -21 -164 -12 137 239 246 -108 -102 315 -326 125 295 -48 136
8149A36k76j04L01k27L86j54j80M8K96l26j25L69L7K59o43Q0P8j25P3K20P2q9
$$ 136 -140 -244 57 -170 216 62 -118 -70 226 -100 -225 144 181 440 -203 -123 -45 -170 -97 123 195 106
8171A06J1o9r9j27J98l1l1L7j35K62k35M0kn7J07k0N6N9K2O9
$$ 106 117 48 -51 -178 20 -11 -42 -5 -140 122 -113 -73 -75 -132 -25 -45 11 70 92 161
8191A61
$$ Imaginary data points
##PAGE= N=2
##DATA TABLE= (X++(I..I)), XYDATA
0@%%%%jJqJ6j6K4l2M0m9N9p4R0j08J30j56J83k15K52k93L39l90M45n09N80o59
$$ 0 0 0 0 0 -1 0 -8 8 -8 16 -16 24 -25 34 -40 50 -58 72 -84 99 -116 136 -157 182 -208 237 -272 308 -351
29c51P45q41R45j059J187j325J479j646J831k030K249k495K762l056L385l750
$$ -351 394 -447 498 -561 626 -699 780 -866 965 -1065 1184 -1311 1451 -1605 1780 -1970
45a970M158m619N140n737O429p241Q208r386J0857j2759J5326j9003K4759l5141
$$ -1970 2188 -2431 2709 -3028 3401 -3840 4368 -5018 5839 -6920 8406 -10597 14162 -20979
59b0979N9850k26307k88846J93871J65614J96804J31613J28034Q873l1616k2979
$$ -20979 38871 -187436 -476282 -282411 -116797 80007 211620 339654 348527 316911 293932
70B93932J3699p4073j35629j42051j00215q9651p569Q8606J00343j0032o9811
$$ 293932 307631 233558 97929 -44122 -144337 -233988 -241557 -152951 -52608 -62640 -132451
81a32451m9500k0937k5142K1062O8326M0334j9874J7761J06365J33603R9242P8483
$$ -132451 -181951 -202888 -228030 -206968 -138642 -98308 -118182 -100421 5944 139547 238789 317272
93C17272K8829p3104j26705n5645K7619K1548j6440j4006k4955o3543m7608L0027
$$ 317272 346101 272997 146292 90647 118266 139814 123374 109368 84413 20870 -26738 3289
105C289M3365l4013q8786p3038n7905m4367K4196R6545O8865j0785j4020M1129
$$ 3289 46654 12641 -76145 -149183 -207088 -251455 -227259 -130714 -61849 -72634 -86654 -45525
117d5525N6837M5532O3021N4956k7512q9953m4495K5442K7033O613J1897j3635
$$ -45525 11312 56844 119865 174821 147309 57356 12861 38303 65336 71949 83846 70211
129G0211p4472p1653Q968M3713q393n0489m5279n3869o1547O498J03433J09951
$$ 70211 -4261 -75914 -66946 -23233 -31626 -82115 -127394 -181263 -242810 -236312 -132879 -22928
141b2928M9299K8971M3892K1519m811K2894L4315l3101r4221o0938N05J1917J9438
$$ -22928 26371 55342 99234 120753 115942 138836 173151 140050 45829 -15109 -14604 -2687 16751
154A6751N3191L6802m2641p6947k9122M209j6338j4593J7637Q498k5501L565O7750
$$ 16751 69942 106744 64103 -12844 -41966 -37757 -54095 -68688 -51051 -42553 -68054 -64489 3261
167C261N8825o453l1287k8860n6453o8408m774O4395N6103K5473M3077N5314J2400
$$ 3261 62086 55633 24346 -4514 -60967 -129375 -134149 -69754 -13651 11822 54899 110213 122613
180A22613j6694N867K005n5134p4889k5916O982p469L053L8726J9668m1554n0501
$$ 122613 105919 111786 113791 58657 -16232 -42148 -35166 -42635 -39582 -856 18812 -22742 -73243
193g3243j5972j8754m1100p171M9071N0317L5014O9013R7852N5122p54m871j1966
$$ -73243 -89215 -107969 -149069 -156240 -107169 -56852 -21838 47175 145027 200149 199395 194524 182558
206A82558o6740r5352n5194k2113l5261k7437K3158L3083r564j6185K2400K5513
$$ 182558 115818 20466 -34728 -56841 -92102 -119539 -96381 -63298 -72862 -89047 -66647 -41134
218d1134p008L742M0748K7317q401J1636N3655L4640q539q196l645m6022p3138
$$ -41134 -48142 -44400 -3652 23665 15264 26900 80555 115195 106656 98460 94815 48793 -24345
231b4345l0782Q300j2856k9844L423K4407N423J5929O5074O5517M188k6097o773
$$ -24345 -55127 -46827 -59683 -89527 -86104 -61697 -56274 -40345 24729 90246 94434 68337 61564
244F1564r599l5802k1307R303j8352o6410m7021J4421L4254L1867N3775N6546
$$ 61564 51965 16163 -5144 4159 -14193 -80603 -127624 -113203 -78949 -47082 6693 63239
256F3239k36m1145n824L6578K0535l921L257q353m8936m2149J9418L7654j2256
$$ 63239 63003 21858 16034 52612 73147 69226 72483 64130 15194 -26955 -7537 30117 17861
269A7861m8914m3792m5943m6324R425P8913P2397J6095M195K7178K5476J8289
$$ 17861 -31053 -74845 -120788 -167112 -157687 -78774 -6377 9718 13913 41091 66567 84856
281H4856M2329M0449l0531r0705o4084r695O248J1853K6869k32o8173p9348j3424
$$ 84856 127185 167634 137103 46398 -17686 -27381 -21133 -9280 17589 17357 -50816 -130164 -143588
294a43588L7107L1063K5286L3483R506j8324J8618Q2197P3623M904l6404m6123
$$ -143588 -106481 -75418 -50132 -16649 -7143 -25467 -6849 75348 148971 153875 117471 71348
306G1348o2858n5702P996N4215J5896m0837l8543j3218q764Q553M6136L2868l4987
$$ 71348 8490 -47212 -39216 14999 30895 -9942 -48485 -61703 -70467 -61914 -15778 17090 -17897
319a7897n9748n997M6381N3832N7597N5414J09o8724o2347j286J8328p261j6495
$$ -17897 -77645 -83642 -37261 16571 74168 129582 129691 60967 -1380 -2666 15662 8401 -8094
332h094j8770m4838m4528K2762Q1962N8019J144j6560j9429l1217q517M8224N5739
$$ -8094 -26864 -71702 -116230 -93468 -11506 46513 47657 31097 11668 -19549 -28066 20158 75897
345G5897p937n3095l4438q655j113K3558M4852M962o0762n9772j283L1246K8821
$$ 75897 67960 14865 -19573 -28228 -29341 -5783 39069 44031 -16731 -76503 -77786 -46540 -17719
358a7719L5736K8161k2490n2636o972N3546N0450J5299j069k1773n7700m9419
$$ -17719 18017 46178 23688 -28948 -35920 17626 68076 83375 82306 60533 2833 -46586
370d6586J1390L9633M64l4568k5573j5936j3865K2589O8218M8038j7581l9318
$$ -46586 -35196 4437 4901 -29667 -55240 -71176 -85041 -62452 5766 53804 36223 -3095
382c095j1576K063L671K9610M0850m502m8176k4142K0915K3195P519J1146n530
$$ -3095 -14671 -12608 -8937 20673 61523 57021 8845 -15297 5618 28813 36332 47478 41948
395D1948n1768n8023k699L6315J8277j261N525n031k7639m944M3691M3144k287
$$ 41948 -9820 -67843 -70542 -34227 -15950 -17211 -11686 -16717 -44356 -49300 -5609 37535 35248
408C5248j6462m67l234j0619J7565L8494K680m1904l1297r20j904n693J6587J7418
$$ 35248 18786 18319 15085 4466 22031 60525 63205 21301 -9996 -10916 -12820 -18513 -1926 15492
422A5492k2879l8624j154K5650R239k374J1857J840k5137j0377L4380L8393M063
$$ 15492 -7387 -46011 -47165 -21515 -12276 -14650 -2793 -953 -26090 -36467 -2087 36306 40369
435D0369o872M101j1534l0150o272K2080K879k7770j3003J1521L394k847K0178
$$ 40369 33497 37598 26064 -4086 -10358 11722 14601 -13169 -26172 -14651 -11257 -14104 6074
448F074K5757j1294l0330l925J2266o667r682J2430Q228j9118j2822K3031K4115
$$ 6074 31831 20537 -9793 -13718 -1452 -8119 -17801 -5371 2857 -16261 -29083 -6052 18063
461A8063m502n740J1722k670k4400n346K0370M840j9269l261J5982p73j3617R106
$$ 18063 13561 7821 19543 16873 -7527 -12873 7497 12337 -6932 -10193 5789 5016 -8601 505
475E05K0837o429j9367N761J4694j2589j9830M838O872j4685q597K1060J5551
$$ 505 21342 14913 -4454 1307 16001 3412 -16418 -11580 -4708 -19393 -27990 -6930 8621
488H621j3353r900J5301P650j1302J186J9199j749k3183k209K2851Q035r267N509
$$ 8621 -4732 -14632 669 8319 -2983 -1797 17402 15653 -7530 -9739 13112 21147 11880 17389
502A7389J0171j5968k3624O422J6718j1280k2876k922J523j3314J333L2846K4398
$$ 17389 27560 11592 -12032 -5610 11108 -172 -23048 -25970 -24447 -37761 -36428 -3582 20816
515B0816j0268j2060R713P084p176O350J8654r282l6162j6260J3521Q589l98J4417
$$ 20816 10548 -1512 8201 15285 8109 14459 33113 23831 -12331 -28591 -15070 -6481 -6879 7538
529G538J5087j5272k3072R728K5356N56j4045k155o578k3272o699K8616K3507
$$ 7538 22625 7353 -15719 -5991 19365 19921 5876 3721 -2857 -26129 -32828 -4212 19295
542A9295j1843j8244l85j726q043J3687L0436J399l0064j4430J4436J2378O896
$$ 19295 7452 -10792 -11177 -12903 -20946 -7259 23177 24576 -5488 -19918 -5482 6896 13792
555A3792K0052J2461k5221l7169j185K1416N479o099l29j1752l2076j2450L0571
$$ 13792 33844 46305 21084 -16085 -17270 4146 9625 3526 3197 -8555 -40631 -53081 -22510
568b2510L3839Q92j0698j503p099j1151J6759L6078N430l4850k9773m932R09R477
$$ -22510 11329 12221 1523 20 -7079 -18230 -1471 34607 40037 5187 -24586 -29518 -28609 -19132
582a9132L3496K9354j3813l4679n999J9355J1978N215P022j5538m6538l0258J9738
$$ -19132 14364 43718 29905 -4774 -10773 8582 20560 25775 32797 17259 -29279 -59537 -39799
595c9799L6280J5640K969l86j9050k9287N246L8966K2311j4285j8959q294q516
$$ -39799 -3519 12121 15090 14704 -4346 -33633 -28387 10579 32890 18605 -354 -8648 -17164
608a7164L017L5448L7030r185m2121k6649l443N30J2519K8324P429l4010l2557
$$ -17164 -14147 21301 58331 49146 7025 -19624 -23067 -22537 -10018 18306 25735 -8275 -40832
621d0832Q593K9424J7461J1472M473k6588m5579j3270L0917K7422k16q481j0501
$$ -40832 -32239 -2815 14646 26118 30591 4003 -41576 -54846 -23929 3493 3277 -5204 -15705
634a5705k3410j1893L2575N1800J8182j4723j0879j516l509J2054L1930J0296
$$ -15705 -39115 -51008 -18433 33367 51549 36826 25947 24431 20922 32976 64906 75202
646G5202m0326n3870k3854k147J983J3980J8987j2321m0005j5130K9572L8598
$$ 75202 34876 -18994 -42848 -44995 -43012 -29032 -10045 -22366 -62371 -77501 -47929 -9331
658i331K4458J9302Q685j9709k1576J8607M3119J8234j4145k2371k9532l9297
$$ -9331 15127 34429 43114 23405 1829 20436 63555 81789 67644 45273 15741 -23556
670b3556j8088K1264K0328j7489l3629j6327k799M969L0116M7115J8399j9688
$$ -23556 -41644 -20380 -52 -17541 -51170 -67497 -70296 -65327 -35211 11904 30303 10615
682A0615j4112J4282K0514J3573J6073K661l7477n4069k0007J5194J4099O412
$$ 10615 -3497 10785 31299 44872 60945 63606 26129 -27940 -47947 -32753 -18654 -12242
694a2242J0331K48k0503q716K9032L6497O532j2042r445j4525j7777Q328L5500
$$ -12242 -1911 -1663 -22166 -30882 -1850 34647 41179 29137 19692 5167 -12610 -4282 31218
707C1218J8146j8786k6483j5324j8051j8251L851J3261j0612k3729L280L1739
$$ 31218 49364 30578 4095 -11229 -29280 -47531 -43680 -30419 -41031 -64760 -61480 -29741
719b9741K9903K7012L2937J6553k0606k7781k340P701q237j1888k349j1686k5910
$$ -29741 162 27174 60111 76664 56058 28277 25937 33638 25401 13513 11164 -522 -26432
732b6432q573J8846J1278j2568j2427j930r076j0637J6286L3816J5023l366N965
$$ -26432 -35005 -16159 -4881 -17449 -29876 -31806 -40882 -51519 -35233 -1417 13606 10240 16205
745A6205J3286j744o789Q185O118j8906k2347k6Q014l879lJ4354M047j7936j0919
$$ 16205 29491 27747 20958 29143 35261 16355 -5992 -6018 1996 -1883 -1886 12468 16515 -1421 -12340
760a2340R489N093j0108j160R710m085j6957k040J2308k92r552N025J0820o149
$$ -12340 -2851 2242 -7866 -9026 684 -3401 -20358 -22398 -10090 -10382 -19934 -14909 -4089 -10238
774a0238j0147J0877J9022M057J997J5935J0677j2092j1884O835M526j2921j0800
$$ -10238 -20385 -9508 9514 13571 15568 31503 42180 30088 18204 25039 29565 16644 5844
787E844n09j2440k6103q746J3680P736n559K971J0254l708q020J4220K4407L068
$$ 5844 5335 -7105 -33208 -41954 -28274 -20538 -26097 -23126 -12872 -16580 -24600 -10380 14027 17095
801A7095j1997p91N290k407N472K5552J6831j5871k6647j1768q715j4328K1J4537
$$ 17095 5098 4307 9597 7190 12662 38214 55045 39174 12527 759 -7956 -22284 -22263 -7726
815g726p02k1048o107K1201K1732J1326J1920L248k6255l6297q995J6075R446
$$ -7726 -8428 -29476 -35583 -14382 7350 18676 30596 33844 7589 -28708 -37703 -21628 -12182
828a2182K899Q770L871j2031l145K3988K3588o926k2195j4735j2019q564J6829
$$ -12182 -9283 -513 3358 -8673 -11818 12170 35758 28832 6637 -8098 -20117 -28681 -11852
841a1852L8768K0406j3605j8241o794o946p838N963N167k3281l6276q628K2121
$$ -11852 26916 47322 33717 15476 8682 1736 -6102 -139 5028 -18253 -54529 -63157 -41036
854d1036K6182K4055K4272O473k3473k2046R595K2623P552l643n138j5983k3143
$$ -41036 -14854 9201 33473 39946 16473 -5573 4022 26645 34197 30554 25416 9433 -13710
867a3710J301K8023J6632j6238k6626j8987j6587o257K3389L2819M718k0865j3232
$$ -13710 -12409 15614 32246 16008 -10618 -29605 -46192 -52449 -29060 3759 8477 -12388 -25620
880b5620N529Q535J4136K3295N799k8866l4190l175J8622J5884J4189J0961j0848
$$ -25620 -20091 -11556 2580 25875 31674 2808 -31382 -34557 -15935 -51 14138 25099 14251
893A4251l0714j1139K3340K6087N950m809r402k1922j7973J4411L4264J2953j5270
$$ 14251 -16463 -27602 -4262 21825 27775 22966 13564 -8358 -26331 -11920 22344 35297 20027
906B0027j7381j1312j0757L396K7832K2093j1485k6115p991R379J2951K1393K3864
$$ 20027 2646 -8666 -19423 -16027 11805 33898 22413 -3702 -11693 -2314 10637 32030 55894
919E5894l949l6074l1182k559P201J354J808o27k0280k4003N569L1991K1911O21
$$ 55894 51945 15871 -15311 -17870 -10669 -9315 -7507 -8134 -28414 -52417 -46848 -14857 7054 7675
933G675n719j1760k2553j0746K0623K7955M962j0164k991J467j554Q655J9705
$$ 7675 1956 -9804 -32357 -43103 -22480 5475 10437 273 -2718 -1251 -2805 5850 25555
946B5555R94k9323k8506m734Q065J1240K2379K3531p39j9020l174J5207P685m437
$$ 25555 26549 -2774 -31280 -36014 -27949 -16709 5670 29201 28462 9442 6268 21475 29160 24723
960B4723l395p285k2399j4708J5898K8418J0236m327k879r239j8176o103J4169
$$ 24723 21328 14043 -8356 -23064 -7166 21252 31488 27161 24282 15043 -3133 -9236 4933
973D933P593j4540j4167K062M135K651J4078J7618o539k6325j5545K510J182j186
$$ 4933 12526 -2014 -16181 -14119 -9984 -7333 6745 24363 17824 -8501 -24046 -21536 -20354 -21540
987b1540R176P279j2513j2965R220J9423N527k095L383l433j5707m593J7792J5428
$$ -21540 -12364 -5085 -17598 -30563 -21343 -1920 3607 1512 4895 1462 -14245 -18838 -1046 14382
1001A4382k789n103K955k959j0177K847J3252q24j5783n769O698J061j433J0967
$$ 14382 11593 6490 9445 6486 -3691 -844 12408 11584 -4199 -9968 -3270 -2209 -3642 7325
1015G325J2018o465j1860L757R880k313n490M859Q17j3525p891R659P279p141
$$ 7325 19343 12878 1018 4775 14655 12342 6852 11711 12528 -997 -8888 771 8050 909
1029I09n006N691j876j2094j030R858j27j0502J807J2151K452l921O204Q666p232
$$ 909 -4097 1594 -282 -12376 -13406 -3548 -3675 -14177 -12370 -219 2233 -1688 4516 13182 5950
1044E950j1350L474N941p724r054M672N709n078O57J4554P884r965q011L676j595
$$ 5950 -5400 -1926 4015 -3709 -12763 -8091 -2382 -7460 -6803 7751 15635 5670 -2341 1335 -260
1059b60j0178l97J0383O92p936N430J5502L396o215R51J775j2463j3229M738Q939
$$ -260 -10438 -10835 -452 240 -7696 -2266 13236 16632 10417 11368 13143 680 -12549 -7811 1128
1074A128m883o566N388O114m313J23J2216K869j5138j0952L865L596k579P001
$$ 1128 -3755 -10321 -4933 1181 -3132 -3009 9207 12076 -3062 -14014 -10149 -6553 -9132 -2131
1088b131J4035oj1148K0J1201O29q307k058l85j2246r691J0631J6036R34o057
$$ -2131 11904 11898 750 770 11971 12600 4293 2235 1850 -10396 -20087 -9456 6580 7514 1457
1103A457K098J5p765M77J4771N838j3910j2845O67J941j372Q412J2454m908j8903
$$ 1457 3555 3570 -4195 -3718 11053 16891 2981 -9864 -9197 -7256 -8628 -216 12238 7330 -11573
1118a1573o908R974P051K661Q939M266j2541j2706P453J6603L267n088k681p742
$$ -11573 -18481 -8507 -1456 1205 10144 14410 1869 -10837 -3384 13219 16486 11398 8717 975
1132I75j5978l732J6457J2279p695j1090k903k396k319J2777K0338J605j6813
$$ 975 -15003 -18735 -2278 10001 2306 -8784 -11687 -14083 -16402 -3625 16713 18318 1505
1145A505r875L896M662M298J2854O440j5779k1511j397J1663N815J027L763n920
$$ 1505 -8370 -4474 188 4486 17340 23780 8001 -13510 -14907 -3244 2571 3598 7361 1441
1159A441j8586o653J7122J8729J415m343l055r661j1065P229J9238M144j5397
$$ 1441 -17145 -23798 -6676 12053 13468 9125 6070 -3591 -14656 -7427 11811 15955 558
1172E58j2679k514j261L813J8816J4424r783k0623n305P834P425Q040J2591j310
$$ 558 -12121 -14635 -15896 -12083 6733 21157 11374 -9249 -14554 -6720 705 8745 21336 20026
1186B0026k0150j3421R804J6018M740j251m345j7129k1699K64J9724J3347m675
$$ 20026 -124 -13545 -3741 12277 17017 15766 11421 -5708 -27407 -27143 -7419 5928 1253
1199A253o457l678o867j1K0243K1336k063j8742j0524j754L25Q547J8256L883
$$ 1253 -5204 -8882 -15749 -15760 4483 25819 23756 5014 -5510 -7264 -6939 1608 19864 23747
1213B3747k0195k0635p84Q934O557Q752O737j0995k2389n099J7108J6464N202
$$ 23747 3552 -17083 -17867 -8933 -2376 6376 13113 2118 -20271 -25370 -8262 8202 13404
1226A3404J344l496j5509j3214R665K0023M067j0612q448p411r262L025K0532
$$ 13404 14748 11252 -4257 -17471 -7806 12217 16284 5672 -2776 -10187 -19449 -16424 4108
1239D108J4652q475j4036k912L043K680J1380J4772l448k2003j3249M240O202
$$ 4108 18760 10285 -3751 -6663 -3620 -940 10440 25212 21764 -239 -13488 -9248 -3046
1252c046K241N709J890j4774j7188L339J6837R212N72K030k907j2049m024J5979
$$ -3046 -805 4904 6794 -7980 -25168 -21829 -4992 4220 4792 6822 3915 -8134 -12158 3821
1266C821J5889k015r443l521m755p398M557J4276K380j4914j1388J269R59J053
$$ 3821 19710 17695 8252 4731 -24 -7422 -2865 11411 13791 -1123 -12511 -11242 -10283 -9230
1280i230R926J0017o548j6058j207R892N111J971O287M71j3630j0617P990J1940
$$ -9230 696 10713 4165 -11893 -13100 -3208 1903 3874 10161 10632 -2998 -13615 -5625 6315
1294F315J096j486K528l471j1376o01J3110O206p314n561J6m867p667N261J1383
$$ 6315 7411 5925 8453 4982 -6394 -6995 6115 12321 5007 -554 -538 -5405 -13072 -7811 3572
1309C572j008r767j159M845j530j094R123P926o926q363L790N699k737J18Q015
$$ 3572 2564 -7203 -8362 -3517 -5047 -6141 2982 10908 3982 -4381 -591 5108 2371 2489 10504
1324A0504J408j0114n647O281J340n550N9N844l399j0903o94O924J51m184M841
$$ 10504 11912 1798 -3849 2432 3772 -1778 -1719 4125 726 -10177 -10871 -3947 -3796 -7980 -3139
1339c139P005m822p466M528P552j623j401P265L094p750n256P207N388m254k279
$$ -3139 3866 -956 -8422 -3894 3658 2035 634 7899 10993 3243 -2013 5194 10582 6328 4049
1354D049L665m012j1465k121Q238J458o556k038K127l816m643R438J2562J28o884
$$ 4049 7714 3702 -7763 -9884 -1646 -188 -6744 -8782 -6655 -10471 -15114 -5676 6886 7014 130
1369A30L45K796k948Q33J1598N311j0283j0409O38K663k070L066P256l953j4654
$$ 130 475 3271 323 1156 12754 18065 7782 -2627 -1989 674 -1396 1670 8926 4973 -9681
1384i681n401P497N371n21L126K865q293r729O112J4402L667l933j177k621q602
$$ -9681 -15082 -7585 -2214 -2735 391 3256 -5037 -14766 -8654 5748 9415 5482 4305 1684 -6918
1399f918j142J3591J0266n646j0121l227j354k608P012J4227J73j4812j1102J996
$$ -6918 -8060 5531 15797 10151 30 -3197 -4551 -7159 -147 14080 14253 -559 -11661 -9665
1413i665L474K823R045O168j0514j5951p97J1610P309L135L431l688j4341p693
$$ -9665 -6191 -3368 5677 11845 1331 -14620 -15417 -3807 3502 6637 10068 6380 -7961 -15654
1427a5654J1484J4823K015n193l315p673q404M638J7088P340r944j1185m487m043
$$ -15654 -4170 10653 12668 7475 4160 -3513 -11917 -7279 9809 17149 7205 -3980 -8467 -12510
1441a2510N24J2345J2888n453j6456p050M802N557P136J1764K402j4067j3794
$$ -12510 -11986 359 13247 7794 -8662 -15712 -10910 -5353 1783 13547 15949 1882 -11912
1454a1912L912J1620N455K634J346q912j5261k705J3857J0485k289n059m121q284
$$ -11912 -8000 3620 9075 11709 13055 4143 -11118 -13823 34 10519 8230 3171 -950 -9234
1468i234n294R969J6252K042j0845p437r80j826L952J2632P054j1268j5276k635
$$ -9234 -14528 -4559 11693 13735 2890 -4547 -5527 -7353 -3401 9231 16285 5017 -10259 -12894
1482a2894N152L713N878P809l886j5621o667R032J0317K677J399l02r569j0856
$$ -12894 -7742 -4029 1849 9658 5772 -9849 -16516 -7484 2833 5510 6909 6607 -2962 -13818
1496a3818M765J4832M818n592l979k724o236n26J3160J1246n300j1869l315L71
$$ -13818 -9053 5779 10597 5005 1026 -1698 -7934 -8460 4700 15946 10646 -1223 -4538 -4167
1510d167l89N403J0613l42j3714r897M141N762L157N798M254o921j2310M70J0662
$$ -4167 -4556 847 11460 11118 -2596 -12493 -8352 -2590 567 6365 10619 3698 -8612 -8142 2520
1525B520O674m98N91k068r912o654P183R747k338p594l183k974n903J743J0727
$$ 2520 9194 8696 9287 7219 -2693 -9347 -2164 7583 5245 -2349 -5532 -8506 -14409 -12666 -1939
1540a939N531p731n973K979K783Q20O674Q940k885j0403k262O382K297j010L780
$$ -1939 3592 -4139 -10112 -7133 -4350 -3530 3144 12084 9199 -1204 -3466 2916 5213 4203 7983
1555G983J544q281p866M094P463p98k997J102n65p443j418P918M417n741l952
$$ 7983 9527 1246 -6620 -2526 4937 4139 1142 2244 1679 -5764 -7182 736 5153 -588 -4540
1570d540K539M5l546K934P773r44p657k47N355R63j893M240M155n654o887K903
$$ -4540 -2001 -1956 -5502 -2568 5205 4261 -3396 -3643 1712 2675 782 5022 9177 3523 -3364 -461
1586d61N006k545m171K041n21p809l543N627L420m273j569N073J204l115L619
$$ -461 4545 2000 -2171 -130 -651 -8460 -12003 -6376 -2956 -7229 -8798 -3725 -2521 -5636 -2017
1601b017Q101J267m636J853N594n65l694J941L659n693o690J296L071n388m913
$$ -2017 6084 7351 2715 4568 10162 9597 5903 7844 11503 5810 -880 416 3487 -1901 -6814
1616f814K512Q34m921k153N739L121l445j22O561K524l130J132N618j223n397
$$ -6814 -4302 -3468 -8389 -10542 -4803 -1682 -5127 -5249 1312 3836 706 1838 7456 6233 836
1631H36J350N213j971o532j34J689m209l428M890M555m400m414K879K627k054
$$ 836 2186 7399 5428 -1104 -1238 451 -3758 -7186 -2296 2259 -2141 -6555 -3676 -1049 -3103
1646c103P37O286J476p096k922M607K718l031J285M050l132o981J931P210J431
$$ -3103 -2366 3920 5396 -1700 -4622 -15 2703 -328 957 5007 1875 -5106 -3175 4035 5466
1661E466l495O19J254m645l373N689N756l589o356q05o46l824P48P390K183o916
$$ 5466 1971 2590 3844 -801 -4174 1515 7271 3682 -2674 -3479 -4125 -7949 -7201 189 2372 -4544
1677d544l959L287K871R29M458O825k548p480J63O254K015k083J006n18q034o408
$$ -4544 -8503 -5216 -2345 -1416 3042 9867 7319 -161 2 6256 8271 6188 7194 6676 -1358 -7766
1693g766M268O211j729m476p71j185m424K191R717M739n069m652J359Q27J28O002
$$ -7766 -3498 2713 984 -3492 -4263 -5448 -9872 -7681 2036 6775 1706 -2946 -1587 -760 -632 5370
1709E370P219l435j0181l620L542J688J55L224k58q636q128L325P937J926o64
$$ 5370 12589 9154 -1027 -4647 -1105 583 738 3962 3704 -4932 -13060 -9735 -1798 128 -536
1724e36L28k524o809K98J0427P406k366m603j161k193k287O847R878n48r674n829
$$ -536 -208 -2732 -9541 -9243 1184 8590 6224 1621 460 -1733 -4020 2827 12705 12157 2483 -3346
1740c346L11n4J733P133L363q234j0099o91N826L523K704M377k650r795m028P519
$$ -3346 -3035 -3089 -1356 5777 9140 906 -9193 -9884 -4058 -535 2169 6546 3896 -5899 -9927 -2408
1756b408P991J153j418o89n740o475L638J0153L436o066n158k346l601L2Q281
$$ -2408 5583 6736 5318 4629 -1111 -7586 -3948 6205 9641 3575 -1583 -3929 -7530 -7498 783
1771G83P539m105r002l064K102J669M175P571L37r612p074L946N874L021K724
$$ 783 8322 4217 -4785 -7849 -5747 -4078 97 7668 8005 -1607 -8681 -4735 1139 4160 6884
1786F884J909n746q814k66Q349M983j897k346k763o166l895N990Q192j213o509
$$ 6884 8793 3047 -5767 -6033 2316 7299 5402 3056 293 -5873 -9768 -3778 4414 3201 -3308
1801c308l665j291j750L356R021M091n784o341J004L976K362N578N652l061r767
$$ -3308 -6973 -8264 -10014 -6658 2363 6454 670 -5671 -4667 -691 1671 7249 12901 9840 73
1816G3l507M567L597j12R64j309p957p489K843P106K282k498m8j366m517P52R444
$$ 73 -3434 1133 4730 4618 5582 4273 -3684 -11173 -8330 -1224 1058 -1440 -1488 -2854 -7371 -6619 2825
1833B825O870k037l605j61j068j464L083O221q05q161n341P49n12l31L256K608
$$ 2825 9695 7658 4053 3892 2824 1360 4443 10664 9859 1698 -3643 -2894 -3406 -3737 -481 2127
1849B127n023p422R0M224J663N11L114O70n713k778N119N360O2m54J854q40l811
$$ 2127 -2896 -10318 -10228 -6004 -4341 -3830 -716 -46 -5759 -8537 -3418 1942 2004 1550 3404 2564 -1247
1866a247O41O848J786k947j890J466j818l319K053L685k725n806r66J022j763
$$ -1247 -606 6242 8028 5081 3191 4657 2839 -480 1573 5258 2533 -3273 -4239 -3217 -4980
1881d980j486L873K476l062k483L315L537l61J337M789J246l582j188L420M38
$$ -4980 -6466 -2593 -117 -3179 -5662 -2347 1190 829 2166 6955 8201 4619 3431 6851 7289
1896G289l497k03J629k826n918q51J802j464l256J289K228k799k552L175M385
$$ 7289 3792 3589 5218 2392 -3526 -4377 -2575 -4039 -7295 -6006 -3778 -6577 -9129 -5954 -1569
1911a569o28o83L829J851k441o34M540K414k199r53J919j775l891Q89L911m68
$$ -1569 -2197 -2880 949 2800 359 -275 4265 6679 4480 3527 5446 3671 -220 669 4580 4112
1927D112m482j456N31k258j852L785L434k974m476j20K036k60J247N212J715m702
$$ 4112 -370 -1826 -1295 -3553 -5405 -1620 1814 -1160 -5636 -5756 -3720 -3980 -2733 2479 4194 -508
1943e08k501L013L101P61J647K562k638n896r00M470J187j758j044j436n137l883
$$ -508 -3009 4 3105 3866 5513 8075 5437 -459 -1359 3111 4298 2540 1496 60 -5077 -8960
1959h960L622N199q4l429o93j71j975K233P456M556k958m253J27R04l12L568M597
$$ -8960 -5338 -139 -223 -3652 -4345 -4516 -6491 -4258 3198 7754 4796 543 670 1574 1262 4830 9427
1976I427k287p172l771J360J246M23K486N21n277n515J413N723K297K94P76j297
$$ 9427 7140 -32 -3803 -2443 -1197 -774 1712 2233 -3044 -8559 -7146 -1423 874 1168 1944 647
1992F47m454j434O322M786j141l050j493k146k410L306O554J254n269l448o8M00
$$ 647 -3807 -5241 1081 5867 4726 1676 183 -1963 -4373 -1067 5487 6741 1472 -1976 -2044 -1644
2008a644J067M145L361m084o652j628K625J081J003K608j770o009k923L718N225
$$ -1644 -577 3568 6929 2845 -3807 -5435 -2810 -1729 -726 1882 112 -5897 -8820 -5102 123
2023A23J922O78P08k266l648K151O748L082l298l727j774l182j542L565M257k613
$$ 123 2045 2723 3431 1165 -2483 -332 6416 9498 6200 2473 699 -2483 -4025 -460 3797 1184
2039A184o413k655R78N38K854N900J686m025l902K068M672J917K082J799l158
$$ 1184 -5229 -7884 -6906 -6368 -3514 2386 4072 47 -3855 -1787 2885 4802 6884 8683 5525
2054E525o406j895L681K357j451j274j311m036k455K963O247N77k639j244n01
$$ 5525 -881 -2776 905 3262 1811 537 -774 -4810 -7265 -4302 1945 2522 -117 -1361 -1862
2069a862j296P26N480K686l762m919o79J191J2J807L881r56m912j773L209K637
$$ -1862 -3158 -2432 3048 5734 1972 -2947 -3626 -2435 -2423 -616 3265 2309 -2603 -4376 -1167 1470
2085A470O63J755J265l237m276R74M107N0k237p88r21l423j505L612L524j126
$$ 1470 2133 3888 5153 1916 -2360 -1386 2721 2771 534 -254 -1175 -4598 -6103 -2491 1033 -93
2101i3k475O58O49l10K508M334Q80l551k001J319L70o37R23Q54k897m563m23K597
$$ -93 -2568 -1910 -1261 -1571 937 5271 6151 2600 599 1918 2288 1651 2574 3428 531 -4032 -4455 -1858
2119a858N44n95R62O18k391j087L285L370p66j073O97k72k168k79L018Q37l285
$$ -1858 -1314 -1909 -947 -329 -2720 -3807 -522 2848 2082 1009 1706 1434 -734 -1013 2005 2842 -443
2136d43j715O65j54j012J814K544j031l011O26K853L79o97K295J119k879k276
$$ -443 -2158 -1493 -1647 -2659 -845 1699 668 -2343 -1717 1136 1515 818 3113 4232 1353 -923
2152i23J598J390j502j453J035m92k904o05K702J157j642j0J971J18j372J112
$$ -923 675 2065 563 -890 145 -347 -3251 -3856 -1154 3 -1639 -1649 322 440 -932 180
2168A80K429mk108N21J452q49j577O29J308k141j952J396Q25j462o02J909Q25
$$ 180 2609 2605 497 1018 2470 1621 44 673 1981 -160 -2112 -716 109 -1353 -1955 -46 779
2185G79j435m88J976O45k063j7J930j36j786j36J014r74j713R19J884m68j490
$$ 779 -656 -1144 832 1477 -586 -603 1327 1191 -595 -731 283 -691 -2404 -1485 399 -69 -1559
2202a559R36J571o69m41K390J870k134j348Q27O58j327j099J355q08l095o84J871
$$ -1559 -623 948 279 -162 2228 4098 1964 616 1443 2101 774 -325 1030 222 -2873 -3557 -1686
2219a686M24j539J48J512q67n61J624L102L39j337P36R85j162p77J969J224k476
$$ -1686 -1262 -2801 -2653 -1141 -2008 -2569 -945 2157 2496 1159 1895 2880 1718 941 2910 4134 1658
2236A658k749O8J15j331K99K130l12k542m19J823J403l78J081J177j929k020J060
$$ 1658 -1091 -1023 -908 -2239 -1940 190 -122 -2664 -3083 -1260 143 -235 846 2023 94 -1926 -866
2253h66K523q3j028l50k45j588o52L045J807r39j892L66J75p33R46K840J64l174
$$ -866 1657 1574 546 196 -49 -1637 -2289 756 2563 1624 -268 98 273 -460 486 3326 3490 316
2271C16j986L15r8n53J591J374j995l480L64K456J444O54J364K04k050j654L024
$$ 316 -1670 -1355 -1453 -2006 -415 959 -1036 -4516 -4152 -1696 -252 402 1766 1970 -80 -1734 1290
2288A290K840j43j300p01j785k308L03L223Q89k521k160m84q2j74K604K892p10
$$ 1290 4130 3987 2687 1986 201 -2107 -1804 1419 2308 -213 -2373 -2857 -2939 -3113 -509 2383 1673
2305A673l206n76J271N14J074J797M99k871k863J226J812Q87J9N56j423k619J41
$$ 1673 -1533 -2109 -838 -324 750 2547 3046 175 -2688 -1462 350 1237 1256 1812 389 -2230 -2089
2322b089K777K328r46q51o96j402j433K009K581j78l024j645q4o13J271K923J672
$$ -2089 688 3016 2070 1219 523 -879 -2312 -303 2278 2100 -924 -2569 -2653 -3266 -1995 928 2600
2339B600k214k267K29J517R83J549J191o10l539j667J481J812l17j61n6k616k388
$$ 2600 386 -1881 -1652 -135 848 2397 3588 2978 -561 -2228 -747 1065 748 587 531 -2085 -4473
2356d473J352L023J221p51p28j69j423P2L122K192o45k400j60m34k64P75K581
$$ -4473 -3121 -98 1123 372 -356 -525 -1948 -1876 1246 3438 2793 393 233 -201 -465 310 2891
2373B891j0l182k421P44R76O64J279J503j709k473l90K416J313k08K64j4j929
$$ 2891 2881 -301 -2722 -1978 -1002 -338 941 2444 735 -1738 -2128 288 1601 1393 1657 1643 -286
2390b86j932J523K020m28j285k63o11j299J36K154J483j285j270N74n7P1J072
$$ -286 -2218 -695 1325 897 -388 -651 -1262 -2561 -2425 -271 1212 -73 -1343 -769 -826 -755 317
2407C17K211j29k182q70R51r0o4N95N80k056k064J030J325J20N0J277Pj369j40
$$ 317 2528 2399 217 -653 298 208 144 739 1319 -737 -2801 -1771 -446 -326 -276 1001 1008 -361 -501
2426e01J525J009o29p15O48o02j644O19J546l14j135j018M13n49l90J199J519
$$ -501 1024 2033 1404 689 1337 735 -909 -290 1256 942 -193 -1211 -798 -1347 -1737 -538 981
2443I81o09j087O35J108o67J6P69K14k030j372L93L95q05M32J154j1j403L06J681
$$ 981 372 -715 -80 1028 361 377 1146 1360 -670 -2042 -1649 -1254 -2059 -1627 -473 -484 -1887 -1581 100
2462A00M88J7N04J304m50r63N07Q64m91p53p5p40j399j475O46M86n42L04P82N10
$$ 100 588 605 1109 2413 1963 1000 1507 2371 1880 1127 1052 312 -1087 -2562 -1916 -1430 -1972 -1668 -886 -376
2482c76o40O33J696R12r05l71M03p12n79P41J180q22j202p46M56j322k67J352
$$ -376 -1016 -383 1313 2225 1320 949 1352 640 61 802 1982 1160 -42 -788 -332 -1654 -1921 -569
2500e69Q29j166j000O22Q53J1O33J581k98j614r07R94N77o46K26L86r35j185N67
$$ -569 260 -906 -1906 -1284 -431 -420 213 1794 1496 -118 -1025 -31 546 -100 126 512 -423 -1608 -1041
2519a041J552O18J9j00K9q33n50R43J235n80j625j79p6j096M40J692m5j440j212
$$ -1041 511 1129 1148 1048 1077 244 -306 637 1872 1292 -333 -512 -588 -1684 -1244 448 403 -1037 -2249
2538b249K39J59K99J008J715k19j128K45J700P04k16o9M0j992j296P04J126J98
$$ -2249 -2010 -1851 -1552 -544 1171 952 -176 69 1769 2473 2257 2188 2228 236 -1060 -356 770 968
2556I68r57K40o17j305o9J588P03j117r32L1K51K64J121K246r0j405o93o4j05
$$ 968 11 251 -366 -1671 -1740 -152 551 -566 -1498 -1467 -1216 -952 169 2415 2325 920 227 163 58
2575E8k88Q56N54j562j327K40J083O97j76K09n65j910o05J370J201q5K05J6k93
$$ 58 -230 626 1180 -382 -1709 -1469 -386 311 135 344 -221 -2131 -2736 -1366 -165 -250 -45 -29 -322
2594c22q53N22J761L98j429m77j38k24R65J005J517n45j192o14O49j72m3K66Q3
$$ -322 -1175 -653 1108 1506 77 -400 -538 -762 203 1208 2725 2180 988 374 1023 851 808 1074 1157
2613A157j786r57R04R42j97L14J9q46r90p4J287O55k48j16N9l91m14R96J088k10
$$ 1157 -629 -1586 -682 260 63 377 396 -450 -1440 -1514 -227 428 180 64 123 -268 -682 314 1402 1192
2633A192j428n4p11o68N40P65L51r11q07M42R26k77N57O37k4j435k99J118L29
$$ 1192 -236 -290 -1001 -1669 -1129 -364 -13 -924 -1731 -1289 -363 -640 -83 554 530 -905 -1204 -86 243
2652B43k46M80M60j92n88Q69R08l48o10j67k96j086j29R21O48q11l91J87J30m97
$$ 243 -3 477 937 745 157 1026 1934 1586 976 809 513 -573 -702 219 867 56 -335 -148 -18 -515
2672e15K57N31j55j172J64O73L71M51J91R14o50j156k2L51o87k15l19M99q08j62
$$ -515 -258 273 118 -1054 -890 -217 154 605 796 1710 1060 -96 -118 233 -454 -669 -988 -489 -1297 -1459
2692a459R13Q94m16k85K36o0p75K16Q51M45m56p8N82K13l36m7O01o52r87N8J84
$$ -1459 -546 348 -68 -353 -117 -177 -952 -736 115 560 104 26 608 821 485 438 1039 387 -600 -542 -358
2713c58K4J19J031j78l81k00k87O84j017J01P6J72k40k29O03N23l20k01L86Jn29
$$ -358 -334 -215 816 638 257 57 -230 454 -563 -462 -386 -214 -454 -683 -80 443 123 -78 308 309 -220
2734b20K88N47l45k8j80M38l2k74k8k7q0q46L38P1n27J07M51J06j23o0O58Q4r0
$$ -220 68 615 270 242 62 500 468 194 166 139 59 -787 -449 -378 -905 -798 -347 -241 -364 -424 234 318 228
2757B28j11M89m2n44L07L13l02k37jK12O4o57L21j67j47k49o5K68l24qN74P7M9
$$ 228 117 606 564 20 327 640 338 101 100 312 376 -281 40 -127 -274 -523 -588 -320 -644 -652 -78 -1 48
2780D8J18P2K21k44l33P54m02m06r7N46j48j49M61N41k36p69l28J04l51L0J92
$$ 48 166 238 459 215 -118 636 234 -172 -269 277 129 -20 441 982 746 -23 -351 -247 -598 -568 -376
2801c76N92l45L1L83J10p1o18P92n34j14n69L70J77R5J46Q8K95o07j1L19K14m09
$$ -376 216 -129 -98 285 395 324 -294 498 -36 -150 -719 -349 -172 -77 69 157 452 -155 -166 153 367 -42
2823d2k86J85j42P6Q48R0k66n55l89K33l04L7N35n3K6n6J20M09l72L94K70o53
$$ -42 -328 -143 -285 -209 639 729 463 -92 -481 -248 -552 -515 20 -33 -7 -63 57 466 94 488 758 105
2845A05m48L49M4L28m33K67J29o02J01l5J83P6l64L47N1m82L47N37M00m29j92
$$ 105 -343 6 50 378 -55 212 341 -261 -160 -195 -12 64 -300 47 98 -384 -37 500 900 471 279
2866B79N5j61m00J69L34j91l89l61N24l36P3M60j66j93q0M73L52J28J49mk61Q7
$$ 279 334 173 -227 -58 276 85 -304 -665 -141 -477 -404 56 -110 -303 -383 90 442 570 719 715 454 541
2888E41n12L75L2j79q9n62j7l38L37L29n25m1R1J55R9J72L27N69j00m09J70k83
$$ 541 29 404 436 257 168 -394 -411 -749 -412 -83 -608 -649 -558 -403 -304 -132 195 764 664 255 425 142
2910A42K18rj98L10p67P2L56K54l03j86K29n52l70j7N80K54o38O56J3q2j58L68
$$ 142 360 351 153 463 -304 -232 124 378 75 -111 118 -434 -804 -821 -241 13 -625 31 44 -38 -196 172
2932A72J12M9n11r9M12j79o3L42J70j42k72j86J47j80k12J77p5J43l02L12L56
$$ 172 284 333 -178 -277 135 -44 -107 235 405 263 -9 -195 -48 -228 -440 -263 -338 -195 -497 -185 171
2953A71k54K19l05R8j33k0N35k39j60M11L3p60L07K49K35o99L14L8j26K41n52
$$ 171 -83 136 -169 -71 -204 -224 311 72 -88 323 356 -404 -97 152 387 -312 2 40 -86 155 -397
2974c97L50L80k48m13K19j0J4j70M35l00o5o3K8K86K4K8J10p2j69K46l1J60j91
$$ -397 -47 333 85 -328 -109 -119 -105 -275 160 -140 -205 -268 -240 46 70 98 208 136 -33 213 182 342 151
2997A51r9j06J65l71L44M2k60O0l11J71l79J42M99l39K10Q4J61J1l80R2K59O6
$$ 151 52 -54 111 -260 84 126 -134 -74 -385 -214 -593 -451 48 -291 -81 3 164 175 -205 -113 146 212
3019B12j12j39L41j70J15k91k5OJ22N6j17j31k26M82m41j14MM18J76R7J1J11p3
$$ 212 100 -39 302 132 247 -44 -69 -63 59 115 -2 -133 -359 123 -318 -432 -428 -10 166 263 274 385 312
3042C12j99J77J68k55k11j35J58j2k80M6l3N8j42K69J84l05M2K63j13J6K1O2O1
$$ 312 113 290 458 203 -8 -143 15 3 -277 -231 -264 -206 -348 -79 105 -200 -158 105 -8 8 29 91 152
3065A52J4j91K38r7M4l3l87M43l81L41j72P3o0j6L42j32j62k49K39J1l93J35L13
$$ 152 166 -25 213 116 160 127 -260 183 -198 143 -29 44 -16 -32 310 178 16 -233 6 17 -376 -241 72
3088G2p4l77L34O0K69m92M82L11k43k73K41j00j36p9l8J62k94j46K74n7j43R8
$$ 72 -2 -379 -45 15 284 -208 274 585 342 69 310 210 74 -5 -43 119 -175 -321 -47 -104 -247 -149
3110a49L35l34m2j3J37P4k7L39o3p4j39J57j30L02l88P8P6l43J14M1J0k66K30
$$ -149 186 -148 -190 -203 -66 8 -19 320 257 183 44 201 71 373 -15 63 139 -204 -90 -49 -39 -305 -75
3133g5k2K70o12K71L06J54k90J08r8k00J0P05l09R3j76k80J25K04oj29J85n89
$$ -75 -97 173 -439 -168 138 292 2 110 12 -188 -178 527 218 311 135 -145 -20 184 178 49 234 -355
3155c55j88J43M46k60M57l93K73j95J62J47o7j60N1j09J27o14N32K45J61n00J27
$$ -355 -543 -400 46 -214 243 -150 123 -72 90 237 170 10 61 -48 79 -535 -3 242 403 -97 30
3176C0j76O6m1L76k62l3l09J97K01J99J9k8k11m22q6O96J5j32O0j76Ql88L48P10
$$ 30 -146 -80 -121 255 -7 -40 -349 -152 49 248 267 239 28 -394 -480 216 231 99 159 -17 -9 -397 -49 661
3200F61l79m72L25l01R0M0q5L28j91n10L51o5K21J1K55j98n82K96P5K53j99l9
$$ 661 282 -190 135 -166 -76 -36 -121 207 16 -494 -143 -208 13 24 279 81 -501 -205 -130 123 -76 -115
3222a15J07L01p39K66J91L90J33l05R5k67J4j19N76n25n5Q1nj72m49P02K32n06
$$ -115 -8 293 -446 -180 11 401 534 229 324 57 71 -48 528 3 -52 29 24 -148 -597 105 337 -169
3244a69k53m7j50O01l25M42K63k91l5L04L5n1j51r1nMl90O9q8j12N9J04m01L4
$$ -169 -422 -469 -619 -18 -343 99 362 71 36 340 375 324 173 82 77 81 -309 -240 -328 -440 -381 -277 -678 -644
3268f44N99m7K90k47L23Oj29j36N26j45k44l73L47l22k74L06L16M5n52N8K12j57
$$ -644 -45 -92 198 -49 274 280 151 15 541 396 152 -221 126 -196 -470 -164 152 197 -355 -297 -85 -242
3290b42j25J90J71n6L6J84m8N6k82L70k15J6j3J34M06p07L38J03l24o4q7L12j64
$$ -242 -367 -177 -6 -62 -26 158 110 166 -116 254 39 55 42 176 582 -125 213 316 -8 -72 -159 153 -11
3313a1j35M62n4m07j30K33n7p8k93L40K0K7m4K6K54K5j1k3j18m21K97O2j61k14
$$ -11 -146 316 262 -145 -275 -42 -99 -177 -470 -130 -110 -83 -127 -101 153 178 167 144 26 -395 -98 -36 -197 -411
3337d11M89o5pk05L70J05k76k96M33l09J52J89J67L49m18m17M14j49o17L78k47
$$ -411 78 13 6 -199 171 276 0 -296 137 -172 -20 169 336 685 267 -150 264 115 -502 -124 -371
3358c71K24n77L07Q20J1N1l55P23p06N9k76N13m07q4Q7J30k61rK61%p18m45N45
$$ -371 -147 -724 -417 403 414 465 110 833 127 186 -90 423 16 -68 19 149 -112 -121 140 140 -578 -1023 -478
3381d78j90M93P1P03q2l29J54L43M3l61j09k17l34k78L16J96J59j01n66L27n1
$$ -478 -668 -175 -104 599 517 188 342 685 728 367 258 41 -293 -571 -255 -59 100 -1 -567 -240 -291
3402b91J1N19mn17J59K03k5K79m7L69m18j55q15Q10l02J03J28J56l01l56M0M28
$$ -291 -280 239 235 -282 -123 80 55 334 287 656 238 83 -732 78 -224 -121 7 163 -138 -494 -454 -26
3424b6J89J10K13P4o61l40P89k75j14j66j66j07M8K87O16J91k01k95k13j16k05
$$ -26 163 273 486 560 -101 -441 348 73 -41 -207 -373 -480 -432 -145 471 662 461 166 -47 -163 -368
3445c68K30O84k09j15l20P13l22k97p4oo03k73j19K39P88J04L01P0l30k35M22
$$ -368 -138 546 337 222 -98 615 293 -4 -78 -84 -687 -960 -1079 -840 -52 52 353 423 93 -142 280
3466B80k07o09j36K26j81k9L47R60j10l86k77M0k76j12J05K17j6k77O69K94L09
$$ 280 73 -536 -672 -446 -627 -656 -309 651 541 155 -122 -82 -358 -470 -365 -148 -164 -441 228 522 831
3487H31l04K46j33p14l55N00r2J06J56L31K34n45q6L05J10k12k88J0l97l51N10
$$ 831 527 773 640 -74 -429 71 -21 85 241 572 806 261 175 480 590 378 90 100 -297 -648 -138
3508a38L36m32j75nmj80j71K17K15q1k87L23L25l1J70K58oo23o6K72P4mK84l8
$$ -138 198 -234 -409 -414 -418 -598 -769 -552 -337 -418 -705 -382 -57 -88 82 340 334 -289 -355 -83 -9 -13 271 233
3532B33j65m93L95L63k98J87k73J99o49K3P95J45l66j59P55j96J12K16L93Pl53
$$ 233 68 -425 -30 333 35 222 -51 148 -501 -478 317 462 96 -63 692 496 608 824 1217 1224 871
3553H71q15L38m54l93J12O08k97J6j03K04k32j74l22M6k90j33L44N03P8J26N18
$$ 871 56 394 -60 -453 -341 267 -30 -14 -117 87 -145 -319 -641 -595 -885 -1018 -674 -171 -93 33 551
3574E51L96n05n48M14m80m92o4K54k48j02O40J039o35l15j3K77k72o58K42P10
$$ 551 947 442 -106 308 -172 -664 -728 -474 -722 -824 -184 855 220 -95 -108 169 -103 -761 -519 191
3594A91N1j78L44K47J08n13J62l21j068J14J89M17O2M32P35j42m56O8L05p9l77
$$ 191 242 64 408 655 763 250 412 91 -977 -863 -674 -257 -195 237 972 830 374 442 747 668 291
3615B91l10K25l00m63J67O79m73m30M31k18m75O4K30M35L5k90N91J73P3J96M63
$$ 291 -19 206 -94 -557 -390 289 -184 -614 -183 -401 -876 -812 -582 -147 -112 -402 189 362 435 631 1094
3636A094l12p58j54M58m39j24L5L22m83m75K54K27q1j64L13M04k11J6L21N56l54
$$ 1094 782 24 -130 328 -111 -235 -200 122 -361 -836 -582 -355 -436 -600 -287 117 -94 -78 243 799 445
3657D45M4J50J77p44k59N06p9q88J81O1k40j12N10M54k37nM32K99n43m36Q34n46
$$ 445 489 639 816 72 -187 319 240 -648 -467 -406 -646 -758 -248 206 -31 -36 396 695 152 -284 550 4
3679Dm37k83N90L4m7M5M66j43o13p7J86M52j28J57J19r6k0M08J04j22r99K35m23
$$ 4 -433 -716 -126 -92 -139 -94 372 229 -384 -461 -275 177 49 206 325 229 209 617 721 599 -400 -165 -588
3702e88l16QM51K9J64J84O53Qr1j16N20p48l45o4K49L61m04K35K93k25q66K54
$$ -588 -904 -896 -445 -416 -252 -68 585 593 502 386 906 158 -187 -251 -2 359 -45 190 483 258 -608 -354
3724c54K20k15m46O9L51k38K52Q90K42l51r0j7j80n86J17K95L05n81J9L47J20
$$ -354 -134 -349 -795 -726 -375 -613 -361 529 771 420 330 313 133 -453 -336 -41 264 -317 -298 49 169
3745A69o58N97L16n47l45L7P51Kj42L09K9o75k34L16n8J19m61L46l11k14K33O57
$$ 169 -489 108 424 -123 -468 -431 320 322 180 489 518 -157 -391 -75 -133 -14 -475 -129 -440 -654 -421 236
3767B36j16J78n9K79k45l01L04P39n55k21k90K05m77k10J07L67l39k67L95j10
$$ 236 120 298 239 518 273 -28 276 1015 460 239 -51 154 -323 -533 -426 -59 -398 -665 -270 -380
3787c80MO18j6j37j64o8P15L7J41j93J01m63l20j58L46l46O2j20K06l47M6P25
$$ -380 -376 242 226 89 -75 -143 572 609 750 557 658 195 -125 -283 63 -283 -221 -341 -135 -482 -436 289
3809B89N38l70o53N05k41j21O0N30J84p89k80L29P9k49o0L84n70l58K53J91M27
$$ 289 827 457 -196 309 68 -53 7 537 721 -68 -348 -19 60 -189 -249 135 -435 -793 -540 -349 78
3830G8RO85p8o03mM0K86k87l38K95l04k20J2N31Q1l74k15M79j87k25L86Q89l79
$$ 78 87 772 694 91 87 127 413 126 -212 83 -221 -441 -429 102 183 -191 -406 73 -114 -339 47 936 557
3853E57m28j46J92M5o55M82J86m09m49O11L1k42K94QJ42m46k56Q96J39m30J05
$$ 557 129 -17 175 220 -435 47 233 -176 -625 -14 17 -225 69 77 219 -227 -483 413 552 122 227
3874B27K54n10n15J88K18j47n96J96L49l46J42M40M17L20l46J45K16l00j06L58
$$ 227 481 -29 -544 -356 -138 -285 -881 -685 -336 -682 -540 -100 317 637 291 436 652 352 246 604
3894F04l28l94k16M04j86m27J81J35l21l22K05M06N23j34K29R4l95j24N77K33
$$ 604 276 -118 -334 70 -116 -543 -362 -227 -548 -870 -665 -259 264 130 359 453 58 -66 511 744
3914G44j45o41J03j78m33j23L35N34m66rK1P6j89L62N28j13n38KM24o8o4OJ98
$$ 744 599 -42 61 -117 -550 -673 -338 196 -270 -279 -258 -182 -371 -9 519 406 -132 -130 294 226 162 168 366
3937C66m47k42p0K07j36j08L91J37m71j48M12N19r2K44R2l51m03J95M36l16r6
$$ 366 -81 -323 -393 -186 -322 -430 -39 98 -373 -521 -109 410 318 562 654 303 -100 95 531 215 119
3958A19l23M5r0l96N00J72j17n05K55J27l41M73L61N68o84L3o6R7m04L35L15l89
$$ 119 -204 -159 -249 -645 -145 27 -90 -595 -340 -213 -554 -81 280 848 164 197 131 228 -176 159 474 85
3980H5n53J82N17l78k42M38K09o02j68J70L91j65R3L2L47l18J2J19K91k15k20
$$ 85 -468 -286 231 -147 -389 49 258 -344 -512 -342 49 -116 -23 9 356 38 50 169 460 245 25
4001B5O0k51l91QM91l7m73M33P8k9j82M43M17l92n11K92J99M3j96K39J40k63n24
$$ 25 85 -166 -557 -549 -58 -95 -568 -135 -57 -86 -268 175 592 200 -311 -19 180 223 27 266 406 143 -381
4024c81Q00j84l62j66m5J70o89L51N38N24n74j00N47k99j36R3M31k11l43J14M70
$$ -381 419 235 -127 -293 -338 -168 -857 -506 32 556 -18 -118 429 130 -6 87 518 307 -36 78 548
4045E48m62j76L40M8n71l27P79J10l13j95K98K45p57r4M47K91l93L9L26m23p09
$$ 548 86 -90 250 298 -273 -600 179 289 -24 -219 79 324 -433 -527 -80 211 -182 -143 183 -240 -949
4066i49O52M75l0l77N04Rl81k34L94L70m18r5K56N4k62m99O05K02n59M5j7K85
$$ -949 -297 178 148 -229 275 284 -97 -331 63 433 15 -80 176 230 -32 -531 74 276 -283 -238 -255 30
4088C0n03M54M60n94N5J11P45k98o03O72l11o8l74N22j07Q2n32K66K9j16J25l0
$$ 30 -473 -19 441 -153 -98 13 758 460 -143 529 218 150 -224 298 191 273 -259 7 36 -80 45 15
4110A5J66l90j82L48J28o77K83N19m28l58L77K64Q0p64N84J75m32K3M57K41m12
$$ 15 181 -209 -391 -43 85 -592 -309 210 -218 -576 -199 65 145 -619 -35 140 -292 -269 188 429 17
4131A7R7L98p7l34J10J0L26o04j2J68j06o40Q1R33k16l02J42K05m77j85P28L81
$$ 17 114 512 435 101 211 221 547 -57 -69 99 -7 -647 -566 367 151 -151 -9 196 -281 -466 262 643
4153F43k09k08J73k11k27J03O44n70l87k02N21k20k80k43Q52n57o88K75N43J12
$$ 643 434 226 399 188 -39 64 708 138 -249 -451 70 -150 -430 -673 179 -378 -1066 -791 -248 -136
4173a36mJ83L49m28m85L81P29k27j49J26J44m78j52O23j62m03j03J1K40k65j57
$$ -136 -140 43 392 -36 -521 -140 589 362 213 339 483 5 -147 476 314 -89 -192 -181 59 -206 -363
4194c63M51k54l50pN86J2m24M18O14r51J50QO47j62j47L63N8p34L1L94J20l78
$$ -363 88 -166 -516 -523 63 75 -349 69 683 -268 -118 -110 537 375 228 591 649 -85 -54 340 460 82
4216H2l67L80l00m00j85R95k08q60M17K52k36r8L75L39N2o34M86L10o4o7O13n9
$$ 82 -285 95 -205 -605 -790 205 -3 -863 -446 -194 -430 -528 -153 186 238 -396 90 400 336 269 882 823
4238H23n63k94M82j16m16J62j0l11j04j93N80j14l1l46N94l82l42M79N43o03k84
$$ 823 260 -34 448 332 -84 78 68 -243 -347 -540 40 -74 -105 -451 143 -239 -581 -102 441 -162 -446
4259d46O15J79M6n10N02L87l73p26O38J16m53P8J87R8o94L47K44m15k46j07O5
$$ -446 169 348 394 -116 386 773 400 -326 312 428 -25 53 240 338 -356 -9 235 -180 -426 -533 -468
4280d68m14o7L05N93m93K74J56N54l67J5O73N09p23R5J93k57k23j94K65P6q95
$$ -468 -882 -949 -644 -51 -544 -270 -114 440 73 88 761 1270 547 642 835 578 355 161 426 502 -393
4301c93o4K13l29l98PN93N3j27L09K55j37j26O85K36l26k32M61K67r76J60L80
$$ -393 -457 -244 -573 -971 -964 -371 -318 -445 -136 119 -18 -144 541 777 451 219 680 947 -29 131 511
4322E11l66n77L86J9N1p64K92J49j91l32L79K22K36k06%K77J40l59M27q9l19l61
$$ 511 145 -432 -46 -27 24 -740 -448 -299 -490 -822 -443 -221 15 -191 -191 86 226 -133 294 205 -114 -475
4344d75O74L26n40k39Q13P5m89l07N06K75o99M18R8o3p54R09P8l75k49r9N00p84
$$ -475 199 525 -15 -254 559 634 145 -162 344 619 -80 338 436 373 -381 528 606 231 -18 -117 383 -401
4366d01j31L06L68k79j43M58J92o90K68L82J56q23J03R3O6q37N59O63l22o46J79
$$ -401 -532 -226 142 -137 -280 178 370 -320 -52 330 486 -337 -234 -141 -75 -912 -353 310 -12 -658 -479
4387d79Q8j82r5L01M43j14o12N37Q24n16M09O1K55o53j45N19j66j14m65K83J37
$$ -479 -391 -573 -668 -367 76 -38 -650 -113 711 195 604 665 920 267 122 641 475 361 -104 179 316
4408C16l98J6N86l88k50J32L14k40m96N21M53l38k29K25M4p9j50O08m65p25q8
$$ 316 -82 -66 520 132 -118 14 328 88 -408 113 566 228 -1 224 268 189 39 647 182 -543 -631
4429f31N08k36P9j66K54k69k43j0P32k18l68L92O4k56k68M72L14j48j12J41J21
$$ -631 -123 -359 -280 -446 -192 -461 -704 -714 18 -200 -568 -176 -112 -368 -636 -164 150 2 -110 31 152
4450A52o08K08N87N3m61j17J81M62k86M02M38m45o48P9L87j47l02L57k56k73l90
$$ 152 -456 -248 339 392 -69 -186 -5 457 171 573 1011 566 -82 -3 384 237 -65 292 36 -237 -627
4471f27M94K83j41k44J39l3k22K51N27Ml96k8K69ok29k66R08m98o86q2K39K47
$$ -627 -133 150 9 -235 -96 -129 -351 -100 427 431 35 7 276 270 41 -225 683 185 -501 -583 -344 -97
4493i7l93M8N12n01m7L35M29l71J11M51P4o34r3O48p3j44n19O07m78j90k43O34
$$ -97 -490 -442 70 -431 -478 -143 286 -85 26 477 551 -83 -176 472 399 255 -264 343 -135 -325 -568 66
4515F6l38j17O2M29JJ3j05R53j52q41L18k9k51qn5L32o71r2N78n46l3l4K49j1
$$ 66 -272 -389 -327 102 103 116 11 964 812 -29 289 260 9 1 -54 278 -393 -485 93 -453 -486 -520 -271 -282
4539b82J6M1M85K47k22P8l8k63j00L40j30m53j15r8P86o53j85L81K56n97J51M28
$$ -282 -266 -225 260 507 285 363 325 62 -38 302 172 -281 -396 -494 292 -361 -546 -165 91 -506 -355 73
4561G3K50j8p16K50K02l12L27K00m3n23K02N36n94l61M99K78j4n75N59M78l76
$$ 73 323 305 -411 -161 41 -271 56 256 213 -310 -108 428 -166 -527 -28 250 236 -339 220 698 322
4582C22l71N02k5n92J52O14n09n18P2K91m07j26M31r1R7l83K8R82m47mN26j5j84
$$ 322 -49 453 428 -164 -12 602 93 -425 -353 -62 -469 -595 -164 -255 -158 -541 -513 469 22 18 544 529 345
4605C45j25nJ15J25m87L32q2n12q1N86o6o72R8K39L85o23L71M15n97j05K63N42
$$ 345 220 215 330 455 -32 300 218 -294 -375 211 145 -527 -429 -190 195 -428 -57 358 -239 -344 -81 461
4627D61k05l88K70K26k93l22Q5P29n04k71M46q1m04K36J5K9k69J18K07j32l39
$$ 461 256 -132 138 364 71 -251 -166 563 59 -212 234 153 -251 -15 0 29 -240 -122 85 -47 -386
4648c86L4J65J5k16N9N37k83o94J251k92p1k56R9M78m93J63J31L54p48J5K35K59
$$ -386 -352 -187 -172 -388 -329 208 -75 -769 482 190 119 -137 -38 440 -53 110 241 595 -153 -138 97 356
4670C56o47J80J31k50l21O17l3K46m78M7M97k87j54k3M57r1p24L67J62n6j40N78
$$ 356 -291 -111 20 -230 -551 66 33 279 -199 -152 345 58 -96 -119 338 247 -477 -110 52 -4 -144 434
4692D34l3p62J41M93On32J93K92j62m18lM35Mm31J20J79m46P7L26M55j12j91J37
$$ 434 401 -361 -220 273 279 -253 -60 232 70 -348 -351 84 88 -343 -223 -44 -490 -413 -87 368 256 65 202
4715B02l9n0M0K60J29n39N9J07m38j74L03L57n00m69L75L55K5k2J44K07l72k33
$$ 202 163 113 153 413 542 3 62 169 -269 -443 -140 217 -283 -752 -377 -22 3 -19 125 332 -40 -273
4737b73L76N66m82k95M70j66l17o6M26j94l36p6P8P0J8N9M56l23k27J6L50j23
$$ -273 103 669 187 -108 362 196 -121 -187 239 45 -291 -367 -289 -219 -201 -142 314 -9 -236 -220 130 7
4759GL4K87J96p65N1O8N78m01l16L71j00m94J04N49K88m15k09K30L2m01L92O94
$$ 7 41 328 524 -241 -190 -122 456 55 -261 110 10 -484 -380 169 457 42 -167 63 95 -306 86 780
4781G80j94r23J50N27n9p22K06L81l62l61L82M11n67L16K66J65l56k55O18K01
$$ 780 586 -337 -187 340 281 -441 -235 146 -216 -577 -195 216 -351 -35 231 396 40 -215 403 604
4801F04m49q3m2M4o04K11O45n9q61M23J60L3k97O36q5K89o19R1M24l76J38k58
$$ 604 155 72 30 74 -530 -319 326 267 -594 -171 -11 22 -275 361 276 565 -54 37 461 85 223 -35
4823c5R1Jn84P35l48J03k88L49k53k64L31N97ko94M33L78n00l07L63L95m06m18
$$ -35 56 57 -527 208 -140 -37 -325 24 -229 -493 -162 435 433 -261 172 550 50 -257 106 501 95 -323
4845c23K06P4m07o0M74J75m59k02P38J89p23J54O80l23m08K76N77k01j60j54K7
$$ -323 -117 -43 -450 -510 -36 139 -320 -522 216 405 -318 -164 516 193 -215 61 638 437 277 123 150
4866A50m02M5J96N09q39r4M27n7k64lP34j83m68O1K79J45l43p4M01k94L5L15k
$$ 150 -252 -207 -11 498 -341 -435 -8 -65 -329 -332 402 219 -249 -188 91 236 -107 -181 220 -74 -39 276 274
4889B74j15k91J25N05j62m57K96N0l59k68O30L3l43n0J94J30k58m12N02l1q2K
$$ 274 159 -132 -7 498 336 -121 175 225 -134 -402 228 261 -82 -132 62 192 -66 -478 24 -7 -89 -87
4911h7J06k38k64L29N35k14j24K78j3O1l26K17O7k99j21j30L29m56k48M45o0m39
$$ -87 19 -219 -483 -154 381 167 43 321 308 369 43 260 327 28 -93 -223 106 -350 -598 -153 -213 -652
4933f52J41m1N89m84K14L96k25k07j72Q83J5j18k52L19j59l75L55M38k31n67L46
$$ -652 -511 -552 37 -447 -233 163 -62 -269 -441 442 457 339 87 406 247 -128 227 665 434 -133 213
4954B13k24J20P1K33j41j94m12L67k02k0o0M49J32o53O9O76l84j13L33K09n41
$$ 213 -11 109 180 413 272 78 -334 33 -169 -189 -249 200 332 -321 -252 424 40 -73 260 469 -72
4975g2q8O6L05l17K2j62r1j93K15N95j10l86j68N74n8m67M62Q7k68n26P5O24j87
$$ -72 -160 -94 211 -106 -84 -246 -337 -530 -315 280 170 -216 -384 190 132 -335 127 214 -54 -580 -505 119 -68
4998f8M51l37J77l42N6L03M00l18J39Kq7n01J17pN67n25J6K4m43P1p8K77j95j67
$$ -68 383 46 223 -119 -63 240 640 322 461 463 376 -125 -8 -15 552 27 43 67 -376 -305 -383 -106 -301 -468
$$ [...]
8191b50
##END NTUPLES=NMR FID
##END=
