##TITLE=1H_CA-8416-13-1
 CDCl3, 8 sc, 
 11.2.2019
##JCAMPDX= 6.0         $$ Bruker NMR JCAMP-DX V2.0
##DATA TYPE= NMR FID
##DATA CLASS= NTUPLES
##ORIGIN= UXNMR, Bruker Analytische Messtechnik GmbH
##OWNER= root
$$ XWIN-NMR		Version 3.5
$$ Mon Feb 11 13:56:55 2019 Russian Standard Time (UT+4h)  she@DPX200
##.OBSERVE FREQUENCY= 200.1313
##.OBSERVE NUCLEUS= ^1H
##.DELAY= (6, 6)
##.ACQUISITION MODE= SIMULTANEOUS
##.ACQUISITION SCHEME= undefined
##.AVERAGES= 8
##.DIGITISER RES= 18
##SPECTROMETER/DATA SYSTEM= spect
##.PULSE SEQUENCE= zg30
##.SOLVENT NAME= CDCl3
##.SHIFT REFERENCE= (INTERNAL, CDCl3, 0, 15.7039)
##AUDIT TRAIL= $$ (NUMBER, WHEN, WHO, WHERE, WHAT)
$$ ##TITLE= Audit trail, XWIN-NMR		Version 3.5
$$ ##JCAMPDX= 5.01
$$ ##ORIGIN= Bruker BioSpin GmbH
$$ ##OWNER= she
$$ F:/spectra/data/she/nmr/H-F/1/audita.txt
$$ ##AUDIT TRAIL=  $$ (NUMBER, WHEN, WHO, WHERE, WHAT)
(   1,<2019-02-11 13:54:46.18 +0400>,<she>,<DPX200>,
      <created by zg, POWCHK disabled, PULCHK disabled
       configuration hash MD5:
       00 E9 B6 7A A2 85 ED C7 34 08 36 98 17 FE 4E 26
       data hash MD5: 16K
       4D 57 05 6A AA B1 DF 76 5B 2F 99 46 C6 8E E9 D3>)
$$ ##END=
$$ 
$$ hash MD5
$$ CB 62 25 A9 9E 9E 62 FB 98 AD 23 D3 12 2F 00 D0
##$RELAX= 
##$RELAX= 
##$RELAX= 
##$RELAX= 
##$RELAX= 
##$RELAX= 
$$ Bruker specific parameters
$$ --------------------------
##$DU= <F:/spectra>
##$EXPNO= 1
##$NAME= <H-F>
##$PROCNO= 1
##$TYPE= <nmr>
##$USER= <she>
##$AMP= (0..31)
100 100 100 100 100 100 100 100 100 100 100 100 100 100 100 100 100 100 
100 100 100 100 100 100 100 100 100 100 100 100 100 100 
##$AQSEQ= 0
##$AQ_mod= 1
##$AUNM= <au_zg>
##$AUTOPOS= <>
##$BF1= 200.13
##$BF2= 200.13
##$BF3= 200.13
##$BF4= 200.13
##$BF5= 200.13
##$BF6= 200.13
##$BF7= 200.13
##$BF8= 200.13
##$BYTORDA= 1
##$CFDGTYP= 0
##$CFRGTYP= 5
##$CHEMSTR= <none>
##$CNST= (0..31)
1 1 145 1 1 1 1 1 1 1 1 1 1 1 1 1 1 1 1 1 1 1 1 1 1 1 1 1 1 1 1 1 
##$CPDPRG= <>
##$CPDPRG1= <>
##$CPDPRG2= <>
##$CPDPRG3= <>
##$CPDPRG4= <mlev>
##$CPDPRG5= <mlev>
##$CPDPRG6= <mlev>
##$CPDPRG7= <mlev>
##$CPDPRG8= <mlev>
##$CPDPRGB= <>
##$CPDPRGT= <>
##$D= (0..31)
0 1.2 0 0 0 0 0 0 0 0 0 0.03 0 0 0 0 0 0 0 0 0 0 0 0 0 0 0 0 0 0 0 0 
##$DATE= 1549878885
##$DBL= (0..7)
120 120 120 120 120 120 120 120 
##$DBP= (0..7)
150 150 150 150 150 150 150 150 
##$DBP07= 0
##$DBPNAM0= <>
##$DBPNAM1= <>
##$DBPNAM2= <>
##$DBPNAM3= <>
##$DBPNAM4= <>
##$DBPNAM5= <>
##$DBPNAM6= <>
##$DBPNAM7= <>
##$DBPOAL= (0..7)
0.5 0.5 0.5 0.5 0.5 0.5 0.5 0.5 
##$DBPOFFS= (0..7)
0 0 0 0 0 0 0 0 
##$DE= 6
##$DECBNUC= <off>
##$DECIM= 32
##$DECNUC= <off>
##$DECSTAT= 4
##$DIGMOD= 1
##$DIGTYP= 9
##$DL= (0..7)
0 120 120 120 120 120 120 120 
##$DP= (0..7)
150 150 150 150 150 150 150 150 
##$DP07= 0
##$DPNAME0= <>
##$DPNAME1= <>
##$DPNAME2= <>
##$DPNAME3= <>
##$DPNAME4= <>
##$DPNAME5= <>
##$DPNAME6= <>
##$DPNAME7= <>
##$DPOAL= (0..7)
0.5 0.5 0.5 0.5 0.5 0.5 0.5 0.5 
##$DPOFFS= (0..7)
0 0 0 0 0 0 0 0 
##$DQDMODE= 0
##$DR= 18
##$DS= 0
##$DSLIST= <SSSSSSSSSSSSSSS>
##$DSPFIRM= 0
$$ [...]
##$SUBNAM2= <"">
##$SUBNAM3= <"">
##$SUBNAM4= <"">
##$SUBNAM5= <"">
##$SUBNAM6= <"">
##$SUBNAM7= <"">
##$SUBNAM8= <"">
##$SUBNAM9= <"">
##$SW= 20.0189088683792
##$SWIBOX= (0..15)
0 0 2 0 0 0 0 0 0 0 0 0 0 0 0 0 
##$SW_h= 4006.41025641026
##$TD= 16384
##$TD0= 1
##$TE= 0
##$TE2= 300
##$TE3= 300
##$TEG= 300
##$TL= (0..7)
0 120 120 120 120 120 120 120 
##$TP= (0..7)
150 150 150 150 150 150 150 150 
##$TP07= 0
##$TPNAME0= <>
##$TPNAME1= <>
##$TPNAME2= <>
##$TPNAME3= <>
##$TPNAME4= <>
##$TPNAME5= <>
##$TPNAME6= <>
##$TPNAME7= <>
##$TPOAL= (0..7)
0.5 0.5 0.5 0.5 0.5 0.5 0.5 0.5 
##$TPOFFS= (0..7)
0 0 0 0 0 0 0 0 
##$TUNHIN= 0
##$TUNHOUT= 0
##$TUNXOUT= 0
##$USERA1= <user>
##$USERA2= <user>
##$USERA3= <user>
##$USERA4= <user>
##$USERA5= <user>
##$V9= 5
##$VALIST= <valist>
##$VCLIST= <CCCCCCCCCCCCCCC>
##$VD= 0
##$VDLIST= <DDDDDDDDDDDDDDD>
##$VPLIST= <PPPPPPPPPPPPPPP>
##$VTLIST= <TTTTTTTTTTTTTTT>
##$WBST= 1024
##$WBSW= 4
##$XGAIN= (0..3)
0 0 0 0 
##$XL= 0
##$YL= 0
##$YMAX_a= 759645
##$YMIN_a= -483611
##$ZGOPTNS= <>
##$ZL1= 120
##$ZL2= 120
##$ZL3= 120
##$ZL4= 120
##$ABSF1= 10
##$ABSF2= 0
##$ABSG= 5
##$ABSL= 3
##$ALPHA= 0
##$AQORDER= 0
##$ASSFAC= 0
##$ASSFACI= 0
##$ASSFACX= 0
##$ASSWID= 0
##$AUNMP= <proc_1d>
##$AZFE= 0.1
##$AZFW= 0.1
##$BCFW= 1
##$BC_mod= 2
##$BYTORDP= 1
##$COROFFS= 0
##$CY= 11.3945322036743
##$DATMOD= 1
##$DC= 2
##$DFILT= <>
##$DTYPP= 0
##$F1P= 18.9103706918063
##$F2P= -1.10871071338519
##$FCOR= 0.5
##$FTSIZE= 0
##$FT_mod= 4
##$GAMMA= 1
##$GB= 0.15
##$INTBC= 1
##$INTSCL= 1
##$ISEN= 128
##$LB= 0.24
##$LEV0= 0
##$LPBIN= 0
##$MAXI= 10000
##$MC2= 0
##$MEAN= 0
##$ME_mod= 0
##$MI= 1.114404
##$NCOEF= 0
##$NC_proc= 0
##$NLEV= 6
##$NOISF1= 3.799351
##$NOISF2= 2.8
##$NSP= 1
##$NTH_PI= 0
##$NZP= 0
##$OFFSET= 15.70392
##$PC= 1
##$PHC0= -8678.922
##$PHC1= 13.20018
##$PH_mod= 1
##$PKNL= yes
##$PPARMOD= 0
##$PSCAL= 0
##$PSIGN= 0
##$REVERSE= no
##$SF= 200.130013532006
##$SI= 16384
##$SIGF1= 3
##$SIGF2= 2
##$SINO= 400
##$SIOLD= 16384
##$SREGLST= <1H.CDCl3>
##$SSB= 0
##$STSI= 0
##$STSR= 0
##$SW_p= 3612.71676300578
##$SYMM= 0
##$S_DEV= 0
##$TDeff= 0
##$TDoff= 0
##$TI= <>
##$TILT= no
##$TM1= 0
##$TM2= 0
##$TOPLEV= 0
##$USERP1= <user>
##$USERP2= <user>
##$USERP3= <user>
##$USERP4= <user>
##$USERP5= <user>
##$WDW= 1
##$XDIM= 8192
##$YMAX_p= 0
##$YMIN_p= 0
$$ End of Bruker specific parameters
$$ ---------------------------------
##NTUPLES= NMR FID
##VAR_NAME=  TIME,          FID/REAL,        FID/IMAG
##SYMBOL=    X,             R,               I
##VAR_TYPE=  INDEPENDENT,   DEPENDENT,       DEPENDENT
##VAR_FORM=  AFFN,          ASDF,            ASDF
##VAR_DIM=   8192,          8192,            8192
##UNITS=     SECONDS,       ARBITRARY UNITS, ARBITRARY UNITS
##FACTOR=    0.0002496,     1,               1
##FIRST=     0,             0,               0
##LAST=      2.0444736,     0,               0
##MIN=       0,             -483611,         0
##MAX=       2.0444736,     759645,          0
$$ Real data points
##PAGE= N=1
##DATA TABLE= (X++(R..R)), XYDATA
$$ [...]
$$ plain form
2639 -2738 -3091 -5303 -9432 -10683 -9297 -5559 -422 2724 2996 5013 8548 10742 9494 5812 574
2654 574 -2215 -1680 -1834 -3210 -4893 -6430 -5111 -761 1159 720 459 1286 3228 5901 5053 867 -2487
2671 -2487 -3841 -4434 -4434 -5092 -6760 -4176 875 4603 5516 4063 1177 726 2053 1296 -714 -2524 -3886
2688 -3886 -2178 198 -554 -3030 -3901 -2275 1743 6457 8314 8105 7507 7193 4999 2232 -2807 -7700
2704 -7700 -8047 -5409 -3612 -2086 -2390 -3722 -2213 -101 427 414 573 1000 4047 6172 4185 46 -3946
2721 -3946 -6875 -7265 -5568 -4081 -2106 1811 5216 7031 7715 4816 1490 556 335 575 1123 602 -542
2738 -542 -1162 -2505 -5113 -6972 -6820 -4899 146 5785 8099 8707 7899 5133 1890 -1378 -4617 -6450
2754 -6450 -5348 -3523 -1828 -680 -1429 -2798 -2887 -1524 -146 2814 6044 8773 11185 11066 6656 854
$$ packed form
2639b738l53k212m129j251J386L738N137L146K72K017L535K194j248l682n238
2654E74k789N35j54j376j683j537J319M350J920m39k61Q27J942K673q48m186l354
2671b487j354n93%o58j668K584N051L728R13j453k886m51J327p57k010j810j362
2688c886J708K376p52k476q71J626M018M714J857k09n98l14k194k767n039m893
2704g700l47K638J797J526l04j332J509K112N28j3J59M27L047K125j987m139l992
2721c946k929l90J697J487J975L917L405J815O84k899l326r34k21K40N48n21j144
2738e42o20j343k608j859J52J921N045N639K314O08q08k766l243l268l239j833
2754f450J102J825J695J148p49j369q9J363J378K960L230K729K412j19m410n802
$$ plain form
2770 854 -5239 -10409 -11658 -10500 -8819 -6129 -2392 -226 1710 2373 1459 545 1946 4837 7628 9811
2786 9811 7720 3326 -1715 -7183 -11856 -13443 -12893 -9544 -2298 5054 10016 13180 12629 10069 9083 8047
2802 8047 6518 5391 4131 1558 -628 -3689 -9485 -14846 -17331 -16468 -10583 -2598 3749 8246 10500
2817 10500 9923 6913 2308 -3822 -8365 -8937 -6921 -4497 -2600 -2708 -3511 -2763 -1916 -862 1785 5810
2833 5810 10038 14728 16994 13360 5823 -1729 -7808 -10150 -9384 -7780 -4308 1776 7187 10596 11054
2848 11054 7402 3497 2411 2134 2081 742 -2648 -6730 -9261 -13261 -18074 -20815 -19828 -14530 -4152
2863 -4152 6787 13246 15885 15913 13788 11325 6745 719 -3254 -4112 -2937 -1443 -1548 -5325 -8931 -8206
2879 -8206 -5539 -814 4256 8726 13096 17379 17483 12895 5358 -3346 -8932 -9431 -7971 -7103 -5440 -3658
$$ packed form
2770H54o093n170j249J158J681K690L737K166J936O63r14r14J401K891K791K183
2786I811k091m394n041n468m673j587N50L349P246P352M962L164n51k560r86j036
2802H047j529j127j260k573k186l061n796n361k485Q63N885P985O347M497K254
2817A0500n77l010m605o130m543n72K016K424J897j08q03P48Q47J054K647M025
2833E810M228M690K266l634p537p552o079k342P66J604L472O084N411L409M58
2848A1054l652l905j086k77n3j339l390m082k531m000m813k741R87N298J0378
2863d152J0939O459K639K8k125k463m580o026l973q58J175J494j05l777l606P25
2879h206K667M725N070M470M370M283J04m588p537q704n586m99J460Q68J663J782
$$ plain form
2895 -3658 -2507 -1490 -2371 -5705 -7359 -6284 -2862 2075 5363 3531 1038 -931 -3401 -5010 -4995 -3043
2911 -3043 1538 8101 12766 13831 11210 5250 -407 -3428 -6329 -8543 -8076 -5555 -2627 286 733
2926 733 -1257 -2199 -978 1820 7158 10400 11135 10273 8802 3752 -1602 -7800 -13396 -15195 -12370 -8295
2942 -8295 -4082 -443 164 1830 2772 2706 936 1449 3002 5376 8482 8743 5543 1302 -2764 -4979
2958 -4979 -4894 -4380 -3348 -1051 1517 3244 2939 748 -3425 -6720 -6411 -4208 -1141 2124 3533 4939
2974 4939 5765 4402 2104 537 -969 -411 2322 3860 3431 1616 -1636 -4237 -6022 -7753 -8479 -6635
2990 -6635 -3745 -120 3859 5437 4196 2658 2063 1683 2442 3485 4277 4951 5465 3607 387 -3480
3006 -3480 -7544 -9499 -7909 -6421 -4792 -2313 -388 1122 2796 2517 1539 2409 3930 5784 8389 8370
$$ packed form
2895c658J151J017q81l334j654J075L422M937L288j832k493j969k470j609J5J952
2911c043M581O563M665J065k621n960n657l021k901k214M67K521K928K913M47
2926G33j990r42J221K798N338L242P35q62j471n050n354o198n596j799K825M075
2942h295M213L639O07J666R42o6j770N13J553K374L106K61l200m241m066k215
2958d979Q5N14J032K297K568J727l05k191m173l295L09K203L067L265J409J406
2974D939Q26j363k298j567j506N58K733J538m29j815l252k601j785j731p26J844
2990f635K890L625L979J578j241j538n95l80P59J043P92O74N14j858l220l867
3006c480m064j955J590J488J629K479J925J510J674k79r78Q70J521J854K605j9
$$ plain form
3022 8370 5087 2003 -657 -4376 -6863 -8183 -9309 -7452 -4152 -1136 1158 2006 1825 2537 4435 4488
3038 4488 4049 4224 3702 2966 2430 -410 -3876 -6638 -7711 -6008 -2823 -426 624 2809 4751 5013
3054 5013 4963 3501 464 -1441 -1893 -2021 -2248 -3370 -4974 -4263 -2633 -2070 -409 1920 4100 6288 7708
3071 7708 7266 4825 1539 -1664 -3847 -5665 -8089 -9155 -7550 -4966 -2330 902 3096 4372 6727
3086 6727 8955 9557 8564 6164 2794 -31 -3070 -7261 -10285 -11243 -11170 -8439 -3840 -758 1792 5358
3102 5358 8526 10797 11572 9011 5455 2786 -76 -3060 -5389 -8531 -11206 -10149 -7433 -4413 -1725
3117 -1725 1002 3483 6831 8814 9298 7987 5868 2350 182 -1243 -4473 -7244 -7893 -7277 -4851 -2377
3133 -2377 -533 774 2977 4509 5897 6476 4688 1704 461 -950 -2260 -3181 -5032 -5884 -4790 -2911
$$ packed form
3022H370l283l084k660l719k487j320j126J857L300L016K294Q48j81P12J898N3
3038D488m39J75n22p36n36k840l466k762j073J703L185K397J050K185J942K62
3054E013n0j462l037j905m52j28k27j122j604P11J630N63J661K329K180K188J420
3071G708m42k441l286l203k183j818k424j066J605K584K636L232K194J276K355
3086F727K228O02r93k400l370k825l039m191l024r58P3K731M599L082K550L566
3102E358L168K271P75k561l556k669k862k984k329l142k675J057K716L020K688
3117a725K727K481L348J983M84j311k119l518k168j425l230k771o49O16K426K474
3133b377J844J307K203J532J388N79j788k984j243j411j310r21j851q52J094J879
$$ plain form
3149 -2911 -1261 715 1839 2974 5290 6599 5546 3360 1469 -594 -2181 -3116 -4819 -6019 -4858
3164 -4858 -3276 -1470 598 799 1007 3056 4847 5544 5669 4101 1631 116 -1265 -3288 -5145 -6357
3180 -6357 -6370 -3859 -1230 17 1334 2314 3381 4388 4660 3419 1431 119 -398 -602 -1669 -3714
3196 -3714 -5801 -5237 -4116 -1588 885 2044 3115 5365 6536 6001 4431 1116 -1594 -2572 -3166 -4304
3212 -4304 -4559 -4700 -4359 -2425 -548 161 1159 2771 4489 6515 7174 4803 2248 257 -2390 -3804
3228 -3804 -4928 -6147 -6636 -4175 -1546 712 2497 2984 3181 4280 4450 3844 3048 1479 -477 -1344 -2828
3245 -2828 -5251 -6571 -6460 -5015 -2448 495 1974 3467 5206 5392 5096 3959 792 -1523 -2492 -3084
3261 -3084 -3935 -4449 -4618 -4343 -2107 -218 1848 3883 5221 6257 7644 7401 4679 1510 -1088 -4100
$$ packed form
3149b911J650J976J124J135K316J309j053k186j891k063j587r35j703j200J161
3164d858J582J806K068K01K08K049J791O97J25j568k470j515j381k023j857j212
3180f357j3K511K629J247J317R80J067J007K72j241j988j312n17k04j067k045
3196c714k087N64J121K528K473J159J071K250J171n35j570l315k710r78n94j138
3212d304k55j41L41J934J877P09R98J612J718K026O59k371k555j991k647j414
3228c804j124j219m89K461K629K258J785M87J97J099J70o06p96j569j956q67j484
3245b828k423j320J11J445K567K943J479J493J739J86k96j137l167k315r69n92
3261c084q51n14j69K75K236J889K066K035J338J036J387k43k722l169k598l012
$$ plain form
3277 -4100 -5388 -6270 -6897 -6154 -4150 -1978 1170 3346 3616 4151 5033 4785 4344 2742 -609 -3917 -5687
3294 -5687 -7430 -8365 -8269 -7609 -5417 -1507 2401 5359 7683 9078 9064 8675 7400 4607 1834 -838 -3791
3311 -3791 -4765 -5683 -7187 -6875 -4934 -2818 -93 2977 4608 6013 6860 6923 5676 3670 272 -2629
3327 -2629 -4302 -5760 -7012 -6841 -6556 -5178 -2964 -1022 93 1889 2935 3547 4297 3185 1209 190
3343 190 -1006 -1546 -1559 -1674 -2516 -1476 977 2370 3957 4847 4600 4068 4425 3408 1188 -920 -3292
3360 -3292 -4728 -4658 -5049 -5647 -4420 -3162 -1005 1801 2735 2841 3356 4172 4284 3564 2415 -478 -2299
3377 -2299 -2829 -3275 -4432 -4768 -4899 -3962 -1598 134 1345 2144 2676 3031 3668 3671 2503 2175 1283 1221 1023
3396 1023 -403 -1809 -2236 -2090 -1815 -1170 -948 -998 -492 892 830 759 -157 -1146 -528 371 114 273 647 204
$$ packed form
3277d100j288q82o27P43K004K172L148K176K70N35Q82k48m41j602l351l308j770
3294e687j743r35R6O60K192L910L908K958K324J395j4l89j275k793k773k672k953
3311c791r74r18j504L12J941K116K725L070J631J405Q47O3j247k006l398k901
3327b629j673j458j252J71K85J378K214J942J115J796J046O12P50j112j976j019
3343A90j196n40j3j15q42J040K453J393J587Q90k47n32L57j017k220k108k372
3360c292j436P0l91n98J227J258K157K806R34J06N15Q16J12p20j149k893j821
3377b299n30m46j157l36j31R37K364J732J211P99N32L55O37Lj168l28q92o2j98
3396A023j426j406m27J46K75O45K22n0N06J384o2p1r16r89O18Q99k57J59L74m43
$$ plain form
3416 204 443 819 272 -528 -120 284 1239 2137 1315 91 -277 -514 -1270 -1962 -2947 -3472 -2215 -693 281
3435 281 602 578 -4 1359 2663 2634 2896 2879 2024 1532 1208 -790 -2774 -3951 -4681 -3966 -2651 -2020 -1137
3454 -1137 834 1596 2020 2714 2290 1530 1816 2284 1833 1307 -56 -1867 -2537 -2834 -3096 -2720 -1636 -898
3472 -898 792 2478 2465 2302 1703 725 13 67 -312 -72 562 344 202 603 129 -324 168 547 566 737
3492 737 639 -248 -1439 -2566 -4100 -4243 -4577 -4887 -2980 -536 1274 2736 3948 3909 3996 4133 3526 2817
3510 2817 2088 762 -41 -947 -2440 -4174 -4254 -4132 -3173 -611 1410 2992 4889 5837 6353 5824 3470
3527 3470 891 -322 -769 -1966 -2846 -4154 -5819 -5937 -5077 -4805 -3785 -3088 -2001 523 2664 2848 2436
3544 2436 1323 656 11 19 -286 -359 496 1717 3111 3372 2745 2024 2336 2405 1941 1856 841 -467 -962 -1043
$$ packed form
3416B04K39L76n47q00M08M04R55Q98q22j224l68k37p56o92r85n25J257J522R74
3435B81L21k4n82J363J304k9K62j7q55m92l24j998j984j177p30P15J315O31Q83
3454a137J971P62M24O94m24p60K86M68m51n26j363j811o70k97k62L76J084P38
3472h98J690J686j3j63n99r78p12N4l79K40O34k18j42M01m74m53M92L79J9J71
3492G37r8q87j191j127j534j43l34l10J907K444J810J462J212l9Q7J37o07p09
3510B817p29j326q03r06j493j734q0J22R59K562K021J582J897R48N16n29k354
3527C470k579j213m47j197q80j308j665j18Q60K72J020O97J087K524K141J84m12
3544B436j113o67o45Ql05p3Q55J221J394K61o27p21L12O9m64q5j015j308m95q1
$$ plain form
3564 -1043 -2152 -3187 -3483 -3129 -1209 1115 1942 2804 3504 2863 2350 1387 -565 -2738 -3364 -3406 -3909 -4373
3582 -4373 -5274 -5749 -4250 -3119 -1990 -111 1096 2893 5562 6935 6411 5163 4270 3098 2298 1201
3598 1201 -429 -1047 -1215 -1694 -1406 -1325 -2640 -2976 -1396 -35 488 1092 831 848 1482 716 -267 -1095 -2303
3617 -2303 -2401 -863 -251 -363 -226 -21 -316 123 -84 -800 -249 120 -16 -122 168 -1212 -1273 -760 -356 -74
3637 -74 1106 1725 2857 3852 3893 3256 2585 1023 180 -154 -1269 -3047 -3089 -3081 -3635 -3315 -2714 -2192 -786 705
3657 705 1583 3088 3373 3431 3286 2979 1207 -518 -1288 -2612 -2712 -2245 -2490 -2403 -1113 -876 319 1489
3675 1489 1923 2229 2821 2612 1618 1435 -70 -1477 -1926 -2605 -2842 -1954 -1712 -698 751 1762 1776 2683
3693 2683 2720 1867 1571 905 -109 -1139 -1773 -2415 -2997 -2598 -2295 -1079 308 1087 1744 3275 3262 3164 2879
$$ packed form
3564a043j109j035k96L54J920K324Q27Q62P00o41n13r63j952k173o26m2n03m64
3582d373r01m75J499J131J129J879J207J797K669J373n24j248q93j172q00j097
3598A201j630o18j68m79K88Q1j315l36J580J361N23O04k61J7O34p66r83q28j208
3617b303r8J538O12j12J37K05k95M39k07p16N51L69j36j06K90j380o1N13M04K82
3637g4J180O19J132R95M1o37o71j562q43l34j115j778m2Qn54L20O01N22J406J491
3657G05Q78J505K85N8j45l07j772j725p70j324j00M67k45Q7J290K37J195J170
3675A489M34L06N92k09r94j83j505j407m49o79k37Q88K42J014J449J011J4R07
3693B683L7q53k96o66j014j030o34o42n82L99L03J216J387P79O57J531j3r8k85
$$ plain form
3712 2879 1271 -444 -1165 -1648 -2626 -2906 -3407 -3272 -1756 -209 436 1307 2236 2652 3063 3379 1886 805
3730 805 -286 -1647 -2210 -2620 -3597 -3445 -2079 -616 509 1537 2075 2556 3768 3644 2629 1628 -195
3747 -195 -1272 -1504 -2379 -3617 -3536 -2916 -2095 -384 983 1142 2106 3457 3764 3325 2197 146 -665 -562
3765 -562 -1608 -2538 -3043 -3401 -2521 -663 746 818 1377 1867 2673 3352 2436 936 -195 -1084 -1612 -1511 -2249
3784 -2249 -3232 -2561 -1082 -114 1173 1162 1209 2092 3149 2487 1431 289 -1208 -1635 -1256 -1926 -2577 -2562 -2037
3803 -2037 -691 647 1205 1179 1886 2134 2264 2090 805 -308 -534 -1150 -1821 -2233 -2234 -2411 -1027 183 263
3822 263 770 1420 1510 2164 2392 1298 575 118 -567 -945 -1198 -2021 -2184 -1429 -848 -614 214 438 708 1760
3842 1760 1730 1161 646 725 -156 42 123 -1058 -1176 -1033 -697 -343 282 25 -27 366 721 518 708 184 -215
$$ packed form
3712B879j608j715p21m83r78k80n01J35J516J547O45Q71R29M16M11L16j493j081
3730H05j091j361n63m10r77J52J366J463J125J028N38M81J212j24j015j001j823
3747a95j077k32q75j238Q1O20Q21J711J367J59R64J351L07m39j128k051q11J03
3765e62j046r30n05l58Q80J858J409P2N59M90Q06O79r16j500j131q89n28J01p38
3784b249r83O71J479R68J287j1M7Q83J057o62j056j142j497m27L79o70o51J5N25
3803b037J346J338N58k6P07K48J30j74j285j113k26o16o71m12jj77J384J210Q0
3822B63N07O50R0O54K28j094p23m57o85l78k53q23j63P55N81K34Q28K24K70J052
3842A760l0n69n15P9q81J98Q1j181j18J43L36L54O25k57n2L93L55k03J90n24l99
$$ plain form
3863 -215 -32 -589 -1006 -1097 -671 -835 -366 -278 -81 776 1228 1352 1884 1727 744 1169 936 52 -421 -1100 -1825
3884 -1825 -1536 -1392 -1725 -1552 -1085 -440 461 1164 1168 1317 2161 1930 1880 1749 545 -430 -457 -749 -1169 -1805 -2071
3905 -2071 -2313 -1389 -718 -830 -300 269 843 1612 1729 1221 1300 1186 482 287 36 -554 -807 -91 277 139
3925 139 183 -59 25 491 169 -512 -623 -1016 -983 -742 -860 -1362 -887 -180 434 1279 1736 1482 2430 2958 2723
3946 2723 2189 846 -433 -431 -759 -2072 -2894 -3140 -3127 -2379 -767 -307 -161 903 1832 2585 3266 2776 1617
3965 1617 1131 602 -364 -1400 -2364 -3285 -2787 -2298 -2118 -1906 -1215 -533 737 1438 1363 1115 1138 1157 1125 1669
3985 1669 337 90 477 853 1126 1432 1145 1257 1898 1482 1013 176 -744 -1418 -1587 -2106 -2907 -3010 -3042 -2057
4005 -2057 -668 -285 -232 18 1470 2007 2387 2071 798 102 42 -788 -1534 -2187 -2980 -2748 -1668 -1271 -512
$$ packed form
3863b15J83n57m17r1M26j64M69Q8J97Q57M52J24N32j57r83M25k33q84m73o79p25
3884a825K89J44l33J73M67O45R01P03MJ49Q44k31n0j31j204r75k7k92m20o36k66
3905b071k42R24O71j12N30N69N74P69J17n08P9j14p04j95k51n90k53P16L68j38
3925A39M4k42Q4M66l22o81j11l93L3K41j18n02M75P07O14Q45M57k54R48N28k35
3946B723n34j343j279Kl28j313q22k46J3P48J612M60J46J064R29P53O81m90j159
3965A617m86n29r66j036r64r21M98M89J80K12O91O82J270P01p5k48K3J9l2N44
3985A669j332k47L87L76K73L06k87J12O41m16m69q37r20o74j69n19q01j03l2R85
4005b057J389L83N3K50J452N37L80l16j273o96o0q30p46o53p93K32J080L97P59
$$ plain form
4024 -512 484 1547 2655 3583 3726 3444 3318 3309 2795 2462 1486 -327 -1009 -1010 -1807 -1819 -2329 -2390 -1987 -1192 -926
4045 -926 -1199 -1083 -1027 -613 -428 -861 -1211 -973 -709 -551 -186 -265 -456 524 1301 1412 1413 990 539 950 709
4066 709 -24 -523 -909 -943 -181 48 70 874 1383 2168 2941 2965 2327 2068 1971 838 -169 -997 -2551 -3493
4086 -3493 -3421 -3618 -4095 -3605 -3243 -2233 -763 395 898 2046 2902 3041 2928 2567 1435 944 473 -586
4104 -586 -1180 -1963 -2323 -1711 -967 -956 -484 257 235 1438 2055 1918 1363 1100 817 824 484 -486 -1133 -576 -260
4125 -260 -402 82 -203 -474 202 936 321 -457 -880 -1231 -1183 -1084 -1669 -1974 -1481 -1142 93 1476 2007 2422
4145 2422 3183 3371 3461 2852 1204 106 -433 -2015 -3199 -3615 -4048 -4117 -2894 -2022 -1369 -81 1449 2767
4163 2767 4040 4270 3363 2857 2351 1150 150 -1083 -2400 -2677 -2163 -1872 -1876 -1236 -1021 421 1358 1556
$$ packed form
4024e12R96J063J108R28J43k82j26rn14l33r76j813o82jp97j2n10o1M03P95K66
4045i26k73J16N6M14J85m33l50K38K64J58L65p9j91R80P77J11Jm23m51M11k41
4066G09p33m99l86l4P62K29K2Q04N09P85P73K4o38k59r7j133j007q28j554r42
4086c493P2j97m77M90L62J010J470J158N03J148Q56J39j13l61j132m91m71j059
4104e86n94p83l60O12P44J1M72P41k2J203O17j37n55k63k83Pl40r70o47N57L16
4125b60j42M84k85k71O76P34o15p78m23l51M8R9n85l05M93L39J235J383N31M15
4145B422P61J88R0o09j648j098n39j582j184m16m33o9J223Q72O53J288J530J318
4163B767J273K30r07n06n06j201j000j233j317k77N14K91mO40K15J442R37J98
$$ plain form
4181 1556 1142 1207 1112 756 580 -130 -1567 -1673 -1092 -538 -67 226 966 1713 2162 2030 1891 634 -585
4200 -585 -1127 -1474 -2249 -2781 -2848 -2574 -1601 -694 -246 438 1637 2669 3759 4062 2813 1806 1230 113
4218 113 -1275 -2295 -3487 -3544 -3179 -2435 -1723 -717 -136 957 2053 2523 2221 2254 2162 1732 1256 12 -1234
4237 -1234 -1699 -1515 -1544 -846 -541 -462 320 1839 1856 1290 803 280 -233 2 -1047 -1626 -1906 -2052 -1805 -1240
4257 -1240 -748 -691 455 1467 2084 2140 2137 956 551 493 -280 -1220 -1919 -2250 -1568 -743 -124 -301 498 1323
4277 1323 2039 2406 2169 1500 1756 1208 651 -253 -1610 -2744 -2003 -1631 -1645 -1673 -1027 -133 946 1825 1313
4296 1313 713 156 -75 124 -286 -1001 -1582 -1513 -1350 -1028 -939 -637 -196 814 1693 1969 1909 1366 1317 1621 979
4317 979 -227 -627 -1099 -1100 -570 -382 -1137 -826 -610 161 493 636 57 255 759 607 327 86 -628 -797
$$ packed form
4181A556m14O5r5l56j76p10j437j06N81N54M71K93P40P47M49j32j39j257j219
4200e85n42l47p75n32o7K74R73R07M48O84J199J032J090L03j249j007n76j117
4218A13j388j020j192n7L65P44P12J006N81J093J096M70l02L3r2m30m76j244j246
4237a234m65J84k9O98L05P9P82J519J7n66m87n23n13K35j049n79k80j46K47N65
4257a240M92N7J146J012O17N6lj181m05n8p73r40o99l31O82Q25O19j77P99Q25
4277A323P16L67k37o69K56n48n57r04j357j134P41L72j4k8O46Q94J079Q79n12
4296A313o00n57k31J99m10p15n81O9J63L22Q9L02M41J010Q79K76o0n43m9L04o42
4317I79j206m00m72jN30J88p55L11K16P71L32J43n79J98N04j52k80k41p14j69
$$ plain form
4337 -797 -240 -504 -660 -609 -420 266 554 -10 22 -148 112 127 460 286 -140 205 104 96 21 -447 -964 71
4359 71 661 -78 163 373 335 594 1027 562 -5 -219 -85 337 -15 -781 -1311 -1023 -872 -726 -589 -395 -216
4380 -216 576 1230 1163 1301 1187 974 956 286 -319 -708 -1034 -1351 -1233 -1148 -1520 -1184 -405 148 765 1151 973
4401 973 1204 1590 1527 667 -143 -703 -1132 -1075 -1191 -1671 -1268 -1015 32 268 662 280 1200 1756 1733 1268 649
4422 649 -368 -467 93 -650 -1073 -1120 -1254 -362 335 462 565 860 767 832 820 295 -701 -697 -1008 -842 -940 -1463
4444 -1463 -944 -42 602 922 1476 1424 1477 1764 1647 642 -321 -1085 -1331 -1699 -2120 -2296 -2304 -1352 -571 370 1001
4465 1001 1387 2262 2975 3179 2328 1245 295 -363 -777 -1368 -2684 -2894 -3038 -2591 -1456 -535 -329 298 1360
4484 1360 2190 2541 2365 1253 770 854 301 -231 -552 -1419 -1093 -413 -439 66 -136 84 658 1037 441 -408
$$ packed form
4337g97N57k64j56N1J89O86K88n64L2j70K60J5L33j74m26L45j01qp5m68n17J035
4359G1N90p39K41K10l8K59M33m65n67k14J34M22l52p66n30K88J51J46J37J94J79
4380b16P92O54o7J38j14k13j8o70o05l89l26l17J18Q5l72L36P79N53O17L86j78
4401I73K31L86o3q60q10n60m29N7j16m80M03K53J047K36L94l82R20N56k3m65o19
4422F49j017r9N60p43m23m7j34Q92O97J27J03K95r3O5j2n25r96Ml11J66r8n23
4444a463N19R02O44L20N54n2N3K87j17j005r63p64k46l68m21j76qR52P81R41O31
4465A001L86Q75P13K04q51j083r50o58m14n91j316k10j44M47J135R21K06O27J062
4484A360Q30L51j76j112m83Q4n53n32l21q67L26O80k6N05k02K20N74L79n96q49
$$ plain form
4504 -408 -980 -1203 -931 -1042 -932 -1021 -394 376 1182 1794 2159 2206 2483 2400 1414 405 -596 -1760 -2358 -2574
4524 -2574 -3707 -3818 -3282 -1978 -739 607 1512 2007 2946 3584 3627 3548 2018 969 354 -598 -1729 -2390
4542 -2390 -2715 -3206 -2546 -1943 -1207 -912 177 789 1618 1860 1686 1615 1365 1029 690 89 -544 -721 -498 -612
4562 -612 -127 -316 -447 -14 47 258 -562 -445 -512 -597 -755 -1322 -1280 -498 -81 402 937 1085 1449 1672 2060
4583 2060 1675 1116 587 147 -912 -839 -1960 -2538 -2531 -2266 -1702 -922 -287 38 1129 2080 2453 2987 2549 1656
4603 1656 1738 1312 107 -719 -1653 -2515 -2024 -1732 -2018 -1972 -1271 -474 634 1381 1560 1506 1950 1714 999 988
4623 988 -85 -260 -137 -588 -785 -1117 -1126 -750 -136 -60 -366 63 429 858 1092 288 -234 -535 79 -127 -110
4644 -110 -729 -686 -309 649 690 699 483 85 345 747 321 -555 -1105 -913 -702 -720 -960 -982 -602 65 967 1543
$$ packed form
4504d08n72k23K72j11J10q9O27P70Q06O12L65M7K77q3r86j009j001j164n98k16
4524b574j133j11N36J304J239J346R05M95R39O38M3p9j530j049o15r52j131o61
4542b390l25m91O60O03P36K95J089O12Q29K42j74p1k50l36l39o01o33j77K23j14
4562f12M85j89j31M33O1K11q20J17o7q5j58n67M2P82M17M83N35J48L64K23L88
4583B060l85n59n29m40j059P3j121n78PK65N64P80O35L25J091R51L73N34m38q93
4603A656Q2m26j205q26r34q62M91K92k86M6P01P97J108P47J79n4M44k36p15j1
4623I88j073j75J23m51j97l32rL76O14P6l06M29L66M29K34q04n22l01O14k06J7
4644a10o19M3L77R58M1Rk16l98K60M02m26q76n50J92K11j8k40k2L80O67R02N76
$$ plain form
4666 1543 1231 1215 1578 1635 1311 698 7 -1013 -850 -1023 -1624 -1982 -1783 -1637 -716 53 298 224 780 1203
4686 1203 1603 1385 580 50 -21 -417 -1178 -1341 -1879 -2057 -957 -544 46 185 526 1114 1900 1914 1512 888
4706 888 565 517 250 -291 -1022 -1174 -633 -224 248 372 53 305 939 1075 647 514 -354 -918 -426 -1062
4726 -1062 -2094 -2144 -2023 -1705 -961 -599 -437 585 1050 1444 1730 1449 440 140 328 -71 -241 -410 -603
4745 -603 -255 13 94 477 948 1193 1604 1791 1029 751 478 108 -302 -1104 -1799 -1716 -1439 -990 -582 -262 -204
4766 -204 -120 454 914 611 168 98 -499 -298 -896 -1454 -1288 -1344 -1105 -405 169 97 434 1429 1876 1832 1739 1542
4788 1542 1015 1307 863 49 -371 -882 -716 -447 -636 -985 -714 -363 -217 -308 0 -188 -43 -76 -261 -112
4808 -112 -255 -697 -379 164 -256 -583 -399 -120 31 517 -93 18 324 221 408 506 -154 -466 -280 231
$$ packed form
4666A543l12j6L63N7l24o13o91j020J63j73o01l58J99J46R21P69K45p4N56M23
4686A203M00k18q05n30p1l96p61j63n38j78J100M13N90J39L41N88P86J4m02o24
4706H88l23m8k67n41p31j52N41M09M72J24l19K52O34J36m28j33q68n64M92o36
4726a062j032n0J21L18P44L62J62J022M65L94K86k81j009l00J88l99j70j69j93
4745f03L48K68Q1L83M71K45M11J87p62k78k73l70m10q02o95Q3K77M49M08L20N8
4766b04Q4N74M60l03m43p0n97K01n98n58J66n6K39P00N74p2L37R95M47m4r3j97
4788A542n27K92m44q14m20n11J66K69j89l49K71L51J46r1L08j88J45l3j85J49
4808a12j43m42L18N43m20l27J84K79J51M86o10J11L06j03J87R8o60l12J86N11
$$ plain form
4828 231 -69 -335 -410 -243 237 697 302 198 403 315 566 890 285 -675 -401 -354 -402 -658 -1235 -1144 -936 -400
4850 -400 -293 18 16 492 977 1167 825 831 899 291 416 222 -690 -1145 -815 -818 -644 -441 -892 -682 125 98 401
4873 401 373 -81 413 662 419 -363 -770 -811 -856 -297 -433 -364 -271 502 1055 1885 1658 905 624 692 707 196
4895 196 -306 -1532 -1254 -1227 -1271 -1197 -1094 -620 268 1385 1493 1885 1444 1422 1178 547 -256 -1417 -1743 -2054
4915 -2054 -1630 -1396 -1294 -1349 -591 715 1198 1577 1655 1487 1852 1303 586 -304 -1150 -1274 -1183 -1154 -1039 -295 189
4936 189 1197 1609 1881 1362 1137 951 695 -276 -844 -1724 -2044 -1852 -1789 -1641 -1282 -661 240 1918 2435 2516
4956 2516 2255 1802 1306 571 -450 -1372 -2005 -1973 -2119 -1751 -1192 -768 -130 876 1387 1979 2167 2007 1887
4975 1887 1497 730 -427 -1009 -1769 -1924 -1971 -1622 -1043 -216 267 793 1440 1317 1271 1055 1083 100 -327 -560
$$ packed form
4828B31l00k66p5J67M80M60l95j04K05q8K51L24o05r60K74M7m8k56n77R1K08N36
4850d00J07L11kM76M85J90l42OO8o08J25j94r12m55L30lJ74K03m51K10Q07k7L03
4873D01k8m54M94K49k43p82m07m1m5N59j36O9R3P73N53Q30k27p53k81O8J5n11
4895A96n02j226K78K7m4P4J03M74Q88J117J08L92m41k2k44o31q03j161l26l11
4915b054M24K34J02n5P58J306M83L79P8j68L65n49p17q90q46j24R1K9J15P44M84
4936A89J008M12K72n19k25j86k56r71n68q80l20J92O3J48L59O21R01J678N17Q1
4956B516k61m53m96p35j021r22o33L2j46L68N59M24O38J006N11N92J88j60j20
4975A887l90p67j157n82p60j55m7L49N79Q27M83N26O47j23m6k16K8r83m27k33
$$ plain form
4995 -560 -1358 -1086 -1103 -1291 -1208 -338 382 1025 1478 1731 1470 1449 1040 76 -537 -1373 -1278 -1370 -1517 -1276 -1231 -809
5017 -809 -156 636 1463 1215 1423 2018 1652 1252 694 -644 -1304 -1533 -2022 -1856 -1633 -1405 -733 359 983
5036 983 783 1342 1386 1457 1568 1160 417 151 -167 -412 -1011 -1299 -1756 -1285 -510 -256 320 413 204 471 685
5057 685 578 52 44 -380 69 312 -27 206 -6 -139 523 444 15 -386 51 411 12 -426 -883 -1134 -1044
5078 -1044 -454 -794 -184 -153 251 1000 1376 1333 1033 1012 636 865 842 -318 -340 -561 -889 -1164 -1385 -1527 -1503
5099 -1503 -813 -431 -251 476 578 644 1710 1517 1307 1172 1064 385 654 435 -657 -853 -1439 -1398 -1132 -1172
5119 -1172 -1450 -783 -313 87 672 762 620 837 1282 1243 922 -2 -122 94 9 -317 -503 -616 -553 -362 104
5140 104 4 -483 -127 -91 91 -124 -18 -586 -315 7 -28 170 212 336 528 935 600 1034 472 330 22
$$ packed form
4995e60p98K72j7j88Q3Q70P20O43M53K53k61k1m09r64o13q36R5r2j47K41M5M22
5017h09O53P92Q27k48K08N95l66m00n58j338o60k29m89J66K23K28O72J092O24
5036I83k00N59M4P1J11m08p43k66l18k45n99k88m57M71P75K54N76R3k09K67K14
5057F85j07n26qm24M49K43l39K33k12j33O62p9m29m01M37L60l99m38m57k51R0
5078a044N90l40O10L1M04P49L76m3l00k1l76K29k3j160k2k21l28k75k21j42K4
5099a503O90L82J80P27J02O6J066j93k10j35j08o79K69k19j092j96n86M1K66m0
5119a172k78O67M70M00N85R0j42K17M45l9l21r24j20K16q5l26j86j13O3J91M66
5140A04j00m87L56L6J82k15J06n68K71L22l5J98M2J24J92M07l35M34n62j42l08
$$ plain form
5161 22 -283 -998 -1227 -1142 -1396 -1120 -1004 -560 -428 276 877 1312 1458 1510 1236 1439 837 97 -625 -771 -1278
5182 -1278 -1391 -1368 -1452 -1171 -670 -108 593 850 1038 1259 1452 1086 785 358 -83 -728 -614 -1307 -1456 -1172
5202 -1172 -1059 -576 75 405 510 824 1311 1034 1069 379 5 78 -86 -606 -919 -633 -778 -352 82 -22
5222 -22 340 878 794 910 917 279 -328 -450 -737 -966 -894 -1145 -740 -216 326 369 293 703 554 698 918 646
5244 646 86 -66 -647 -521 -1102 -1452 -1756 -1145 -761 -143 707 610 800 1228 1452 1186 877 432 203 523
5264 523 438 -614 -1032 -1025 -1231 -1285 -969 -805 -322 78 756 1078 726 668 736 678 609 246 97 -402 -273 -317 -531
5287 -531 -906 -907 -1116 -334 -99 318 275 480 462 722 687 244 -366 -317 -323 -100 381 -123 -388 -331 316 191 61
5310 61 -183 -102 400 462 171 -354 -428 -1027 -878 -677 -549 -530 143 493 907 1280 805 904 733 473 372 262
$$ packed form
5161B2l05p15k29Q5k54K76J16M44J32P04O01M35J46N2k74K03o02p40p22j46n07
5182a278j13K3q4K81N01N62P01K57J88K21J93l66l01m27m41o45J14o93j49K84
5202a172J13M83O51L30J05L14M87k77L5o90l74P3j64n20l13K86j45M26M34j04
5222b2L62N38q4J16Po38o07j22k87k29P2k51M05N24N42M3p6M10j49J44K20k72
5244F46n60j52n81J26n81l50l04O11L84O18Q50r7J90M28K24k66l09m45k29L20
5264E23q5j052m18Pk06n4L16J64M83M00O78L22l52n8O8n8o9l63j49m99J29m4k14
5287e31l75jk09P82K35M17m3K05j8K60l5m43o10M9oK23M81n04k65N7O47j25j30
5310F1k44Q1N02O2k91n25p4n99J49K01J28J9O73L50M14L73m75R9j71k60j01j10
$$ plain form
5332 262 -89 -709 -421 -644 -1200 -1294 -1355 -948 -88 621 1057 1218 1424 1226 1243 1176 -2 -475 -312 -837 -1174
5353 -1174 -1229 -1405 -1390 -839 -641 -136 571 711 1093 1905 1735 1107 528 -357 -525 -905 -1060 -1102 -849 -408 -340
5374 -340 158 243 396 565 727 692 616 588 172 -309 -653 -606 -942 -685 -496 146 575 904 921 1411 999 553
5396 553 169 -800 -936 -1226 -1191 -1489 -1208 -1066 -445 127 512 850 1244 1889 2015 1776 1392 586 -476 -640
5416 -640 -1624 -1616 -2006 -1980 -1606 -638 -55 372 590 1388 1402 1556 1609 1000 1090 237 34 -579 -1040 -1444 -1339 -880
5438 -880 -663 -16 -160 519 578 1000 322 249 -201 -507 -393 -390 -790 -843 -578 -143 -233 323 770 783 1153 1466
5460 1466 1231 826 301 -639 -701 -925 -1144 -1316 -1337 -768 -304 426 405 780 1084 1202 1266 1645 882 496 101
5481 101 -244 -578 -1137 -1621 -1750 -1407 -822 -739 -678 -289 345 534 1000 635 682 538 171 459 530 69 -624
$$ packed form
5332B62l51o20K88k23n56r4o1M07Q60P09M36J61K06j98J7o7j178m73J63n25l37
5353a174n5j76J5N51J98N05P07J40L82Q12j70o28n79q85j68l80j55m2K53M41O8
5374c40M98Q5J53J69J62l5p6k8m16m81l44M7l36K57J89O42M29L29J7M90m12m46
5396E53l84r69j36k90L5k98K81J42O21N72L85L38L94O45J26k39l84q06j062j64
5416f40r84Ql90K6L74R68N83M27K18P98J4J54N3o09R0q53k03o13m61m04J05M59
5438h80K17O47j44O79N9M22o78p3m50l06J14Lm00n3K65M35r0N56M47J3L70L13
5460A466k35m05n25r40o2k24k19j72k1N69M64P30k1L75L04J18O4L79p63l86l95
5481A01l45l34n59m84j29L43N85Q3O1L89O34J89M66l65M7j44l67K88P1m61o93
$$ plain form
5502 -624 -538 -102 2 21 35 -98 371 220 555 227 -108 -413 -201 6 -347 -171 -342 -125 443 258 262 100
5524 100 181 316 532 540 -310 -221 -158 39 -328 -553 -730 -470 -392 -234 -253 -246 -173 48 675 475 453 472 387 305 700
5549 700 337 159 -179 -209 -539 -424 -544 -1034 -909 -602 -185 13 445 365 678 748 1071 854 521 580 -18
5570 -18 -99 -240 -585 -509 -711 -703 -327 -301 -108 138 266 560 998 658 444 260 144 -174 -426 -823 -881 -574
5592 -574 -606 -287 126 58 251 621 315 150 224 149 -153 -155 -195 -620 -924 -310 -250 -213 502 692 818 1137 1050
5615 1050 1065 824 295 75 -262 -534 -594 -449 -454 -786 -588 -585 -475 286 460 600 800 777 536 546 388 -168
5637 -168 -576 -474 -552 -801 -597 -674 -283 498 506 276 558 343 191 460 306 -124 -338 -460 -663 -268 -400
5658 -400 -117 145 469 550 902 762 464 96 -70 -394 -677 -1041 -1228 -1137 -964 -800 -1038 -338 -243 433 936
$$ packed form
5502f24Q6M36J04J9J4j33M69j51L35l28l35l05K12K07l53J76j71K17N68j85Mj62
5524A00Q1J35K16Qq50Q9O3J97l67k25j77K60P8J58j9PP3K21O27k00k2J9q5q2L95
5549G00l63j78l38l0l30J15j20m90J25L07M17J98M32q0L13P0L23k17l33N9n98
5570a8q1j41l45P6k02QL76K6J93K46J28K94M38l40k14j84j16l18k52l97n8L07
5592e74l2L19M13o8J93L70l06j65P4p5l02km0m25l04O14O0L7P15J90J26L19q7
5615A050J5k41n29k20l37k72o0J45nl32J98LJ10P61J74J40K00k3k41J0j58n56
5637a68m08J02p8k49K04p7L91P81Qk30K82k15j52K69j54m30k14j22k03L95j32
5658d00K83K62L24Q1L52j40k98l68j66l24k83l64j87R1J73J64k38P00R5O76N03
$$ plain form
5679 936 1069 1349 933 1088 1115 495 -76 -738 -938 -1181 -1050 -816 -676 -849 -178 -70 223 528 323 340 817
5700 817 1040 593 208 -279 -250 -164 -45 -502 -785 -286 -18 -175 348 -97 -321 -135 75 -105 -186 -362 -669
5721 -669 -185 -118 14 13 76 74 631 1071 631 859 496 613 121 -31 -418 -813 -869 -858 -975 -209 -437 -535 5
5744 5 448 564 678 610 725 934 1025 325 176 -307 -556 -753 -668 -1043 -922 -720 -288 218 149 274 208 698
5766 698 650 623 601 336 117 -405 -189 -637 -310 -440 -592 -417 276 121 476 474 513 767 270 353 14 -61 -443
5789 -443 -315 -453 -578 -670 -207 -177 270 257 294 213 460 533 435 294 177 -66 -368 -555 -692 -551 -238 -689
5811 -689 -241 218 418 427 645 343 279 636 89 -43 -70 -457 -535 -596 -476 -365 -244 -101 169 340 597 621
5833 621 555 549 59 79 22 -778 -626 -790 -522 -526 -505 -278 10 316 507 712 618 694 491 324 94 -221 -385
$$ packed form
5679I36J33K80m16J55K7o20n71o62k00k43J31K34J40j73O71J08K93L05k05J7M77
5700H17K23m47l85m87K9Q6J19m57k83M99K68j57N23m45k24J86K10j80q1j76l07
5721f69M84O7J32jO3kN57M40m40K28l63J17m92j52l87l95n6J1j17P66k28r8N40
5744EM43J16J14o8J15K09R1p00j49m83k49j97Q5l75J21K02M32N06o9J25o6M90
5766F98m8k7k2k65k19n22K16m48L27j30j52J75O93j55L55kL9K54m97Q3l39p5l82
5789d43J28j38j25r2M63L0M47j3L7q1K47P3r8j41j17k43l02j87j37J41L13m51
5811f89M48M59K00RK18l02o4L57n47j32k7l87p8o1J20J11J21J43K70J71K57K4
5833F21o6om90K0n7q00J52j64K68mK1K27K88L06J91K05r4P6k03j67k30l15j64
$$ plain form
5856 -385 -520 -307 -531 -351 -199 -564 97 276 263 233 -26 230 385 -57 84 -186 -479 -302 -204 -169 -171 -234
5878 -234 -4 246 227 108 117 -28 247 159 -42 -391 -586 -371 -322 -203 -101 -214 -92 81 581 520 385 68
5900 68 -74 186 345 -120 -228 -467 -263 -64 -453 -240 -250 -70 -122 604 281 190 98 -4 -99 46 65 -383
5922 -383 -265 -114 -75 87 -157 -263 44 375 350 122 89 256 317 280 243 -245 -132 38 -140 148 188 -161
5944 -161 -107 -138 -39 105 -241 -359 124 416 444 323 -36 -166 -88 345 -60 178 -42 -207 -342 -112 -575 -670
5966 -670 -137 -259 -47 173 56 223 391 -6 210 194 9 -303 -132 139 -123 181 242 242 381 315 220 82
5988 82 232 -61 89 -480 -636 -666 -290 -453 -382 6 86 -192 574 961 493 557 524 565 -83 -30 -261 -393 -714
6011 -714 -727 -759 -465 -677 -462 -140 254 523 657 848 440 742 196 12 -211 -572 -579 -469 -380 -204 -361 -57
$$ packed form
5856c85j35K13k24J80J52l65O61J79j3l0k59K56J55m42J41k70k93J77R8L5ko3
5878b34K30K50j9j19Rj45K75q8k01l49j95K15M9J19J02j13J22J73N00o1j35l17
5900F8j42K60J59m65j08k39K04J99l89K13j0J80n2P26l23r1r2j02r5J45J9m48
5922c83J18J51L9J62k44j06L07L31k5k28l3J67O1l7l7m88J13J70j78K88M0l49
5944a61N4l1R9J44l46j18M83K92K8j21l59j30P8M33m05K38k20j65j35K30m63r5
5966f70N33j22K12K20j17J67J68l97K16j6j85l12J71K71k62L04O1%J39o6r5j38
5988H2J50k93J50n69j56l0L76j63P1L88Q0k78P66L87m68O4l3M1o48N3k31j32l21
6011g14j3l2K94k12K15L22L94K69J34J91m08L02n46j84k23l61pJ10Q9J76j57L04
$$ plain form
6033 -57 -25 -6 4 -84 288 384 151 -51 -254 -114 -270 106 -390 -300 -139 109 209 712 631 545 422 175 -150
6056 -150 -102 -442 -837 -618 -334 -1071 -571 -459 -471 22 220 379 417 1150 1039 738 339 141 -251 -190 -300
6077 -300 -466 -425 -541 -621 -124 12 -138 244 94 329 666 199 116 235 49 -14 -194 -192 -647 -635 -252 -96
6099 -96 337 311 -202 189 417 70 67 -399 -446 -266 -261 -194 -379 -398 -366 82 460 514 198 213 403 517 501 24
6123 24 -417 -411 -361 -424 -450 -517 -661 38 108 -233 165 251 345 421 610 551 224 24 -242 -130 16 -496 -486 -411 -227
6148 -227 -146 -75 -14 -86 339 223 256 213 378 -58 341 186 -132 -3 15 -114 -230 105 -346 -3 83 -14 165
6171 165 124 59 75 195 -184 -125 -31 -102 157 -147 63 49 212 -71 17 156 329 417 -71 3 -59 -99 8 -268
6195 -268 -503 -547 -197 -238 249 100 306 663 843 618 434 448 196 130 -58 -402 -438 -833 -449 -419 -609 -234
$$ packed form
6033e7L2J9J0q8L72R6k33k02k03J40j56L76m96R0J61K48J00N03q1q6j23k47l25
6056a50M8l40l95K19K84p37N00J12j2M93J98J59L8P33j11l01l99j98l92O1j10
6077c00j66M1j16q0M97J36j50L82j50K35L37m67q3J19j86o3j80Km55J2L83J56
6099i6M33k6n13L91K28l47lm66m7J80NO7j85j9L2M48L78N4l16J5J90J14j6m77
6123B4m41ON0o3k6o7j44O99P0l41L98Q6R4P6J89n9l27k00k66J12J46n12J0P5J84
6148b27Q1P1O1p2M25j16L3m3J65m36L99j55l18J29J8j29j16L35m51L43Q6r7J79
6171A65m1o5J6J20l79N9R4p1K59l04K10j4J63k83Q8J39J73Q8m88P4o2m0J07k76
6195b68k35m4L50m1M87j49K06L57J80k25j84J4k52o6j88l44l6l95L84L0j90L75
$$ plain form
6217 -234 23 211 463 388 309 346 504 489 -175 92 -55 -52 -45 -277 -503 -180 -161 -138 11 195 278 17 163 321
6241 321 13 -220 -408 -218 43 -71 -412 201 55 339 356 240 412 380 393 252 75 45 -183 -423 -540
6262 -540 -402 -540 -197 -455 62 163 235 494 400 330 490 514 116 -32 -85 -143 -306 -408 -533 -614 -437 -69
6284 -69 3 162 170 161 69 568 83 474 37 -3 276 -53 -454 -19 -249 127 82 524 -65 202 -63 114 303
6307 303 -187 -34 -573 -516 -388 -629 -124 -203 -304 220 293 247 270 359 301 275 265 -64 -173 -264 -423 -144 -301
6330 -301 -259 -549 44 338 261 366 497 72 594 337 307 314 -82 -49 124 -36 -328 -216 -177 -335 -9 -114
6352 -114 -351 -73 136 -144 264 -162 -234 -356 -160 15 -138 -37 -183 0 -94 32 130 -23 -61 222 184 3
6374 3 215 193 -102 117 -169 -9 -149 -203 -18 15 44 197 41 101 290 -238 -72 66 85 -32 56 15 -73 -235
$$ packed form
6217b34K57J88K52p5p9L7J58j5o64K67j47LPk32k26L23J9K3J49J84Q3k61J46J58
6241C21l08k33j88J90K61j14l41O13j46K84J7j16J72l2J3j41j77l0k28k40j17
6262e40J38j38L43k58N17J01P2K59r4p0J60K4l98j48n3n8j63j02j25q1J77L68
6284f9P2J59Qrr2M99m85L91m37m0K79l29m01M35k30L76m5M42n89K67k65J77J89
6307C03m90J53n39N7J28k41N05p9j01N24P3m6K3Q9n8k6j0l29j09r1j59K79j57
6330c01M2k90N93K94p7J05J31m25N22k57l0Pl96L3J73j60k92J12L9j58L26j05
6352a14k37K78K09k80M08m26p2j22J96J75j53J01j46J83r4J26R8j53l8K83l8j81
6374CK12k2k95K19k86J60j40n4J85L3K9J53j56O0J89n28J66J38J9j17Q8m1q8j62
$$ plain form
6398 -235 -178 141 -71 200 -38 51 145 156 44 162 152 175 47 57 353 -123 -153 -59 -187 -285 -9 46 105 267
6422 267 32 -62 435 363 41 -164 56 -89 101 -286 -439 -78 -296 -17 -125 316 270 272 334 290 196 326 308
6445 308 -203 -78 53 -523 -230 -340 -58 288 -34 -226 152 186 202 359 -24 172 28 -145 -23 -236 -2
6466 -2 -310 -311 158 48 218 272 656 299 201 249 86 -22 -214 -337 -66 -208 -468 -378 14 8 295 190 -168
6489 -168 39 401 360 419 272 -115 74 35 -13 -230 -373 -296 -161 -133 133 12 -125 202 196 172 92 -83 -76 -42
6513 -42 -489 -353 -379 -412 -303 -66 -37 82 176 300 387 804 200 104 -141 -140 -96 -317 -140 -373 -225 -264 -443 -36
6537 -36 -72 45 203 505 269 182 177 -75 188 -91 -103 61 -361 -3 -66 224 -158 -128 295 167 251 381 -48
6560 -48 -342 33 89 -312 274 -517 -183 -23 -5 -24 213 169 51 562 239 319 240 62 122 51 -59 -299 -299 150
$$ packed form
6398b35N7L19k12K71k38Q9R4J1j12J18j0K3j28J0K96m76l0R4j28r8K76N5N9J62
6422B67k35r4M97p2l22k05K20j45J90l87j53L61k18K79j08M41m6KO2m4r4J30j8
6445C08n11J25J31n76K93j10K82L46l22j92L78L4J6J57l83J96j44j73J22k13K34
6466bl08jM69j10J70N4L84l57r8M8j63j08j92j23K71j42k60R0L92oK87j05l58
6489a68K07L62m1N9j47l87J89l9m8k17j43P7J35K8K66j21j37L27ok4q0j75PL4
6513d2m47J36k6l3J09K37K9J19R4J24Q7M17o04r6k45JM4k21J77k33J48l9j79M07
6537c6l6J17J58L02k36q7nk52K63k79j2J64m22L58o3K90l82L0M23j28Q4J30m29
6560d8k94L75N6m01N86p91L34J60J8j9K37m4j18N11l23Q0p9j78O0p1j10k40%M49
$$ plain form
6584 150 -393 -334 -171 -83 -23 448 198 215 247 510 368 340 -10 -290 -143 -136 -297 -212 -327 -685 -179 -63 -54 -116
6608 -116 73 148 -25 127 141 6 -73 -153 -182 -207 66 -111 125 40 141 41 77 294 24 224 19 -131 -365
6631 -365 -345 -288 -323 -265 84 -272 -21 210 -39 190 426 427 88 375 197 -41 -205 -267 -324 -569 -505 -326 -592
6654 -592 83 -6 -123 223 241 253 537 73 227 283 -130 76 13 -342 -377 -173 -44 6 -88 48 131 318 84
6677 84 158 212 -184 -85 -229 -146 -140 -311 -477 -298 -21 44 -19 103 214 476 288 334 -10 -97 -39 -421 -283 -275 -414
6702 -414 -288 -267 161 128 191 43 215 446 378 100 83 -71 -230 -125 -446 -562 -404 -380 -126 278 305 211 202
6725 202 449 466 244 223 -49 -50 498 -67 -349 -357 -449 -481 -405 141 63 127 163 647 340 410 1 88 -36 -307 -269
6750 -269 -492 -546 -260 -115 -54 -7 -18 82 197 297 114 -163 17 65 -166 -206 -408 -309 -116 -89 -350 156 159
$$ packed form
6584A50n43N9J63Q8O0M71k50J7L2K63j42k8l50k80J47Pj61Q5j15l58N06J16Ro2
6608a16J89P5j73J52J4j35p9q0k9k5K73j77K36q5J01j00L6K17k70K00k05j50k34
6631c65K0N7l5N8L49l56K51K31k49K29K36Jl39K87j78k38j64o2n7k45O4J79k66
6654e92O75q9j17L46J8J2K84m64J54N6m13K06o3l55l5K04J29N0r4J36Q3J87k34
6677H4P4N4l96R9j44Q3Oj71j66J79K77O5o3J22J11K62j88M6l44q7N8l82J38Qj39
6702d14J26K1M28l3O3j48J72K31o8k78j7j54j59J05l21j16J58K4K54M04K7r4r
6725B02K47J7k22k1k72jN48n65k82qr2l2P6N46p8O4L6M84l07P0m09Q7j24k71L8
6750b69k23n4K86J45O1M7j1J00J15J00j83k77J80M8k31m0k02R9J93K7k61N06L
$$ plain form
6773 159 105 38 181 51 225 54 -88 90 68 -515 -329 -508 -427 -346 -202 -125 -402 264 462 437 336 501
6795 501 7 66 33 -142 -284 -197 -361 135 -82 -343 -217 -14 80 568 273 25 306 205 351 -141 -151 -66
6817 -66 -391 70 -246 -284 6 -212 -36 -118 -3 -134 44 25 66 -44 -47 -90 -32 110 -393 -388 0 -216 -62 -8
6841 -8 123 242 506 466 48 156 -92 -135 -340 -104 -65 146 -118 -65 1 16 92 -56 5 -73 -1 60 56 61 14 -326
6867 -326 -215 -265 -355 -122 -17 98 -35 -25 -114 -166 174 345 251 169 122 12 136 -23 -72 -179 116 -201 38
6890 38 213 -7 65 60 64 168 -28 269 -19 245 147 -37 -332 -521 0 -31 -355 -284 -352 -66 86 102 191 -190
6914 -190 -125 259 274 57 169 -349 89 -22 107 -72 -551 -202 -221 313 193 -3 76 101 237 -31 -180 -191
6936 -191 -136 -224 197 -85 -394 -311 265 197 117 315 48 -141 144 45 -11 -92 -199 -483 -219 -310 -292 -228 -401 144
$$ packed form
6773A59n4o7J43j30J74j71j42J78k2n83J86j79Q1Q1J44P7k77O66J98k5j01J65
6795E01m94N9l3j75j42Q7j64M96k17k61J26K03R4M88k95k48K81j01J46m92j0Q5
6817f6l25M61l16l8K90k18J76q2J15j31J78j9M1j10lm3N8J42n03NL88k16J54N4
6841hJ31J19K64m0m18J08k48m3k05K36L9K11k64N3O6J5P6j48O1p8P2O1mNm7l40
6867c26J11n0r0K33J05J15j33J0q9n2L40J71r4q2m7j10J24j59m9j07K95l17K39
6890C8J75k20P2nMJ04j96K97k88K64r8j84k95j89N21l1l24P1o8K86J52J6Q9l81
6914a90O5L84J5k17J12n18M38j11J29j79m79L49j9N34j20j96P9K5J36k68j49j1
6936a91N5q8M21k82l09Q3N76o8q0J98k67j89K85r9n6q1j07k84K64r1J8O4j73N45
$$ plain form
6960 144 465 413 352 265 379 252 410 -26 43 -118 -304 -400 -186 -236 -288 -199 -42 134 237 67 101 -46 286
6983 286 319 -163 -67 -159 -129 -214 -126 140 35 7 -26 147 302 171 389 229 154 -23 262 -373 -370 -188 -329 -268
7007 -268 -43 -196 -59 175 175 247 614 449 267 116 186 -155 -60 -138 -121 -588 -181 -136 165 214 -96 35 251
7030 251 253 337 84 79 -231 -244 -367 -153 -443 -308 -365 -29 -46 100 324 167 59 551 -1 229 68 9 78
7053 78 -52 -144 -267 -353 39 -130 -8 40 156 354 516 631 345 179 23 203 81 -351 -431 -329 -221 -157
7075 -157 -399 -310 -202 -186 199 54 272 283 132 284 131 264 -472 -188 -274 -216 203 -149 209 -101 38 274
7097 274 361 303 -12 70 191 124 -380 -288 -363 -300 -253 -361 67 -198 186 281 240 490 239 154 260 402 119 -403
7121 -403 -443 -439 -320 -66 43 -281 -296 39 244 233 467 135 240 245 312 -26 -131 -168 15 59 -84 -313 -308 -83
$$ packed form
6960A44L21n2o1q7J14j27J58m36O9j61j86r6K14n0n2Q9J57J76J03j70L4j47L32
6983B86L3m82R6r2L0q5Q8K66j05k8l3J73J55j31K18j60p5j77K85o35LJ82j41O1
7007b68K25j53J37K34%P2L67j65j82j51P0l41R5p8J7m67M07M5L01M9l10J31K16
7030B51KQ4k53nl10j3j23K14k90J35n7L36j7J46K24j57j08M92n52K30j61n9O9
7053G8j30r2j23q6L92j69J22M8J16J98J62J15k86j66j56J80j22m32q0J02J08O4
7075a57k42Q9J08J6L85j45K18J1j51J52j53J33p36K84q6N8M19l52L58l10J39K36
7097B74Q7n8l15Q2J21o7n04R2p5O3M7j08M28k65L84R5m1K50k51q5J06J42k83n22
7121d03m0MJ19K54J09l24j5L35K05j1K34l32J05NO7l38j05l7J83M4j43k29NK25
$$ plain form
7145 -83 210 283 168 135 46 276 177 124 -142 -381 -319 -277 -32 -33 -26 70 -177 225 436 422 201 324 42 318 157
7170 157 -1 -407 -231 -83 65 -95 -281 117 257 144 127 87 111 257 24 13 51 -301 -425 -188 -159 81
7192 81 -483 54 -2 -61 293 315 353 -118 111 -63 -195 -99 -389 -362 -367 -270 -185 -198 -5 -276 47 -52 368 253
7216 253 76 114 -121 -96 -61 -107 -289 -223 -102 -111 -171 37 109 -211 47 313 31 376 308 23 79 -81 85 -241
7240 -241 -505 -104 -220 23 137 311 43 -17 202 -51 -271 -270 -56 256 -430 -358 -293 -268 108 198 100 85 -167
7263 -167 278 435 111 117 252 38 -411 26 -38 -427 -300 -630 -320 -362 -156 -218 -247 332 14 580 79 362
7285 362 -40 325 92 -354 -67 -177 -54 -188 -4 -209 -226 4 -104 118 201 -113 39 95 335 351 -70
7306 -70 -329 -269 -85 -167 87 -15 -141 -98 37 217 -167 -19 -301 56 268 214 1 -109 -53 -151 -127 -84 -427
$$ packed form
7145h3K93P3j15l3q9K30r9n3k66k39O2M2K45jPR6k47M02K11j4k21J23k82K76j61
7170A57j58m06J76J48J48j60j86L98J40j13j7m0K4J46k33j1L8l52j24K37K9K40
7192H1n64N37n6n9L54K2L8m71K29j74j32R6k90K7nR7Q5j3J93k71L23r9M20j15
7216B53j77L8k35K5L5m6j82O6J21ro0K08P2l20K58K66k82L45o8k85N6j60J66l26
7240b41k64M01j16K43J14J74k68o0K19k53k20JK14L12o86P2O5K5L76R0r8j5k52
7263a67M45J57l24OJ35k14m49M37o4l89J27l30L10m2K06o2k9N79l18N66n01K83
7285C62m02L65k33m46K87j10J23j34J84k05j7K30j08K22Q3l14J52N6K40J6m21
7306g0k59O0J84q2K54j02j26M3J35J80l84J48k82L57K12n4k13j10N6r8K4M3l43
$$ plain form
7329 -427 -209 -56 186 -11 -118 32 154 324 44 261 -169 54 -148 148 -253 -295 -303 -239 -21 187 -69
7350 -69 105 -17 126 258 442 251 -166 40 -144 -377 -245 -457 -203 -2 4 -24 -151 184 116 176 213 24
7372 24 430 118 164 -406 -318 -431 -357 -218 -129 -319 -117 43 249 279 132 98 681 519 56 14 7 -480 -452 -330
7396 -330 -322 -236 -49 30 125 306 222 101 208 -82 32 42 12 -135 -384 -226 -221 -86 -268 4 -223 249 146
7419 146 455 113 92 213 97 81 -123 -149 15 -309 -460 -163 -108 128 -24 381 9 423 139 45 -50 -54 156
7442 156 -246 -374 -324 -260 -470 -100 0 157 358 294 111 135 119 168 20 -246 -264 -478 -188 -224 -110 -309 -383
7465 -383 -12 296 379 518 295 11 -10 114 19 -400 -233 -221 -472 -38 -271 -169 -306 211 512 644 329
7486 329 377 121 230 321 -9 -427 -234 -80 -252 21 -6 -123 221 283 307 -19 132 -14 243 -62 -124 -411
$$ packed form
7329d27K18J53K42j97j07J50J22J70k80K17m30K23k02K96m01m2qO4K18K08k56
7350f9J74j22J43J32J84j91m17K06j84k33J32k12K54K01Ok8j27L35o8O0L7j89
7372B4M06l12M6n70Q8j13P4J39Q9j90K02J60K06L0j47l4N83j62m63m2pm87K8J22
7396c30QQ6J87P9R5J81q4j21J07k90J14J0l0j47k49J58NJ35j82K72k27M72j03
7419A46L09l42k1J21j16j6k04k6J64l24j51K97N5K36j52M05l72M14k84r4r5mK10
7442A56m02j28N0O4k10L70J00J57K01o4j83K4j6M9j48k66j8k14K90l6J14j99p4
7465c83L71L08Q3J39k23k84k1J24r5m19J67J2k51M34k33J02j37N17L01J32l15
7486C29M8k56J09R1l30m18J93J54j72K73k7j17L44O2K4l26J51j46K57l05o2k87
$$ plain form
7508 -411 -287 -421 -515 -233 -126 -119 -306 456 35 236 278 206 -82 88 165 -218 -325 -524 -306 -473 -111 -205
7530 -205 -77 212 268 438 354 156 369 514 219 277 -170 -366 -130 -19 -163 -214 -449 -256 -537 -133 -168 -80
7552 -80 -57 -51 191 338 132 33 142 71 78 2 65 51 303 78 108 -130 148 224 107 -77 116 -36 -145 -147 -174
7577 -174 139 -226 -70 -58 -37 1 237 79 146 214 249 38 -45 -116 -200 -249 -427 -2 -191 14 -150 -213 12 10
7601 10 -107 393 168 181 267 302 103 13 -78 77 -172 74 -161 -156 -140 -385 -105 -111 253 220 61 -58 244 448
7625 448 98 68 14 -50 -29 -62 -20 -57 100 -230 100 -14 256 -5 -5 80 255 213 57 -84 -64 114 -175 -18
7649 -18 -397 -180 -193 214 -198 -133 -21 419 497 22 93 -208 -38 -110 -15 41 -178 -201 200 8 145 40 -175
7672 -175 86 182 81 -145 72 -265 35 -155 -12 -191 -238 -223 -86 318 64 -49 100 188 243 -77 -46 -42 -78
$$ packed form
7508d11J24j34r4K82J07Pj87P62m21K01M2p2k88J70P7l83j07j99K18j67L62r4
7530b05J28K89N6J70q4j98K13J45k95N8m47j96K36J11j44n1k35J93k81M04l5Q8
7552h0K3OK42J47k06r9J09p1Pp6O3j4K52k25L0k38K78P6j17j84J93j52j09kk7
7577a74L13l65J56J2K1L8K36j58O7O8L5k11q3p1q4m9j78M25j89K05j64o3K25k
7601A0j17N00k25J3Q6L5j99r0r1J55k49K46k35NJ6k45K80oL64l3j59j19L02K04
7625D48l50l0n4o4K1l3M2l7J57l30L30j14K70k61%Q5J75m2j56j41K0J78k89J57
7649a8l79K17j3M07m12O5J12M40P8m75P1l01J70p2R5N6k19k3M01j92J37j05k15
7672a75K61R6j01k26K17l37L00j90J43j79m7J5J37M04k54j13J49Q8N5l20L1Ml6
$$ plain form
7695 -78 33 -217 -404 -286 -58 -23 -251 249 251 -39 344 513 220 242 54 26 16 -51 -121 -239 -308 -263 -119 -104
7719 -104 -218 1 -289 132 197 172 71 54 11 140 57 23 -329 -334 95 -12 -37 57 320 447 147 161 -19 -94
7743 -94 -1 118 46 -354 -87 -184 -43 -155 81 -138 309 -53 -180 383 216 24 -71 196 105 -18 -175 -165
7765 -165 -482 -20 74 -197 -87 -224 -78 137 383 -123 69 82 -119 242 -28 106 -370 -252 -11 -82 -208
7786 -208 -118 -33 175 285 19 234 210 197 12 180 -209 -188 -289 -235 -368 -450 -87 -116 -151 173 67 420 272
7809 272 469 118 40 215 -296 -33 3 -230 -343 -168 -127 -247 102 158 -225 201 192 417 288 -85 -46 -296
7831 -296 -8 -384 -198 -195 -163 65 106 21 -89 198 395 327 169 -8 -33 -279 -44 -250 -310 -351 -290 -216 49 19
7855 19 -27 122 193 271 342 1 105 -51 -168 -198 -116 -104 -594 -122 15 192 180 132 169 271 629 146 132 -248
$$ packed form
7695g8J11k50j87J18K28L5k28N00Kk90L83J69k93K2j88k8j0o7p0j18o9M5J44J5
7719a04j14K19k90M21O5k5j01j7m3J29q3l4l52nM29j07k5R4K63J27l00J4j80p5
7743i4R3J19p2m00K67r7J41j12K36k19M47l62j27N63j67j92r5K67r1j23j57J0
7765a65l17M62R4k71J10j37J46K15K46n06J92J3k01L61k70J34m76J18K41p1j26
7786b08R0Q5K08J10k66K15k4j3j85J68l89K1j01N4j33q2L63k9l5L24j06L53j48
7809B72J97l51p8J75n11K63L6k33j13J75M1j20L49N6l83M26rK25j29l73L9k50
7831b96K88l76J86LL2K28M1q5j10K87J97o8j58j77k5k46K35k06o0m1O1P4K65l0
7855A9m6J49P1P8P1l41J04j56j17l0Q2J2m90M72J37J77j2m8L7J02L58m83j4l80
$$ plain form
7879 -248 -71 -190 -187 -397 -321 -279 -272 176 291 22 335 209 182 524 -47 -33 22 297 -12 -25 -38 -373 -396 -13
7903 -13 122 49 -1 -30 120 -84 176 -1 -102 -525 81 96 -199 -313 24 -61 297 367 322 85 56 251 97
7926 97 159 -69 -481 -297 95 -211 -472 -408 -231 -58 218 45 -24 180 198 128 339 -249 23 -132 -77 -168 -187
7949 -187 -168 -335 -123 87 39 87 -13 -34 17 227 52 233 126 13 295 30 64 -62 -205 28 -74 2
7971 2 -184 -104 172 23 -2 -140 -78 221 76 252 92 -74 113 17 -163 -113 21 -36 -169 17 67 48 -9 -64
7995 -64 176 284 97 -129 -129 -40 -238 172 -24 -62 -36 47 208 93 155 65 470 210 396 -41 13 129 -2
8018 -2 -226 -424 -47 -355 -379 -142 27 -32 142 230 226 -63 42 -26 -57 143 -187 97 -99 -97 20 88 -171 -147
8042 -147 145 100 144 146 71 178 -103 51 12 -41 -407 -174 -152 -96 -46 -244 -69 390 -4 166 151 139 329 -108
$$ packed form
7879b48J77j19Lk10P6M2PM48J15k69L13j26k7L42n71J4N5K75l09j3j3l35k3L83
7903a3J35p3n0k9J50k04K60j77j01m23O06J5k95j14L37q5L58P0m5k37k9J95j54
7926I7O2k28m12J84L92l06k61O4J77J73K76j73o9K04J8p0K11n88K72j55N5r1j9
7949a87J9j67K12K10m8M8j00k1N1K10j75J81j07j13K82k65L4j26j43K33j02P6
7971Bj86Q0K76j49k5j38O2K99j45J76j60j66J87r6j80N0J34n7j33J86N0j9n7n5
7995f4K40J08j87k26%Q9j98M10j96l8K6Q3J61j15O2r0M05k60J86m37N4J16j31
8018bk24j98L77l08k4K37J69n9J74Q8mk89J05o8l1K00l30K84j96KJ17O8k59K4
8042a47K92m5M4Kp5J07k81J54l9n3l66K33K2N6N0j98J75M59l94J70j5j2J90m37
$$ plain form
8066 -108 33 -180 -294 -107 -203 -181 -389 -165 -166 309 204 154 182 73 1 100 61 24 -268 -348 -175 -173 293 -268
8090 -268 -125 -29 592 199 367 472 7 -236 -126 -186 -450 -479 -285 172 -174 -298 169 -84 -24 311 493
8111 493 273 336 316 280 433 179 -85 -462 -356 -267 138 -288 81 -265 -334 236 246 118 428 69 177 156
8133 156 57 93 -312 125 90 -209 112 -204 -30 268 46 -46 -20 -34 -138 -93 -186 -235 103 -338 -191 305 129
8156 129 174 -101 -85 214 345 280 462 -56 -13 9 -162 -291 -396 -226 -419 -54 99 -89 65 17 -105 116
8178 116 145 224 404 253 0 66 -198 -102 -303 -141 -212 -196 -201
$$ packed form
8066a08J41k13j14J87r6K2k08K24jM75j05n0K8j09p2R9l9l7k92q0J73KM66n61
8090b68J43R6O21l93J68J05m65k43J10o0k64k9J94M57l46j24M67k53O0L35J82
8111D93k20O3k0l6J53k54k64l77J06Q9M05m26L69l46o9N70J0j28L10l59J08k1
8133A56r9L6m05M37l5k99L21l16J74K98k22r2K6j4j04M5r3m9L38m41J47M96j76
8156A29M5k75J6K99J31o5J82n18M3K2j71j29j05J70j93L65J53j88J54m8j22K21
8178A16K9P9J80j51k53O6k64R6k01J62p1J6n
8191b01
$$ Imaginary data points
##PAGE= N=2
##DATA TABLE= (X++(I..I)), XYDATA
$$ plain form
0 0 0 0 0 0 0 0 0 0 0 0 0 -8 8 -8 8 -16 16 -24 30 -32 40 -48 56 -66 80 -92 108 -124 143 -164 188 -214 242
33 242 -277 311 -351 394 -442 492 -549 610 -679 753 -832 921 -1017 1125 -1237 1365 -1504
50 -1504 1656 -1825 2011 -2221 2454 -2718 3018 -3364 3767 -4244 4816 -5522 6415 -7587 9203
65 9203 -11584 15460 -22853 42242 -210511 -483611 -245972 -42026 189027 303376 387866
76 387866 389652 367158 255730 102669 -82598 -197125 -210559 -132484 -94586 -116721 -164108
87 -164108 -181375 -186411 -175334 -174636 -157715 -86293 59757 219980 324644 315958 239995 183667
99 183667 171224 150903 113591 75334 54538 56282 55998 -3129 -128318 -267730 -345404 -320817
111 -320817 -228069 -139928 -64284 26960 114327 159501 146506 75877 -9809 -39042 4990 75783
$$ packed form
0@%%%%%%%%%%%qJ6j6J6k4L2m0N4o2P2q8J04j22J46j72K00k32K67l07L52m02M56
33B42n19N88o62P45q36R34j041J159j289J432j585J753j938K142k362K602k869
50a504L160l481L836m232M675n172N736o382P131q011R060j0338J1937j4002J6790
65I203k0787K7044l8313O5095k52753k73100K37639K03946K31053J14349Q4490
76C87866J786k2494j11428j53061j85267j14527j3434P8075L7898k2135m7387
87a64108j7267n036J1077O98J6921P1422J46050J60223J04664q686p5963n6328
99A83667j2443k0321l7312l8257k0796J744k84n9127j25189j39412p7674K4587
111c20817R2748Q8141P5644R1244Q7367M5174j2995p0629q5686k9233M4032P0793
$$ plain form
123 75783 114459 95018 46839 11555 -24905 -87786 -154277 -187531 -165141 -80245 26976 88591
135 88591 88305 55423 23069 11307 8874 -1396 6921 54042 111406 146571 139867 76790 -13101
148 -13101 -75073 -92824 -78675 -48251 -16314 13018 39563 34436 -15953 -83799 -144350 -175057
160 -175057 -148497 -72681 11749 82815 128395 138009 120547 86733 46038 20926 16272 18270
172 18270 25385 31565 8343 -45808 -106591 -157910 -176561 -145109 -78134 1001 78214 133434
184 133434 158826 156174 111395 32683 -35235 -66334 -61795 -31500 -5664 -6258 -17794 -22776 -25871
197 -25871 -29942 -38066 -41130 -9843 54366 104799 110009 69359 481 -57495 -80871 -87511 -89122
210 -89122 -71213 -24785 45620 109799 121073 76559 24260 -3257 -3738 5187 -5906 -37557 -52585
$$ packed form
123G5783L8676j9441m8179l5284l6460o2881o6491l3254K2390Q4896J07221O1615
135H8591k86l2882l2354j1762k433j0270Q317M7121N7364L5165o704o3077q9891
148a3101o1972j7751J4149L0424L1937K9332K6545n127n0389o7846o0551l0707
160a75057K6560P5816Q4430P1066M5580R614j7462l3814m0695k5112m654J998
172A8270P115O180k3222n4151o0783n1319j8651L1452O6975P9135P7213N5220
184A33434K5392k652m4779p8712o7918l1099M539L0295K5836n94j1536m982l095
197b5871m071q124l064L1287O4209N0433N210m0650o8878n7976k3376o640j611
210h9122J7909M6428P0405O4179J1274m4514n2299k7517m81Q925j1093l1651j5028
$$ plain form
223 -52585 -38686 -25350 -38121 -77211 -107755 -81193 -318 78436 117468 116655 95337 82421
235 82421 70690 23717 -55737 -118317 -126438 -78590 -16859 5824 -8318 -14365 8086 43801
247 43801 64732 49925 22316 27345 60698 74360 37480 -41219 -113133 -128211 -95513 -60718
259 -60718 -39459 -18831 19294 80532 129172 119971 64359 12685 -6312 1949 4983 -24292 -63944
272 -63944 -74797 -58285 -39572 -38854 -57906 -60501 -12353 60834 108257 111218 82776 53391 44020
285 44020 30753 -12354 -66248 -97619 -89522 -48808 -16311 -21617 -39149 -32173 -321 36882 53649
298 53649 44424 39568 60062 80867 71592 26693 -36100 -75058 -69637 -49692 -46177 -51500 -46748
311 -46748 -17358 28855 57253 49267 30600 26131 39064 55690 48225 10200 -25419 -39375 -42632
$$ packed form
223e2585J3899J3336j2771l9090l0544K6562Q0875P8754L9032q13k1318j2916
235H2421j1731m6973p9454o2580q121M7848O1731K2683j4142o047K2451L5715
247D3801K0931j4807k7609N029L3353J3662l6880p8699p1914j5078L2698L4795
259f0718K1259K0628L8125O1238M8640r201n5612n1674j8997Q261L034k9275l9652
272f3944j0853J6512J8713P18j9052k595M8148P3187M7423K961k8442k9385r371
285D4020j3267m3107n3894l1371Q097M0714L2497n306j7532O976L1852L7203J6767
298E3649r225m856K0494K0805r275m4899o2793l8958N421J9945L515n323M752
311d6748K9390M6213K8398p986j8667m469J2933J6626p465l8025l5619j3956l257
$$ plain form
324 -42632 -49257 -65159 -81176 -68969 -25002 19999 45560 51848 49210 54763 68208 63160 33125
337 33125 -91 -22453 -29268 -27747 -38754 -61565 -70900 -59041 -34301 -4965 14513 25428 45136
350 45136 69239 77782 67382 42641 12110 -6219 -14166 -28931 -47972 -60016 -62365 -49687 -28085
363 -28085 -14543 -5297 10466 29630 48139 61583 58405 42325 26810 8522 -13481 -30840
375 -30840 -45213 -55704 -53580 -43714 -31131 -10719 12480 29973 44314 53117 52060 48935 41696
388 41696 19942 -6846 -28631 -45403 -52907 -54225 -58860 -57110 -37165 -6012 26183 49540 54673
401 54673 53382 62339 69267 57559 26827 -14622 -47082 -54125 -50118 -55686 -66091 -67553 -47333
414 -47333 -4251 33978 43861 39708 42343 54653 65997 56211 17772 -22889 -36651 -30074 -23142
$$ packed form
324d2632o625j5902j6017J2207M3967M5001K5561O288k638N553J3445n048l0035
337C3125l3216k2362o815J521j1007k2811r335J1859K4740K9336J9478J0915J9708
350D5136K4103Q543j0400k4741l0531j8329p947j4765j9041j2044k349J2678K1602
363b8085J3542R246J5763J9164J8509J3444l178j6080j5515j8288k2003j7359
375c0840j4373j0491K124R866J2583K0412K3199J7493J4341Q803j057l125p239
388D1696k1754k6788k1785j6772p504j318m635J750J9945L1153L2195K3357N133
401E4673j291Q957O928j1708l0732m1449l2460p043M007n568j0405j462K0220
414d7333M3082L8229R883m153K635J2310J1344r786l8439m0661j3762O577O932
$$ plain form
427 -23142 -31427 -51800 -53586 -19735 21284 38987 30374 12203 9693 28443 38482 15322 -24330
440 -24330 -51508 -46848 -18599 -3542 -14891 -23864 -4726 33648 66509 67961 37046 11236 12441
453 12441 22119 11570 -27142 -73244 -84895 -56108 -26265 -21054 -30528 -29399 3409 57614 87994
466 87994 74131 42410 25900 33362 42257 16779 -36351 -73771 -71490 -45193 -22484 -24350 -41470
479 -41470 -34047 6880 47399 56525 33358 5910 8032 32233 37682 12655 -23068 -43212 -29168
492 -29168 3816 16588 1723 -9873 2403 32045 51553 36157 -1778 -26820 -29132 -22805
504 -22805 -24011 -41748 -61544 -52243 -17873 10287 17262 12185 14267 37835 65195 69876 50483
517 50483 22601 220 -7743 -14463 -38671 -69459 -78456 -60684 -30147 -4958 4240 8024 22049
$$ packed form
427b3142q285k0373j786L3851M1019J7703q613j8171k510J8750J0039k3160l9652
440b4330k7178M660K8249J5057j1349q973J9138L8374L2861J452l0915k5810J205
453A2441R678j0549l8712m6102j1651K8787K9843N211r474J129L2808N4205L0380
466H7994j3863l1721j6510P462Q895k5478n3130l7420K281K6297K2709j866j7120
479d1470P423M0927M0519R126k3167k7448K122K4201N449k5027l5723k0144J4044
492b9168L2984J2772j4865j1596J2276K9642J9508j5396l7935k5042k312O327
504b2805j206j7737j9796R301L4370K8160O975n077K082K3568K7360M681j9393
517E0483k7882k2381p963o720k4208l0788q997J7772L0537K5189R198L784J4025
$$ plain form
530 22049 40730 52520 53481 41692 29932 32931 37784 24601 -800 -25740 -39967 -39489 -34194
543 -34194 -33908 -31989 -23888 -11821 2394 9442 -1343 -14617 -15617 -8371 137 9022 14494 18065
557 18065 21430 17777 9026 1390 -6595 -9523 -1844 5809 7348 10702 11990 4753 -5072 -14094 -17794
572 -17794 -11922 -2164 3912 10538 13619 10247 5635 -579 -13663 -19598 -8599 10656 26954 33324
586 33324 28345 21372 16524 5546 -11998 -29590 -43912 -45547 -30877 -20658 -26606 -36654 -38735
599 -38735 -29728 -11113 6742 21577 42297 68172 87348 91491 70563 30553 -2691 -18189
611 -18189 -29534 -43184 -55864 -60940 -50833 -32476 -24778 -29657 -32457 -21848 7972 46457 65963
624 65963 62577 56112 51174 40712 18478 -16778 -47325 -51127 -30296 -5966 5205 -2230 -14134
$$ packed form
530B2049J8681J1790R61j1789j1760K999M853j3183k5401k4940j4227M78N295
543c4194K86J919Q101J2067J4215P048j0785j3274j000P246Q508Q885N472L571
557A8065L365l653q751p636p985k928P679P653J539L354J288p237r825r022l700
572a7794N872R758O076O626L081l372m612o214j3084n935J0999J9255J6298O370
586C3324m979o973m848j0978j7544j7592j4322j635J4670J0219n948j0048k081
599c8735R007J8615J7855J4835K0720K5875J9176M143k0928m0010l3244j5498
611a8189j1345j3650j2680n076J0107J8357P698m879k800J0609K9820L8485J9506
624F5963l386o465m938j0462k2234l5256l0547l802K0831K4330J1171p435j1904
$$ plain form
637 -14134 -9758 2116 -1423 -19436 -32526 -25917 1518 26483 23187 -1646 -21830 -20914 708
650 708 21852 24752 23534 40194 65849 75122 51671 1120 -47169 -65521 -60187 -55091 -59068 -65285
664 -65285 -55130 -19797 13247 17805 6197 5965 30028 71068 98595 89600 58661 30208 12300
677 12300 -3869 -34428 -77571 -101419 -82784 -42012 -9491 -51 -8483 -11023 5576 24800 27065
690 27065 16437 10707 26526 56634 65622 36859 -4705 -30115 -29317 -10822 305 -5148 -8819
703 -8819 3653 21490 24501 -2940 -46694 -68922 -54474 -25615 -4869 2271 2287 10724 30632
716 30632 39130 25256 2376 -7686 7159 33397 40005 18374 -10816 -32264 -41957 -43442 -48420
729 -48420 -55285 -44661 -9274 33127 61591 62812 44732 31895 30617 29781 25946 19865 12267 11046
$$ packed form
637a4134M376J1874l539j8013j3090O609K7435K4965l296k4833k0184R16K1622
650G08K1144K900j218J6660K5655R273k3451n0551m8289j8352N334N096l977o217
664f5285J0155L5333L3044M558j1608k32K4063M1040K7527q995l0939k8453j7908
677A2300j6169l0559m3143k3848J8635M0772L2521R440q432k540J6599J9224K265
690B7065j0628n730J5819L0108Q988k8763m1564k5410P98J8495J1127n453l671
703h819J2472J7837L011k7441m3754k2228J4448K8859K0746P140J6Q437J9908
716C0632Q498j3874k2880j0062J4845K6238O608k1631k9190k1448r693j485m978
729d8420o865J0624L5387M2401K8464J221j8080j2837j278q36l835o081p598j221
$$ plain form
743 11046 13426 3461 -21082 -47332 -61799 -55987 -36266 -17924 -4811 7336 14421 12931 7045
756 7045 -6371 -24154 -29787 -20929 -5652 9550 16495 14130 7800 -1523 -12187 -14977 -9483 -2723
770 -2723 8587 23556 31804 31058 24581 11029 -2699 -8243 -4408 8822 24682 32150 31910 31233
784 31233 23722 6450 -11698 -26841 -33105 -24494 -9593 -3346 -8956 -22636 -34995 -35401 -33152 -37115
798 -37115 -36062 -22100 297 24799 37786 28418 8131 -3899 -2629 5319 8052 1862 574
811 574 12550 23121 19299 2340 -19272 -27513 -9953 16074 29584 29267 25995 30519 40216 34800
825 34800 7450 -21296 -33079 -24799 -5608 1794 -12731 -31007 -33185 -23508 -16541 -20093 -28681
838 -28681 -21247 6442 31677 37721 22782 -1749 -14459 -7889 -1929 -9378 -18908 -15600 3778
$$ packed form
743A1046K380r965k4543k6250j4467N812J9721J8342J3113J2147P085j490n886
756G045j3416j7783n633Q858J5277J5202O945k365o330r323j0664k790N494O760
770b723J1310J4969Q248p46o477j3552j3728n544L835J3230J5860P468k40o77
784C1233p511j7272j8148j5143o264Q611J4901O247n610j3680j2359m06K249l963
798c7115J053J3962K2397K4502J2987r368k0287j2030J270P948K733o190j288
811E74J1976J0571l822j6959k1612q241J7560K6027J3510l17l272M524R697n416
825C4800k7350k8746j1783Q280J9191P402j4525j8276k178R677O967l552q588
838b8681P434K7689K5235O044j4939k4531j2710O570N960p449r530L308J9378
$$ plain form
851 3778 26736 30000 11032 -6555 -7624 5820 22263 22463 7294 -471 6586 12247 3425 -19084
865 -19084 -39363 -35473 -11339 9567 14807 9472 5716 13783 25669 19142 -4644 -22366 -20296
878 -20296 -3370 11144 4248 -16004 -26250 -18911 -4691 3422 -1954 -8241 4710 30140 43470
891 43470 34487 10618 -10192 -12726 -6210 -8369 -19852 -28069 -23009 -4619 10692 4967 -10982
904 -10982 -15679 -3632 14917 26155 19080 6343 3740 8746 8655 -3113 -22738 -33136 -20976
917 -20976 520 11726 11848 7611 7177 15899 21361 12899 -602 -5975 -1102 9222 11293 -2897
931 -2897 -17808 -19757 -12404 -4534 -2603 -7568 -7831 4308 16308 16743 6500 -9596 -17563 -11623
945 -11623 -5440 -6904 -10310 -9879 -4677 6536 12137 6544 1323 2897 9265 16628 18162 9906 2370
$$ packed form
851C778K2958L264j8968j7587j069J3444J6443K00j5169p765P057N661q822k2509
865a9084k0279L890K4134K0906N240n335l756Q067J1886o527k3786j7722K070
878b0296J6926J4514o896k0252j0246P339J4220Q113n376o287J2951K5430J3330
891D3470q983k3869k0810k534O516k159j1483q217N060J8390J5311n725j5949
904a0982m697J2047J8549J1238p075j2737k603N006r1j1768j9625j0398J2160
917b0976K1496J1206J22m237m34Q722N462q462j3501n373M873J0324K071j4190
931b897j4911j949P353P870J931m965k63J2139J2000M35j0243j6096p967N940
945a1623O183j464l406M31N202J1213N601n593n221J574O368P363J534q256p536
$$ plain form
960 2370 1159 20 -2603 -7235 -14512 -16189 -8569 -412 3797 5958 3487 818 3222 4942 5001 5823
976 5823 5189 2744 3361 3063 104 -2640 -7414 -14090 -14606 -10586 -7129 -4958 -4073 -6292 -3363 3054
992 3054 6135 5485 3932 3525 9219 17937 17182 8046 -76 -3852 -1065 3604 -28 -9597 -12910 -6965
1008 -6965 1519 6536 -618 -12653 -13565 -4535 2793 3287 -3381 -9636 -3106 10509 16016 10703 2503
1023 2503 437 10796 21906 16976 249 -11983 -13216 -6574 -3170 -14928 -30834 -32301 -17084
1036 -17084 1451 10332 3635 -2889 8387 27971 37413 30287 11764 -345 4839 13141 5879
1049 5879 -14784 -33068 -34648 -18212 -4363 -9270 -20375 -19240 -2203 20030 29534 17135 1234
1062 1234 2220 15942 25639 17836 -4635 -19508 -11872 2784 6132 -3912 -17840 -19726 -3125
$$ packed form
960B370j211j139k623m632p277j677P620Q157M209K161k471k669K404J720N9Q22
976E823o34k445O17k98k959k744m774o676n16M020L457K171Q85k219K929O417
992C054L081o50j553m07N694Q718p55r136q122l776K787M669l632r569l313N945
1008f965Q484N017p154j2035r12R030P328M94o668o255O530J3615N507n313q200
1023B503k066J0359J1110m930j6727j2232j233O642L404j1758j5906j467J5217
1036a7084J8535Q881o697o524J1276J9584R442p126j8523j2109N184Q302p262
1049E879k0663j8284j580J6436J3849m907j1105J135J7037K2233R504j2399j5901
1062A234R86J3722R697p803k2471j4873P636J4656L348j0044j3928j886J6601
$$ plain form
1075 -3125 12694 9565 -4954 -14878 -9791 5604 11405 -313 -13420 -12551 508 15762 18871
1088 18871 6671 -2460 5255 19044 22868 11398 -8471 -17345 -11022 -5176 -10005 -21118 -29629
1101 -29629 -24355 -5810 7790 6589 3232 8289 21153 33550 31433 15824 3701 496 1081
1114 1081 -878 -12126 -28774 -33103 -21464 -8744 -4224 -5872 -6589 2197 17581 24676 21177 12864
1128 12864 5306 4831 8086 3214 -9503 -16391 -14729 -8197 -2053 -2072 -5268 -2389 4574 9898 11442
1143 11442 6404 -2506 -3870 -896 -2381 -6684 -10117 -10940 -5856 1407 4585 6088 7606 8637 10240
1158 10240 11945 7883 1654 -71 -2074 -6624 -10298 -12619 -12654 -8476 -5413 -3099 1047 4513 7103
1173 7103 11555 13646 9961 7380 7788 5161 595 -3586 -7678 -8034 -7221 -9744 -10632 -8998 -8096 -4237
$$ packed form
1075c125J5819l129j4519r924N087J5395N801j1718j3107Q69J3059J5254L109
1088A8871j2200r131P715J3789L824j1470j9869q874O323N846m829j1113q511
1101b9629N274J8545J3600j201l357N057J2864J2397k117j5609j2123l205N85
1114A081j959j1248j6648m329J1639J2720M520j648p17Q786J5384P095l499q313
1128A2864p558m75L255m872j2717o888J662O532O144j9l196K879O963N324J544
1143A1442n038q910j364K974j485m303l433q23N084P263L178J503J518J031J603
1158A0240J705m062o229j725k003m550l674k321l5M178L063K314M146L466K590
1173G103M452K091l685k581M08k627m566m181m092l56Q13k523q88J634R02L859
$$ plain form
1189 -4237 1252 841 -2131 201 3915 6059 4899 1016 -1145 1497 3718 2637 2186 11 -785 5326
1205 5326 9911 5941 701 830 5033 8984 6796 -1775 -6973 -5583 -1928 863 -1658 -11023 -13878
1220 -13878 -3923 5026 5629 615 -4432 -971 8006 11051 4480 -5583 -12180 -9960 -1991 -3187 -15815
1235 -15815 -23424 -17934 -6090 3114 2954 -2949 -801 12094 25750 30829 22751 9765 8849 18726
1249 18726 21166 10023 -5077 -14473 -11647 -2694 -1792 -11749 -19577 -17447 -4458 8760 6245 -6260
1263 -6260 -8920 34 9366 9998 -1277 -15645 -16251 -4345 4489 1708 -10424 -17883 -7585 9174
1277 9174 12244 2319 -7579 -8352 2281 13289 9687 -4692 -11435 -4688 10772 19541 11793 1465
1291 1465 5557 18972 27921 24205 8252 -6522 -7217 712 1038 -11996 -29103 -35080 -23156 -7792
$$ packed form
1189d237N489m11k972K332L714K144j160l883k161K642K221j081m51k175p96O111
1205E326M585l970n240J29M203L951k188q571n198J390L655K791k521r365k855
1220a3878R955Q949O03n014n047L461Q977L045o571j0063o597K220P969j196j2628
1235a5815p609N490J1844R204j60n903K148J2895J3656N079q078j2986r16R877
1249A8726K440j1143j5100r396K826Q953R02r957p828K130J2989J3218k515j2505
1263f260k660Q954R332O32j1275j4368o06J1906Q834k781j2132p459J0298J6759
1277I174L070r925r898p73J0633J1008l602j4379o743O747J5460Q769p748j0328
1291A465M092J3415Q949l716j5953j4774o95P929L26j3034j7107n977J1924J5364
$$ plain form
1305 -7792 -5568 -10393 -11512 -4101 12122 24805 21196 8560 1809 4165 9344 5611 -9267 -21446
1319 -21446 -20270 -11801 -4734 -2235 -6136 -6340 5634 19790 23792 18089 9077 5764 9614 10151 1883
1334 1883 -8445 -15551 -16157 -9774 -4378 -6556 -8881 -3887 4248 11039 12298 7119 3853 4429 3855
1349 3855 1875 -2143 -8712 -11884 -7560 -2982 -2760 -2657 -2094 1078 6749 9811 8874 6731 3598 -512
1365 -512 -347 -921 -5311 -8170 -8215 -8525 -6067 -1495 1395 3024 4238 3668 5200 7275 4013 -1470 -4862
1382 -4862 -7398 -8126 -6364 -6762 -8943 -7374 -1467 6553 13866 14610 11755 13946 17801 18812 15507 5479
1398 5479 -6509 -11610 -9844 -10198 -15218 -21777 -23933 -16097 -4118 1664 2511 3404 6814 14767 22016
1413 22016 18763 7960 903 -142 420 -1952 -11851 -21610 -20685 -12508 -4909 -1627 -4076 -5829 2857
$$ packed form
1305g792K224m825j119P411J6223J2683l609j2636o751K356N179l733j4878j2179
1319b1446J176Q469P067K499l901k04J1974J4156M002n703r012l313L850N37q268
1334A883j0328p106o06O383N396k178k325M994Q135O791J259n179l266N76n74
1349C855j980m018o569l172M324M578K22J03N63L172N671L062r37k143l133m110
1365e12J65n74m390k859m5l10K458M572K890J629J214n70J532K075l262n483l392
1382d862k536p28J762l98k181J569N907Q020P313P44k855K191L855J011l305j0028
1398E479j1988n101J766l54n020o559k156P836J1979N782Q47Q93L410P953P249
1413B2016l253j0803p057j045N62k372r899r759R25Q177P599L282k449j753Q686
$$ plain form
1428 2857 14847 18847 14006 6544 3289 8238 12505 6960 -3445 -9523 -8829 -2037 2631 -3048 -9891
1443 -9891 -7823 876 6717 4798 -4852 -11043 -5968 1548 3401 -893 -8408 -8624 3140 13932 13188
1458 13188 6067 2515 6716 16078 17695 6806 -6292 -11638 -9959 -6204 -9587 -21087 -26778 -18121
1472 -18121 -5186 3444 3365 -978 2099 14841 24064 22122 11872 1191 -673 4949 4297 -7291
1486 -7291 -19465 -22962 -15985 -4874 -1039 -4991 -5152 3408 15079 22893 19973 9874 6212 11488
1500 11488 14002 8574 -2457 -12435 -11983 -3945 -1503 -5938 -12148 -13087 -4725 5138 5280 -4126 -10421
1515 -10421 -9137 -3666 352 -4114 -12737 -12868 -4445 4973 9450 6855 2855 7591 16601 19119 13647
1530 13647 4282 -2858 -1842 1607 -1739 -10307 -16644 -15924 -7302 2658 4133 1563 3066 9119 15697
$$ packed form
1428B857J1990M000m841p462l255M949M267n545j0405o078O94O792M668n679o843
1443i891K068Q699N841j919r650o191N075P516J853m294p515k16J1764J0792p44
1458A3188p121l552M201R362J617j0889j3098n346J679L755l383j1500n691Q657
1472a8121J2935Q630p9m343L077J2742R223j942j0250j0681j864N622o52j1588
1486g291j2174l497O977J1111L835l952j61Q560J1671P814k920j0099l662N276
1500A1488K514n428j1031r978M52Q038K442m435o210r39Q362R863J42r406o295
1515a0421J284N471M018m466q623j31Q423R418M477k595m000M736R010K518n472
1530A3647r365p140J016L449l346q568o337P20Q622R960J475k570J503O053O578
$$ plain form
1545 15697 19137 13272 4329 -23 -217 -1466 -4764 -11388 -17073 -16118 -10467 -7739 -6115 -5382 -4659 796
1561 796 6412 7132 5151 3153 1152 2186 4705 3545 771 114 427 2563 6200 5759 3591 2511
1577 2511 825 -879 -55 -1595 -5884 -8796 -9925 -9190 -5853 -3555 -4052 -2455 1209 5610 9892 11118
1593 11118 8330 6734 8923 9414 7739 3748 -3284 -6479 -4588 -3787 -6264 -10227 -13307 -10838 -3391
1608 -3391 1459 -451 -2732 -2132 3315 11739 13560 8327 3833 3927 7358 9079 2978 -8525 -13619
1623 -13619 -10582 -6393 -6575 -11708 -17717 -15018 -3236 5210 6216 2689 1448 9369 20707 23200
1637 23200 14532 5053 1014 4271 9485 5314 -7106 -14564 -12186 -4422 243 -4564 -13165 -12722 -3117
1652 -3117 5183 5797 -465 -7277 -4441 5787 10177 5165 -2992 -5510 1637 11256 10772 1709 -5283
$$ packed form
1545A5697L440n865q943m352j94j249l298o624n685R55N651K728J624P33P23N455
1561G96N616P20j981j998k001J034K519j160k774o57L13K136L637m41k168j080
1577B511j686j704Q24j540m289k912j129P35L337K298m97J597L664M401M282J226
1593A1118k788j596K189M91j675l991p032l195J891Q01k477l963l080K469P447
1608c391M850j910k281O00N447Q424J821n233m494R4L431J721o101j1503n094
1623a3619L037M189j82n133o009K699J1782Q446J006l527j241P921J1338K493
1637B3200q668r479m039L257N214m171j2420p458K378P764M665m807q601M43R605
1652c117Q300O14o262o812K836J0228M390n012q157k518P147R619m84r063o992
$$ plain form
1667 -5283 -5851 -94 4420 -1527 -12458 -16355 -10865 -2737 891 -3371 -6982 -586 11094 18674 18820
1682 18820 13478 9011 12672 17359 12090 -777 -13187 -17582 -14222 -11168 -15944 -22578 -21513 -12633
1696 -12633 710 9777 9004 6289 10963 19581 22873 17975 6650 -2380 -3704 -2490 -6211 -12770
1710 -12770 -19130 -19116 -9586 -391 669 -1094 211 5471 12836 14378 8332 1193 -1848 -958 1898
1725 1898 959 -4782 -7926 -3047 3510 6707 6212 3568 2350 4295 3677 -825 -7054 -12969 -14294 -10975
1741 -10975 -8910 -10054 -7867 -1588 6059 13817 17691 16709 15939 15573 13486 9678 1612 -8731 -15261
1756 -15261 -17111 -19017 -20688 -18617 -14763 -8055 1072 8422 13291 16639 18609 18883 18420 12752 4100
1771 4100 -1769 -6887 -11637 -13771 -15296 -15788 -12610 -7302 -2025 4312 8640 9898 10795 10702 7810 5002
$$ packed form
1667e283n68N757M514n947j0931l897N490Q128L628m262l611O396J1680P580J46
1682A8820n342m467L661M687n269j2867j2410m395L360L054m776o634J065Q880
1696a2633J3343R067p73k715M674Q618L292m898j1325r030j324J214l721o559
1710a2770o360J4R530R195J060j763J305N260P365J542o046p139l041Q90K856
1725A898r39n741l144M879O557L197m95k644j218J945o18m502o229n915j325L319
1741a0975K065j144K187O279P647P758L874r82p70l66k087l808q066j0343o530
1756a5261j850j906j671K071L854O708R127P350M869L348J970K74m63n668q652
1771D100n869n118m750k134j525m92L178N308N277O337M328J258Q97r3k892k808
$$ plain form
1787 5002 2843 -2346 -7658 -9711 -10165 -8225 -4882 -3214 -889 3651 8105 11252 13246 9811 4556
1802 4556 2462 1384 -2768 -8296 -13119 -15140 -11261 -6285 -4116 -2536 -759 3352 11867 17372 14978
1817 14978 8479 4659 3463 2907 -318 -8086 -14495 -14765 -9912 -3766 -543 -2195 -1862 5136 12400
1832 12400 13278 9167 2700 -1027 355 154 -5291 -12576 -16349 -13174 -3347 3527 1925 1276 6065
1847 6065 14131 20196 18355 8971 -55 -2288 -2004 -4111 -12150 -22609 -23743 -14887 -5612 -2558 -2278
1862 -2278 -639 6948 18573 24055 18691 9325 3868 4589 7147 1475 -11329 -19327 -17370 -9533 -2296
1877 -2296 -2109 -6749 -6972 1746 10655 13157 7060 -2009 -3026 3131 5564 1112 -5002 -8055 -3114
1892 -3114 6935 11269 7093 2032 1772 7154 10837 5450 -6441 -14042 -14348 -11869 -10195 -13150 -18284
$$ packed form
1787E002k159n189n312k053m54J940L343J668K325M540M454L147J994l435n255
1802D556k094j078m152n528m823k021L879M976K169J580J777M111Q515N505k394
1817A4978o499l820j196n56l225p768o409k70M853O146L223j652L33O998P264
1832A2400Q78m111o467l727J382k01n445p285l773L175R827O874j602o49M789
1847F065Q066O065j841r384r026k233K84k107q039j0459j134Q856R275L054K80
1862b278J639P587J1625N482n364r366n457P21K558n672j2804p998J957P837P237
1877b296J87m640k23Q718Q909K502o097r069j017O157K433m452o114l053M941
1892c114J0049M334m176n061k60N382L683n387j1891p601l06K479J674k955n134
$$ plain form
1907 -18284 -15542 -5057 5942 11464 11028 9868 13950 19802 19257 12770 4661 -2476 -4190 -3141 -6992
1922 -6992 -14234 -17423 -14554 -6904 -156 713 369 3407 9007 13145 14410 10008 3701 1786 3971
1937 3971 3704 260 -4506 -7914 -6000 -3564 -3846 -5776 -7350 -8465 -5826 -2865 -3429 -7137 -7568 -5670
1953 -5670 -3117 -551 -272 412 3757 7612 11860 14889 13687 10230 8313 8013 5633 3815 537 -3016
1969 -3016 -5299 -5679 -6443 -5933 -5693 -7227 -5650 -860 2081 4449 6187 4291 2825 2151 1287 -857
1985 -857 -3237 -5913 -5642 -3011 -3011 -5245 -6697 -8114 -8146 -4592 -1846 -2366 -2053 320 3989 7853 7713
2002 7713 4712 3767 5929 8639 11334 12088 8221 4796 4784 2700 -1531 -6867 -10862 -9738 -4991 -2278
2018 -2278 -2654 -3234 -3788 -1332 1737 1555 -2713 -3994 -1219 2114 3852 324 -6036 -7350 -4288 -728
$$ packed form
1907a8284K742J0485J0999N522m36j160M082N852n45o487q109p137j714J049l851
1922f992p242l189K869P650O748Q69l44L038N600M138J265m402o307j915K185
1937C971k67l444m766l408J914K436k82j930j574j115K639K961n64l708m31J898
1953e670K553K566K79O84L345L855M248L029j202l457j917l00k380j818l278l553
1969c016k283l80p64N10K40j534J577M790K941K368J738j896j466o74q64k144
1985h57k380k676K71K631%k234j452j417l2L554K746n20L13K373L669L864j40
2002G713l001r45K162K710K695P54l867l425j2k084m231n336l995J124M747K713
2018b278l76n80n54K456L069j82m268j281K775L333J738l528o360j314L062L560
$$ plain form
2034 -728 2431 2488 2194 6202 11884 11860 5718 -2412 -8387 -8202 -6469 -7105 -9640 -9453 -5494 1484 7348
2051 7348 6313 2444 3867 9834 15218 16541 9936 745 -3945 -6078 -9602 -14888 -20257 -20543 -11591
2066 -11591 928 7629 8560 7894 9179 13043 15537 11648 5596 2517 2903 4648 2260 -6792 -15333
2081 -15333 -15924 -10342 -4984 -1929 -1618 -657 5296 9434 6778 -1147 -10303 -14248 -9994 -4718 -4235 -4888
2097 -4888 -3049 1549 7475 9144 4810 1614 3898 10113 14888 13335 4785 -3023 -5020 -5406 -6819
2112 -6819 -9467 -11041 -6191 5127 14885 17168 13199 7095 3863 5137 4111 -1449 -6597 -9036 -8462
2127 -8462 -7106 -10075 -17567 -21465 -18937 -11434 -1877 4608 6566 9131 12579 12879 8744 1492 -6151
2142 -6151 -7788 -2834 2769 5127 5043 3314 2407 3854 4038 2597 2688 4680 7907 10568 8875 1782
$$ packed form
2034g28L159N7k94M008N682k4o142q130n975J85J733o36k535J87L959O978N864
2051G348j035l869J423N967N384J323o605r191m690k133l524n286n369k86Q952
2066a1591J2519O701R31o66J285L864K494l889o052l079L86J745k388r052q541
2081a5333n91N582N358L055L11R61N953M138k656p925r156l945M254N276M83o53
2097d888J839M598N926J669m334l196K284O215M775j553q550p808j997l86j413
2112f819k648j574M850J1318R758K283l969o104l232J274j026n560n148k439N74
2127h462J356k969p492l898K528P503R557O485J958K565L448L00m135p252p643
2142f151j637M954N603K358q4j729r07J447J84j441R1J992L227K661j693p093
$$ plain form
2158 1782 -5131 -10232 -12868 -11613 -8399 -4985 850 7853 10822 10412 6713 -134 -5033 -6043 -6588
2173 -6588 -6699 -5913 -7736 -9479 -9094 -9453 -9981 -7697 -3714 2840 12614 20120 22678 20584 14460 6721
2189 6721 392 -4046 -8939 -11188 -9287 -6095 -2195 -358 -3306 -6087 -5557 -2012 3665 8018 8672
2204 8672 8322 8827 7162 2662 -3865 -11607 -15420 -11141 -3136 2672 5541 4078 3194 4542 4394 -211
2220 -211 -4657 -5986 -4060 1466 4439 995 -4713 -7940 -7550 -3684 -408 482 3718 10971 17898 19290
2236 19290 13637 2692 -6829 -9492 -8329 -8108 -9316 -11088 -9599 -4664 -2607 -4861 -6532 -5491 926
2251 926 11460 18864 19190 16121 12914 9864 4771 -3460 -13404 -16986 -13525 -8135 -4464 -5025 -8803
2266 -8803 -9127 -4398 340 1776 2656 5419 11197 17862 17505 10609 1754 -5257 -7438 -5547 -5476 -7448
$$ packed form
2158A782o913n101k636J255L214L414N835P003K969m10l699o847m899j010n45
2173f588j11P86j823j743L85l59n28K284L983O554R774P506K558k094o124p739
2189F721o329m438m893k249J901L192L900J837k948k781N30L545N677M353O54
2204H672l50N05j665m500o527p742l813M279Q005N808K869j463q84J348j48m605
2220b11m446j329J926N526K973l444n708l227L90L866L276Q90L236P253O927J392
2236A9290n653j0945r521k663J163K21j208j772J489M935K057k254j671J041O417
2251I26J0534P404L26l069l207l050n093q231r944l582L461N390L671n61l778
2266h803l24M729M738J436Q80K763N778O665l57o896q855p011k181J891P1j972
$$ plain form
2282 -7448 -5960 -1299 2721 2850 -1748 -8026 -9010 -4238 1058 4525 4360 1517 2049 4836 3717 195
2298 195 -3096 -3028 2614 9634 11158 7679 2817 -1623 -4878 -6717 -10991 -15149 -13897 -8090 -2633 1387
2314 1387 1766 745 3073 7335 10513 11943 12275 11151 12108 12115 5873 -3265 -11554 -16522 -16535 -13753 -11757
2331 -11757 -9566 -5357 -1295 2572 4875 3030 1511 4449 7920 9721 10139 7486 4154 1990 -253
2346 -253 -3505 -7051 -8846 -8121 -3419 701 0 -1678 -2792 -3944 -2773 -850 77 1284 4060 7259
2362 7259 9662 10214 6882 3199 1840 114 -1281 -1736 -2850 -5186 -5608 -5711 -6878 -7187 -8199 -7028
2378 -7028 -2260 2616 5347 7340 7768 5632 4779 4735 2557 99 -1440 -2390 -1617 -111 -876 -1826 -2763
2395 -2763 -4161 -3104 459 1144 819 1108 1641 2089 1942 -153 -2086 -1958 -662 555 2511 1619 -152
$$ packed form
2282g448J488M661M020J29m598o278r84M772N296L467j65k843N32K787j119l522
2298A95l291O8N642P020J524l479m862m440l255j839m274m158J252N807N457M020
2314A387L79j021K328M262L178J430L32j124R57Po242r138q289m968j3K782J996
2331a1757K191M209M062L867K303j845j519K938L471J801M18k653l332k164k243
2346b53l252l546j795P25M702M120p01j678j114j152J171J923R27J207K776L199
2362G259K403N52l332l683j359j726j395m55j114k336m22j03j167l09j012J171
2378g028M768M876K731J993M28k136q53m4k178k458j539r50P73J506p65r50r37
2395b763j398J057L563O85l25K89N33M48j47k095j933J28J296J217J956q92j771
$$ plain form
2412 -152 449 2402 1882 -74 -2357 -4084 -2847 184 356 -626 -2082 -3347 -444 3020 2328 260
2428 260 450 1688 3052 3563 943 -2651 -3013 -1848 -219 292 -2843 -4490 -1388 3464 4727 3716
2444 3716 1150 -444 1869 4107 2630 -1211 -5296 -6389 -2506 289 -1472 -4018 -3359 -789 3252
2459 3252 5565 3002 -149 109 2500 4115 2677 -2593 -6212 -4009 -20 846 435 -1193 -949 3484
2475 3484 7844 6394 1172 -3523 -5378 -3424 -2584 -5897 -8629 -7471 -3983 1354 5235 5372 4962 8171
2491 8171 11987 13562 10613 4229 -1755 -4022 -7322 -11571 -15910 -18669 -17421 -9558 -1802 2399 5315
2506 5315 8577 12882 17005 17435 13000 7633 3545 187 -2961 -7173 -14090 -17352 -15440 -10799 -5760
2521 -5760 -1737 1477 5836 11092 13548 11387 7400 1999 -1940 -1904 -2881 -6422 -8080 -8095 -5289 -910
$$ packed form
2412a52O01J953n20j956k283j727J237L031J72r82j456j265K903L464o92k068
2428B60J90J238J364N11k620l594l62J165J629N11l135j647L102M852J263j011
2444C716k566j594K313K238j477l841m085j093L883K795j761k546O59K570M041
2459C252K313k563l151K58K391J615j438n270l619K203L989Q66m11j628K44M433
2475C484M360j450n222m695j855J954Q40l313k732J158L488N337L881J37m10L209
2491H171L816J575k949o384n984k267l300m249m339k759J248P863P756M201K916
2506E315L262M305M123M30m435n367m088l358l148m212o917l262J912M641N039
2521e760M023L214M359N256K456k161l987n401l939L6r77l541j658j5K806M379
$$ plain form
2537 -910 2448 3561 4931 7123 8843 10096 8211 1975 -3369 -6909 -10065 -11648 -12172 -11575 -8303 -2492
2553 -2492 2760 7573 10549 11038 11212 12199 10729 6423 2057 -2516 -7044 -9619 -12114 -14060 -14096 -12382
2569 -12382 -8237 -1620 4391 7693 11241 12607 11859 10260 8490 4336 321 -2526 -5192 -6266 -7032
2584 -7032 -8285 -7484 -4582 -2416 310 3416 4891 5898 7209 6730 4129 1450 -1930 -4202 -3754 -4007
2600 -4007 -5039 -4385 -3259 -1968 1159 3145 2924 1975 2656 2850 2683 1425 -1667 -2823 -2296 -1801 -1373
2617 -1373 -1169 -1428 -688 2487 4040 3447 1919 93 -170 870 143 -2109 -3712 -4591 -3316 -81 1895
2634 1895 1060 807 2461 3836 4819 3655 224 -2249 -2036 -1909 -1610 -2309 -3920 -3161 367 1869 1639
2651 1639 954 340 1828 4596 4458 1513 -1166 -2793 -2742 -1423 -1833 -4324 -4013 -1436 1619 3645 2608
$$ packed form
2537i10L358J113J370K192J720J253j885o236n344l540l156j583n24N97L272N811
2553b492N252M813K976M89J74R87j470m306m366m573m528k575k495j946l6J714
2569a2382M145O617O011L302L548J366p48j599j770m154m015k847k666j074p66
2584g032j253Q01K902K166K726L106J475J007J311m79k601k679l380k272M48k53
2600d007j032O54J126J291L127J986k21r49O81J94j67j258l092j156N27M95M28
2617a373K04k59P40L175J553n93j528j826k63J040p27k252j603q79J275L235J976
2634A895q35k53J654J375R83j164l431k473K13J27K99o99j611P59L528J502k30
2651A639o85o14J488K768j38k945k679j627N1J319m10k491L11K577L055K026j037
$$ plain form
2668 2608 -467 -998 -966 -1044 -1708 -3058 -3742 -1802 1619 2522 1032 -449 -43 2488 5733 6288 4707
2685 4707 3504 3267 3274 2406 -2112 -7218 -7764 -5031 -1726 1111 1591 -190 453 1737 1129 -266 -2702
2702 -2702 -3660 -1057 2484 2426 -218 -2455 -4183 -3172 -366 -557 -823 90 2322 4811 5531 1492 -3652
2719 -3652 -6192 -5470 -2926 413 1899 2517 5593 7615 6909 4558 911 -1716 -1134 786 520 -846
2735 -846 -2626 -5313 -5804 -5956 -6892 -6936 -3101 1658 7661 11730 10793 7142 3542 -194 -3294 -4977 -6923
2752 -6923 -7355 -4525 -1965 -798 -301 -1103 -1877 310 3858 6503 8438 8935 7673 5235 1466 -5559
2768 -5559 -11597 -15289 -14886 -10546 -4071 528 3614 5936 6901 6733 6433 4137 2430 2797 3972 4416
2784 4416 3396 -1020 -7041 -9407 -9383 -7069 -2510 2726 7797 13197 15821 13827 8631 1667 -4953
$$ packed form
2668B608l075n31L2p8o64j350o84J940L421R03j490j481M06K531L245N55j581
2685D707j203k37Pq68m518n106n46K733L305K837M80j781O43J284o08j395k436
2702b702r58K603L541n8k644k237j728J011K806j91k66R13K232K489P20m039n144
2719c652k540P22K544L339J486O18L076K022p06k351l647k627N82J920k66j366
2735h46j780k687m91j52r36m4L835M759O003M069r37l651l600l736l100j683j946
2752f923m32K830K560J167M97q02p74K187L548K645J935M97j262k438l769p025
2768e559o038l692M03M340O475M599L086K322R65j68l00k296j707L67J175M44
2784D416j020m416o021k366K4K314M559N236N071N400K624j994n196o964o620
$$ plain form
2799 -4953 -7550 -7770 -7998 -8410 -8001 -7322 -6459 -5310 -5808 -5570 -2458 3010 9527 14069 13538 9127 3191
2816 3191 -3384 -9044 -12767 -14692 -14134 -8320 -1537 3774 7284 7735 7073 8517 10916 12241 13816 14384
2832 14384 13359 10679 5546 -3026 -12590 -18308 -20047 -16968 -10934 -6126 -1547 3087 5577 5873 4136
2847 4136 1223 -822 568 2917 3786 2508 -1349 -5836 -8701 -10803 -12864 -11836 -7149 -715 7767
2862 7767 13641 13656 10491 6737 3694 2090 1344 352 1078 3986 5726 5652 3425 -1679 -5604 -4658 -1761
2879 -1761 1071 4012 4409 3564 2223 -2323 -8272 -13578 -15883 -13785 -8069 -1891 1867 4283 5760
2894 5760 5909 5129 3870 1671 1479 3828 5599 5968 3745 -2167 -8028 -10704 -12233 -11639 -7143 -936
2910 -936 5633 12331 15417 13875 10672 6701 3545 2610 1674 -482 -1378 -2175 -4734 -7628 -11798 -14771
$$ packed form
2799d953k597k20k28m12M09O79Q63J149m98K38L112N468O517M542n31m411n936
2816C191o575n660l723j925N58N814O783N311L510M51o62J444K399J325J575N68
2832A4384j025k680n133q572r564n718j739L079O034M808M579M634K490K96j737
2847D136k913k045J390K349Q69j278l857m487k865k102k061J028M687O434Q482
2862G767N874J5l165l754l043j604p46r92P26K908J740p4k227n104l925R46K897
2879a761K832K941L97q45j341m546n949n306k305K098N716O178L758K416J477
2894E760J49p80j259k199j92K349J771L69k223n912n861k676j529N94M496O207
2910i36O569O698L086j542l203l971l156r35r36k156q96p97k559k894m170k973
$$ plain form
2926 -14771 -14267 -9394 -2778 3607 8529 9601 9546 8271 4383 -210 -3204 -4650 -3477 -102 2232
2941 2232 2093 1449 -446 -1624 -1573 -1773 -1986 46 2450 4087 3706 648 -4222 -7950 -8220 -6230 -1658
2958 -1658 2840 6615 10481 13158 12022 8542 3605 -1974 -6186 -6818 -7098 -7409 -8071 -8601 -8633 -7451 -6391
2975 -6391 -3905 1053 6487 12009 16576 17456 13617 8306 2327 -3249 -7785 -10803 -12566 -10733 -7227
2990 -7227 -4486 -2090 -537 -460 430 3117 5462 6865 7515 7077 5608 2897 -1407 -5985 -8418 -9139
3006 -9139 -6502 -1533 2098 3878 5216 6220 5362 3581 298 -2807 -4157 -3363 -2965 -2530 -3550 -5896
3022 -5896 -5663 -3027 -827 1580 4722 6975 9326 11442 9944 5721 874 -4306 -7273 -7766 -8655 -9306
3038 -9306 -8071 -5432 -2735 249 1760 2088 3680 6287 9304 10790 9250 5270 1738 -659 -4030
$$ packed form
2926a4771N04M873O616O385M922J072n5j275l888m593k994j446J173L375K334
2941B232j39o44j895j178N1k00k13K032K404J637l81l058m870l728k70J990M572
2958a658M498L775L866K677j136l480m937n579m212o32k80l11o62n30l2J182J060
2975f391K486M958N434N522M567Q80l839n311n979n576m536l018j763J833L506
2990g227K741K396J553P7Q90K687K345J403O50m38j469k711m304m578k433p21
3006i139K637M969L631J780J338J004q58j781l283l105j350P94L98M35j020k346
3022e896K33K636K200K407L142K253K351K116j498m223m847n180k967m93q89o51
3038i306J235K639K697K984J511L28J592K607L017J486j540l980l532k397l371
$$ plain form
3053 -4030 -6729 -8769 -10433 -8725 -5266 -1718 408 1241 2085 3512 5370 5166 4273 3979 3363 2586 1848
3070 1848 -558 -3780 -5326 -5527 -4395 -2299 -1652 -1583 551 2379 3040 3232 2156 298 221 1524 1455
3087 1455 844 -290 -1237 -1406 -931 -1656 -2470 -2106 -1564 -8 1839 1498 287 542 1390 1690 1678 491
3105 491 -1242 -1003 -401 -302 -333 -1344 -2575 -1724 738 1581 2044 1824 1725 2611 3049 2225 664 -1394 -3304
3124 -3304 -3457 -2946 -3971 -4523 -3630 -1685 486 3103 4282 4121 4676 5449 4752 3717 1292 -2579 -3754
3141 -3754 -4253 -5351 -5948 -6003 -5559 -3323 -327 2363 4575 6197 6764 7158 7165 4616 1090 -1443 -3903
3158 -3903 -5469 -5875 -6320 -6192 -4331 -2241 27 2294 3357 3806 5690 6347 5649 3744 978 -2199
3174 -2199 -4207 -5262 -6627 -6455 -5244 -3430 75 3227 4089 4808 5691 5231 4392 3402 902 -1472 -2887
$$ packed form
3053d030k699k040j664J708L459L548K126Q33Q44J427J858k04q93k94o16p77p38
3070A848k406l222j546k01J132K096O47O9K134J828O61J92j076j858p7J303o9
3087A455o11j134r47j69M75p25q14L64N42J556J847l41j211K55Q48L00j2j187
3105D91j733K39O02R9l1j011j231Q51K462Q43M63k20r9Q86M38q24j561k058j910
3124c304j53N11j025n52Q93J945K171K617J179j61N55P73o97j035k425l871j175
3141c754m99j098n97n5M44K236K996K690K212J622N67L94Pk549l526k533k460
3158c903j566m06m45J28J861K090K268K267J063M49J884O57o98j905k766l177
3174b199k008j055j365J72J211J814L505L152Q62P19Q83m60q39r90k500k374j415
$$ plain form
3191 -2887 -3666 -4310 -4789 -5945 -5198 -2465 585 2938 4974 5932 5859 6069 5150 2346 -792 -3363 -5368
3208 -5368 -5307 -4182 -4356 -3633 -1714 -487 1625 3178 3869 3631 4660 4672 3545 1783 -1566 -4430 -5356
3225 -5356 -5970 -5597 -4138 -2470 -160 3107 5486 5907 5607 4614 2894 1770 315 -2212 -3505 -4895
3241 -4895 -6028 -6253 -5162 -5150 -3500 282 3522 5820 7622 7426 6549 5472 3207 102 -2650 -5611
3257 -5611 -6537 -5481 -4750 -3868 -2844 -837 1098 3887 5639 6295 6856 6561 5241 3647 695 -3521
3273 -3521 -6454 -7809 -8113 -7615 -6122 -4854 -2213 1166 3434 5156 5487 4292 3910 4060 3224 942
3289 942 -1236 -3699 -5525 -5264 -5203 -4526 -3245 -903 1634 5056 7173 6893 6767 5424 3680 2189 618
3306 618 -1948 -3587 -4358 -4414 -3727 -2922 -2634 -1490 936 2794 3562 3903 2520 1368 647 -1642 -3980
$$ packed form
3191b887p79o44m79j156P47K733L050K353K036R58p3K10r19k804l138k571k005
3208e368O1J125j74P23J919J227K112J553O91k38J029J2j127j762l349k864r26
3225e356o14L73J459J668K310L267K379M21l00r93j720j124j455k527j293j390
3241d895j133k25J091J2J650L782L240K298J802j96q77j077k265l105k752k961
3257e611r26J056P31Q82J024K007J935K789J752O56N61k95j320j594k952m216
3273c521k933j355l04M98J493J268K641L379K268J722L31j195l82J50q36k282
3289I42k178k463j826K61O1O77J281K342K537L422K117k80j26j343j744j491j571
3306F18k566j639p71n6O87Q05K88J144K426J858P68L41j383j152p21k289k338
$$ plain form
3323 -3980 -5854 -7534 -7479 -5770 -3737 -2463 -5 2434 4714 7308 8632 7815 6915 5822 3728 1856
3339 1856 -1303 -4560 -6556 -6634 -6376 -5402 -4079 -2240 83 4025 6597 7133 7158 6022 4732 4186 1909
3356 1909 -1787 -4839 -6777 -7823 -6813 -6326 -5995 -4420 -1955 464 3401 4308 3804 3927 4077 3491 2422
3373 2422 170 -2634 -3633 -2833 -2429 -1883 -1003 -447 1600 4413 5394 4548 3685 2272 732 -357 -1899
3390 -1899 -3750 -4800 -5343 -4742 -3321 -2262 -1524 778 3372 5007 5969 6045 4644 3546 2102 -551
3406 -551 -2901 -4950 -6803 -6303 -4728 -3473 -2349 -708 1003 2695 4271 4524 4218 4100 3440 2406
3422 2406 1387 -1069 -3211 -3770 -3764 -3533 -2548 -1440 -474 1687 3272 3219 2022 840 -289 -642 -262 -1269
3440 -1269 -1827 -1602 -1363 -1014 340 474 405 1733 2432 2982 3729 2774 1000 -270 -1805 -3682 -4406 -4473
$$ packed form
3323c980j874j680N5J709K033J274K458K439K280K594J324q17r00j093k094j872
3339A856l159l257j996p8K58R74J323J839K323L942K572N36K5j136j290n46k277
3356A909l696l052j938j046J010M87L31J575K465K419K937R07n04J23J50n86j069
3373B422k252k804r99Q00M04N46Q80N56K047K813R81q46q63j413j540j089j542
3390a899j851j050n43O01J421J059P38K302K594J635R62P6j401j098j444k653
3406e51k350k049j853N00J575J255J124J641J711J692J576K53l06j18o60j034
3422B406j019k456k142n59OK31R85J108R66K161J585n3j197j182j129l53L80j007
3440a269n58K25K39L49J354J34o9J328O99N50P47r55j774j270j535j877p24o7
$$ plain form
3458 -4473 -4339 -2797 -592 297 1398 2122 2267 2864 3591 3571 2892 3112 2058 733 -59 -1889 -3572 -4045
3476 -4045 -4289 -3670 -2268 -807 339 1334 1590 1101 937 883 -125 499 848 467 407 239 -593 -1159 -1472
3495 -1472 -2249 -1714 -1025 -947 28 1550 1040 500 798 148 -138 1077 1908 2605 3409 3385 3182 2598 1208
3514 1208 -518 -953 -1439 -1818 -1380 -1487 -2426 -2443 -2595 -3266 -3265 -3755 -3413 -1459 382 1202 1583 1433 555 559
3534 559 1293 1000 701 1184 1218 1954 2065 721 -787 -1360 -1658 -1983 -891 -339 -56 1700 3403 3719 3817
3553 3817 3217 2584 3313 3953 3132 1937 159 -1856 -3621 -4614 -6452 -7779 -7715 -6324 -4100 -1746 -569
3570 -569 520 2108 2639 2995 3141 2364 1658 2040 2155 887 -215 -1626 -1925 -1098 -156 305 1512 2408
3588 2408 2968 3670 4008 1837 -278 -1155 -1625 -1691 -1539 -1794 -1735 -145 542 1154 1700 948 560 1919 2235
$$ packed form
3458d473J34J542K205Q89J101P24J45N97P27k0o79K20j054j325p92j830j683m73
3476d045k44O19J402J461J146R95K56m89j64n4j008O24L49l81o0j68q32n66l13
3495a472p77N35O89P8R75J522n10n40K98o50k86J215Q31O97Q04k4k03n84j390
3514A208j726m35m86l79M38j07r39j7j52o71Jm90L42J954J841Q20L81j50q78M
3534E59P34k93k99M83L4P36J11j344j508n73k98l25J092N52K83J756J703L16R8
3553C817o00o33P29O40q21j195j778k015j765r93j838j327O4J391K224K354J177
3570e69J089J588N31L56J46p77p06L82J15j268j102j411k99Q27R42M61J207Q96
3588B408N60P02L38k171k115q77m70o6J52k55N9J590O87O12N46p52l88J359L16
$$ plain form
3607 2235 575 -982 -3203 -4605 -4896 -5790 -6403 -6094 -4350 -2024 1521 4078 4871 5330 6137 6303 5660
3624 5660 4923 2419 583 -337 -2035 -3159 -4125 -5057 -4794 -2781 -1082 -81 1857 2980 3523 4146 3481
3641 3481 1874 437 -1064 -1680 -1893 -2161 -3207 -2572 -1590 -1308 -362 522 1124 1846 2430 2085 1842 938
3659 938 -372 -1477 -2003 -2867 -3177 -2171 -1125 155 1700 2669 2690 3039 2753 2603 2311 953 -579 -1278
3677 -1278 -2026 -3194 -3034 -3315 -3144 -2233 -912 358 1977 3383 3655 3632 2782 1562 952 311 -1215 -2217
3695 -2217 -2552 -2350 -2437 -1766 -1343 -669 407 1163 2047 2980 2235 1586 1558 1048 -411 -1681 -2450 -2894 -2417
3714 -2417 -1503 -1210 -691 -168 241 1595 2676 2400 1698 1714 1138 628 278 -829 -1881 -1768 -1843 -1618 -1068
3733 -1068 -718 -352 951 1854 1753 1874 1707 796 1155 716 -686 -1327 -2079 -1907 -1459 -864 -1560 -919 280
$$ packed form
3607B235j660j557k221j402k91q94o13L09J744K326L545K557P93M59Q07J66o43
3624E660p37k504j836r20j698j124r66r32K63K013J699J001J938J123N43O23o65
3641C481j607j437j501o16k13k68j046O35R82K82R46Q84O02P22N84l45k43r04
3659I38j310j105n26q64l10J006J046J280J545R69K1L49k86j50k92j358j532o99
3677a278p48j168J60k81J71R11J321J270J619J406K72k3q50j220o10o41j526j002
3695b217l35K02q7O71M23O74J076P56Q84R33p45o49k8n10j459j270p69m44M77
3714b417R14K93N19N23M09J354J081k76p02J6n76n10l50j107j052J13p5K25N50
3733a068L50L66J303R03j01J21j67r11L59m39j402o41p52J72M48N95o96O41J199
$$ plain form
3752 280 590 1683 2269 1537 1299 1512 920 64 -758 -1938 -1828 -1207 -1343 -1624 -1205 -601 209 1751 2290
3771 2290 1583 1566 1563 1319 1569 165 -1337 -1979 -1768 -2206 -2012 -1808 -1825 -998 836 1614 1896 2258 1985 2284
3791 2284 2717 1208 -595 -1104 -1986 -2285 -1485 -1792 -2543 -1729 -375 717 1959 2093 1776 2268 2458 1692
3809 1692 821 110 -1325 -1615 -1635 -2447 -2749 -2010 -1188 60 1049 1313 1258 2225 2473 2133 1777 330 -1116
3828 -1116 -1383 -1437 -1735 -2118 -2534 -2094 -333 685 1146 1817 2113 2209 2512 2457 697 -659 -1500 -2071 -2230
3847 -2230 -1926 -2905 -2303 -1349 256 1041 2172 2040 2092 2926 2687 2133 1041 -346 -1502 -2077 -2587 -3008
3865 -3008 -2664 -2274 -1293 -249 548 862 1828 2739 2288 2276 1592 800 -22 -230 -1005 -1445 -1798 -1644 -1437 -168
3885 -168 -91 86 918 1030 948 1193 378 -816 -373 -762 -1502 -1557 -2015 -1422 -445 364 662 1427 1849 1980 2367
$$ packed form
3752B80L10J093N86p32k38K13n92q56q22j180J10O21j36k81M19O04Q10J542N39
3771B290p07j7lk44K50j404j502o42K11m38J94K04j7Q27J834P78K82L62k73K99
3791B284M33j509j803n09q82k99Q00l07p51Q14J354J092J242J34l17M92J90p66
3809A692q71p11j435k90k0q12l02P39Q22J248R89K64n5R67K48l40l56j447j446
3828a116k67n4k98l83m16M40J761J018M61O71K96R6L03n5j760j356q41n71j59
3847b230L04r79O02R54J605P85J131j32N2Q34k39n54j092j387j156n75n10m21
3865c008L44L90R81J044P97L14R66R11m51j2o84p92q22k08p75m40l53J54K07J269
3885a68P7J77Q32J12q2K45q15j194M43l89p40n5m58N93R77Q09K98P65M22J31L87
$$ plain form
3906 2367 2096 1091 316 -159 -1251 -1692 -2362 -2870 -2908 -2086 -1703 -1130 -30 228 1742 2740 3052 2507 2130
3925 2130 1657 941 815 -401 -1953 -2115 -2202 -1927 -1355 -1586 -1481 -1101 484 731 990 1330 859 1276 1548
3944 1548 929 238 -103 -361 11 550 403 -447 -247 70 -100 352 -627 -1514 -1326 -1311 -1101 -1403 -1540 -1926
3964 -1926 -1388 -19 278 475 1078 1148 2304 3095 2453 2199 1268 1229 877 624 -595 -1493 -1256 -1532 -1558 -1316
3984 -1316 -1567 -1414 -187 880 902 1923 1643 1469 2130 1834 597 -219 -877 -1828 -1680 -2422 -3626 -3621 -2789
4003 -2789 -2265 -1061 -599 -876 280 1557 2155 2287 2099 1360 1470 2037 1437 933 671 369 950 1402 1456
4022 1456 974 1156 788 482 609 -304 -1397 -1428 -1439 -2050 -1875 -2415 -2497 -1447 -150 226 671 1235 1196 1438
4042 1438 1447 706 -804 -1105 -2275 -2527 -2406 -3268 -3197 -1869 -570 61 1682 2462 3381 4755 5332 5063 3872
$$ packed form
3906B367k71j005p75m75j092m41o70n08l8Q22L83N73J100K58J514R98L12n45l77
3925B130m73p16j26j216j552j62q7K75N72k31J05L80J585K47K59L40m71M17K72
3944A548o19o91l41k58L72N39j47q50K00L17j70M52r79q87J88J5K10l02j37l86
3964a926N38J369K97J97O03P0J156P91o42k54r31l9l52k53j219q98K37k76k6K42
3984a316k51J53J227J067K2J021k80j74O61k96j237q16o58r51J48p42j204NQ32
4003b789N24J204M62k77J156J277N98J32j88p39J10N67o00n04k62l02N81M52N4
4022A456m82J82l68l06J27r13j093l1j1o11J75n40q2J050J297L76M45N64l9K42
4042A438Rp41j510l01j170k52J21q62P1J328J299O31J621P80R19J374N77k69j191
$$ plain form
4061 3872 2991 1854 1246 214 -1485 -2422 -2799 -3098 -2877 -2063 -1958 -1510 -42 486 622 1032 196 110 318
4080 318 5 -937 -1154 -1777 -1483 -617 -381 -36 202 153 867 1397 1262 523 465 79 -492 -748 -914 -1280 -692
4101 -692 538 706 1270 1919 2369 3051 3574 2596 1419 969 -447 -1120 -1584 -3329 -4447 -4233 -3654 -2996
4119 -2996 -1867 -1029 151 1588 2891 3364 3457 2880 2277 2214 1436 7 -1294 -1609 -2014 -1677 -1457 -2060
4137 -2060 -2052 -713 -77 695 1245 765 726 1006 1283 743 241 -264 -291 206 420 243 332 500 233 713 678
4158 678 -404 -979 -822 -882 -952 -1554 -1829 -1501 -886 -376 244 478 1096 1712 2591 2722 1928 1663 1171 621
4178 621 190 -672 -1746 -2267 -2165 -2117 -1797 -1879 -2248 -1552 -134 528 1364 1448 1903 2064 2623 2262 1225 646
4198 646 -112 -185 17 -919 -1493 -1600 -1578 -1638 -1122 -1185 -1145 -290 618 1293 1232 1055 559 845 875 388 -6 24 -288
$$ packed form
4061C872q81j137o08j032j699r37l77k99K21Q14J05M48J468N28J36M10q36q6K08
4080C18l13r42k17o23K94Q66K36L45K38m9P14N30j35p39n8l86n71k56j66l66N88
4101f92J230J68N64O49M50O82N23r78j177m50j416o73m64j745j118K14N79O58
4119b996J129Q38J180J437J303M73R3n77o03o3p78j429j301l15m05L37K20o03
4137b060QJ339O36P72N50m80l9K80K77n40n02n05k7M97K14j77Q9J68k67M80l5
4158F78j082n75J57o0p0o02k75L28O15N10O20K34O18O16Q79J31p94k65m92n50
4178F21m31q62j074n21J02M8L20q2l69O96J418O62Q36Q4M55J61N59l61j037n79
4198F46p58p3K02r36n74j07K2o0N16o3M0Q55R08O75o1j77m96K86L0m87l94L0l12
$$ plain form
4221 -288 332 365 50 -147 -56 -99 409 566 -119 -404 133 -8 -485 -727 -1397 -984 -302 110 253 763 677
4242 677 1144 1766 1614 412 72 -83 -520 -604 -1148 -2121 -2149 -2058 -1760 -799 -786 -371 619 2095 2381 2307 2117
4263 2117 1745 1214 1406 215 -655 -1357 -1501 -1151 -786 -850 -1078 -549 288 820 1404 1220 1209 1429 834 -58
4283 -58 -1198 -2177 -2791 -2172 -1758 -1750 -1320 -231 261 1696 1976 2015 1634 1742 1633 982 668 -912 -1367 -1439
4303 -1439 -1207 -1552 -1457 -643 -104 1591 2341 2444 2549 2168 1455 1343 379 -1293 -2146 -2296 -2123 -1684 -1803
4322 -1803 -1782 -1062 218 1210 2241 2047 1902 1742 1622 545 -914 -1585 -2496 -2789 -2360 -1889 -1761 -491
4340 -491 866 1876 2701 2853 2317 2666 2318 1572 631 -495 -2202 -2736 -2466 -2765 -2767 -2016 -1089 470 1754
4359 1754 1994 2411 2338 2349 1817 1515 -151 -1392 -1609 -1932 -2145 -2093 -1992 -1617 -543 898 1413 1655 1843
$$ packed form
4221b88O20L3l15j97R1m3N08J57o85k85N37j41m77k42o70M13O82M12J43N10q6
4242F77M67O22j52j202l40j55m37q4n44r73k8R1K98R61J3M15R90J476K86p4j90
4263B117l72n31J92j191q70p02j44L50L65o4k28N29Q37N32N84j84j1K20n95q92
4283e8j140r79o14O19M14QM30J089M92J435K80L9l81J08j09o51l14j580m55p2
4303a439K32l45R5Q14N39J695P50J03J05l81p13j12r64j672q53j50J73M39j19
4322a803K1P20J280R92J031j94j45j60j20j077j459o71r11k93M29M71J28J270
4340d91J357J010Q25J52n36L49l48p46r41j126j707n34K70k99kP51R27J559J284
4359A754K40M17p3J1n32l02j666j241k17l23k13N2J01L75J074J441N15K42J88
$$ plain form
4378 1843 1716 1729 1510 279 -538 -1472 -1612 -1563 -1607 -1727 -1138 -81 511 1245 1416 1435 1426 1869 1527 408 -389
4399 -389 -1347 -1702 -1498 -1804 -2085 -1360 -612 -19 1073 1755 1407 1954 2227 1828 1031 198 -974 -1273 -1253 -2003
4419 -2003 -2201 -1878 -1602 -953 300 768 897 1340 1398 1741 2085 1006 -7 -244 -757 -951 -1119 -1844 -1906
$$ packed form
4378A843j27J3k19j231q17r34j40M9m4j20N89J057N92P34J71J9rM43l42j119p97
4399c89r58l55K04l06k81P25P48N93J092O82l48N47K73l99p97q33j172k99K0p50
4419b003j98L23K76O49J253M68J29M43N8L43L44j079j013k37n13j94j68p25o2
$$ [...]
8191D7
##END NTUPLES=NMR FID
##END=
