##TITLE=1H_CA-8415x
 DMSO, 8 sc, 
 24.10.2019
##JCAMPDX= 6.0         $$ Bruker NMR JCAMP-DX V2.0
##DATA TYPE= NMR FID
##DATA CLASS= NTUPLES
##ORIGIN= UXNMR, Bruker Analytische Messtechnik GmbH
##OWNER= root
$$ XWIN-NMR		Version 3.5
$$ Thu Oct 24 14:01:03 2019 Russian Standard Time (UT+4h)  she@DPX200
##.OBSERVE FREQUENCY= 200.1315
##.OBSERVE NUCLEUS= ^1H
##.DELAY= (6, 6)
##.ACQUISITION MODE= SIMULTANEOUS
##.ACQUISITION SCHEME= undefined
##.AVERAGES= 8
##.DIGITISER RES= 18
##SPECTROMETER/DATA SYSTEM= spect
##.PULSE SEQUENCE= zg30
##.SOLVENT NAME= DMSO
##.SHIFT REFERENCE= (INTERNAL, DMSO, 0, 15.7039)
##AUDIT TRAIL= $$ (NUMBER, WHEN, WHO, WHERE, WHAT)
$$ ##TITLE= Audit trail, XWIN-NMR		Version 3.5
$$ ##JCAMPDX= 5.01
$$ ##ORIGIN= Bruker BioSpin GmbH
$$ ##OWNER= she
$$ F:/spectra/data/she/nmr/H-F/1/audita.txt
$$ ##AUDIT TRAIL=  $$ (NUMBER, WHEN, WHO, WHERE, WHAT)
(   1,<2019-10-24 14:00:00.46 +0400>,<she>,<DPX200>,
      <created by zg, POWCHK disabled, PULCHK disabled
       configuration hash MD5:
       00 E9 B6 7A A2 85 ED C7 34 08 36 98 17 FE 4E 26
       data hash MD5: 16K
       25 4E 0F 09 E3 7E 7B 8C E1 68 2D 1C 09 3B DC 39>)
$$ ##END=
$$ 
$$ hash MD5
$$ 15 F0 8A FD 65 F7 E6 F5 24 A4 DB DF CB FD ED 28
##$RELAX= 
##$RELAX= 
##$RELAX= 
##$RELAX= 
##$RELAX= 
##$RELAX= 
$$ Bruker specific parameters
$$ --------------------------
##$DU= <F:/spectra>
##$EXPNO= 1
##$NAME= <H-F>
##$PROCNO= 1
##$TYPE= <nmr>
##$USER= <she>
##$AMP= (0..31)
100 100 100 100 100 100 100 100 100 100 100 100 100 100 100 100 100 100 
100 100 100 100 100 100 100 100 100 100 100 100 100 100 
##$AQSEQ= 0
##$AQ_mod= 1
##$AUNM= <au_zg>
##$AUTOPOS= <>
##$BF1= 200.13
##$BF2= 200.13
##$BF3= 200.13
##$BF4= 200.13
##$BF5= 200.13
##$BF6= 200.13
##$BF7= 200.13
##$BF8= 200.13
##$BYTORDA= 1
##$CFDGTYP= 0
##$CFRGTYP= 5
##$CHEMSTR= <none>
##$CNST= (0..31)
1 1 145 1 1 1 1 1 1 1 1 1 1 1 1 1 1 1 1 1 1 1 1 1 1 1 1 1 1 1 1 1 
##$CPDPRG= <>
##$CPDPRG1= <>
##$CPDPRG2= <>
##$CPDPRG3= <>
##$CPDPRG4= <mlev>
##$CPDPRG5= <mlev>
##$CPDPRG6= <mlev>
##$CPDPRG7= <mlev>
##$CPDPRG8= <mlev>
##$CPDPRGB= <>
##$CPDPRGT= <>
##$D= (0..31)
0 1.2 0 0 0 0 0 0 0 0.06 0 0.03 0 0 0 0 0.0002 0 0 0 0 0 0 0 0 0 0 0 0 
0 0 0 
##$DATE= 1571911199
##$DBL= (0..7)
120 120 120 120 120 120 120 120 
##$DBP= (0..7)
150 150 150 150 150 150 150 150 
##$DBP07= 0
##$DBPNAM0= <>
##$DBPNAM1= <>
##$DBPNAM2= <>
##$DBPNAM3= <>
##$DBPNAM4= <>
##$DBPNAM5= <>
##$DBPNAM6= <>
##$DBPNAM7= <>
##$DBPOAL= (0..7)
0.5 0.5 0.5 0.5 0.5 0.5 0.5 0.5 
##$DBPOFFS= (0..7)
0 0 0 0 0 0 0 0 
##$DE= 6
##$DECBNUC= <off>
##$DECIM= 24
##$DECNUC= <off>
##$DECSTAT= 4
##$DIGMOD= 1
##$DIGTYP= 9
##$DL= (0..7)
0 120 120 120 120 120 120 120 
##$DP= (0..7)
150 150 150 150 150 150 150 150 
##$DP07= 0
##$DPNAME0= <>
##$DPNAME1= <>
##$DPNAME2= <>
##$DPNAME3= <>
##$DPNAME4= <>
##$DPNAME5= <>
##$DPNAME6= <>
##$DPNAME7= <>
##$DPOAL= (0..7)
0.5 0.5 0.5 0.5 0.5 0.5 0.5 0.5 
##$DPOFFS= (0..7)
0 0 0 0 0 0 0 0 
##$DQDMODE= 0
##$DR= 18
##$DS= 0
##$DSLIST= <SSSSSSSSSSSSSSS>
$$ [...]
##$SUBNAM2= <"">
##$SUBNAM3= <"">
##$SUBNAM4= <"">
##$SUBNAM5= <"">
##$SUBNAM6= <"">
##$SUBNAM7= <"">
##$SUBNAM8= <"">
##$SUBNAM9= <"">
##$SW= 24.0689530833862
##$SWIBOX= (0..15)
0 0 2 0 0 0 0 0 0 0 0 0 0 0 0 0 
##$SW_h= 4816.95568400771
##$TD= 16384
##$TD0= 1
##$TE= 0
##$TE2= 300
##$TE3= 300
##$TEG= 300
##$TL= (0..7)
0 120 120 120 120 120 120 120 
##$TP= (0..7)
150 150 150 150 150 150 150 150 
##$TP07= 0
##$TPNAME0= <>
##$TPNAME1= <>
##$TPNAME2= <>
##$TPNAME3= <>
##$TPNAME4= <>
##$TPNAME5= <>
##$TPNAME6= <>
##$TPNAME7= <>
##$TPOAL= (0..7)
0.5 0.5 0.5 0.5 0.5 0.5 0.5 0.5 
##$TPOFFS= (0..7)
0 0 0 0 0 0 0 0 
##$TUNHIN= 0
##$TUNHOUT= 0
##$TUNXOUT= 0
##$USERA1= <user>
##$USERA2= <user>
##$USERA3= <user>
##$USERA4= <user>
##$USERA5= <user>
##$V9= 5
##$VALIST= <valist>
##$VCLIST= <CCCCCCCCCCCCCCC>
##$VD= 0
##$VDLIST= <DDDDDDDDDDDDDDD>
##$VPLIST= <PPPPPPPPPPPPPPP>
##$VTLIST= <TTTTTTTTTTTTTTT>
##$WBST= 1024
##$WBSW= 4
##$XGAIN= (0..3)
0 0 0 0 
##$XL= 0
##$YL= 0
##$YMAX_a= 192630
##$YMIN_a= -320046
##$ZGOPTNS= <>
##$ZL1= 120
##$ZL2= 120
##$ZL3= 120
##$ZL4= 120
##$ABSF1= 10
##$ABSF2= 0
##$ABSG= 5
##$ABSL= 3
##$ALPHA= 0
##$AQORDER= 0
##$ASSFAC= 0
##$ASSFACI= 0
##$ASSFACX= 0
##$ASSWID= 0
##$AUNMP= <proc_1d>
##$AZFE= 0.1
##$AZFW= 0.1
##$BCFW= 1
##$BC_mod= 2
##$BYTORDP= 1
##$COROFFS= 0
##$CY= 11.3945322036743
##$DATMOD= 1
##$DC= 2
##$DFILT= <>
##$DTYPP= 0
##$F1P= 20.1720416913024
##$F2P= 0.152960286110954
##$FCOR= 0.5
##$FTSIZE= 0
##$FT_mod= 4
##$GAMMA= 1
##$GB= 0.15
##$INTBC= 1
##$INTSCL= 1
##$ISEN= 128
##$LB= 0.24
##$LEV0= 0
##$LPBIN= 0
##$MAXI= 10000
##$MC2= 0
##$MEAN= 0
##$ME_mod= 0
##$MI= 1.114404
##$NCOEF= 0
##$NC_proc= 0
##$NLEV= 6
##$NOISF1= 3.799351
##$NOISF2= 2.8
##$NSP= 1
##$NTH_PI= 0
##$NZP= 0
##$OFFSET= 15.70392
##$PC= 1
##$PHC0= -9567.017
##$PHC1= 4.200817
##$PH_mod= 1
##$PKNL= yes
##$PPARMOD= 0
##$PSCAL= 0
##$PSIGN= 0
##$REVERSE= no
##$SF= 200.130013532006
##$SI= 16384
##$SIGF1= 3
##$SIGF2= 2
##$SINO= 400
##$SIOLD= 16384
##$SREGLST= <1H.CDCl3>
##$SSB= 0
##$STSI= 0
##$STSR= 0
##$SW_p= 3612.71676300578
##$SYMM= 0
##$S_DEV= 0
##$TDeff= 0
##$TDoff= 0
##$TI= <>
##$TILT= no
##$TM1= 0
##$TM2= 0
##$TOPLEV= 0
##$USERP1= <user>
##$USERP2= <user>
##$USERP3= <user>
##$USERP4= <user>
##$USERP5= <user>
##$WDW= 1
##$XDIM= 8192
##$YMAX_p= 0
##$YMIN_p= 0
$$ End of Bruker specific parameters
$$ ---------------------------------
##NTUPLES= NMR FID
##VAR_NAME=  TIME,          FID/REAL,        FID/IMAG
##SYMBOL=    X,             R,               I
##VAR_TYPE=  INDEPENDENT,   DEPENDENT,       DEPENDENT
##VAR_FORM=  AFFN,          ASDF,            ASDF
##VAR_DIM=   8192,          8192,            8192
##UNITS=     SECONDS,       ARBITRARY UNITS, ARBITRARY UNITS
##FACTOR=    0.0002076,     1,               1
##FIRST=     0,             0,               0
##LAST=      1.7004516,     0,               0
##MIN=       0,             -320046,         0
##MAX=       1.7004516,     192630,          0
$$ Real data points
##PAGE= N=1
##DATA TABLE= (X++(R..R)), XYDATA
$$ [...]
2004a48kO15q26J68Q45p16m38J373l81p60M66J27q20J263N9j786M02J235r82k63
$$ -148 -150 465 -361 -193 652 -64 -502 871 490 -270 196 323 -497 766 825 -961 -559 676 -306 -569
2024e69P84n14j23J164o61j373J283Q06r66j5J97m30L98R87j285l84J062m04o24
$$ -569 215 -299 -422 742 81 -1292 -9 797 -169 -184 13 -417 -19 968 -317 -701 361 -43 -667
2043f67R39k26m53Q76Q1j638N45J062p49l33O61j78o8O04m38o73O32P40j195J56
$$ -667 272 46 -407 469 550 -1088 -543 519 -230 -563 98 -80 -148 456 18 -655 -23 717 -478 -322
2063c22L52j91J3R98j383k18J759m25r84M88K08n18M93J12j191Q56J042j185n43
$$ -322 30 -161 -148 850 -533 -751 1008 583 -401 87 295 -223 270 382 -809 47 1089 -96 -639
2082f39J077o32J87K85m43p15R62Q25j195j17Q19p27K47O82q90l21J350m32p28
$$ -639 438 -194 -7 278 -165 -880 82 907 -288 -405 414 -313 -66 616 -274 -595 755 323 -405
2101d05N69M94j334J222J6j072K99P76j120K85P53p12k9N16j77p05P27K83j151
$$ -405 164 658 -676 546 562 -510 -211 565 -555 -270 483 -229 -258 258 81 -624 103 386 -765
2120g65O07N20r48L98N86r06n7R71k04o48M47K10n59P07J26j180N37O73p91l22
$$ -765 -158 362 -586 -188 398 -508 -565 406 202 -446 1 211 -348 359 485 -695 -158 515 -276 -598
2140e98N80k78j15Q41j63j159P37M28q07N09J81q34P29O46r29m93J148m21k05
$$ -598 -18 -296 -411 430 267 -892 -155 273 -534 -25 156 -678 51 697 -232 -725 423 2 -203
2159b03M52j84r56J163N20j371O0R86l54r5N19q43n01J650o00j040P62M24m25
$$ -203 249 65 -891 272 792 -579 -519 467 113 18 537 -306 -807 843 243 -797 -35 389 -36
2178c6M02j23o45M55R43j061r02J316J16o72K15l46m29J369P4j255J75O72k23
$$ -36 366 243 -402 53 996 -65 -967 349 465 -207 8 -338 -767 602 676 -579 -404 268 45
2197D5l66M63p65M16J161o36j365R93Q21q10n9L65q02P91Q45j191q05J062K90
$$ 45 -321 142 -623 -207 954 318 -1047 -54 767 -43 -102 263 -539 252 1097 -94 -899 163 453
2216D53o87K41q7q27J474L04j587K07J225l29l75N42j319M58J342p67j115P56
$$ 453 -234 7 -80 -907 567 871 -716 -509 716 387 12 554 -765 -307 1035 268 -847 -91
2234i1P91n26L0l61m50P12Q59j347o40J350j54l27K61l72%Q28j23j432M72J186
$$ -91 700 174 204 -157 -607 105 964 -383 -1023 327 173 -154 107 -265 -265 563 440 -992 -520 666
2254F66l41m06j8l73N04O11l59j187Q07O97n82J91n6n10N21P79j398l68R06Ql36
$$ 666 325 -81 -99 -472 32 643 284 -903 -96 601 19 210 154 -356 165 944 -454 -822 84 92 -244
2275b44N73n11k91Q55K95j150J06Q82n63j8L85p24L01Q77q05o30N56M13m22K43
$$ -244 329 -182 -473 382 677 -473 -367 515 -48 -66 319 -405 -104 773 -32 -662 -106 307 -115 128
2295A28o1o39O26O44q74p44J091j35k30K68n59J85R45q0j103J43P19l23k66N38
$$ 128 67 -572 54 698 -176 -920 171 36 -194 74 -485 -300 645 565 -538 -395 324 1 -265 273
2315B73q03J68J024o55p36O55M06m91M92j55q98R18P61j117k66N18k85L41J49
$$ 273 -530 -362 662 7 -729 -74 332 -159 333 178 -720 198 959 -158 -424 94 -191 150 299
2334B99o04q20J614K25j200l4N69l8K31K82j368K09J600k55j630Q26K2O1K40P4
$$ 299 -305 -1125 489 714 -486 -520 49 11 242 524 -844 -635 965 710 -920 -94 -72 -11 229 303
2354C03j225Q72J326j220o36O29K12Q8j3n21o75J582K03j539J37R12j82L80k71
$$ 303 -922 -50 1276 56 -580 49 261 349 336 -185 -860 722 925 -614 -477 435 253 633 362
2373C62j141J78J675l91j409O66M95m37j04K88j033Q94J020j056p72Q82q4K87
$$ 362 -779 -601 1074 683 -726 -60 435 -2 -106 182 -851 43 1063 7 -765 117 33 320
2391C20J75q98l76J300M93j595j77J022O5J25k27j046L94J241n33p93M32K60k66
$$ 320 495 -403 -779 521 1014 -581 -758 264 329 454 227 -819 -425 816 283 -510 -78 182 -84
2410h4M53p28o64R72J271j115p81N07R4J59L57j171j27J603J15j550J90Q27k53
$$ -84 369 -359 -1023 -51 1220 105 -676 -169 -75 84 441 -730 -857 746 861 -689 -499 328 75
2429G5L76m07o75N06R62o78r61N79K69P3M08q92q00J165Q41q18p41O42J78k02
$$ 75 451 44 -631 -125 837 159 -802 -223 46 119 527 -365 -1165 0 841 23 -718 -76 102 -100
2449a00K06k19o24J171K69q37k45k4M33J69K08j207N15J174p26n32R3N09l94O97
$$ -100 106 -113 -737 434 703 -134 -379 -403 30 199 407 -800 -285 889 163 -369 -276 233 -161 536
2469E36n31p54O01R56p21o95N26j93J88N26q79l50J015P69j629J65Q30m98N49
$$ 536 5 -749 -148 808 87 -608 -82 -275 -87 439 -440 -790 225 994 -635 -470 360 -138 411
2488D11J21j325K00J422k98q87K29J76J19L65o51q39Q53J139j203r8J78m47J010
$$ 411 532 -793 -593 829 531 -356 -127 49 168 533 -118 -957 -104 1035 -168 -266 -88 -535 475
2507D75L84j162k80J063J81q60k09L88j88N95J57j396K47J076J01r59j88M87j36
$$ 475 859 -303 -583 480 661 -199 -408 -20 -208 387 544 -852 -605 471 572 -387 -575 -88 -224
2526b24Q64j97j364Q66R88p77p12M92j15N63M30j458m73J585M19r63l50J99J84
$$ -224 640 443 -921 -55 933 156 -556 -64 -179 384 814 -644 -1117 468 887 -76 -426 -227 -43
2545d3P65j88j049M4J222m85o56K89j16M55L61m96r46P90J093j033k50J94m39
$$ -43 722 534 -515 -471 751 266 -390 -101 -217 238 599 103 -843 -53 1040 7 -243 -49 -488
2564d88Q85L72j289m55J238O66q75k61k29L83O71l5j184j94J221M1j122M56J69
$$ -488 397 769 -520 -975 263 929 54 -207 -436 -53 618 583 -601 -795 426 467 -655 -199 -30
2583c0j33J081j006p08N71J204o49r66O35n07N45R00j637k97J498M5n15k04k05
$$ -30 -163 918 -88 -796 -225 979 330 -636 -1 -508 37 937 -700 -997 501 546 31 -173 -378
2602c78K22O99m51q67K65J146k81n87K68k29J43P85l95j234O28J215p01p80M34
$$ -378 -156 543 92 -775 -510 636 355 -232 36 -193 -50 735 340 -894 -266 949 248 -532 -98
2621i8l03N25N67r55n55J092L09r38K03M6j90J031N1j440L07N75L68p64k29J6
$$ -98 -401 124 691 -264 -819 273 582 -356 -153 -107 -297 734 785 -655 -348 227 595 -169 -398 -382
2641c82J80P90j92j374P57J094q43m04L85m51Q02R1p03n01J054K95q91L27k69
$$ -382 -202 588 396 -978 -221 873 30 -374 11 -440 362 453 -250 -751 303 598 -293 34 -235
2660b35m04J092K15j192j2J200p23j3n2m29K04R01j95r93K93R40k61k83j43m09
$$ -235 -639 453 668 -524 -536 664 -59 -72 -124 -553 -349 552 357 -636 -343 597 336 53 -90 -499
2680d99L76Q83p17p56J078K24o33R9k50rO19J49j017k18J097j32j46k45m90K22
$$ -499 -123 760 43 -713 365 589 -44 55 -195 -204 415 564 -453 -671 426 294 148 -97 -587 -365
2700c65Q87m03q92L71R72o80J09j79k80O49O34q22j072J421L91n90O2k38k62N61
$$ -365 522 119 -773 -402 570 -110 -1 -180 -460 189 823 1 -1071 350 741 151 213 -25 -287 274
2720B74O15j431q5J151k91k60j84l28J70J387p36j125O27O83m28j02L11p29N79
$$ 274 889 -542 -627 524 233 -27 -211 -539 -369 1018 282 -843 -216 467 39 -63 248 -481 98
2739I8J071j352o15Q76K72l14K08m82J5R71m1j140m50J345o8o13J81j95O3O54
$$ 98 1169 -183 -798 78 350 36 244 -238 -223 748 707 -433 -883 462 394 -219 -38 -233 -170 484
2759D84k58r94N77O96n66J55k45l26M14R64j115l87O88M29n21p0r2o5O24j0j065
$$ 484 226 -768 -191 505 -61 94 -151 -477 -63 901 -214 -601 87 516 -5 -75 -167 -232 392 382 -683
2780f83J8J051n36M1Oj36k03Q45P6j310M88R82q96O09j82r36P04P35q81l59O35
$$ -683 -665 386 -150 -109 -103 -239 -442 403 479 -831 -343 639 -257 352 170 -766 -62 673 -208 -567 68
2801F8J52r6N8l31o47J183L09j080k90Q05J02j64k31L4j62R93k30j316P04M88
$$ 68 220 124 182 -149 -796 387 696 -384 -674 131 233 69 -162 -128 -290 703 473 -843 -139 349
2821C49j93l41o2l67P33N42p20n01O19K54n21M32l87m80J060K07q27l90R82r3
$$ 349 156 -185 -247 -614 119 661 -59 -560 59 313 -208 224 -163 -643 417 624 -203 -593 389 296
2841B96p9j32o01L53P08m39n38l6P54l57Q1j19m58L80J111j130j66N48Q0l05M30
$$ 296 217 85 -516 -163 545 106 -432 -468 286 -71 10 -109 -567 -187 924 -206 -372 176 256 -49 381
2862C81l21m75N18O40j127l70P66j9NL37o22l19J128k17r89N39K61k18K15j66
$$ 381 60 -415 103 743 -384 -754 12 -7 -2 335 -287 -606 522 305 -684 -145 116 -102 113 -53
2882e3n23O47Q29q84o45M86Q0qM62m26l92P90K52r33R3M83l22J06J04m92J80P84
$$ -53 -576 71 900 16 -629 -143 -63 -71 391 -35 -427 363 615 -318 -225 258 -64 42 146 -346 -166 618
2904F18n63m60J77K78j50K71Q0r47N63K65J1n53J07K03J82m9J9o38J015M21j091
$$ 618 55 -405 -228 50 -100 171 251 -696 -133 132 143 -410 -303 -100 82 33 52 -586 429 850 -241
2925b41j26N16l65J28O91q54J24N68k02p69K97K02R0j92J22o34P23N93n57o10
$$ -241 -367 149 -216 -88 603 -251 -127 441 239 -530 -233 -31 59 -133 -11 -645 78 671 114 -496
2945d96N06K01k12M8R7o99Q56L44q26k22O62k31n8K70l79m10J025j19q81P06l35
$$ -496 10 211 -1 47 144 -555 301 645 -181 -403 259 28 -30 240 -139 -549 476 357 -524 182 -153
2966a53J32J44j04n99R30L51o62j93L26k43M6J29m71j28O80L71q24J12L83m31
$$ -153 -21 123 19 -580 350 701 39 -154 172 -71 -25 104 -367 -495 185 556 -268 -156 227 -204
2986b04L46P0m63l00J010k04n81L62L29m33M55r6p23N41O23o59m57O29k48l06
$$ -204 142 212 -251 -551 459 255 -326 36 365 -68 387 291 -432 109 732 73 -384 245 -3 -309
3006c09M82l88j84Q32Q2p84N0N67j47n5K14o77l24Q81J89p20L73o3p4M02k80o15
$$ -309 173 -215 -399 433 515 -269 -219 348 201 146 360 -317 -641 240 429 -291 82 19 -55 347 67 -548
3028e48O15K07m95q8N32j97j53M73l90m05L90M46o93J99K24l30K35Q1m69R1P58
$$ -548 67 274 -221 -309 223 26 -127 346 -44 -449 -59 387 -306 -107 117 -213 22 103 -366 -275 483
3049D83k55o06O46n5p18M86L29q37J41J067n35n44K68L81j95L20l50m61P69Ln90
$$ 483 228 -378 268 213 -505 -19 310 -527 -386 681 146 -398 -130 251 56 376 26 -435 334 337 -253
3070b53kL87m84N75J49n78p1P38l44p84N37J29J11J22J69p62K80M68k71k37K91
$$ -253 -255 132 -352 223 372 -206 -277 461 117 -667 -130 -1 110 232 401 -361 -81 387 116 -121 170
3091A70k34j14N00n43o77J205%m98J13L91r19P20J67n65J89N96m06p4j02J56j29
$$ 170 -64 -178 322 -221 -898 307 307 -191 -78 313 -606 114 281 -284 -95 501 95 21 -81 75 -54
3112e4p5L54n88O21N2o55J26K41r4o2K77L1m63M19L28m27j49L35k93j36P58q55
$$ -54 -129 225 -363 258 310 -345 -219 22 -72 -134 143 174 -289 130 458 31 -118 217 -76 -212 546 -309
3134c09j06J033l90l81J02K51m67M07R9n28M8P96o01k06N39l54j32M74k07l51
$$ -309 -415 618 228 -153 -51 200 -267 140 239 -289 -241 555 -46 -252 287 -67 -199 275 68 -283
3154b83M63K37o69N93k27l31L43L03p69k9Q28l94m01J05O9J44kJ53m17J23K71
$$ -283 180 417 -252 341 114 -217 126 429 -340 -369 459 65 -336 -231 -162 -18 -20 133 -284 -161 110
3175A10j78l59L90k45J43N98n15k13K73K67n57K33N4l03M32J96m06k1K97k30J07
$$ 110 -68 -427 -37 -282 -139 459 -56 -269 4 271 -286 -53 1 -302 130 326 -80 -101 196 -34 73
3196G3L06j20m98K86q5m88N95L19n45K16K59n20k1L36k23m73Q68J80q41N88m0
$$ 73 379 259 -239 47 -38 -526 69 388 -157 59 318 -202 -223 113 -110 -583 285 465 -376 212 172
3217A72m41J44M78m66m9L96jm94M70l7k84M03j30m14K34L65q09K66K87J66m14
$$ 172 -269 -125 353 -113 -162 234 233 -261 209 172 -112 291 161 -253 -19 346 -463 -197 90 256 -158
3238a58N95n09j96LN96o43M32J68n18K34K85l30k49O73m94j40O69l00n39N09J73
$$ -158 437 -72 -268 -265 331 -312 120 288 -230 4 289 -41 -290 383 -111 -251 418 118 -421 88 261
3259B61l57K47q1l3J36R8k69k05O55j53m41J37L78m95M36k15l81J39L86m95J93
$$ 261 -96 151 70 37 173 271 2 -203 452 299 -142 -5 373 -122 314 99 -282 -143 243 -252 -59
3280e9O62n45J0J50n6o14N06J44l53K43J32n04J54N96l27k01K59K0p47O56l3k68
$$ -59 603 58 68 218 162 -452 54 198 -155 88 220 -284 -130 466 139 -62 197 217 -530 126 93 -175
3302a75L2N60n88M36J74n54k62N94l68j68P56m10j25J78M13l99J03O5l37J14K12
$$ -175 -143 417 -171 265 439 -115 -377 217 -151 -319 437 27 -98 80 493 94 197 262 -75 39 251
3323B51o30M18J93k02k47K84L36o51N79Q6p37L97Ok96J36L91j32o7J01pl30J00
$$ 251 -379 39 232 30 -217 67 403 -248 331 417 -320 77 83 -213 -77 314 182 115 216 209 -121 -21
3345b1O8j31J9M55m50nL83l04J9J30n14j48R95m21j37L17m4o28L47L3J7K5M17
$$ -21 47 -84 -65 390 -60 -65 318 14 33 163 -351 -499 496 75 -62 255 211 -417 -70 -37 -20 5 422
3368D22o45o9N09k91j52K9M29l55k60N47m87J29L85l18j85L10n6m20N41J40l01
$$ 422 -223 -292 217 -74 -226 -197 232 -123 -383 164 -323 -194 191 -127 -312 -2 -58 -478 63 203 -98
3389i8M00j50k74L37m0m56J60M98n19L6N93n79k77N92j00m86L35K08l37k34P10
$$ -98 302 152 -122 215 175 -281 -121 377 -142 -106 487 -92 -369 223 123 -363 -28 180 -157 -391 319
3410C19n12n6L55j60k25N52k12j51q4N38p78M66K38l89J77K65n42M2K47l5l13
$$ 319 -193 -249 106 -54 -279 273 61 -90 -174 364 -414 52 290 -99 78 343 -199 -157 90 55 -258
3431b58L37K5k98K92N6k18L93R7n84JN30l03m47O24j63k33L69M4k25q4L70p65
$$ -258 79 104 -194 98 154 -64 329 426 -158 -157 373 70 -377 247 84 -149 220 264 39 -45 325 -440
3453d40L09L59m41L24lj44k29N07Qn16J95J90l74J26K89k44K50P9k93k7R5J67
$$ -440 -131 228 -213 111 108 -36 -265 242 250 -266 -71 119 -255 -129 160 -84 166 245 -48 -75 20 187
3475A87l13J31J53m52N64k45k33L26o8J76k76M28k05n4J01l64j11L26kk10n2L57
$$ 187 -126 5 158 -294 270 25 -208 118 50 226 -50 378 173 119 220 -144 -255 71 69 -141 -193 164
3497A64m46j22N85o5m19L26J72n02L95j96q4K54J51m92L07Q1r2j98L77n4q8j08
$$ 164 -282 -404 181 116 -303 23 195 -307 88 -108 -192 62 213 -279 28 109 17 -181 196 142 54 -54
3519e4K22m36J81L35n65L41L24o13R9P09n49j71M61k44k64O75j70m46L9K14l80
$$ -54 168 -268 -87 248 -317 24 348 -265 -166 543 -6 -177 284 40 -224 451 281 -165 -126 88 -292
3540b92L88K97p87M19P6j73k8M2P9k36K13Q3m93M54K20m15O6J15po3L46j35m95
$$ -292 96 393 -394 25 101 -72 -100 -58 21 -215 -2 81 -412 42 262 -153 -87 28 21 -42 304 169 -326
3563c26N07Q3m94L3L33k55KM23m54j61N54l55n2M16K15l94K34j38k62J32Q2j66
$$ -326 181 264 -230 -197 136 -119 -117 306 -148 -309 245 -110 -162 254 469 75 309 171 -91 41 123 -43
3585d3J89R5k50l50O62m64j22L11J93n62K05K07N1O8L37o09j94O14l43k25K82
$$ -43 146 241 -9 -359 303 -161 -283 28 221 -341 -136 71 122 190 527 -82 -276 338 -5 -230 52
3606E2k3l38J62N89n45k2L10p27M07M41n27J57K54j55k23K38Mj60O0R1j91J64
$$ 52 29 -309 -147 442 -103 -125 185 -542 -135 306 -221 -64 190 35 -188 50 54 -106 -46 45 -146 18
3628A8M4P3j58J48l04M21n5m3m20K26P5k86K7L75k93J19M87p46M73k02o8j19M12
$$ 18 62 135 -23 125 -179 242 187 144 -276 -50 25 -261 -234 141 -152 -33 454 -292 181 -21 -89 -208 204
3651B04k01j48K67l0k46J82L33l23q4J67k01J24L85m37j91K96j87l14O14jl79
$$ 204 3 -145 122 92 -154 28 361 38 -46 121 -80 44 429 -8 -199 97 -90 -404 210 209 -170
3672a70L18m1m85J00N09m74O7M73l65q7N06l45m0J8J08O8k12L36k87p4J59K2k25
$$ -170 148 107 -378 -278 231 -243 -176 297 -68 -155 351 6 -34 -16 92 160 -52 284 -3 -77 82 104 -121
3695a21KM48k96J09Rq9qK00l61J82J34k02L0M6l60K27J21j2j25K39l66R3l08M95
$$ -121 -119 329 33 142 151 62 54 254 -107 75 209 7 37 83 -277 -50 71 59 -66 173 -193 -100 -408 87
3719H7k6j49K32j91p2K2J73l14K42K15j18O9Q7l34j60L20L0j82K33l08q7J49L55
$$ 87 61 -88 144 -47 -119 -97 76 -238 4 219 101 170 257 -77 -237 83 113 -69 164 -144 -231 -82 273
3742B73n12K89K33n84m0M80j15o3J02p2l64N23m3l72L22Kk90L82J68n84J76M99
$$ 273 -239 50 283 -301 -341 139 24 -39 63 -9 -373 150 107 -265 57 59 -231 151 319 -265 -89 410
3764D10k65l34O47n44j16M80J06n35R0L45k86j16K77k67o1K70j22m1K22J69m73
$$ 410 145 -189 458 -86 -202 278 384 -151 -61 284 -2 -118 159 -108 -169 101 -21 -62 160 329 -144
3785a44Q1M76l92j85M51o54J92L40k23j85K76J36k64k8L33j88R0O2l44J31J5k08
$$ -144 -63 413 21 -164 287 -367 -175 165 -58 -243 33 169 -95 -123 210 22 112 174 -170 -39 -24 -232
3807b32R5N32k52k42M8K15j42j21J13j63o0O29n79M5M13l68l21M94m7j64R4l1
$$ -232 -137 395 143 -99 -51 164 22 -99 14 -149 -209 420 -159 -114 299 -69 -390 104 57 -107 -13 -44
3829d4k77O77l68q7J5M11k75p8M0l84L70K5J43j36J36O2j89p1J44m29K86J89m
$$ -44 -321 356 -12 -99 -84 327 52 -26 14 -370 0 25 168 32 168 230 41 -30 114 -315 -29 160 156
3852A56r4J60o7l71L47N7k86N74k17m48L80J35p40L7N86k38j29L54j94l69M54
$$ 156 62 222 155 -216 131 188 -98 476 259 -189 191 326 -414 -377 209 -29 -158 196 2 -367 87
3873H7Q5l18L7J91k45k82M80j31l4M78l16p0N08j32o66L30J61m12M13J4k94P1
$$ 87 172 -146 -109 82 -163 -445 35 -96 -130 348 32 -38 470 338 -328 2 163 -249 164 178 -116 -45
3895d5k5K2j99M09j11n03N28j39k85N04l39n2J83pq6J03K34p3k41J8O2m13M52
$$ -45 -70 -48 -247 162 51 -452 76 -63 -348 156 -183 -235 -52 -59 -145 -42 192 119 -122 -104 -42 -455 -3
3918cQ9k04J58K29j74l64K93J8j33M8p1J14L63k22m6k52N62m17O5L27n89L2j79
$$ -3 86 -118 40 269 95 -269 24 42 -91 -43 -114 0 363 141 95 -157 405 -12 53 380 -209 -177 -356
3941c56J75pK88j74K9J99j52j78K3J07j61J15M78m11K1Q0j29k05mM75l62L42j27
$$ -356 -181 -188 100 -74 -45 154 2 -176 -153 -46 -207 -92 386 -25 -4 76 -53 -258 -262 213 -149 193 66
3964F6j11k23M12k94l19P00k31PJ69j92j25K24M3Rk91M79n27K39J57j30l36N80
$$ 66 -45 -268 144 -150 -469 231 0 7 176 -16 -141 83 126 135 -156 323 -204 35 192 62 -274 306
3986C06l25J8O0n5l66M38J45l25J38r7Kl0p0J04j66L77k6l02K42J67k52J07R4
$$ 306 -19 -1 59 4 -362 76 221 -104 34 -63 -61 -91 -161 -57 -223 154 128 -174 68 235 -17 90 184
4009A84k24l62N59l45L51K00n75M4N5L85m94J50K37j00j38K42j17l07M27o0m07
$$ 184 -40 -402 157 -188 163 363 -212 -168 -113 272 -222 -72 165 65 -73 169 52 -255 172 112 -295
4030b95K82J12k01R6K0L33l02J34k14nJ50l89k2N06k03l11M68r1k97K10R9p3r8
$$ -295 -13 99 -102 -6 14 347 45 179 -35 -40 110 -279 -301 205 2 -309 159 68 -229 -19 80 7 -91
4053i1J39j46J98J73l48j74L79j87j66J13L65j43l22K06p8N5M69j78l22J38j30
$$ -91 48 -98 100 273 -75 -249 130 -57 -223 -110 255 112 -210 -4 -82 -27 442 264 -58 80 -50
4074e0k13P61m42j70Q8l0J6M39k58j55N9J01k20R2J02q1j57L64k18k22j50N63
$$ -50 -263 498 56 -114 -26 -56 -40 399 141 -14 45 146 -74 18 120 39 -118 246 28 -194 -344 219
4096B19m36L71L12n87K46j12J46k36J27Q7k51J43j12J79J05j5l47J33L06m10o4
$$ 219 -217 154 466 -121 125 13 159 -77 50 137 -114 29 -83 96 201 186 -161 -28 278 -132 -196
4117a96M02l77J48J83k03J86j17J2k78M54l11P7m1J24k42j07M66j29j69K13K66
$$ -196 206 -171 -23 160 -43 143 26 38 -240 214 -97 -20 -61 63 -179 -286 180 51 -118 95 361
4138C61n49P0M23n53M5L17j89j4RP8j55L66j03k65J34R9N2K3p6k09L3K41k87R
$$ 361 -188 -118 305 -248 -203 114 -75 -89 -80 -2 -157 209 106 -159 -25 74 126 149 73 -136 -103 138 -149 -140
4162a40M17j81q7K54j27l84K36K71m25J68J7J3J37M1k71o3M18m92N4P1N8k98N26
$$ -140 277 96 9 263 136 -248 -12 259 -166 2 19 32 169 210 -61 -124 294 -198 -144 -73 -15 -313 213
4185B13l31No6k5J87j21N7j51kK08J74l36J79l0N5J25K30n78m7K57N7j46N5J13
$$ 213 -118 -113 -179 -204 -17 -138 -81 -232 -234 -26 148 -188 -9 -39 16 141 371 -207 -254 3 60 -86 -31 82
4209H2m62M45J69k42r9J19l12L26l7J9n4o5J66N3o2K1j85J56j5K2j46M25j60n7
$$ 82 -380 65 234 -8 -107 12 -300 26 -11 8 -46 -111 55 108 46 67 -118 38 23 45 -101 324 164 107
4233A07J7M0M0r8K07n02J63M11l91K0L9J93m52L70j41j50K53o7l86N56m54K36
$$ 107 124 164 204 106 313 -189 -26 385 -6 14 53 246 -206 164 23 -127 126 59 -327 229 -225 11
4255A1J14j8l45m3N5K19k10J33K11l04J75P0k98M16R8n67L32R2Q1m60L2L20l31
$$ 11 125 107 -238 -281 -226 -7 -217 -84 127 -177 -2 68 -230 186 284 -283 49 141 222 -238 -206 114 -217
4278b17L25q3o4N67p45L23m43N46j35k72L07j79k28M94j62j92R3J26k08K43j51
$$ -217 108 25 -39 528 -217 106 -337 209 74 -198 109 -70 -298 196 34 -158 -65 61 -147 96 -55
4299e5P2o5L35j76j4P4j77j50j11N63o96M83m6k94K73n5m9K25l76L63q5J99k67
$$ -55 17 -48 287 111 97 171 -6 -156 -267 296 -400 83 37 -257 16 -39 -88 137 -239 124 39 238 -29
4322b9K6L2k1r7J27n3j58K16L53l56lJ35n17L63J96k01m35M99Ol17K59r9j4J14
$$ -29 -3 29 8 -89 38 -15 -173 43 396 40 37 172 -345 18 214 13 -422 77 83 -234 25 -74 -88 26
4346B6L02n27j91L26K0j37L15k68L51r2J94n88J97L82m55P5L84l81J06j01J2O1
$$ 26 328 -199 -390 -64 -44 -181 134 -134 217 125 319 -269 -72 310 -145 -70 314 -67 39 -62 -50 11
4368A1m7%l2K07lk03K38l45K10k11P1R6j44J70jq0M12n61J43k2n3J57j38Q7k65
$$ 11 -36 -36 -68 139 136 -67 171 -174 36 -175 -104 -8 -152 18 17 -63 349 -212 -69 -91 -144 13 -125 -38 -303
4393c03J03j46J63N6L13j52r7p3J29j05J91Q9l09m1L49l98L15k73K31k63K61j38
$$ -303 -200 -346 -183 -127 186 34 -63 -136 -7 -112 79 168 -141 -182 167 -231 84 -189 42 -221 40 -98
4415i8p0K48l73J22L22J47k69j57L28l77J83j93K1r2M35M55q23J03L62j91k33
$$ -98 -168 80 -293 -171 151 298 29 -128 200 -177 6 -187 -166 -258 177 632 -191 -88 274 83 -150
4436a50M31l13RL4J66q7k28L7q8J72K41m21n1N94o20K82J28m22L54M8m11L94k50
$$ -150 281 -32 -23 11 177 90 -138 -101 -189 -17 224 -197 -248 346 -274 8 136 -286 68 116 -295 99 -151
4459a51Q4R9K89o25L74j50K20J73l43P5J28m73J62J51R5j07J43l84J50J95k52
$$ -151 -67 32 321 -304 70 -80 140 313 -30 45 173 -300 -138 13 108 1 144 -240 -90 105 -147
4480a47K10j95L15k97J03j63M03l09K78k39M28j30m74L14J94m62N8J58j65QN4
$$ -147 63 -132 183 -114 -11 -174 229 -80 198 -41 387 257 -217 97 291 -171 -113 45 -120 -112 -58
4501e8Q9l69N28k93J71k10L87k46p4J04k38M27k54m0m6L5O04o59j5K24m5j93J13
$$ -58 31 -338 190 -103 68 -142 245 -1 -75 29 -209 218 -36 -76 -122 -87 517 -142 -157 67 22 -171 -58
4524e8L01n69M89k42j52J63K09j79J93k06J79J0k12Q3K98n18J09m5L22N3l02K22
$$ -58 243 -326 163 -79 -231 -68 141 -38 155 -51 128 138 -74 9 307 -211 -102 -147 175 228 -74 148
4546A48K7j58P5L6m18Q8J76J84n02L06J33J0k53m0K17k98N06m43L6K91N3j77O7
$$ 148 175 17 92 128 -290 -202 -26 158 -344 -38 95 105 -148 -188 29 -269 237 -206 -170 121 174 -3 64
4569F4k07J68kn0j75K24k8k73J17L44n8j75l0Q7nK00j67r9Q5J06K2m8j92j00J85
$$ 64 -143 25 23 -27 -202 22 -6 -279 -162 182 124 -51 -81 6 1 201 34 -65 20 126 148 100 -92 -192 -7
4594gk8o3m7K48l04K10K03J31n94Q0Q1k98O56j93R3J28N1m91PL32j40q6Q3L5m6
$$ -7 -35 -98 -145 103 -201 9 212 343 -251 -171 -90 -388 268 75 168 296 347 -144 -137 195 55 -31 52 87 41
4619D1j20K86k76J94k00L1O4k10K90N0J76l72l7J61k06J09n9q0N7K65j32j36K47
$$ 41 -79 207 -69 125 -75 -44 20 -190 100 150 326 -46 -83 78 -128 -19 -78 -158 -101 164 32 -104 143
4642A43k30l60L20K59O3m13J45p2K65J4p6k07j39O5J02K74j43p8K7J35n9j30K53
$$ 143 -87 -447 -127 132 195 -218 -73 -145 120 134 58 -149 -288 -223 -121 153 10 -68 -41 94 35 -95 158
4665A58j78J36k06J86j07j64O03k95j97J72j50n4k9K71m40L82j72J5L48Pk68K11
$$ 158 -20 116 -90 96 -11 -175 428 133 -64 108 -42 -96 -125 146 -294 88 -84 -69 279 286 18 229
4687B29J61o56K57P0rk16K00M7p7k39M75j2m94M04j78J86j31j54R6J54J3l43K9
$$ 229 390 -266 -9 61 52 -164 36 83 6 -233 242 230 -264 140 -38 148 17 -137 -41 113 126 -217 -188
4710a88M5J68k6J01m13K67j56K19J98k33L6N6O7l16K06J34l04r6J31K23j52kp
$$ -188 -143 25 -1 100 -313 -46 -202 17 215 -18 18 74 141 -175 31 165 -139 -235 -104 119 -33 -35 -42
4733d2m5k24J93K68j04k11K01M2J20l16K50j80J70J44j89J43j47k32J35J45j12
$$ -42 -87 -311 -118 150 46 -165 36 78 198 -118 132 -48 122 266 77 220 73 -159 -24 121 9
4754Ip4m8l8J11k06R6J8k4n9P8J55R2r3O5j99j7K27j35Q1j78J60j89J09j59K54
$$ 9 -65 -113 -151 -40 -246 -150 -132 -156 -215 -137 18 110 17 82 -117 -134 93 -42 39 -139 21 -168 -59 -218 36
4779C6l0m2J06k07NK58l04J48LJ49j14P3J1l4J10k65J02p1N1m3K36l88N16m50
$$ 36 6 -36 70 -137 -132 126 -178 -30 -27 122 8 81 92 58 168 -97 5 -66 -15 -58 178 -210 306 -144
4803a44K43k93J79R8MQl35L10q1M6j09l30M30kj52l1K8Nj26P3J87M0R7r9J33l31
$$ -144 99 -194 -15 83 87 95 -240 70 -11 35 -74 -404 26 24 -128 -159 -131 -126 -252 -179 8 48 145 46 179 -152
4829a52L93l00K74k20j08J7o4K88J5j98Q1J19l5l4j71L03j83J96l27J07K25j59
$$ -152 241 -59 215 -5 -113 -96 -160 128 143 -55 26 145 110 76 -95 208 25 221 -106 1 226 67
4851F7m8J10k32j7J35L9J09j34R2m7J58k09QJ6n5n6J19J75j89J44j95k91L30Q9
$$ 67 19 129 -103 -120 15 54 163 29 121 74 232 23 31 47 -8 -64 55 230 41 185 -10 -301 29 118
4875A18j35Q4K16M0k78q0J14l16M11j73k26L01q0Q7j89L25k19q8j06K34l0m3K36
$$ 118 -17 67 283 323 45 -35 79 -237 174 1 -225 76 -4 83 -106 219 0 -88 -194 40 10 -33 203
4898B03k69j24L03j62K06j70Q2P6r6L4O0k71K5p3M91l17O8K8m86L73n9O1K4J00
$$ 203 -66 -190 113 -49 157 -13 69 145 49 83 143 -128 -103 -176 315 -2 66 94 -392 -19 -78 -17 7 107
4922A07p6q4n6M57l98L28k85J20k83r3J65K08k1l2k51K97r6m0m6L4j74J90op1
$$ 107 31 -53 -109 348 -50 278 -7 113 -170 -263 -98 110 89 57 -194 103 7 -33 -79 -45 -219 -29 -35 -106
4946a06K3K04k76K88j34p9K75m77J53j29O0P0J68j26k29M09j61N4j0o4K79k39
$$ -106 -83 121 -155 133 -1 -80 195 -282 -129 -258 -198 -128 40 -86 -315 94 -67 -13 -23 -87 192 -47
4968d7K94J8k62k84M28m18K8J87j40J80K08k13J93j03J9K90n42J60j0K4m8K03
$$ -47 247 265 3 -281 147 -271 -243 -56 -196 -16 192 -21 172 69 88 378 -164 -4 -14 10 -38 165
4990A65j54l1q7M90o14R4J24K92l48k50K17Q7n2J88j24j29J17N0m3K23k03l69
$$ 165 11 -20 -107 383 -231 -137 -13 279 -69 -319 -102 -15 -67 121 -3 -132 -15 35 -8 215 12 -357
5012c57N14J96n85K76J49o3j32kj8J08J6m67L32J14j06M4J95l60J2J25k20L31
$$ -357 157 353 -232 44 193 130 -2 -4 -22 86 102 -365 -33 81 -25 19 214 -146 -134 -9 -229 102
5034A02j29r9K83l6j87K2J98j27L2K13j19P6k01j21J1OM01l64k32L75j6j80K50
$$ 102 -27 -126 157 121 -66 -44 154 27 59 272 153 229 28 -93 -82 -76 325 -39 -271 104 88 -92 158
5057A58J28k43K09j77j02j68L29j15R7k61J55J28l20N5L3j06K71p6j13P4J44P0
$$ 158 286 43 252 75 -27 -195 134 19 116 -145 10 138 -182 -127 -94 -200 71 -5 -118 -44 100 170
5079A70J4l44L31O6m59R2M1p2j03K9O34n29L92l09j60L15j50J84n4k77R8K29l65
$$ 170 184 -160 171 237 -222 -130 -89 -161 -264 -235 399 -130 262 -47 -207 108 -42 142 88 -189 -91 138 -227
5102b27K47j99J76j18R2J23j09J39k69M2K02j80j4N0J81P9m2j60J39p7M9l25L57
$$ -227 20 -179 -3 -121 -29 94 -15 124 -145 -103 99 -81 -95 -45 136 215 173 13 152 75 124 -201 156
5125A56j19k09L0L68j89J96l02q4k2J53L12l76l37N20j19o4J7K97r8K84n75jM93
$$ 156 37 -172 -142 226 37 233 -69 -153 -175 -22 290 -86 -423 97 -22 -86 -69 228 130 414 -161 -162 331
5148C31n56N13l58K51k33J31o4Q5k05K79j50K4P3j66kJ76r5j34K15j67j3M51j95
$$ 331 -225 288 -70 181 -52 79 15 100 -105 174 24 48 121 -45 -47 129 34 -100 115 -52 -65 386 191
5171A91Rl14M0K70j35N4j59L43m52L18j67l19L03J4j49J38P5n3k15J09J59r1M9
$$ 191 200 -114 -74 196 61 115 -44 299 -153 165 -2 -321 -18 -4 -153 -15 60 7 -208 -99 60 -31 18
5194A8r7K85J7k10j7R3k80K5K69q1p5K59k31J0m5J07K05l67J20J19j15N2J05l46
$$ 18 -79 206 223 13 -4 89 -191 -166 103 22 -53 206 -25 -15 -60 47 252 -115 5 124 9 61 166 -180
5218a80J91NO5n0J67l0q4J46m31J17m5M8n7L8l05M34j41N32l39J8J87l67O2J56
$$ -180 11 16 81 31 198 168 84 230 -201 -84 -129 -81 -138 -100 -405 29 -112 420 81 99 286 -81 -19 137
5242A37l49J70j26K45K66j5q6j56o5r6J43M4o6P2j9j60P5o4K93l18K36j84o1J05
$$ 137 -212 -42 -168 77 343 328 242 86 21 -75 68 112 46 118 99 -61 14 -50 243 -75 161 -23 -84 21
5266B1N4Q1l74j14L13P3J4mrk14K82j81J18L64j75n1nj73k93J20L60j43k86L49
$$ 21 75 156 -218 -332 -19 54 68 64 55 -159 123 -58 60 424 249 198 193 20 -273 -153 207 64 -222 127
5290A27j7J1k9k91J05M40k65j08PJ25o9K06l87J58L72j8j77l1n8l95K84R2k00
$$ 127 110 121 92 -199 -94 346 81 -27 -20 105 36 242 -145 13 385 367 190 159 101 -294 -10 82 -118
5313a18R6L6l8P9j86L09K01m06j31L49j55j9j80O4K6J19j37M44l25M2J61m95K66
$$ -118 -22 14 -24 55 -131 178 379 -27 -158 191 36 17 -163 -99 -73 46 -91 353 28 70 231 -264 2
5336Bl23J38K15p5K25k10k69L77P7k22L87m85L29m71L38m06L34K01k31rJ88k33
$$ 2 -321 -183 32 -43 182 -28 -297 80 157 -65 322 -163 166 -305 33 -373 -39 162 -69 -78 110 -123
5358a23o8J93N4K09l48K38k14L5K28j08mK29m86P3L5N30m68j36m2J56j72J96L02
$$ -123 -191 2 56 265 -83 155 -59 -24 204 96 92 321 -165 -92 -57 473 5 -131 -173 -17 -189 7 309
5381C09l78lK1K47k11J77j59l4k9L70k23Q7k23K2j28k97K97j02K26lM0O7m3j38
$$ 309 -69 -72 -51 196 -15 162 3 -31 -60 310 87 174 -49 -27 -155 -452 -155 -257 -31 -34 6 73 30 -108
5405a08J69q7j24K64k70K54k51L30j38K01q4l20J83J96pl18m3Q2k6M2J76j46L5
$$ -108 61 -26 -150 114 -156 98 -153 177 39 240 156 -164 19 215 208 -110 -153 -71 -97 -55 121 -25 10
5428A0m5P0j10K58j43k14K46j3J41j14J47l7j24P3j77q2P7m7j74L64j32P9k43
$$ 10 -35 35 -75 183 40 -174 72 59 200 86 233 196 72 145 -32 -114 -37 -84 -258 106 -26 53 -190
5451a90L63q5m38N02K7l48K76j04J00k27PK24J87k49J77l7K4m58L51j19q8K03
$$ -190 173 88 -350 152 179 -169 107 3 103 -124 -117 107 294 45 222 185 209 -249 102 -17 -105 98
5473I8m7j53L6r7N2L40j43l66K56J94l9Q3k95k6j62L65J21k64J02n62K19J80L25
$$ 98 51 -102 -66 -163 -111 229 86 -280 -24 170 131 214 -81 -107 -269 96 217 -47 55 -507 -288 -108 217
5496B17n49J85K88j41r3K09j10j84J74k4j40J18K11j95p5J12M56k36l80P8J30
$$ 217 -332 -147 141 0 -93 116 6 -178 -4 -28 -168 -50 161 -34 -109 3 459 223 -157 -79 51
5517E1p5J3RK14r9J71l43J77k4q0j02N0J72m49L44J82j57R0k23L6M17l57j68o5
$$ 51 -24 -11 -2 212 113 284 -59 118 94 14 -88 -38 134 -315 29 211 54 144 -79 -43 374 17 -151 -216
5541b16J83N1Ok33J54K20l23J78Q9r6r5J73l13K31j14K01M1j61J00j56P6M6k6
$$ -216 -33 18 24 -209 -55 165 -158 20 109 13 -82 91 -222 9 -105 96 137 -24 76 -80 -4 42 16
5564A6J7r9J47l48K10K60j40n7m3j01M6m8J2j43K18k3L44j24k6j10j71J27Q2M6
$$ 16 33 -66 81 -267 -57 203 63 6 -37 -138 -92 -140 -128 -271 -53 -76 268 144 118 8 -163 -36 46 92
5588I2J30k93J7Mm3Lk09N39l53l3J24L8L08m38K63j40K92l53J82k11O9J42k39
$$ 92 222 -71 -54 -50 -93 -90 -299 240 -113 -146 -22 16 324 -114 149 9 301 -52 130 -81 -12 130 -109
5611a09K51p3j60M35m70K08K69k18j84o0J09j26j17J98j41J99j56M4J54p6m2j2
$$ -109 142 69 -91 344 -126 82 351 133 -51 -111 -2 -128 -245 -47 -188 11 -145 -101 53 -23 -65 -77
5633g7k69L86j78K07o5m9n0L57j52m9p9k68J02K78q3J25k1j91J80j94J39J27k15
$$ -77 -346 40 -138 69 4 -45 -95 262 110 61 -18 -286 -184 94 11 136 115 -76 104 -90 49 176 -39
5656c9k74J16L61j40M4k4M6k30K15jJ38j79l22N19k29j70j6J12R3Ro0J15q8P7
$$ -39 -313 -197 164 24 68 44 90 -140 75 74 212 33 -289 230 1 -169 -185 -73 20 29 -31 84 -4 73
5680G3n1K8k1p6J15j76M8K52n08K99K30l32j13K48KR3j30j53J74k87k9L07N2j38
$$ 73 22 50 29 -47 68 -108 -60 192 -316 -17 213 -119 -232 16 18 111 -19 -172 2 -285 -314 -7 45 -93
5704i3N5M6J05l84K24R3m1L2r2J1j24K91j67J86k79K19o2J71k18l09L42j97J30
$$ -93 -38 8 113 -271 -47 46 5 37 -55 -44 -168 123 -44 142 -137 82 20 191 -27 -336 6 -191 -61
5727f1J03k47L51l88J29P3K34r5l78K83M6Q1j85J09j18j24n1J17q8K77R1k24K50
$$ -61 42 -205 146 -242 -113 -40 194 99 -279 4 50 131 -54 55 -63 -187 -238 -121 -209 68 159 -65 185
5750A85L3k61j01k7K43K22n14J68L8j69N20j76j63P2P7m68J16P1M28k84k92K03
$$ 185 218 -43 -144 -171 72 294 -220 -52 -14 -183 337 161 -2 70 147 -321 -205 -134 294 10 -282 -79
5772g9j24J20J92m0j30J27J59k59m4j18L53l57j99N03j10P5J70n98M85j10p4p1
$$ -79 -203 -83 109 69 -61 66 225 -34 -78 -196 157 -200 -399 104 -6 69 239 -359 126 16 -58 -129
5794a29J66K7k46K93J25l14K85k44J35k11P9K6j79L64J0l33J43l7L0j69J76l44
$$ -129 37 64 -182 111 236 -78 207 -37 98 -113 -34 -8 -187 177 187 -146 -3 -40 -10 -179 -3 -347
5816c47M49J34k54l9K89p9m9j21O2j92K86p2q4J07j89P1k69L11J62j33k15l3J47
$$ -347 102 236 -18 -57 232 153 104 -17 45 -147 139 67 -17 90 -99 -28 -297 14 176 43 -172 -205 -58
5839e8K04j08OJ8K5j44p8L38j35k15N5L05j90P6k48p1N33j54k5k74JJ09j72L45
$$ -58 146 38 44 62 87 -57 -135 203 68 -147 -92 213 23 99 -149 -220 313 159 134 -140 -139 -30 -202 143
5863A43j39j59K53Jk07L36j99o9M09j68k32J07j92K10j80J42m8L01k00J83k84
$$ 143 4 -155 98 99 -108 228 29 -40 369 201 -31 76 -116 94 -86 56 8 309 109 292 8
5884HK6k7m8N1n4j5J41J27l05J85J72j27Q2k20o5J21K7k65o4M77l96K18j54K2
$$ 8 34 7 -41 10 -44 -59 82 209 -96 89 261 134 216 -4 -69 52 79 -186 -250 227 -169 49 -105 -83
5908h3K53O5j90k49J13J43M58n01p2K4N7j72J94L8Nk53K73K6k13J51j44J75k29
$$ -83 170 235 45 -204 -91 52 510 9 -63 -39 18 -154 40 78 83 -170 103 129 -84 67 -77 98 -131
5931a31p1K89MO1k41m0n2j01J34N4L90m53K40L6K2j91K2J35J43k61J48j26q8k13
$$ -131 -202 87 91 152 -89 -129 -181 -282 -148 -94 296 -157 83 119 141 -50 -28 107 250 -11 137 11 -77 -290
5955b90OM18N5l55J6J62O4J49m7k17R5R8o1l57J6L22k18j87M61j33L84n59M45
$$ -290 -284 134 189 -166 -150 12 76 225 178 -39 56 154 93 -264 -248 74 -144 -331 130 -3 381 -178 267
5978B67n09j1L63j36K03k63P6L6q2j89o6R9K70j14J2j00K85r6K03p2j97J12M9
$$ 267 -242 -253 110 -26 177 -86 -10 26 -56 -245 -311 -212 58 -56 -44 -144 141 45 248 176 -21 91 140
6001A40j31J23j50l2j63J18N9k02M91k41l4k07K34K2Pn7K67k35K9q9J83mN8l0
$$ 140 9 132 -18 -50 -213 -95 -36 -238 253 12 -22 -229 5 27 34 -23 244 9 38 -51 132 128 186 156
6025A56j77o1p9K43j51L6k12Q7L04j62p3N9q1K9P8K6j76L16O0l07J67J10k49m5
$$ 156 -21 -82 -161 82 -69 -33 -245 -158 146 -16 -89 -30 -111 -82 -4 22 -154 162 222 -85 82 192 -57 -102
6049a02P3l8J87k28J9l7J28N3O0k79o5P8K10k09J68l24L60K5J6J25l62J53m1k8
$$ -102 -29 -67 120 -108 -89 -126 2 55 115 -164 -229 -151 59 -150 18 -306 54 79 95 220 -142 11 -30 -58
6073e8jP3K4J75P0m43L35l13Q7J59k96L36l17J55O0p2M6j23J99p2j38K60r0o4
$$ -58 -59 14 38 213 283 -160 175 -138 -51 108 -188 148 -169 -14 46 -26 20 -103 96 24 -114 146 56 -8
6097hJ57ln2O6n09K35O0JK60l26K56mj15j5p3O6n6L66nm37k37N93J10k34K7m97
$$ -8 149 146 94 160 -349 -114 -54 -53 207 -119 137 133 18 3 -70 -4 -60 306 301 -136 -373 220 330 96 123 -374
6123c74M10j76j87N48n96M57o5J92j06J32l6k16M14j51j28J31l37L65l99o3J72
$$ -374 36 -140 -327 221 -375 82 17 209 103 235 199 -17 397 246 118 249 -88 277 -122 -185 -13
6144a3k29M08l62N1K10N5k0M32l41l78k6QK23J02k93L92l24K47m66L24o2Q2k91
$$ -13 -242 166 -196 -145 65 120 100 532 191 -187 -213 -205 18 120 -173 219 -105 142 -324 0 -62 20 -271
6167b71K78J51j53J86j1o6j93L25l31K14r7p2o4rJ54l83J71J01M6K4j94M1K34
$$ -271 7 158 5 191 180 114 -79 246 -85 129 32 -40 -104 -113 41 -342 -171 -70 -24 0 -194 -153 81
6190H1k34O1K20j37n1j29K97r3qJ75l33L1L4J62J56j10j64m7L71l49r7J71k48
$$ 81 -153 -92 128 -9 -60 -189 108 15 7 182 -151 -120 -86 76 232 122 -42 -89 282 -67 -164 7 -241
6213b41M71l23l43O02j62Q3j44K9J13r4j27k54L24K58J67m80j19N23l53J19j65
$$ -241 230 -93 -436 166 4 87 -57 -28 85 -9 -136 -390 -66 192 359 -121 -240 283 -70 49 -116
6234a16J19K01l8l98J06J67j38L47k17l29J91J34N1j19J04J37l42p9L72k9j25
$$ -116 3 204 166 -232 -126 41 -97 250 33 -296 -105 29 80 -39 65 202 -140 -219 153 124 -1
6255al6L13m30OJ23k19L19p2j79K3J00J83N9J2P0n85N29mj52N5j97q9K28J1Q1
$$ -1 -37 276 -154 -148 -25 -244 75 3 -176 -153 -53 130 189 201 271 -314 215 211 59 114 -83 -172 56 67 148
6280A48L0l33L09m7m01L19J02l23K78k8j24K6N5k08L44l07M8l2K07o6n9k80O31
$$ 148 178 -155 154 107 -294 25 127 -196 82 54 -70 -44 11 -197 147 -160 -112 -144 63 -3 -62 -342 289
6303B89l54p5J36N0J79j82K41l03r7K33r4j18j09J55n8J40K3o5l15N10l74K07
$$ 289 -65 -140 -4 46 225 43 284 -19 -116 117 23 -95 -204 -49 -107 33 56 -9 -324 186 -188 19
6325A9J16j35J15N0Q1k51j75K78j36J73j56j23J07J79j59K0O3j78L15j8m7r1k69
$$ 19 135 0 115 165 246 -5 -180 98 -38 135 -21 -144 -37 142 -17 3 66 -112 203 185 138 47 -222
6348b22K43J68k35J83l36N45o32K98M2q4o9P7j47J54K85l46K10j6l54O1K18J3
$$ -222 21 189 -46 137 -199 346 -286 12 54 -30 -99 -22 -169 -15 270 -76 134 118 -236 -175 43 56
6370E6p2O4m3r1m8K26j05j58K81J36k63L5o53O55k00o0L27K54N3m87K3K39k76
$$ 56 -16 48 5 -86 -134 92 -13 -171 110 246 -17 18 -635 20 -180 -240 87 341 394 -93 -70 169 -107
6393a07O2j4j42K18j11J69k12R1N76l93r9k70K50k01K38Q8k09N2k39P9R9m3J65
$$ -107 -45 -59 -201 17 -94 75 -137 -46 530 137 38 -232 18 -183 55 143 -66 -14 -253 -174 -75 -118 47
6416D7L2k40J59M3mN2MQ6l42Q8K57j89l16L72R6J10k2k01J82o1l26N6K22j61K88
$$ 47 79 -161 -2 41 37 89 93 179 -163 -75 182 -7 -323 49 145 255 233 32 214 153 -173 -117 105 -56 232
6441B32q7k41m7O9J75r0m6m4k10K76J73j84N6k0O7K2n3j27K00k72K47q1j77L72
$$ 232 145 -96 -143 -74 101 11 -35 -79 -289 -13 160 -24 32 12 79 101 48 -79 121 -151 96 15 -162 210
6465B10r5j87L55n0j10K2j96J16k37K79j53q8K7L0K05o8l36M07l85J94J42k77
$$ 210 115 -72 283 233 123 145 -51 65 -172 107 -46 -134 -107 -77 128 60 -276 131 -254 -60 82 -195
6487a95K54p6k84R1L96k12K43j19k4k50k3j00M84m28j6M44j98k49K18k2L44j57
$$ -195 59 -17 -301 -210 186 -26 217 98 74 -176 -199 -299 185 -243 -259 185 -13 -262 -44 -66 278 121
6509A21P9k29j90R4j85J63J30K99p11L93q5K76p0k87PL42k90L26j39J83m9n8N3
$$ 121 200 -29 -219 -125 -310 -147 -17 282 -429 -36 -121 155 85 -202 -195 147 -143 183 44 227 178 120 173
6532A73r1R5j46P1j17J92k09m1l3L32m05J5N12j94j85J58j36o4M06q1l38L65l05
$$ 173 82 177 31 102 -15 177 -32 -73 -106 226 -179 -164 348 154 -31 127 -9 -73 333 252 -86 279 -26
6555b6j20J98MK56m97M49k05j7p4l2n7R7r4N90l76k06K53k67K17O5j63l1l6k98
$$ -26 -146 52 56 312 -185 264 59 42 -32 -64 -121 -24 -118 472 96 -110 143 -124 93 158 -5 -36 -72 -370
6579c70L92q9L20p6j31o3k03M62J8k80L82n78K15J7q3K6Q3j64J59J66Jl2j02j64
$$ -370 22 -67 253 177 46 -17 -220 242 260 -20 362 -216 -1 16 -67 -41 42 -122 37 203 204 172 70 -94
6603i4K45L3n0j17L8o2j02k47L81L73o82K64l02M59N5J7j29k48J99Q0L5k87j4
$$ -94 151 184 134 17 55 -7 -109 -356 25 398 -284 -20 -322 137 192 209 80 -168 31 111 146 -141 -155
6626a55p0L98k44O0m8R7j56J31p0K51j8j50j7j97K68k35K50k06J57j58k5J67j24
$$ -155 -225 173 -71 -11 -59 38 -118 13 -57 194 176 26 9 -188 80 -155 95 -111 46 -112 -137 30 -94
6649i4L8k5j23M9J53o1j34K11N1j71O3O5pJ7l0J82l00J54QO1m3Rk4k18J20J0O7
$$ -94 -56 -81 -204 -155 -2 -63 -197 14 65 -106 -43 22 15 32 2 184 -116 38 46 107 64 73 49 -169 -49 -39 28
6676B8l03M73k43j19J04Q6o4m7M8J13m37J61K83k6J12l71L73l90J03J91j42L86
$$ 28 -275 198 -45 -164 -60 26 -38 -85 -37 76 -361 -200 83 57 169 -202 171 -219 -116 75 -67 319
6698C19k95K7j45K28k32K82m47N78o17N60l84j0q6M32k84O0j55j02L0J37K11j89
$$ 319 24 51 -94 134 -98 184 -263 315 -302 258 -126 -136 -222 210 -74 -14 -169 -271 -241 -104 107 -82
6720h2n3K06l0m13K60J59j24l6K01k39O2L0K8J25j17KJ90k37J54J7l8j40Q0L4
$$ -82 -135 71 41 -372 -112 47 -77 -113 88 -151 -89 -59 -31 94 -23 -21 169 -68 86 103 65 -75 5 39
6744C9J51k00n1R6Rj1l43J84R4K02j66K2k2J97k34M4j55N7L7L32j35K52k24k48
$$ 39 190 -10 -61 35 44 33 -310 -126 -32 170 4 26 4 201 -33 11 -144 -87 -50 282 147 399 175 -73
6768g3P1j68K64j5j4O0K2J12j75p4l69M28L0J5o3j39K75n57M38j2k77K12J09r4
$$ -73 -2 -170 94 79 65 125 147 259 84 10 -359 69 99 114 51 -88 187 -370 68 56 -221 -9 100 6
6792Fm3p9K66k3j13R0k81p8L76K7k80K39q7J7O7J06k91J92J9M8j52j2p3J32k62
$$ 6 -37 -116 150 127 14 104 -177 -255 121 148 -132 107 20 37 104 210 -81 111 130 178 26 14 -59 73 -189
6817a89O6J65J17k25jK18j05k52K68J36J6J6l48J33j59L33k0k33L68k22j65l1
$$ -189 -123 42 159 -66 -67 151 46 -206 62 198 214 230 -118 15 -144 189 169 -64 304 82 -83 -114
6839a14M69k7m97J33J58o5L1j73L56l23lJ28K4m29L06N8M10l50k64R6J76O4n1
$$ -114 355 328 -169 -36 122 57 88 -85 271 -52 -55 73 97 -332 -26 32 442 92 -172 -76 100 164 113
6862A13l36J90K62n19L15J1q6qm7L0l7J24k1K76j22k77P7j58J52M3n6J84j92Q0
$$ 113 -223 -33 229 -290 25 36 -50 -58 -105 -75 -112 12 -9 267 145 -132 -55 -213 -61 -18 -74 110 -82 -2
6886bJ27n07K63J30j25M77k72k60R2J32j35J95j29K8j69j7L46l2J10l62R0k06
$$ -2 125 -382 -119 11 -114 363 91 -169 -77 55 -80 115 -14 14 -155 -172 174 142 252 -110 -20 -226
6908b26K60m38M70j9K01k73RJ00L4k3r9Q7r3L04j56r8k43K59n1N1L8r4j84J90
$$ -226 34 -404 66 47 248 -25 -16 84 118 95 -4 83 -10 294 138 40 -203 56 5 56 94 0 -184 6
6932Fk23J27N4ON2k22l3K27k02J57j01j62L83k76K18J0rj01J54P4J16k03m0p9
$$ 6 -217 -90 -36 -30 22 -200 -233 -6 -208 -51 -152 -314 69 -207 11 21 12 -89 65 139 255 52 12 -67
6956f7R5k11P6l9J41J73j3KK0nl52J86P3k0l8l3j20R0j08J42q4K8K49m3j48l97
$$ -67 28 -183 -107 -146 -5 168 155 157 177 172 -180 6 79 59 21 -12 -132 -42 -150 -8 -92 -64 185 142 -6 -403
6982d03O80m14K79J08m71J32P8q6J6O3K98j42j85J10k86J79m1J64pQ3O3k64R5
$$ -403 277 -137 142 250 -221 -89 -11 -97 -81 -18 280 138 -47 63 -223 -44 -85 79 72 155 218 -46 49
7005D9J04k40l5jn8J0J95P9o1K5q7q8J64J93n1J6k59O1j43N89l54k77M03k25m0
$$ 49 153 -87 -122 -123 -181 -171 24 103 42 67 -20 -108 56 249 198 214 -45 16 -127 462 108 -169 234 9 -31
7030c1M7k7k41M13k91K14j89L0J89m09N09j59j24l9J67J1n9l7J7J21k48J89J68
$$ -31 16 -11 -252 161 -130 84 -105 -75 114 -295 214 55 -69 -108 59 70 11 -26 -9 112 -136 53 221
7053B21l73J61n5J23k0K91m54K13k60L54p1l11K32j9k23L19o0m3j00P2j62L0j4
$$ 221 -152 9 -46 77 57 348 -106 107 -153 201 130 -181 51 32 -191 128 68 25 -75 -3 -165 -135 -149
7076a49M7K15l0p8P4m2K21j1k06l8Nk29J30j30K85N9J90l06Q4j44PJ78j99J94
$$ -149 -102 113 83 5 79 37 258 247 41 3 8 -221 -91 -221 64 123 313 7 91 -53 -46 132 -67 127
7100A27j62j03K56O4M2r8N2o82N69k2j84L10r3q0J60m60lM06o2N4J9l1n6l2Q2
$$ 127 -35 -138 118 182 224 126 178 -504 65 43 -141 169 76 -4 156 -304 -307 99 37 91 110 79 23 -9 73
7125G3k53j88M74j91J98j55J12o1K51l23j52L72L0j72J78J65m46P1P4k35J61J71
$$ 73 -180 -368 106 -85 113 -42 70 9 260 -63 -215 157 187 15 193 358 -88 -17 57 -178 -17 154
7147A54j72J31pq0j17L2p3j32L82j84K08l34K39K2j06j17J45j14LL94l6j92p3
$$ 154 -18 113 106 26 -91 -59 -132 -264 118 -66 142 -192 47 69 -37 -154 -9 -123 -120 274 238 46 -27
7170b7J7p9k78O26m90O08k79m8K42j42k84K87m73J64J2O2J21q3K04m05J25J70
$$ -27 -10 -89 -367 259 -231 377 98 50 292 150 -134 153 -320 -156 -144 -82 39 -44 160 -245 -120 50
7192E0O5j26Qm9J88R4j9l33K49n6j92K5J64j67K8K83k32O8k26N7J82j91J02L90
$$ 50 115 -11 -3 -52 136 230 211 -122 127 71 -121 -96 68 -99 -71 212 -20 48 -178 -121 61 -130 -28 362
7216C62k13j25P0l28M30l78J98J90l13K40o6l83K71q1M39l08O5J74m73K02P2l3
$$ 362 149 24 94 -234 196 -182 16 206 -107 133 67 -316 -45 -126 313 5 70 244 -229 -27 45 12
7238A2n7m4M71k19o3l3J5l19M62k32j53J21k5o5J22k2j39M67j40m00J82K69k88
$$ 12 -45 -89 382 163 100 67 82 -237 225 -7 -160 -39 -64 -129 -7 -29 -168 299 159 -241 -59 210 -78
7261g8L13j36j2J10k69m9L01n4k07M3M7J84o2j83k85L95j90L37k60j17L63J36
$$ -78 235 99 87 197 -72 -121 180 126 -81 -38 9 193 131 -52 -337 58 -132 205 -55 -172 191 327
7283C27p8k16J29J5k26O6J0q9L37j62J25k47m1K19l95M70k43N3J94l02J57k86
$$ 327 249 33 162 177 -49 17 27 -62 275 113 238 -9 -50 169 -226 244 1 54 248 -54 103 -183
7305a83L81l56M77j29m01J38%J33j63P0l22N77j40J70r6L27n80j17L68r1j55P8
$$ -183 198 -158 319 190 -211 -73 -73 60 -103 -33 -355 222 82 252 156 483 -97 -214 154 63 -92 -14
7327a4O2l31L23k10j33L56j48m6K90m4j16n4k02J68R5k30J43M3K06n1J17j41m8
$$ -14 48 -283 40 -170 -303 53 -95 -141 149 105 -11 -65 -267 -99 -4 -234 -91 -48 158 107 224 83 35
7350C5J01n2j6q4k02J18K96j57QJ00j38k47J5j29K88L00J3l79K27j32l2Q8Qk15
$$ 35 136 84 68 -16 -218 -100 196 39 47 147 9 -238 -223 -352 -64 236 249 -130 97 -35 -67 21 29 -186
7374a86L54m6m35L97J04j01k48J91L0q4j58L83j85N4r7m0K47l27K97Q8k30R3l76
$$ -186 168 122 -313 84 188 87 -161 30 60 -24 -182 201 16 70 -27 -67 180 -147 150 238 8 101 -275
7397b75M53m22K36j19K75k38m6n8K57n0k56J20M69m84K23l8J1j4j64K48l24J37
$$ -275 178 -244 -8 -127 148 -90 -136 -194 63 13 -243 -123 346 -138 85 47 58 44 -120 128 -196 -59
7419e9L54l37K2j77Q8k45L30J47j62J25J43j35l01L01J21j90J7n2nJ48j69O3K05
$$ -59 295 -42 -20 -197 -109 -354 -24 123 -39 86 229 94 -207 94 215 25 42 -10 -15 133 -36 27 232
7442B32r9k00K22j8m11M23k31j64J73l8K28Nj37k48M78k05j14J91k31Q1K09k10
$$ 232 133 -67 155 137 -274 149 -82 -246 -73 -111 117 122 -15 -263 215 10 -104 87 -144 -63 146 -64
7464f4l9J04l74K51J63k12K20j9K29l31J38j6m11J58J08J15k73L72j65j01K81
$$ -64 -103 1 -373 -122 41 -171 49 30 259 -72 66 50 -361 -203 -95 20 -253 119 -46 -147 134
7485A34K02l86q6j45K94Q7j55Q9J77j55k64K77J1j09n7M7J04j58J46J39rj56K36
$$ 134 336 -50 -136 -281 13 100 -55 34 211 56 -208 69 80 -29 -86 -39 65 -93 53 192 183 27 263
7508B63j55Nk13J80J44l74Jo4K97o9P4P1Nk49J59j57J01M1M2j2q4k1P1r1J51K2
$$ 263 108 113 -100 80 224 -150 -149 -213 84 15 89 160 165 -84 75 -82 19 60 102 90 6 -15 56 -35 116 138
7534A38m2m5o9R8K31j18J73m52K83J4j13J77m77K27j58J20K22n0L0L8l71L16l46
$$ 138 96 51 -18 80 311 193 366 -86 197 211 98 275 -202 25 -133 -13 209 159 189 227 -144 172 -174
7557a74p2J96K6L19j95j19j9J79J14q1Q8K08n36l42L61l6j2j32L72J10l83J36
$$ -174 -246 -50 -24 295 100 -19 -38 141 255 174 262 470 -66 -408 -47 -83 -95 -227 145 255 -128 8
7579Hj9M04j68q0j8k66R5J24K9k4j66J23j24l33K89J36K25k34K45l75M9O7K41
$$ 8 -11 393 225 145 127 -139 -44 80 109 85 -81 42 -82 -415 -126 10 235 1 246 -129 -80 -13 228
7602B28k84j69L55J9k64N0k06L14j64J0M4K6J37l70O19l43k9j69L33n20J96J30
$$ 228 -56 -225 130 149 -115 -65 -271 43 -121 -111 -67 -41 96 -274 345 2 -27 -196 137 -383 -187 -57
7624e7q7J19k50K49k48K60r1N8RN0J01J14j28k39k00M08j14j54J73m4j04J26K6
$$ -57 -144 -25 -275 -26 -274 -14 -105 -47 -38 12 113 227 99 -140 -340 68 -46 -200 -27 -71 -175 -49 -23
7647b3K61j73m42K99N45m72N6k56K65K8k0M2j24n4l8k19K36J53m3n3Q2N8k47J84
$$ -23 238 65 -377 -78 467 -5 51 -205 60 88 68 110 -14 -68 -106 -325 -89 64 21 -32 50 108 -139 45
7671D5j15L21k90j22J3J35k3J86m63M14j27k46K12K87k64l0R1K42o8r6o9J92l75
$$ 45 -70 251 -39 -161 -148 -13 -36 150 -313 101 -26 -272 -60 227 -37 -67 24 266 198 102 33 225 -150
7694a50oJ61O1J35k83J81j08n3L47k13j14ojL19m74n8J41QN49l24p7J5J66j3k96
$$ -150 -156 5 66 201 -82 99 -9 -62 285 72 -42 -48 -49 270 -204 -262 -121 -113 436 112 35 50 216 203 -93
7719i3Q2L35m66L05n60L94k5J82l78N62m48J48j09p4j4Q9K60j16k3j53O11n99
$$ -93 -11 324 -142 163 -397 -3 -28 154 -224 338 -110 38 -71 -145 -159 -70 190 74 51 -102 509 -90
7741i0P3j38J14J83J5k45J56k56K95jk83K96J30l88K39k06N20n64K15k72L46l84
$$ -90 -17 -155 -41 142 157 -88 68 -188 107 106 -177 119 249 -139 100 -106 414 -150 65 -207 139 -245
7763b45N78l58J46k06K68J41l84P3n6j08K25j24R0j2N8j23j43M4L07l2l03J88
$$ -245 333 -25 121 -85 183 324 -60 13 -43 -151 74 -50 40 28 86 -37 -180 -136 171 139 -164 24
7785B4k58N97n64K68J19k63M1N5L35k54l44K61k64l3K40l0J1r7M13l91o7J51O9
$$ 24 -234 363 -201 67 186 -77 -36 19 354 100 -244 17 -247 -280 -40 -70 -59 -156 257 -134 -201 -50 19
7808A9j90J48K51j55o2J98l15J34j20P3P3l26J16K31j46J21N5j21k82K22K29l65
$$ 19 -171 -23 228 73 11 209 -106 28 -92 -19 54 -272 -156 75 -71 50 105 -16 -298 -76 153 -212
7830b12K88o3j49k9j09L67k04J9J52j87K89k03J13l91M63j90Q4K2q0j08J18j77
$$ -212 76 13 -136 -165 -274 93 -111 -92 60 -127 162 -41 72 -319 144 -46 38 60 -20 -128 -10 -187
7852a87J93M3L35l70L2n4j60L40m25O57l79j28J31O8k46J18k59L27k25n6L04j39
$$ -187 6 49 384 14 46 -8 -168 172 -253 404 25 -103 28 96 -150 -32 -291 36 -189 -245 59 -80
7874h0l1K31k25L79n7o4k25NN8kP2o1J6K8k80N9M55j81j60k2M9j75N13k00J61
$$ -80 -111 120 -105 274 217 153 -72 -67 -9 -11 61 0 16 44 -236 -177 278 97 -63 -85 -36 -211 302 102 263
7899B63j95K9k17J9J48Nj55l6j07L6L73K2j19m65M78k61j68L50j28K43l37j47
$$ 263 68 97 -120 -101 47 52 -103 -139 -246 -210 163 185 66 -399 79 -182 -350 0 -128 115 -222 -369
7921c69L43K0J50j80j31R9n4J93m4p4p1K15l9k95L14L1j16r9j02K09k48J99pJ18
$$ -369 -26 -6 144 -36 -167 -68 -122 71 27 -47 -118 97 58 -237 77 108 -8 -107 -209 0 -248 -49 -56 62
7945F2K2k45J73j42K25k46k68N42k54K55p6n4K67O0m01J07o1lJk60M71k88J52
$$ 62 84 -161 12 -130 95 -151 -419 123 -131 124 48 -6 261 321 -80 27 -34 -37 -36 -296 175 -113 39
7968C9j14J21K02k03j59n8R9n7P1J5P2j60J42J47j68p4L46j98k68J99k42K44J61
$$ 39 -75 46 248 45 -114 -172 -73 -130 -59 -44 28 -132 10 157 -11 -85 261 63 -205 -6 -248 -4 157
7991A57L9l64J73j80j47M26l9j04K73lm74K06L7L7k31R6J31RM9j66K16J10j80
$$ 157 196 -168 5 -175 -322 104 65 -39 234 231 -243 -37 0 37 -194 -98 33 42 91 -75 141 251 71
8014G1j74M26k63k24J48o4K41k8j51j0k2j3K8L7r4p5L5O0N8j19n5M67j57J46n88
$$ 71 -103 323 60 -164 -16 -80 161 133 -18 -28 -50 -63 -35 2 -92 -167 -132 -72 -14 -133 -188 279 122 268 -320
8039c20M05j30J69k11l7K20k22lK93p8q4j91K00j01J1M24j55J02k22k9l17K8J95
$$ -320 85 -45 124 -87 -124 96 -126 -129 164 86 2 -189 11 -90 -79 345 190 292 70 41 -276 -248 -53
8062e3J45M6k56M03j44l8j2J8j65M12n72J44j02J33j21k3J2N04l22j63K32p7J26
$$ -53 92 138 -118 285 141 103 91 109 -56 356 -216 -72 -174 -41 -162 -185 -173 331 9 -154 78 1 127
8085A27J29k47k14J33J00r2M0K99k13MJ3j09l88Q3O8K31J73j92n8R3K44m79O4
$$ 127 256 9 -205 -72 28 -64 -24 275 62 66 79 -30 -418 -335 -267 -36 137 -55 -113 -20 224 -255 -191
8108a91L19k00Q2q4L19k89K4K39j40k68K86j5k10l9J82k36J46O1p9m2j29K84o5
$$ -191 128 -72 10 -74 245 -44 -20 219 79 -189 97 82 -128 -167 15 -221 -75 -14 -93 -135 -264 20 -45
8131d5n3l4j04L09l47K58M2K73k43J41m83L54j15k95N38k78Q4k42M01j60qm76
$$ -45 -98 -132 -236 73 -274 -16 26 299 56 197 -286 68 -47 -342 196 -82 2 -240 161 1 -7 -483
8153d83%O18j75L14l3j77k60N93p09L17j26L30j96N1m1j39K08m06L47K5J76m00
$$ -483 -483 135 -40 274 241 64 -196 397 -312 5 -121 209 13 64 23 -116 92 -314 33 58 234 -166
8175a66K78J85l10j48L74m19K29j90N54l72J08j70kk48L46o2
$$ -166 112 297 -13 -161 213 -206 23 -167 387 15 123 -47 -49 -297 49 -13
8191a3
$$ Imaginary data points
##PAGE= N=2
##DATA TABLE= (X++(I..I)), XYDATA
0@%%%%%%%%%Qj6J6j6K4l2L2m0M9n7O7p8R2j06J23j41J62j86K12k40K71l06L42
$$ 0 0 0 0 0 0 0 0 0 0 8 -8 8 -8 16 -16 16 -24 25 -32 35 -43 49 -57 66 -75 87 -99 113 -127 144 -162 180
32A80l83M29m79N36n97O62p34Q13q99R96j101J218j352J501j667J856k077K333
$$ 180 -203 226 -253 283 -314 348 -386 427 -472 524 -577 641 -711 790 -877 979 -1098 1235
50A235k634K994l437L998m731N739p215R590j4045K5235j02881k33894J55900
$$ 1235 -1399 1595 -1842 2156 -2575 3164 -4051 5539 -8506 16729 -86152 -320046 -164146
63a64146K53990J02786j20775j58499m8424O8665M1269k121K8977N0019l1946
$$ -164146 89844 192630 71855 -86644 -135068 -66403 -25134 -27255 1722 51741 19795
74A9795q7728n2168L9302R8767O1118n4572r0358j9694M0022M2221L6008L141
$$ 19795 -67933 -120101 -80799 17968 79086 24514 -65844 -85538 -45516 -3295 32713 35854
86C5854m0115m2987j6444J7787O7831O0523l6634r8931m3817M9500R0915M2246
$$ 35854 -4261 -47248 -63692 -45905 21926 82449 45815 -53116 -96933 -47433 43482 85728
98H5728n9394q7653K075O3192K0455k4771r171J8379J4315l1541o0019J1254J01451
$$ 85728 26334 -61319 -59244 3948 24403 -368 -9539 8840 23155 -8386 -68405 -57151 44300
111D4300N3846p8118j09882j6898Q9668J05087M052r7195p2667J5021M6402M0637
$$ 44300 98146 20028 -89854 -106752 -17084 88003 92055 -5140 -77807 -62786 -16384 24253
123B4253L2263m349m3225m4142k0816K3479O9379M7613k5879n7735l9665q460
$$ 24253 56516 52167 8942 -35200 -56016 -32537 36842 84455 58576 841 -38824 -47284
135d7284L9418O6365K3572l6220n5469l8775J3089O7873M6260k6048n3726l1227
$$ -47284 -7866 58499 82071 45851 -9618 -48393 -35304 32569 78829 52781 -945 -32172
147c2172J627L7876L9010n264l1349k1043j4467L48K9503K7181j219j8445l1871
$$ -32172 -30545 7331 46341 41077 9728 -11315 -25782 -25434 4069 31250 30031 11586 -20285
160b0285l1303J5242N1167K7030j1935l5880m3363q423M5566M7826O573k9914
$$ -20285 -51588 -36346 14821 41851 29916 -5964 -49327 -57750 -12184 35642 42215 12301
172A2301m7594k5925L7250N9564O794l7113l1287l259K4129K3467r315j1530J8384
$$ 12301 -35293 -61218 -23968 35596 42390 5277 -26010 -29269 -5140 18327 9012 -2518 15866
185A5866M334l6237k3968K8642N3591K2242m8306p7195l247Q0898N6154k7358
$$ 15866 20200 -16037 -40005 -11363 42228 64470 16164 -61031 -64278 16620 72774 45416
197D5416n9678l1268J9223M1556J0000j8484K55P577k3797k6695J3031L8235K8130
$$ 45416 -14262 -45530 -26307 15249 25249 6765 7020 14597 -9200 -35895 -22864 15371 43501
210D3501j3769n3002k9008L3286M2970K558j4581j0186j3126p869j36J3707L7764
$$ 43501 29732 -23270 -52278 -18992 23978 26536 11955 1769 -11357 -19226 -19362 -5655 32109
223C2109K1578m5650o3984N321O4759M8612j5649o3505l5727L7828M7844j1121
$$ 32109 53687 8037 -55947 -50626 14133 62745 47096 -16409 -52136 -14308 33536 22415
235B2415l0629N977K2082l421l3083k5514L1020O3068J688p1876m7388L0168O0264
$$ 22415 -8214 -2237 19845 16424 -16659 -42173 -11153 51915 53603 -18273 -65661 -35493 24771
248B4771K4053l5180n1332j040L8162J1218j7061j065R917m467j5328j2641J1078
$$ 24771 48824 13644 -37688 -38728 -566 10652 -6409 -7474 2443 -2024 -17352 -29993 -18915
261a8915L5319R975l8654l0801J5558L0065J2458p749j8312n769R086m576q285
$$ -18915 16404 26379 -12275 -43076 -27518 2547 15005 7256 -11056 -16825 -7739 -12315 -20600
274b0600K3215K9240j3307m0905k2662K0550M9983K3808l7987m6604O022L3234
$$ -20600 2615 31855 18548 -22357 -45019 -24469 25514 49322 11335 -35269 -29247 3987
286C987J4932p015j2801j423J2913l936k5158J610L4981J6380k1428k9941j1579
$$ 3987 18919 11904 -897 -2320 10593 6657 -18501 -16891 18090 34470 13042 -16899 -28478
299b8478K3436L6962Q72l3431j8147P272J2006J4255P160j1080j2104m318n211
$$ -28478 -5042 31920 32792 -639 -18786 -11514 492 14747 21907 10827 -1277 -5595 -10806
312a0806P273K2787N449j5967j1827n404r04J3608J4081q55o953j0052j5591J876
$$ -10806 -3533 19254 24703 8736 -3091 -8495 -9399 4209 18290 17435 10482 430 -15161 -13285
326a3285K4845J3593j0132j6774j4356J106K3246J3961j1720j3730m983l651O950
$$ -13285 11560 25153 15021 -1753 -16109 -15003 8243 22204 10484 -3246 -8229 -11880 -4930
339d930J5770K229q908p990j0030j924J6367J1662o462n830m309j0045j106J1589
$$ -4930 10840 13069 4161 -3829 -13859 -15783 584 12246 5784 -46 -4355 -14400 -15506 -3917
353c917R934O085m150k4739j5994K1647K8149M19k0505k0460m17K4933J5905j6853
$$ -3917 6017 12102 7952 -16787 -32781 -11134 17015 17434 -3071 -23531 -23948 985 16890 37
367C7j5636P934Q261l894n901J5J2203J4921j4558l1193J449L1958J9078q865
$$ 37 -15599 -7665 596 -3298 -9199 -9184 3019 17940 3382 -27811 -26362 5596 24674 15809
381A5809k3253j6113J1856K1932k32j0517M941M157j1233q351M782J4511J5014
$$ 15809 -7444 -23557 -11701 10231 9999 -518 4423 8580 -2653 -11004 -6222 8289 23303
394B3303q444k7436m667K5673J3206j1750j2447r59R208P593j0318j0660J6088
$$ 23303 14859 -12577 -17244 8429 21635 9885 -2562 -3521 5687 13280 2962 -7698 8390
407H390J6638j5696k5518O86K3896K3012o727l6086j6841K6462K5404q256j8061
$$ 8390 25028 9332 -16186 -15500 8396 31408 24681 -11405 -28246 -1784 23620 15364 -2697
420b697m753Q541R149q539j6777Q958K5844k099k5689j3060J1220K0674R123j7984
$$ -2697 -7450 1091 10240 1701 -15076 -6118 19726 17627 -8062 -21122 -9902 10772 19895 1911
434A911k0606Q057J7798j725q262J178K530o02n383p729P730K0534k186k4399
$$ 1911 -18695 -10638 7160 5435 -2827 -1649 881 279 -5104 -12833 -5103 15431 13245 -11154
448a1154r995J2927J4546M369r915j3908N331J2309p754j0733Q913J2769j483
$$ -11154 -21149 -8222 6324 10693 778 -13130 -7799 4510 -3244 -13977 -5064 7705 6222
461F222j2578j3933L449K3316R623j9989j6981O367J2950O745l274j1656j662
$$ 6222 -6356 -20289 -16840 6476 16099 -3890 -20871 -14504 -1554 5191 1917 -9739 -11401
474a1401J0797l55q638M659J0035j030p278o234j866J1853J2218o469j0768R06
$$ -11401 -604 -959 -9597 -4938 5097 4067 -3211 -9445 -11311 542 12760 6291 -4477 -3571
488c571J465K65O318M243j858k282n497o365Q482J3119l173j0193k562P40M140
$$ -3571 -2106 -1841 4477 8720 6862 4580 -917 -7282 1200 14319 11146 953 -1609 -869 3271
503C271O253l175o041L824Q7p093J508Q174R09l576m525o585L112J1584J61p876
$$ 3271 9524 6349 308 4132 4219 -2874 -1366 6808 7717 4141 -384 -6969 -3857 7727 7888 12
519A2j439m65l260L822N977q24k83l439r094K015J3288K531p662m105j008K202
$$ 12 -1427 -1892 -5152 -1330 4647 3823 3540 101 -8993 -6978 6310 8841 1179 -2926 -3934 -1732
535a732O265j159n388N061M805q858o759N787Q364M233l749j4334m618J4921R519
$$ -1732 4533 3374 -2014 3047 7852 -1006 -7765 -1978 6386 10619 6870 -7464 -12082 2839 12358
550A2358q310p244n5J668L275j297n908M965Q839p285j2731K635J0472M939k563
$$ 12358 4048 -3196 -3251 -1583 1692 395 -5513 -548 8291 1006 -11725 -9090 1382 6321 3758
565C758j0801n927J1027R098q032o754N816M387k629m461k514O946J1282n522
$$ 3758 -7043 -12970 -1943 7155 -877 -7631 -1815 2572 -57 -4518 -7032 -86 11196 5674
579E674j6358M23J5196O483m439r635n576R622J0555p635r254O535Q111l716p714
$$ 5674 -10684 -10261 4935 11418 6979 -2656 -8232 1390 11945 4310 -4944 1591 9702 5986 -1728
594a728l466O071J2418j046j6723o056J2000P675l256o290m239L086P015n107
$$ -1728 -5194 877 13295 12249 -4474 -10530 1470 9145 5889 -401 -4640 -1554 5461 354
608C54q868O865R247n179r722k591N368J0176J104j3472o720J0372P374n096m364
$$ 354 -8514 -1649 7598 2419 -7303 -9894 -4526 5650 6754 -6718 -13438 -3066 4308 -788 -5152
623e152K52K679M257m477q004O246J2646l373j2100k727M985Q377M499q869q242
$$ -5152 -4900 -2221 2036 -2441 -10445 -4199 8447 5074 -7026 -9753 -4768 3609 8108 -761 -9003
638i003O333O654m644l369L531K384M36l176p182K303J1277M66j0219k093L847
$$ -9003 -2670 3984 -660 -4029 -498 1886 2322 -854 -8036 -5733 5544 6010 -4209 -6302 -2455
653b455K552J163k279m371L696M805o379l993O511M093k773l826l075K265R394
$$ -2455 97 1260 -1019 -5390 -1694 3111 -3268 -7261 -750 3343 570 -3256 -6331 -4066 5328
668E328N50r726j934O549K282j519l49j261K168L888m898m543O527O223l692l984
$$ 5328 5878 -3848 -5782 767 3049 1530 1181 -80 2088 5976 1078 -3465 3062 9285 5593 1609
684A609j564L73N534K973n611k006M338j476m029K931L450r28r29m428l893O093
$$ 1609 45 418 5952 8925 3314 1308 5646 4170 141 3072 6522 5594 4665 237 -3656 2437
700B437O211m755n463J622O91L67K21k799J90O307j700r384N37O665K368j277
$$ 2437 8648 3893 -1570 52 743 1110 1331 -1468 -1278 5029 3329 -6055 -5518 1147 3515 2238
716B238m010m824L691P654l174o453K619L590j286o40j345n39M913Q17p315j440
$$ 2238 -1772 -6596 -2905 4749 1575 -4878 -2259 1331 45 -595 -1940 -2479 2434 3251 -4064 -5504
732e504P375J881l967j655j713K042M655k873n408M260N044n173n027K186L939
$$ -5504 1871 3752 -215 -1870 -3583 -1541 3114 241 -5167 -907 4137 -1036 -6063 -3877 62
747F2L593j221r385k343J0189M196o758l627J351K595K820k659n891L895Q322
$$ 62 3655 2434 -6951 -9294 895 5091 -1667 -5294 -3943 -1348 1472 -1187 -7078 -3183 5139
762E139l158q419M79M766M187J821n992n264N693N092l848k346K990Q34%j278
$$ 5139 1981 -6438 -5959 -1193 2994 4815 -1177 -6441 -748 4344 496 -1850 1140 1974 1974 696
778F96k931K102O513j683p259P61N186N11j176k513k547M907L674o246m343O013
$$ 696 -2235 -133 6380 4697 -2562 -1801 3385 3896 2720 207 -2340 2567 6241 -5 -4348 1665
794A665L303k748l318k395K140P933j317j0249j388Q033K551k505l022k878L177
$$ 1665 4968 2220 -1098 -3493 -1353 6580 5263 -4986 -6374 1659 4210 1705 -1317 -4195 -1018
809a018N289l949n832M386M765k092l941j189N72M947K128n916k441M895R11l400
$$ -1018 4271 322 -5510 -1124 3641 1549 -2392 -3581 -3009 1938 4066 -1850 -4291 604 1515 -1885
825a885J083J544M1K85k860l030N050N648m744n705K236K949J440m59m610j131
$$ -1885 -802 742 783 1068 -1792 -4822 228 5876 1132 -4573 -2337 612 2052 1593 -3017 -4148
841d148O349J604o955q97M215K099m48l044m346K982P888k189o839K65L314R27
$$ -4148 2201 3805 -3150 -4047 168 2267 1819 -1225 -5571 -2589 5299 3110 -3729 -3464 -150 777
857G77J184k073k863L067L159m217j999M541Q16j671j17j578O0M123p17m458K236
$$ 777 1961 -112 -2975 92 3251 -966 -2965 1576 2392 721 604 -974 -914 3209 2492 -1966 270
874B70L698l309k077J813R77J873N98n692k208P119K868n029l209J084J676L535
$$ 270 3968 659 -1418 395 1372 3245 3843 -1849 -4057 3062 5930 901 -2308 -1224 452 3987
890C987j135o015O34O459q89m930Q6J353K010J991l702m818M121M959l093k641
$$ 3987 2852 -3163 -2529 3930 3041 -1889 -1803 -450 1560 3551 -151 -4969 -848 4111 1018 -1623
906a623R25n49P89J351k162l83L928j715m628J900L784o50j377j133j598L171
$$ -1623 -698 -1247 -458 893 -1269 -1652 2276 561 -4067 -2167 1617 967 -410 -1543 -3141 30
922C0K780m575l014M698K355k768k054p89J778M909q42p007j79O163J264k001
$$ 30 2810 -1765 -4779 -81 2274 -494 -2548 -3337 -1559 3350 2508 -4499 -4678 1485 2749 748
938G48j883k240J738N195k647m587K525L509j969j317J45m68K747J755m377j636
$$ 748 -1135 -3375 -1637 3558 911 -3676 -1151 2358 389 -928 -783 -1251 1496 3251 -1126 -2762
954b762M167K78k805J136O29p19J156o77k735L026L604l995l668K909K144J03
$$ -2762 1405 1683 -1122 14 643 -76 1080 403 -2332 694 4298 303 -3365 -456 1688 1791
970A791k04l197j363N909J412n637j383L486J173N0k051l507K674O096j968n737
$$ 1791 1587 -1610 -2973 2936 4348 -1289 -2672 814 1987 2037 -14 -3521 -847 5249 3281 -2456
986b456O43K826P29M07j618l022K704L026l623j551L139K30j379K08q55p18L208
$$ -2456 -1813 1013 1742 2149 531 -2491 213 3239 -384 -1935 1204 1434 55 263 -592 -1310 1898
1003A898q51m249K186L046k352j356Q52K19R39P73l743j471N243K005m155k384
$$ 1898 1047 -3202 -1016 2030 -322 -1678 -826 -607 332 1105 -2638 -4109 1134 3139 -1016 -3400
1019c400J077J718K702j028n132M72N837l30l982j73Q90J459K360k849l557L010
$$ -3400 -2323 -605 2097 1069 -4063 -3591 2246 1916 -2066 -2239 -1349 110 2470 -379 -3936 -926
1035i26M177k776j544N58j40J016J493k360j193L261j54k985J148K407j218m82
$$ -926 3251 475 -1069 -511 -651 365 1858 -502 -1695 1566 1412 -1573 -425 1982 764 282
1051B82k26j718K469K608l794k374L483K225k305j021r01K23L796p5n542l44N374
$$ 282 56 -1662 807 3415 -379 -2753 730 2955 650 -371 -1272 -1049 2747 2672 -2870 -3214 2160
1068B160R24k567j477j432K020M131j802m647J519L399j545p52j1r02J834J996
$$ 2160 3084 517 -960 -2392 -372 3759 1957 -2690 -1171 2228 683 -69 -80 -982 852 2848
1084B848l387j694L477O21k361R57J33q03R14M7k553K045K682l084k678K820J192
$$ 2848 -539 -2233 1244 1865 -496 461 594 -209 705 752 -1801 244 2926 -158 -2836 -16 1176
1101A176p01J56k812m52M359J100n283n64K889Q75m26o22l095J388M970j752m582
$$ 1176 475 631 -2181 -2633 1726 2826 -2457 -3021 -132 743 317 -305 -3400 -2012 2958 1206 -3376
1118c376J068K392J82R15j562k767K246L443k757j957K606J1r21R35q41q04K746
$$ -3376 -2308 84 266 1181 -381 -3148 -902 2541 -216 -2173 433 444 -477 458 -383 -1187 1559
1135A559K87l701J231L058j925q75Q36l83P45J536l052j801L997J659l329j669
$$ 1559 1846 -1855 -624 2434 509 -366 470 87 832 2368 -684 -2485 1512 3171 -158 -1827
1151a827J082Q69K192l05m771J33M852r7k886n48P63Q08J657j527l177K249L404
$$ -1827 -745 124 2316 2011 -2760 -2627 2225 2128 -758 -1306 -543 265 1922 395 -2782 -533 2871
1168B871k097k296J535m56R45J431k203j654L120J32k507J052J708j273k19L29
$$ 2871 774 -1522 13 -443 502 1933 -270 -1924 1196 1328 -1179 -127 1581 308 89 418
1184D18j910J735K247k874j784K928Q94j708j33m02r40L063O21m510j75M034q4
$$ 418 -1492 243 2490 -384 -2168 760 1654 -54 -187 -589 -1529 1534 2155 -2355 -2530 1504 1420
1201A420j884k34j378Q36L418j343m105J341K674q51j79k2j561J151K485k333
$$ 1420 -464 -698 -2076 -1240 2178 835 -3270 -1929 745 -106 -285 -307 -1868 -717 1768 -565
1217e65j963K660O87j867Q39Kj038J950O0k500J413K167k268j073J465R83p81
$$ -565 -2528 132 819 -1048 -209 -207 -1245 705 765 -1735 -322 1845 -423 -1496 -31 952 171
1234A71N16j138j687L864J061l919p28K400K52J00n02k069M63L827j190l486Q22
$$ 171 687 -451 -2138 1726 2787 -1132 -1860 540 792 892 390 -1679 -1216 2611 1421 -2065 -1243
1251a243K206n95P88j188k127J945K797k379j954K418qr12O30n47r24K435L9k995
$$ -1243 963 368 1156 -32 -2159 -214 2583 204 -1750 668 660 -252 378 -169 -1093 1342 1381 -1614
1269a614J287K568j725j062J168o76K69J636k259j506L095J148k632o78J214k66
$$ -1614 -327 2241 516 -546 622 -54 215 1851 -408 -1914 1181 2329 -303 -981 233 -33
1285c3J466Q8l364K8L970o59k358p8N03L68J850j538l071K087L001k227j570J092
$$ -33 1433 1521 -1843 -1815 2155 1496 -862 -940 -437 -69 1781 243 -2828 -741 2260 33 -1537 -445
1303d45L28L02J090j749j698K897L54k572L43J826p97n2O26k189J286K304j552
$$ -445 -117 185 1275 -474 -2172 725 1079 -1493 -1150 676 -121 -173 453 -1736 -450 1854 302
1320C02k721K465J293j474K01q57p27K757J025l675o12L353O2j520r9j030O81
$$ 302 -2419 46 1339 -135 66 -791 -1518 1239 2264 -1411 -2023 1330 1392 -128 -227 -1257 -576
1337e76L152j236l726J334K359n87q14L06j441J444J735k391j815K634R65k024
$$ -576 2576 1340 -2386 -1052 1307 720 -94 212 -1229 215 1950 -441 -2256 378 1343 -681
1353f81N76o4p41J519N04k552K23K995j696j380J277J35m43J212j237j433K317
$$ -681 -105 -169 -910 609 1113 -1439 -1216 1779 83 -1297 -20 115 -328 884 -353 -1786 531
1370E31J462k781o39J707m3J50L23k149J20L172m41k587K74J552o12Q12j85k824
$$ 531 1993 -788 -1427 280 237 387 710 -1439 -1319 1853 1412 -1175 -901 651 39 851 666 -2158
1388b158J559K703j947j795J676K2m82J178r91j503K445N68k619O17J862q96p27
$$ -2158 -599 2104 157 -1638 38 60 -422 756 -235 -1738 707 1275 -1344 -727 1135 239 -488
1405d88J207j158L6J859j385j746J998J150k310K25O74l10R87O19k518j81K672
$$ -488 719 -439 -403 1456 71 -1675 323 1473 -837 -612 62 -248 739 1358 -1160 -1341 1331
1422A331n5j730K52Q7l68J645j42k609J160K225j813r50J192j80l08J746j840
$$ 1331 1276 -454 -202 -115 -483 1162 1020 -1589 -429 1796 -17 -967 225 45 -263 1483 -357
1439c57r55K266J45k086M92J453j169K38N70j343M54K019j213k062J736R48j388
$$ -357 -1312 954 1099 -987 -495 958 -211 27 597 -746 -292 1727 514 -1548 188 1136 -252
1456b52M34j17j244J600J286k454o19K454k43j351Q62j227K21K210l93k927J138
$$ -252 182 65 -1179 421 1707 -747 -1366 1088 845 -506 356 -871 -650 1560 1167 -1760 -622
1473f22K221j630r5L78j225Q80J772k033j418K091R01j602k28P07q77J663J47
$$ -622 1599 -31 -126 252 -973 -93 1679 -354 -1772 319 1220 -382 -610 97 -780 883 1030
1490A030k473L35K644j051j782J350J23m34J209j453j099J917J406k253p27J809
$$ 1030 -1443 -1108 1536 485 -1297 53 176 -258 951 -502 -1601 316 1722 -531 -1258 551
1506E51l63L23J86j827j59K945l26k698Q66J228p42K81K42j925J071K161j323
$$ 551 188 511 697 -1130 -1289 1656 1330 -1368 -502 726 -16 265 507 -1418 -347 1814 491
1523D91j824J536K87p36J028r11j052J647Q91k471K39J810o82p24R63r97o5J764
$$ 491 -1333 203 490 -246 782 -129 -1181 466 1357 -1114 -875 935 253 -471 492 -505 -570 1194
1541A194r81j708J627J311j547q0M34j147J127J481k410n58K082j03j338M16k5
$$ 1194 213 -1495 132 1443 -104 -184 250 -897 230 1711 -699 -1257 825 722 -616 -200 -225
1558b25l06J239L25k388P20J707j064m67M76j88n6J099r75j700K113R61k188o1
$$ -225 -531 708 1033 -1355 -635 1072 8 -459 17 -171 -227 872 -103 -1803 310 1271 -917 -978
1576i78J561j098N75P25j932L77K012q05j648J032Q27j075N27K6j379J472Q85
$$ -978 583 -515 60 785 -1147 -770 1242 437 -1211 -179 648 -427 100 126 -1253 219 1104
1593A104j968m34K080m10n70L51p12l19J835k77k201R43J447j052m13R68j047
$$ 1104 -864 -1298 782 372 -198 153 -559 -878 957 680 -1521 -578 869 -183 -596 372 -675
1610f75L85J355j374j185J820N77j455M83K53n10M43O53j636K15K043j045j251
$$ -675 -290 1065 -309 -1494 326 903 -552 -69 184 -326 117 770 -866 -651 1392 347 -904
1627i04J169k43n82J138m23j603J673Q28j498k34J143m41k8Q62j432n66J982J04
$$ -904 265 22 -560 578 155 -1448 225 1053 -445 -679 464 23 -5 857 -575 -1141 841 945
1645I45j819N61R73q08N42K06j562P11J514j184j177J817N3p94O85m87j039J637
$$ 945 -874 -313 660 -148 394 600 -962 -251 1263 79 -1098 719 772 -22 663 176 -863 774
1663G74J62j809J62J842o12r03P87q45Q9J830j256j589J469J289j643O5P06j106
$$ 774 936 -873 -711 1131 519 -384 403 -442 -353 1477 221 -1368 101 1390 -253 -188 518 -588
1681e88P95J034j571n19J521r3p04J57K99q47J128M2j357M43J419j278n11J139
$$ -588 207 1241 -330 -849 672 579 -125 32 331 -516 612 654 -703 -260 1159 -119 -630 509
1699E09o14k86Q92n06j117J302Q56j854J60J273p85j9P22j370l6J881p56j781
$$ 509 -105 -391 501 -5 -1122 180 1036 -818 -658 615 -170 -189 533 -837 -873 1008 252 -1529
1717a529J401M29r80O15j0j259J266J372j979m13J368l05l25O46p61n74J655j11
$$ -1529 -128 301 -679 -64 -74 -1333 -67 1305 -674 -1087 281 -24 -349 297 -464 -1038 617 506
1735E06j538M30J343j036j22P08j019L42J416j249j021J593J38j128N19L79p82
$$ 506 -1032 -602 741 -295 -417 291 -728 -386 1030 -219 -1240 353 491 -637 -118 261 -521
1752e21N62N31j592J97J755p43j096O72J83m44J104l43j325R38J427j409o45J053
$$ -521 41 572 -1020 -823 932 189 -907 -235 -52 -496 608 265 -1060 -122 1305 -104 -749 304
1770C04l02r7P93r83l38J380Oj562O68P79j014M99P96j720N84J343j448m60J080
$$ 304 2 -95 698 -285 -623 757 763 -799 -131 648 -366 133 929 -791 -207 1136 -312 -772 308
1789C08oo39R39k87q24R50O90j659L37J112o42o18Q83p06%J541r42j057P38J010
$$ 308 302 -337 602 315 -509 441 1131 -528 -191 921 279 -339 544 -162 -162 1379 437 -620 118 1128
1809A128j296J48L67q42O80J007j499o33J602Q2j191N32O7o62J109o7j294J82
$$ 1128 -168 -20 347 -495 185 1192 -307 -940 662 744 -447 85 152 -510 599 532 -762 -580
1827e80J684j358l85J014k71l31P40n24j007J652K80j550n4J053m67J51M33r11
$$ -580 1104 -254 -639 375 104 -227 513 -11 -1018 634 914 -636 -690 363 -104 47 480 -431
1845d31j76K024q82j503R77M26q50M92J46j245R71J203j558p02J308j51n96Q25
$$ -431 -607 1417 535 -968 9 435 -415 77 223 -1022 -51 1152 -406 -1108 200 49 -547 278
1863B78j64r92J130K17j295N65Q09q09O7N98r02j45J108q14p60J295K86j173N58
$$ 278 114 -878 252 469 -826 -261 548 -261 -194 404 -498 -643 465 -349 -1109 186 472 -701 -143
1882a43L18q11M06R10j242l03J536m46q40M34K51n65R50k84j311R97R87j041o91
$$ -143 175 -636 -230 680 -562 -865 671 225 -615 -181 70 -495 455 171 -1140 -143 844 -197 -888
1901h88J127m46K40O97r74n82J190K94j149M53q0l88N50O52j479K45J520q87r50
$$ -888 239 -207 33 730 -244 -826 364 658 -491 -38 -118 -506 44 696 -783 -538 982 95 -855
1920h55J153m7o04M17Kp74Q62L75j275L88Q02j05q42P37j74l93J191k36j575J065
$$ -855 298 251 -353 64 66 -708 154 529 -746 -358 444 339 -503 234 60 -333 858 622 -953 112
1940A12R88j285M66J39j049N57J138q90q27J035L36q91P00P2r80L93L83o49K19
$$ 112 1100 -185 281 420 -629 -72 1066 176 -651 384 720 -171 529 601 -379 14 397 -252 -33
1959c3J087j415j01J124j99j023R97r6j072R06O25j247L79M50o50J95N87r26J30
$$ -33 1054 -361 -462 662 463 -560 437 341 -731 175 800 -447 -68 382 -268 -73 514 -412 -282
1978b82J155n75q78R47K56j143O19K37r20P06R94j404p32J506J63p76N01m50p62
$$ -282 873 298 -580 367 623 -520 99 336 -584 122 1116 -288 -1020 486 649 -127 374 -76 -838
1997h38J158J67j405N36R57q16j17O93r16mJ186o20q20J030N93j368N68Q9m04
$$ -838 320 487 -918 -382 575 -241 -358 335 -581 -585 601 -19 -839 191 784 -584 -16 73 -331
2016c31O43M76j456J67J401n64j227Q63K51l72P40k02j649J196Q78j001n13Q29
$$ -331 312 788 -668 -501 900 336 -891 -28 223 -149 591 389 -1260 -64 814 -187 -700 129
2034A29r3%Q57j078r27J578J46j152K54P04p04K23Q71j514L8J302j54j019P59
$$ 129 36 36 893 -185 -1112 466 612 -540 -286 418 -286 -63 808 -706 -668 634 480 -539 220
2053B20j23m04N82j41p53O27R00j297k12J060m86kL02m72k11R73j50r76L59Q97
$$ 220 97 -307 275 134 -619 8 908 -389 -601 459 -27 -29 273 -199 -410 563 413 -563 -204 693
2073F93q40L71K38r61K36J344j154q23R57J57k96M92n99r35J347R18j342k11J137
$$ 693 -147 224 462 -499 -263 1081 -73 -896 61 218 -78 414 -185 -1120 227 1145 -197 -408 729
2092G29q89J54M93o52m05Q68l4r97P82N5p36M93N84q12k65J152m26p24R40l99
$$ 729 -160 -6 487 -165 -570 298 264 -733 49 104 -632 -139 445 -367 -632 520 94 -630 310 -89
2112h9n65Q46R7q09L08J015j224J35R38r03M0P78p53n68Q12J60p50K28Q60j166
$$ -89 -654 192 289 -520 -212 803 -421 -286 652 -251 -211 567 -186 -754 58 218 -532 -304 556 -610
2132f10P25M62j156j89J523o52n33N96p1m12M26J8r15P16Q55q53Q5O31j230L58
$$ -610 115 577 -579 -768 755 103 -430 166 95 -317 109 127 -788 -72 783 -70 15 646 -584 -226
2152b26R45n61r22R34K65o80P87l54r00J192P14j500j51R71k53q18R21o88p6J137
$$ -226 719 158 -764 170 435 -245 542 188 -712 480 1194 -306 -457 514 261 -557 364 -324 -400 737
2172G37k49j028J93R56n17m2n2m87N81O94r14r42J427K49q28L22j47m45Q94K21
$$ 737 488 -540 -347 609 92 50 -2 -489 92 786 -128 -1070 357 606 -222 100 -47 -492 402 623
2192F23j345N1J272R4j176L46m1j08J185p25j082O31J176r03l14M60n09O06N39
$$ 623 -722 -671 601 695 -481 -135 -176 -284 901 176 -906 -275 901 -2 -316 144 -365 241 780
2211G80r29q48J104N43m29p5l85j24J111J57j573j00J517l19p93J93L2q8Q87k27
$$ 780 -149 -997 107 650 221 146 -239 -363 748 905 -668 -768 749 430 -363 -170 -138 -226 661 434
2231D34j312O31O00n57k45K37k30M44M82p85k85J018M8r84L19K19m25Q83K11j352
$$ 434 -878 -247 353 -204 -449 -212 -442 2 484 -301 -586 432 480 -504 -185 34 -391 492 703 -649
2251f49j78J480o01m47K46P0l64R50m19j084R38R86j330K07J96l59O61N54j281
$$ -649 -827 653 52 -395 -149 -79 -443 507 88 -996 -58 928 -402 -195 1 -358 303 857 -424
2270d24m35J083K43q33J57L20r44J332J23j442o7J189j55o75P49n97j78R84j90
$$ -424 -859 224 467 -366 -209 111 -833 499 622 -820 -887 302 147 -528 221 -376 -554 430 240
2289B40j197R85O61o18l76M93m14k8J115r36p30R68K78m84RJ0l20Q82M7j074n2
$$ 240 -957 28 689 71 -305 188 -226 -254 861 -75 -805 163 441 -43 -34 -24 -344 538 585 -489 -541
2310e41J561m75o99M89p22K16R77l24j165Q13J11m6k16L05m33J58Q31r77p47Q77
$$ -541 1020 545 -154 335 -387 -171 806 482 -683 130 241 195 -21 284 -149 9 840 -137 -884 -7
2330gM80n31K72j53p97J049N89j414j41J048m0k91K43p94k70J605j75j609P44
$$ -7 473 -58 214 61 -736 313 902 -512 -653 395 355 64 307 -487 -757 848 673 -936 -192
2349a92N26l00P6N7o61M42J017r73p80J137J8p7j83k86l65J206J79j884N6J344
$$ -192 334 34 110 167 -494 -52 965 -8 -788 349 367 290 107 -179 -544 662 841 -1043 -987 357
2369C57J49p23M12q95K89J485p83j682J228R44p02J49m02l06J96J284j159p71
$$ 357 506 -217 195 -700 -411 1074 291 -1391 -163 781 79 228 -174 -480 -284 1000 -159 -930
2387i30P42N30j4p3q83l29J634K59j471n73J378J54k56J80o99k23J569p30j010
$$ -930 -188 342 328 255 -628 -957 677 936 -535 -1108 270 424 168 348 -351 -574 995 265 -745
2406g45L73P89k84J6k36r22P71J040r71p63R33M53j34k81n34k33J175L79j414
$$ -745 -372 417 133 149 -87 -1009 -238 802 -169 -932 1 454 320 39 -495 -728 447 826 -588
2425e88J62O85l35K43j39p15M02J406j015r86N67P24k78L8k67o03P85J067q99
$$ -588 -426 259 -76 167 28 -687 -285 1121 106 -880 -313 411 133 171 -96 -699 86 1153 254
2444B54j198J171J53l88J35k20o66J250M04j324j12R79j97n3J53q26J25J327m99
$$ 254 -944 227 380 -8 127 -93 -759 491 895 -429 -541 438 241 188 341 -485 -360 967 468
2463D68j200J48J127l59J0j66q88R91Q42j052n64P20L03k37M28r93j96Q67P25
$$ 468 -732 -584 543 184 194 28 -860 131 973 -79 -643 77 380 143 571 -422 -618 249 974
2482I74j429J27O52j2m8R2r63K97J036m23q96L13M43j59M60n63m55M04J056r43
$$ 974 -455 -328 324 312 264 356 -607 -310 726 303 -593 -280 163 4 464 -99 -554 -150 906 -37
2502c7n38M23K98k19O33p99q76J535O96j356n20P90l54M49K38r14j01J257K25
$$ -37 -575 -152 146 -73 560 -239 -1115 420 1116 -240 -760 30 -324 125 363 -551 -652 605 830
2521H30j240K15M49l05M75k02j245J029O81m34j104P82R8m8L79n96o00J502M33
$$ 830 -410 -195 254 -51 424 222 -1023 6 687 253 -851 -69 29 -19 360 -236 -836 666 1099
2540A099j454l3N14j50M64j53r04J07J370q4j424L07L84J63L17m32j049O78J249
$$ 1099 -355 -388 126 -24 440 287 -617 -510 860 776 -648 -341 43 206 523 91 -958 -280 969
2559I69n80j141N32L73o7M16p39r68J512O33j073l71L66J69M06j3r25j15J285
$$ 969 389 -752 -220 153 86 502 -237 -1205 307 940 -133 -504 -138 31 437 424 -501 -616 669
2578F69J01j171J4L46K77J61l94r21R32J154p68j001O27J5J00M92j057n89J529
$$ 669 770 -401 -387 -41 236 397 3 -918 14 1168 400 -601 26 41 141 633 -424 -1013 516
2597E16M28j383M9L23M06j25K45j209J60J378j12j318K64M13K26M50q28q25O47
$$ 516 944 -439 -390 -67 339 214 459 -750 -590 788 676 -642 -378 35 261 711 -117 -942 -295
2616b95J211n91p93L21Q9J40M69o01r97J274P86j205k55M29K03J04L16j398J13
$$ -295 916 325 -468 -147 -58 82 551 -50 -1047 227 1013 -192 -447 -18 185 289 605 -793 -680
2635f80J369q7j038l9O73l96N95j83j158Q99O60n43m87N49k1j28N68o26p41J053
$$ -680 689 602 -436 -475 198 -198 397 214 -944 -45 615 72 -415 134 113 -15 553 -73 -814 239
2655B39K75q05l04K84M59N6K39p39j28J058k21p29J89K36K0M98n66q09N20J145
$$ 239 514 -291 -595 -311 148 204 443 -296 -424 634 413 -316 -127 109 129 627 61 -748 -228 917
2675I17o59o03K37P2J16L87n68q64Q32O55l76j86Ok14O77L98j311l44J390L9r89
$$ 917 258 -345 -108 -36 80 467 -101 -965 -133 522 146 -40 -34 -248 429 827 -484 -828 562 601 -388
2696c88K05o7k50J474p13q57L20P93l13l74J63l29N85M80q34q25J323L87m28k89
$$ -388 -183 -250 -500 974 261 -596 -276 517 204 -170 -7 -336 249 729 -105 -930 393 780 352 63
2716F3J6L4L23j36q48k79J353J87r37j8j00N75K87j18j251N77R25o94p2L64p41
$$ 63 79 113 436 300 -548 -827 526 713 -224 -242 -342 233 520 402 -849 -272 653 -41 -113 251 -490
2737d90M15R84j158o75J071L91m92k07P3m54Q65J18j079J82J051j70n08P7j18
$$ -490 -75 909 -249 -924 147 538 46 -161 -88 -542 323 441 -638 -456 595 425 -83 -6 -124
2756a24o8P90l11j068Q05P88q07N9j39o25P38P67r06r62J165N17p83k82K40k48
$$ -124 -192 598 287 -781 24 812 5 64 -75 -700 38 805 -101 -1063 102 619 -164 -446 -206 -454
2776d54P95K40j225J86R33k5q21L43j83k69J152l41j188L80R58l50m54P00p56
$$ -454 341 581 -644 -458 475 450 -371 -28 -211 -480 672 331 -857 -477 481 131 -323 377 -379
2795c79L26R08p08q09P93M82p84L05l08j4J89N68j010m14J201L0n71J28j24r5
$$ -379 -53 855 147 -662 131 613 -171 134 -174 -188 1 569 -441 -855 346 376 -195 -67 -191 -286
2815b86M97k95n55L64Q99o98k06M33m53M71M30m99r51R80O5l13L00m86j1O00K48
$$ -286 211 -84 -639 -275 624 -74 -280 153 -300 171 601 102 -849 131 196 -117 183 -303 -314 286 534
2836E34j246K93N95K05n56K07l68Q2N85J14r05N00O59n13l80J48k75K10J097p94
$$ 534 -712 -419 176 381 -175 32 -336 -254 331 445 -460 40 699 186 -194 -46 -321 -111 986 192
2856A92q51R04N2n01L13j49m03N15N04r47q6Q98m8o51L50n4j54O45k90q71L26
$$ 192 -659 245 297 -204 109 -40 -443 72 576 -371 -457 441 393 -258 92 38 -116 529 239 -632 -306
2877c06P92k10l61K2k26L59N42n33q21P97L00l41J08j02n95P19O26j008k89P71
$$ -306 486 276 -85 -63 -289 70 612 79 -742 55 355 14 122 20 -575 144 770 -238 -527 244
2897B44J65j69j05m70K64P04p00p03N77L61J7R5k01o91M42Q37n30o81N41J54j41
$$ 244 409 240 135 -335 -71 633 -67 -770 -193 168 185 280 79 -612 -170 667 137 -544 -3 151 10
2918A0L07k75l42K77M82m95m42O12J36n24N98m70j05Q18m14p62K92M68j79J4K51
$$ 10 317 42 -300 -23 459 -36 -478 134 270 -254 344 -126 -231 587 173 -589 -297 171 -8 6 257
2939B57n49J13Q92p99k36M51M6l75M67k46k97L42M59r31R9L74L0k07L17j0o96
$$ 257 -292 -179 713 -86 -322 129 175 -200 267 21 -276 66 525 -406 -307 67 97 -110 207 197 -499
2960d99J023k96o39L28N57m46J86k11n31K94Q99l15q40O95J23k83m3J60o65M80
$$ -499 524 228 -411 -83 474 28 214 3 -528 -234 665 350 -490 205 328 45 2 162 -503 -23
2980b3N97p69j30N53r0j54P5o1l68N12K01o99J58M98j79J6K94p76J6Q68n15n75
$$ -23 574 -195 -325 228 138 -16 59 -2 -370 142 343 -356 -198 300 121 137 431 -345 -329 539 24 -551
3002e51Q10j19m93L36L11p69M38N33r44q9O05k17p2O38p44r8O58K49j119N49O00
$$ -551 259 140 -353 -17 294 -475 -37 496 -448 -537 68 -149 -221 417 -327 -425 233 482 -637 -88 512
3023E12n28N21m42l10o4Q10j65j118J092l71j6P4P0p29P28M35p75J42J20J23k05
$$ 512 -16 505 63 -247 -311 499 334 -784 308 -63 -79 -5 65 -664 64 499 -276 -134 -14 109 -96
3044i6j23L07n98Q77l34n44M40N24o09J64J12m03O4N10k60l95N63J02k41K10k2
$$ -96 -219 88 -510 367 33 -511 -71 453 -156 8 120 -283 -219 291 31 -364 199 301 60 270 248
3065B48q51N14N46o92j56R16o44K03J0m01J61L38J6l45J19L8m56N57Pn83kN93
$$ 248 -603 -89 457 -235 -391 525 -119 84 94 -307 -146 192 208 -137 -18 20 -436 121 128 -455 -457 136
3087A36j08r2K77l45j42P44k26n05M35J98m40k59K00K46M5K72m89l77O19K86p79
$$ 136 28 -64 213 -132 -274 470 244 -261 174 372 -68 -327 -127 119 164 436 -53 -430 189 475 -304
3108c04K02L61k41J68K31o54M1N81k94m43J18K77k44O29m82m56P09K20p34J34
$$ -304 -102 259 18 186 417 -237 -196 385 91 -352 -234 43 -201 428 -54 -510 199 419 -315 -181
3128a81O14l61k40L7J72l62O72k83n18M16O0l32N47J12r24M77L37m17L5L78j84
$$ -181 433 72 -168 -131 41 -321 351 68 -450 -34 26 -306 241 353 -571 -94 243 -174 -139 239 55
3149E5l92P16k46p26O55K55o83K19L90p3p4j00k51o2P80l23m89J40L14q6j05L99
$$ 55 -337 379 133 -593 62 317 -366 -147 243 170 96 -4 -255 -317 463 140 -349 -209 105 19 -86 313
3171C13n41J69M50l50l67J99K20j18J51M82j123P23J24p33K81L36l63l2N98n32
$$ 313 -228 -59 391 41 -326 -127 93 -25 126 608 -515 208 332 -401 -120 216 -147 -179 419 -113
3191a13P4L97l78k31L85j01k7p5K44l43J37N33m00o13O61j87q6M17k98m03P17
$$ -113 -39 358 -20 -251 134 33 6 -69 175 -168 -31 502 102 -511 150 -37 -123 294 -4 -407 310
3212C10Jn79J94L0k37L04K54q49L03P50o99J09j01M23m91J23J5k10L38M61p56
$$ 310 311 -268 -74 -44 -281 23 277 -572 -269 481 -218 -109 -210 213 -278 -155 -140 -350 -12 449 -307
3233c07J42M02l31j63N12k62L7l99O91m41j13J50ML66J3n32K9N29n6l22jK56n57
$$ -307 -165 237 -94 -257 255 -7 30 -369 322 -119 -232 -82 -78 288 301 -231 -202 327 271 -51 -52 204 -353
3256c53K10K60n0p1K11j74k31O02l94j34K36J13l14oL06m22M2M56n99n8O68l62
$$ -353 -143 117 67 -4 207 33 -198 404 10 -124 112 225 -89 -95 211 -211 -169 287 -312 -370 298 -64
3278f4k09P02k90l70K84N7m97K26L72m68L59M66q20k22Q19m14p9J61O4m96N28
$$ -64 -273 429 139 -231 53 110 -387 -161 211 -257 102 568 -252 -474 345 -69 -148 13 77 -419 109
3299A09L10o18K67L10n02J13K64K6n68N38j33p6pP3j92J27K25o59N78k3l13k53
$$ 109 419 -199 68 378 -124 -11 253 279 -289 249 116 40 33 106 -86 41 266 -393 185 162 -151 -404
3321d04N71o8l67P08m01l84P62m01j85J29J81l85L01L01n80N7K09j21p0K77k59
$$ -404 167 99 -268 440 39 -345 417 16 -169 -40 141 -244 57 358 -222 -165 44 -77 -147 130 -129
3342a29r7L17Jm8J85J88k64m88O66j53q12P43k26j29L55k5j30m7K20l97N14j63
$$ -129 -226 91 92 44 229 417 153 -335 331 178 -634 109 -117 -246 109 84 -46 -93 127 -270 244 81
3364H1j72l35P69n37k12O98J08p72M35K63l30m7K69m05J61K0j46k17L85J51n48
$$ 81 -91 -426 343 -194 -406 292 400 -372 63 326 -4 -51 218 -187 -26 -6 -152 -369 16 167 -381
3385c81O93j68l44K86J00m51J69L19l36k28L18j03L81r7j16n9K56k19k50K49J60
$$ -381 312 144 -200 86 186 -265 -96 223 -113 -341 -23 -126 255 158 42 -17 239 20 -230 19 179
3406A79j33J1K14l08j6K09l08j87N01K1l49J54J31l60N8N71n81K27M94m95j29
$$ 179 46 57 271 -37 -53 156 -152 -339 162 183 -166 -12 119 -241 -183 388 -193 34 528 33 -96
3427i6K24j32l38L46M84q41M02L28l50K45k32l47N9M76m04j91Q28o62J51j04K38
$$ -96 128 -4 -342 4 488 -353 49 377 27 272 40 -307 -248 228 -176 -367 461 -201 -50 -154 84
3448H4n21J58O90l32k05K59k80k08L36J5j96R1L40m92J11M54n69K42N38p80RN86
$$ 84 -437 -279 411 79 -126 133 -147 -355 -19 -4 -200 -109 231 -261 -150 304 -265 -23 515 -265 -256 330
3470C30m96k10N08j03j78L50L35q08L68K06o06K52L88m73j10M50J78p16K65K35
$$ 330 -166 -376 132 29 -149 201 536 -272 96 302 -304 -52 336 -137 -247 203 381 -335 -70 165
3490A65n40K94L09l54K07Q3k48j08M18l43l82M47R6m5L4J73n07L18J84k3m30L71
$$ 165 -375 -81 228 -126 81 164 -84 -192 226 -117 -499 -52 44 -1 33 206 -301 17 201 178 -252 119
3512A19m8k44J59J20j25Q9L30o28K63J07j72K95j25j17m34M43K11m35N67l58j86
$$ 119 71 -173 -14 106 -19 70 400 -228 35 142 -30 265 140 23 -411 32 243 -192 375 17 -169
3533a69L13j06o5k94N47k08j23L88l17j95L32L1n06M45L44m52l9L45m40K64L28
$$ -169 144 38 -27 -321 226 18 -105 283 -34 -229 103 134 -372 73 417 -35 -74 271 -169 95 423
3554D23k69n04N45l48J95O2j5j36M9J4l90L51J88l84k5M15m96M2N35l03J85L15
$$ 423 154 -350 195 -153 42 104 89 -47 2 16 -374 -23 165 -219 -244 171 -325 -283 252 -51 134 449
3576D49m60o2pj6j47P3M57k00m02N87l02j97M34k63k19K78K30n29K04M03j36j0
$$ 449 -11 -73 -80 -96 -243 -170 287 87 -315 272 -30 -227 207 -56 -275 3 233 -296 -92 311 175 165
3598A65j7q8j95J93n5k28L11j61l00K08j2k55M78j48j09PK48J31m03L68N9j17
$$ 165 148 60 -135 58 3 -225 86 -75 -375 -167 -179 -434 44 -104 -213 -206 42 173 -230 138 197 80
3620H0k12M63o37M35J16k80k4K52J74n83N4L03J90k52J42n9j63K6m5Q2J78k99
$$ 80 -132 331 -306 129 245 -35 -59 193 367 -216 -162 141 331 79 221 162 -1 25 -20 62 240 -59
3642e9RJ07K22m52M60j51j14M4j75j04K08J57l8j62L15l12j60M82l57k8L62J17
$$ -59 -50 57 279 -173 287 136 22 66 -109 -213 -5 152 114 -48 267 -45 -205 277 -80 -108 254 371
3664C71o42L46l53L23J03N6j03l55L41J50m66O46n04j34K80l8j42J76k33M1L15
$$ 371 -271 75 -278 45 148 204 101 -254 87 237 -229 417 -87 -221 59 21 -121 55 -178 -137 178
3685A78p8k27j0K58j14j51P4J84n24M29P8l91J56q5J64k28N92l66J5L90J25n47
$$ 178 100 -127 -137 121 7 -144 -70 114 -410 19 97 -294 -138 -223 -59 -287 305 -61 -46 344 469 -78
3707g8r0L27l47N42l40l1Q1L61p22J99K28K5j83j36N10m47K11j03k03K71K55l75
$$ -78 -168 159 -188 354 14 -17 64 425 -297 -98 130 155 -28 -164 346 -101 110 7 -196 75 330 -45
3729d5L03P2l43j05L31l68N6K76k01k82J37J27j69Q9K64j65J5J82l05j1L80n0
$$ -45 258 330 -13 -118 213 -155 -99 177 -24 -306 -169 -42 -211 -122 142 -23 -8 174 -131 -142 238 188
3751A88j82j46M19n71K39L2l72L45K03j44r2N61l21j95J80l39M9K51j46J88j51
$$ 188 6 -140 279 -292 -53 -21 -393 -48 155 11 -81 480 159 -36 144 -195 -146 105 -41 147 -4
3772dK03m76J19j68N33n80N75k43j80J42j7m14P83k8n08J78J27J24l89K34J01
$$ -4 199 -277 -158 -326 207 -373 202 -41 -221 -79 -96 -510 273 245 -263 -85 42 166 -223 11 112
3793A12j73J11J61j23q6J62l61K46Q6k19N6J80j24k01K63J41k23j97L15l06J95
$$ 112 -61 50 211 88 2 164 -197 49 135 -84 -28 152 28 -173 90 231 8 -189 126 -180 15
3814A5l0J00k67L91l11j04N32j56k54J95j13k00mK85j93J4K07q9O3J27k52m7L67
$$ 15 -15 85 -182 209 -102 -206 326 170 -84 111 -2 -202 -206 79 -114 -100 107 18 81 208 -44 -91 276
3837B76k83l12M48l1k25o1K75n42L18K06m13K51L98n72j72P52l85m7J64J81m65
$$ 276 -7 -319 129 98 -127 -188 87 -455 -137 69 -344 -93 305 -267 -439 313 -72 -119 45 226 -239
3858b39J22K07l37J90L39m21j8J94J61m00m9N71n53M90j13k36J46R5j17l18O26
$$ -239 -117 90 -247 -57 282 -139 -157 37 198 -202 -251 320 -233 257 144 -92 54 149 32 -286 340
3879C40l09m2J82k13q4N7P3l68L68N8j52r0K73r5k57K83Oj57K70j13k18K06K21
$$ 340 31 -11 171 -42 -126 -69 4 -364 4 62 -90 -180 93 -2 -259 24 30 -127 143 30 -188 18 239
3902B39k41r9K78m5j12j22L17k38L4L18l23M8J22l27K19Jj86o8P5J81j11K22j00
$$ 239 -2 -101 177 132 20 -102 215 -23 11 329 6 54 176 -151 68 69 -117 -185 -110 71 -40 182 82
3925H2k74Q8M37l77j4K11j36p3K18l99L5K40JJ61Rj10l24L59N2m84M60N3l35K3
$$ 82 -192 -104 333 -44 -58 153 17 -56 162 -237 -202 38 39 200 209 99 -225 134 186 -298 162 215 -120 -97
3949i7K26j0m74L77J17l7J0J14j68j32L15n95L34rJ85k15oK36k30L03k91r2K03
$$ -97 129 119 -355 22 139 102 112 226 58 -74 241 -354 -20 -29 156 -59 -65 171 -59 244 -47 -139 64
3972F4J11k76NL70m21L43k5l13j18L15M0l86N12j41k92k2O6L6J69L0l41L3P37
$$ 64 175 -101 -96 274 -147 196 171 -142 -260 55 95 -291 221 80 -212 -234 -168 -132 37 67 -274 -241 496
3995D96m99J82j56J44j24j57O4r5l7K93O0j84L62m78l52N64q2j6L11l22m24L60
$$ 496 -3 179 23 167 43 -114 -50 -145 -182 111 171 -13 349 -129 -481 83 1 -15 296 -26 -450 -90
4017i0M21j42j09l64M08j81K78k33l59M59k8l43J65J19J49L5k16m3l5M64m20K19
$$ -90 331 189 80 -284 124 -57 221 -12 -371 88 60 -283 -118 1 150 185 -31 -74 -109 355 -65 154
4039A54K2p1o9%J98l05L76m41J27J70j89M7j34J92j11m64P68m80K62P0J4k58l1
$$ 154 176 105 36 36 234 -71 305 -136 -9 161 -28 19 -115 77 -34 -498 270 -210 52 122 136 -122 -153
4062a53M16k93Q1j22J98j40M0J4J99j40k00J30o9K40k69M7J00j35n7K38j73r6
$$ -153 263 -30 51 -71 127 -13 27 41 240 100 -100 30 -39 201 -68 -21 79 -56 -113 125 -48 -144
4084a44j67L30l51N24N6k62q6L70n71J64L88l39N8N2M0j67Q3R3k09N8Q8k24J60
$$ -144 -311 19 -332 192 248 -14 -100 270 -301 -137 251 -88 -30 22 62 -105 -22 71 -138 -80 8 -216 -56
4107e6M55m77k99M18l63K37J8K10k87K88j63n0J85M4j50n5J7R4J12R5j26k40R1
$$ -56 399 -78 -377 41 -322 -85 -67 143 -144 144 -19 -69 116 160 10 -45 -28 66 178 273 147 -93 -2
4130bN5r0q6K00k28K44qk77M27k1l44P1M18l39j91J88R1q8k40N5j24J97O6j02
$$ -2 53 -37 -123 77 -151 93 85 -192 235 214 -130 -59 359 20 -171 17 108 20 -220 -165 -289 -92 -26 -128
4154a28P1M6R2k78L62k73k96M25j1L6R1k12k43O30m7n88J92K69k66Qk41J50K66
$$ -128 -57 -11 81 -197 165 -108 -404 21 10 46 137 -75 -318 312 265 -323 -131 138 -128 -120 -361 -211 55
4177E5q5J17j88L64l02l5L0Q5k0j49J16k7J3J32K4k95pN63l80J68l67l9J25J60
$$ 55 -30 87 -101 263 -39 -74 -44 41 21 -128 -12 -39 -26 106 130 -165 -172 391 11 179 -188 -227 -102 58
4201E8P9k38M10l04j62K83j73Mk6J33k36K15J28j28k97M05kl82K83r2k65J84O3
$$ 58 137 -101 309 5 -157 126 -47 -43 -69 64 -172 43 171 43 -254 151 149 -233 50 -42 -307 -123 -60
4224f0J4k64O10k07l73N41m56J22L70l48J60O9q9l03J35J85R8k19L26k75o7J28
$$ -60 -46 -310 300 93 -280 261 -195 -73 297 -51 109 178 89 -214 -79 106 204 -15 311 36 -31 97
4246I7j67p5L1jj57J07K46J73m85N34m30J05J69k3l3j22K2m42O08L05n60J28J7
$$ 97 -70 -145 -114 -115 -272 -165 81 254 -231 303 -127 -22 147 124 91 -31 -9 -451 157 462 -98 30 47
4269D7pj32O6J6J04k04L00k88j3J64q8K52m27l2R4K38M5p9M3j2M6m5N5k12M7j7
$$ 47 40 -92 -26 -10 94 -110 190 -98 -111 53 -35 217 -210 -242 -148 90 135 56 99 87 133 88 143 -69 -22 -39
4295c9K07mR8m4n3l14L00j18kq4R4J34j1l8j74J53j64L23L0l89q5L97l34j43M79
$$ -39 168 164 262 218 165 -149 151 33 31 -53 41 175 164 126 -48 105 -59 264 294 -95 -180 217 -117 -260 219
4320B19k87j35K25J20k47M09k68r4j21K45p9J46k7k09j01M40l08J16K29n2j61
$$ 219 -68 -203 22 142 -105 304 36 -58 -179 66 -13 133 106 -103 -204 236 -72 44 273 221 60
4341F0K4pJ10k68P3J51r1J54k25J14Nj74j05J05M19j88k29K67k79j36M56k89M
$$ 60 84 77 187 -81 -8 143 52 206 -19 95 100 -74 -179 -74 345 157 -72 195 -84 -220 236 -53 -49
4364d9L33j21m80L87j3j09p5K38p8M2k39J29L34l43P1p0j38k8k5Q7j20J89j84
$$ -49 284 163 -317 70 57 -52 -127 111 33 75 -164 -35 299 -44 27 -43 -181 -209 -234 -147 -267 -78 -262
4387b62L23k35j92O57l44K34l60j5K96J37l43M7L8L61o39M65P5l06j01J00K26
$$ -262 61 -174 -366 291 -53 181 -179 -194 102 239 -104 -57 -19 342 -297 168 243 -63 -164 -64 162
4408A62k24q1J79J73j00K3Q9k92K63m4n66N60l09q9N30k39m94O65k93o5K09J39
$$ 162 -62 -143 36 209 109 132 221 -71 192 148 -418 142 -167 -256 274 35 -459 206 -87 -152 57 196
4430A96l23P2j9j92K01K28J6j50j65R0k90K31L25j81k34L15k5n27N23L1m24M09
$$ 196 -127 -55 -74 -266 -65 163 179 29 -136 -46 -336 -105 220 39 -195 120 95 -432 91 122 -302 107
4452A07k77k90J76J39l1K20k2l15L76k18j16J13J79k7k93M24pm22N62l61q5J1
$$ 107 -170 -460 -284 -145 -176 44 22 -293 83 -135 -251 -138 41 14 -279 145 138 -284 278 -83 -168 -157
4474a57K30K5k75K64j41M6R1J86l40p4K41k08L40J75p5m75J16J38L9j92J54j21
$$ -157 73 98 -177 87 -54 -8 83 269 -71 -145 96 -112 228 403 328 -147 -31 107 146 -46 108 -13
4496a3K7K10k28l16L81r7k2J07j52K0J51J2q2k16q5L65l7j46P9O7k07QM07k12
$$ -13 14 224 -4 -320 61 -36 -58 49 -103 -83 68 80 -2 -218 -303 62 25 -121 -42 25 -182 -174 233 21
4520B1k51O6L96j41m1N5j91l4O4l6k7J74K33j35j71P0P9m27J50J63j81J59k33
$$ 21 -230 -164 232 91 50 105 -86 -120 -56 -92 -119 55 288 153 -18 52 131 -296 -146 17 -164 -5 -238
4543b38K62J9K60m41J1M80m50M4K4J77r8l8k8J7L6l21K53J36j77M9q0N6Q5j81
$$ -238 24 43 303 -138 -127 353 -97 -53 -29 148 50 12 -16 1 37 -284 -31 105 -72 -23 -103 -47 38 -143
4567a43K51k28R6J31k48J48K56k56j32k50P42l91k67M61o1l13K70j21p7P7K9l5
$$ -143 108 -120 -24 107 -141 7 263 7 -125 -375 367 -24 -291 170 109 -204 66 -55 -132 -55 -26 -61
4589f1n6%k54K12L53j15j43J77k03K58l20J67j56j8J01j54J53K86J20m45L34l50
$$ -61 -117 -117 -371 -159 194 79 -64 113 -90 168 -152 15 -141 -159 -58 -212 -59 227 347 -98 236 -114
4611a14J7j69M46p3p4N0m87O57j90L4k75K97l16J02K18j6j16j65L89k76n0K34
$$ -114 -97 -266 180 107 33 83 -404 253 63 97 -178 119 -197 -95 123 107 -9 -174 215 -61 -111 123
4633A23n10N44k14M0J41j13K01k61L95n2o64M48J42l7k7K5l95L31J44k91n7M98
$$ 123 -387 157 -57 -17 124 11 212 -49 346 294 -370 78 220 183 156 181 -214 117 261 -30 -87 411
4655D11j89j54l74J60r2J83J99j37o8M8m6r8K58j87L0K03J75n40l5L83k14n9K28
$$ 411 222 68 -306 -146 -238 -55 144 7 -61 -13 -59 -157 101 -86 -56 147 322 -218 -253 130 -84 -143 85
4678H5Qj37P6j1q5J6p5j48L61O9n0k72K55O0k46p5L7J43J90l11K38k8j4N5k89
$$ 85 93 -44 32 21 -64 -48 -123 -271 90 159 109 -163 92 152 -94 -169 -132 11 201 -110 128 100 86 141 -148
4703a48J96k26K60J53k54j18M6p1j3L23J6l39K09J13q1R7j0j99J43j69l3p7K85
$$ -148 48 -178 82 235 -19 -137 -91 -162 -175 148 164 -175 34 147 66 163 153 -46 97 -72 -105 -182 103
4726A03j44O1n9K07k53K18j27j67M25l6l25J63q4J16lJ98n82K41J48o2qj08K84
$$ 103 -41 20 -39 168 -85 133 6 -161 264 228 -97 66 -18 98 95 293 -289 -48 100 38 30 -78 206
4749B06n31R0K50L30j83k5j64j08J19K30O3m4O6l87Q6jK73k43J57j20j06m7k5
$$ 206 -325 -235 15 345 162 137 -27 -135 -16 214 277 233 299 -88 -2 -3 270 27 184 64 -42 -89 -114
4772a14J20L17o70L51J12m34J78Q9J60k0j03J39m36M85P4o17K47k0R1j16M02k91
$$ -114 6 323 -347 4 116 -318 -140 -51 109 89 -14 125 -311 174 248 -369 -122 -142 -51 -167 235 -56
4794e6k17J28J33l7L87m22J20j62J14K15o6j4m2j38J73J79k28k4j88M14j49J26
$$ -56 -273 -145 -12 -49 338 -84 36 -126 -12 203 137 123 81 -57 116 295 67 43 -145 269 120 246
4816B46j97n5Q6J05j89J10k82M31n09J69L7o4K82J29m63O28n53Q1K75l50P0o8
$$ 246 49 -6 80 185 -4 106 -176 255 -254 -85 -48 -112 170 299 -164 464 -89 -8 267 -83 -13 -81
4838h1k2L86m9n0l71OK47J6k49J63N3j65K59Q3j18j18K3qK2j09n0QJ93p2J15l0
$$ -81 -103 283 234 184 -187 -181 66 82 -167 -4 49 -116 143 226 108 -10 13 5 27 -82 -132 -124 69 -3 112 82
4864H2J29l41M0n4M12j94j93j09L54L8k33J53J7l57J12K62n5o1m5J43o9r2L13
$$ 82 211 -130 -90 -144 268 74 -119 -228 126 164 -69 84 101 -256 -144 118 63 2 -43 100 31 -61 252
4887B52P1j75j44j75M88j73M1l68m8K0J14k96O82l32M7K92n09K32P0j31r7L30
$$ 252 323 148 4 -171 317 144 185 -183 -231 -211 -97 -393 289 -43 4 296 -213 19 89 -42 -139 191
4909A91l07K47J14n6j41m1J08j02rQ6j73O4J41l71L35l85O84n08R5K95m65J60
$$ 191 -116 131 245 189 48 7 115 13 4 90 -83 -19 122 -249 86 -299 385 -123 -28 267 -198 -38
4931c8K9K50l01J91k27RJ8J39m04M02j81M0p9K19j95j66N53n47N87k63n2J52R9
$$ -38 -9 241 -60 131 -96 -87 -69 70 -334 68 -113 -73 -152 67 -128 -294 259 -288 299 36 -16 136 235
4954B35k01j08L6J11k13L81k09mr4n2L68r1Oj61K1J30L7p6k80K70k21J75j53K27
$$ 235 34 -74 -38 73 -140 241 32 28 -66 -118 250 159 165 4 25 155 192 116 -164 106 -115 60 -93 134
4978A34k14j65J76k14M08Rj26J89J1k55J13j48J19k03K82k92J21K78J75l66j07
$$ 134 -80 -245 -69 -283 125 134 8 197 208 -47 66 -82 37 -166 116 -176 -55 223 398 32 -75
4999g5o6J35r2L05k76l2L75l46J00l5K07m10L49l98J05K9M55m44J35k31n6R1K01
$$ -75 -141 -6 -98 207 -69 -101 274 -72 28 -7 200 -210 139 -259 -154 -125 330 -114 21 -210 -266 -175 26
5022B6j67R7J16M5p0K02k89l7Q3m8K1j51J87K21k18K4K03m55M29l27j25K75j13
$$ 26 -141 -44 72 117 47 249 -40 -77 6 -42 -21 -172 15 236 18 42 245 -210 219 -108 -233 42 -71
5045g1J79l2p5N8J7J25k00J37J60k27k59K82J50j26k32K85k19K01j90q8J59L23
$$ -71 108 76 1 59 76 201 1 138 298 71 -188 94 244 118 -114 171 -48 153 -37 -125 34 357
5067C57l87j39N0N1kJ19J35m12K50j81k6J60l1o3R6K17k67o9M22J27o03J21J07
$$ 357 -30 -169 -119 -68 -70 49 184 -228 22 -159 -185 -25 -56 -119 -23 194 -73 -142 280 407 -196 -75 32
5090C2P3j00L04K0l37L6j5J62k53K90n19J30K45j16jK54q7j96P7r0j14J18M13
$$ 32 105 5 309 329 -8 28 13 175 -78 212 -307 -177 68 -48 -49 205 118 -78 -1 -91 -205 -87 326
5113C26m05J15J47l15J83m8J57J92o50L17j3J18j05j12J08rj13j0J39j83L49o2
$$ 326 -79 36 183 -132 51 3 160 352 -298 19 6 124 19 -93 15 6 -107 -117 22 -161 188 126
5135A26l34R6O2O5J45ml36N10k87nj05P5j88J66R0K55m54R2L3j8J10j60J21l6
$$ 126 -208 -112 -50 15 160 156 -180 330 43 38 -67 8 -180 -14 76 331 -123 -31 2 -16 94 -66 55 19
5159A9K08ol18L94l82l9J91k96R1p6N85m04J96l64K37P7l25K08j90K16J39j64
$$ 19 227 221 -97 297 -85 -124 67 -229 -138 -214 371 -33 163 -201 36 113 -212 -4 -194 22 161 -3
5181cl72N00j56jK11j58l14K95R0j61J55m4j18J11K1q0K6J35l0N5k23K70j39J26
$$ -3 -375 125 -31 -32 179 21 -293 2 92 -69 86 42 -76 35 56 -24 2 137 107 162 -61 209 70 196
5205A96K0j79K2J0K8l92N5N4J45k0k16K08J03R6k40k0K68j97K19k78L93K1p0q9
$$ 196 216 37 59 69 97 -295 -240 -186 -41 -61 -277 -69 34 130 -110 -130 138 -59 160 -118 275 296 226 137
5229A37p4m9J23j95J92R7k94o4K21j35Pk9k04J23N5j11J23J44J12J53m74M5L6
$$ 137 63 14 137 -58 134 231 -63 -127 94 -41 -34 -63 -267 -144 -89 -200 -77 67 179 332 -142 -97 -61
5252f1j68m2L58j99J40o5M4K3p6J16N3j9J20l25J96j2l42K49L35k01j89l0j11
$$ -61 -229 -271 87 -112 28 -37 7 30 -46 70 123 104 224 -101 95 83 -259 -10 325 124 -65 -95 -206
5275b06O0M10n3j70Rj41n4J02J39p9J10j70k29K69q5p9OL28j50n6J35o1j14Q4
$$ -206 -146 264 211 41 50 -91 -145 -43 96 17 127 -43 -272 -3 -88 -167 -161 167 17 -39 96 35 -79 5
5299Em0R8k0O4M7j61K34l29j41M82o9l54L49m17K94j68Q2p7J88J3k55K68N7n46
$$ 5 -35 63 43 107 154 -7 227 -102 -243 239 170 -184 165 -252 42 -126 -44 -121 67 80 -175 93 150 -396
5323c96K91J86oj69j18O1K11j76J2K21k65K41Kj10o2L4M3M1k8Q6j10k7M0P0K8
$$ -396 -105 81 75 -94 -212 -151 60 -116 -104 117 -148 93 95 -15 -77 -43 0 41 13 99 -11 -38 2 72 100
5348A00q1K07k68L5j47L26o0k2K08k71j07R6J3p9K52j09m37M94N2j58K47m75o
$$ 100 19 226 -42 -7 -154 172 112 90 298 27 -80 16 29 -50 202 93 -344 150 202 44 291 -184 -190
5371a90K23j84M4o7K29J08m55K68j01O8k54M83l83PP6j47J94L30k13mj83K35P2
$$ -190 33 -151 -107 -174 55 163 -292 -24 -125 -57 -311 172 -211 -204 -128 -275 -81 249 36 32 -151 84 156
5394A56k85jK89k5k13j91K19L33l63K10j36Q6j78J92j43K1J91r8k87J88l1K74
$$ 156 -129 -130 159 134 -79 -270 -51 282 -81 129 -7 79 -99 93 -50 -29 162 64 -223 -35 -66 208
5416B08l37P0j39L74k16k39L55j61J08k7J84j76Q1j91J42l69J99L6j32L47k10
$$ 208 -129 -59 -198 176 -40 -279 76 -85 23 -4 180 4 85 -106 36 -333 -134 -98 -230 117 -93
5437i3N5k88N07k08J8k90L01l20L82J31k75R8K49p9j21l2N8L10k36j66M5J10k56
$$ -93 -38 -326 181 -27 -9 -299 2 -318 64 195 -80 18 267 188 67 35 93 403 167 1 46 156 -100
5460a00j53J76K42q4O5j21k43K04k33Q1J12K68j51k02L78l80K89j58R2j9p9K38
$$ -100 -253 -77 165 81 146 25 -218 -14 -247 -166 -54 214 63 -139 239 -141 148 -10 82 63 -16 222
5482B22j66M23l36o2L0k19PJ71k03L18r2k8k79L38l62K70M20m90NJ04j2n2j46
$$ 222 56 479 143 81 111 -108 -101 70 -133 185 93 65 -214 124 -238 32 452 -38 -33 71 59 7 -139
5505a39l2j55P05k21l12L05p9j46M34p9j46o7j43RK74J25m30J5L01K0L1l57j46
$$ -139 -171 -326 379 158 -154 151 72 -74 360 281 135 68 -75 -66 208 333 -97 -82 219 239 270 -87 -233
$$ [...]
8191a85
##END NTUPLES=NMR FID
##END=
