##TITLE=1H_CA-8413x
 DMSO, 8 sc, 
 24.10.2019
##JCAMPDX= 6.0         $$ Bruker NMR JCAMP-DX V2.0
##DATA TYPE= NMR FID
##DATA CLASS= NTUPLES
##ORIGIN= UXNMR, Bruker Analytische Messtechnik GmbH
##OWNER= root
$$ XWIN-NMR		Version 3.5
$$ Thu Oct 24 14:06:38 2019 Russian Standard Time (UT+4h)  she@DPX200
##.OBSERVE FREQUENCY= 200.1315
##.OBSERVE NUCLEUS= ^1H
##.DELAY= (6, 6)
##.ACQUISITION MODE= SIMULTANEOUS
##.ACQUISITION SCHEME= undefined
##.AVERAGES= 8
##.DIGITISER RES= 18
##SPECTROMETER/DATA SYSTEM= spect
##.PULSE SEQUENCE= zg30
##.SOLVENT NAME= DMSO
##.SHIFT REFERENCE= (INTERNAL, DMSO, 0, 15.7039)
##AUDIT TRAIL= $$ (NUMBER, WHEN, WHO, WHERE, WHAT)
$$ ##TITLE= Audit trail, XWIN-NMR		Version 3.5
$$ ##JCAMPDX= 5.01
$$ ##ORIGIN= Bruker BioSpin GmbH
$$ ##OWNER= she
$$ F:/spectra/data/she/nmr/H-F/1/audita.txt
$$ ##AUDIT TRAIL=  $$ (NUMBER, WHEN, WHO, WHERE, WHAT)
(   1,<2019-10-24 14:05:41.06 +0400>,<she>,<DPX200>,
      <created by zg, POWCHK disabled, PULCHK disabled
       configuration hash MD5:
       00 E9 B6 7A A2 85 ED C7 34 08 36 98 17 FE 4E 26
       data hash MD5: 16K
       70 D1 D1 CE E2 08 CB 80 C8 A7 8E 7E 0E 7E 2B 61>)
$$ ##END=
$$ 
$$ hash MD5
$$ 64 80 A3 2B 57 93 01 A9 57 A9 F9 96 8D 88 67 71
##$RELAX= 
##$RELAX= 
##$RELAX= 
##$RELAX= 
##$RELAX= 
##$RELAX= 
$$ Bruker specific parameters
$$ --------------------------
##$DU= <F:/spectra>
##$EXPNO= 1
##$NAME= <H-F>
##$PROCNO= 1
##$TYPE= <nmr>
##$USER= <she>
##$AMP= (0..31)
100 100 100 100 100 100 100 100 100 100 100 100 100 100 100 100 100 100 
100 100 100 100 100 100 100 100 100 100 100 100 100 100 
##$AQSEQ= 0
##$AQ_mod= 1
##$AUNM= <au_zg>
##$AUTOPOS= <>
##$BF1= 200.13
##$BF2= 200.13
##$BF3= 200.13
##$BF4= 200.13
##$BF5= 200.13
##$BF6= 200.13
##$BF7= 200.13
##$BF8= 200.13
##$BYTORDA= 1
##$CFDGTYP= 0
##$CFRGTYP= 5
##$CHEMSTR= <none>
##$CNST= (0..31)
1 1 145 1 1 1 1 1 1 1 1 1 1 1 1 1 1 1 1 1 1 1 1 1 1 1 1 1 1 1 1 1 
##$CPDPRG= <>
##$CPDPRG1= <>
##$CPDPRG2= <>
##$CPDPRG3= <>
##$CPDPRG4= <mlev>
##$CPDPRG5= <mlev>
##$CPDPRG6= <mlev>
##$CPDPRG7= <mlev>
##$CPDPRG8= <mlev>
##$CPDPRGB= <>
##$CPDPRGT= <>
##$D= (0..31)
0 1.2 0 0 0 0 0 0 0 0.06 0 0.03 0 0 0 0 0.0002 0 0 0 0 0 0 0 0 0 0 0 0 
0 0 0 
##$DATE= 1571911540
##$DBL= (0..7)
120 120 120 120 120 120 120 120 
##$DBP= (0..7)
150 150 150 150 150 150 150 150 
##$DBP07= 0
##$DBPNAM0= <>
##$DBPNAM1= <>
##$DBPNAM2= <>
##$DBPNAM3= <>
##$DBPNAM4= <>
##$DBPNAM5= <>
##$DBPNAM6= <>
##$DBPNAM7= <>
##$DBPOAL= (0..7)
0.5 0.5 0.5 0.5 0.5 0.5 0.5 0.5 
##$DBPOFFS= (0..7)
0 0 0 0 0 0 0 0 
##$DE= 6
##$DECBNUC= <off>
##$DECIM= 24
##$DECNUC= <off>
##$DECSTAT= 4
##$DIGMOD= 1
##$DIGTYP= 9
##$DL= (0..7)
0 120 120 120 120 120 120 120 
##$DP= (0..7)
150 150 150 150 150 150 150 150 
##$DP07= 0
##$DPNAME0= <>
##$DPNAME1= <>
##$DPNAME2= <>
##$DPNAME3= <>
##$DPNAME4= <>
##$DPNAME5= <>
##$DPNAME6= <>
##$DPNAME7= <>
##$DPOAL= (0..7)
0.5 0.5 0.5 0.5 0.5 0.5 0.5 0.5 
##$DPOFFS= (0..7)
0 0 0 0 0 0 0 0 
##$DQDMODE= 0
##$DR= 18
##$DS= 0
##$DSLIST= <SSSSSSSSSSSSSSS>
$$ [...]
##$SUBNAM2= <"">
##$SUBNAM3= <"">
##$SUBNAM4= <"">
##$SUBNAM5= <"">
##$SUBNAM6= <"">
##$SUBNAM7= <"">
##$SUBNAM8= <"">
##$SUBNAM9= <"">
##$SW= 24.0689530833862
##$SWIBOX= (0..15)
0 0 2 0 0 0 0 0 0 0 0 0 0 0 0 0 
##$SW_h= 4816.95568400771
##$TD= 16384
##$TD0= 1
##$TE= 0
##$TE2= 300
##$TE3= 300
##$TEG= 300
##$TL= (0..7)
0 120 120 120 120 120 120 120 
##$TP= (0..7)
150 150 150 150 150 150 150 150 
##$TP07= 0
##$TPNAME0= <>
##$TPNAME1= <>
##$TPNAME2= <>
##$TPNAME3= <>
##$TPNAME4= <>
##$TPNAME5= <>
##$TPNAME6= <>
##$TPNAME7= <>
##$TPOAL= (0..7)
0.5 0.5 0.5 0.5 0.5 0.5 0.5 0.5 
##$TPOFFS= (0..7)
0 0 0 0 0 0 0 0 
##$TUNHIN= 0
##$TUNHOUT= 0
##$TUNXOUT= 0
##$USERA1= <user>
##$USERA2= <user>
##$USERA3= <user>
##$USERA4= <user>
##$USERA5= <user>
##$V9= 5
##$VALIST= <valist>
##$VCLIST= <CCCCCCCCCCCCCCC>
##$VD= 0
##$VDLIST= <DDDDDDDDDDDDDDD>
##$VPLIST= <PPPPPPPPPPPPPPP>
##$VTLIST= <TTTTTTTTTTTTTTT>
##$WBST= 1024
##$WBSW= 4
##$XGAIN= (0..3)
0 0 0 0 
##$XL= 0
##$YL= 0
##$YMAX_a= 277598
##$YMIN_a= -516971
##$ZGOPTNS= <>
##$ZL1= 120
##$ZL2= 120
##$ZL3= 120
##$ZL4= 120
##$ABSF1= 10
##$ABSF2= 0
##$ABSG= 5
##$ABSL= 3
##$ALPHA= 0
##$AQORDER= 0
##$ASSFAC= 0
##$ASSFACI= 0
##$ASSFACX= 0
##$ASSWID= 0
##$AUNMP= <proc_1d>
##$AZFE= 0.1
##$AZFW= 0.1
##$BCFW= 1
##$BC_mod= 2
##$BYTORDP= 1
##$COROFFS= 0
##$CY= 11.3945322036743
##$DATMOD= 1
##$DC= 2
##$DFILT= <>
##$DTYPP= 0
##$F1P= 20.1720416913024
##$F2P= 0.152960286110954
##$FCOR= 0.5
##$FTSIZE= 0
##$FT_mod= 4
##$GAMMA= 1
##$GB= 0.15
##$INTBC= 1
##$INTSCL= 1
##$ISEN= 128
##$LB= 0.24
##$LEV0= 0
##$LPBIN= 0
##$MAXI= 10000
##$MC2= 0
##$MEAN= 0
##$ME_mod= 0
##$MI= 1.114404
##$NCOEF= 0
##$NC_proc= 0
##$NLEV= 6
##$NOISF1= 3.799351
##$NOISF2= 2.8
##$NSP= 1
##$NTH_PI= 0
##$NZP= 0
##$OFFSET= 15.70392
##$PC= 1
##$PHC0= -9573.28
##$PHC1= 13.80082
##$PH_mod= 1
##$PKNL= yes
##$PPARMOD= 0
##$PSCAL= 0
##$PSIGN= 0
##$REVERSE= no
##$SF= 200.130013532006
##$SI= 16384
##$SIGF1= 3
##$SIGF2= 2
##$SINO= 400
##$SIOLD= 16384
##$SREGLST= <1H.CDCl3>
##$SSB= 0
##$STSI= 0
##$STSR= 0
##$SW_p= 3612.71676300578
##$SYMM= 0
##$S_DEV= 0
##$TDeff= 0
##$TDoff= 0
##$TI= <>
##$TILT= no
##$TM1= 0
##$TM2= 0
##$TOPLEV= 0
##$USERP1= <user>
##$USERP2= <user>
##$USERP3= <user>
##$USERP4= <user>
##$USERP5= <user>
##$WDW= 1
##$XDIM= 8192
##$YMAX_p= 0
##$YMIN_p= 0
$$ End of Bruker specific parameters
$$ ---------------------------------
##NTUPLES= NMR FID
##VAR_NAME=  TIME,          FID/REAL,        FID/IMAG
##SYMBOL=    X,             R,               I
##VAR_TYPE=  INDEPENDENT,   DEPENDENT,       DEPENDENT
##VAR_FORM=  AFFN,          ASDF,            ASDF
##VAR_DIM=   8192,          8192,            8192
##UNITS=     SECONDS,       ARBITRARY UNITS, ARBITRARY UNITS
##FACTOR=    0.0002076,     1,               1
##FIRST=     0,             0,               0
##LAST=      1.7004516,     0,               0
##MIN=       0,             -516971,         0
##MAX=       1.7004516,     277598,          0
$$ Real data points
##PAGE= N=1
##DATA TABLE= (X++(R..R)), XYDATA
$$ [...]
2170e35P61m76O93K74j874N85J766l00j393M44O9l23J228n54j706P24J847q81
2188C49j183J008l6m4lm69p5J448k55j745N61Q19n62M82J52j694P49K089o47k448
2208a504J175O50k55P9l99p07J092Q08j256l89Q02R7J3N23j197j78J325J91j944
2227a074P42Q14n13k5L20r64Q4J563o84j208P32K37m93P67l66n91P92O65j465
2246f67J22R10l61l21Q45o71n90J292R8j408M33N40l52l6N18o44j52J241r31n31
2266f65R11m50k83J018nj238N95J173j335l41J051n66k19J022m88j029Q40O85
2284F76j050K71K08o25O07Q20j547K05J228p25l78Q46q73l09J248R4j740O18Q14
2303C88l21l50L92l82K77O75q02q00J324L30r44J87J94q96R74Q39j932k20J847
$$ plain form
2170 -535 226 -250 443 717 -1157 -572 1194 894 -499 -55 14 -309 919 365 -1341 -617 1230 349
2188 349 -834 174 138 94 91 -378 -453 995 740 -1005 -444 375 -187 295 447 -1247 -498 1591 944 -1504
2208 -1504 -329 321 66 145 -254 -961 131 939 -317 -706 96 193 206 729 -468 -646 679 870 -1074
2227 -1074 -332 482 -31 -56 264 -700 -616 947 263 -945 -213 24 -469 298 -68 -659 133 798 -667
2246 -667 -545 365 4 -317 528 -143 -733 559 657 -751 -318 222 -130 -166 352 -292 -444 797 -134 -665
2266 -665 246 -204 -487 531 526 -712 -117 1056 -279 -620 431 -135 -354 668 180 -849 -9 676
2284 676 -374 -103 105 -520 87 907 -640 -435 793 68 -310 536 -337 -646 602 696 -1044 -426 388
2303 388 67 -283 109 -273 4 679 -123 -923 401 731 -213 -26 168 -728 246 1085 -847 -1067 780
2322G80j94j199Q95o11k3J071n18j382R29Q61o40P8r1n92R43J033j401j197J436
2341A78O00r59P8q3l82R34O53j637m19J665J44j138L17m90M31R62n73j534R32
2360c21J749j465n12N14r1K38R62j259r93J482P45j262j27K18j7R18O6j558j39
2379h52J802j70j102K02N7j54R24m96j305R96J148r25p27N12q2J26O21r65p15
2398a105J306P00j342K66L69p71R05L87j165j22J232j22j280O62r6k5J183o76
2416C06j198P47J121r03o36N95m84L12P90r63p36J478L28r02O2J28p49Q82O23
2435H01j708J17J849p92r10K03M07l35R72j9j366M46J011q02L5L80p30o7J315
2454H07r31q66J206M45p97k1M25j034J032N06q50p99J415k64l74L47q00J23J354
$$ plain form
2322 780 586 -613 282 -329 -352 719 201 -1181 -252 609 -31 47 -44 -636 307 1340 -61 -1258 178
2341 178 778 -181 -103 -186 -568 366 1019 -618 -1037 628 772 -366 -49 -539 -108 854 281 -1253 -321
2360 -321 1428 -37 -549 -35 -126 112 1074 -185 -1178 304 1049 -213 -340 -122 -139 779 845 -713 -852
2379 -852 950 780 -322 -120 -63 -217 707 211 -1094 -98 1050 125 -602 -90 -172 -46 575 -390 -1105
2398 -1105 201 901 -441 -175 194 -577 328 715 -450 -572 660 538 -742 -80 -176 -201 982 306
2416 306 -892 -145 976 73 -563 32 -452 -140 650 -313 -1049 429 757 -145 -83 45 -704 178 801
2435 801 -907 -790 1059 267 -643 -440 -33 -368 604 585 -781 -335 676 -126 -91 289 -441 -508 807
2454 807 -124 -990 216 661 -136 -157 268 -766 266 772 -78 -877 538 274 -100 247 -553 -430 924
2473I24k84j411M84Q06j42k56l6p43N60J082r40r78Q99O03o54J22q0o14P70O43
2493G55j253m76J360j9j64K58p53l49J361M65j691MR42j62l9k65p55Q50R84q73
2513A80j512J244P05n95N4m12n69J207Q39j543o05J369K60o24K25o40j52J635
2531A066j82j989N91J094k32l45j56q46O05J539j091j215J133N80m11ko79l30
2549h70J500N21j788KJ238m2p33K20n44j77J642m57j766R85R80o28K17j86p35
2568f21M56J625j332j186R23O90n94K80n53m04J017O63j430l01J028J26n30J67
2586B4k54m69J626k70j543M35J226o17k84J52r21P27J181j006r50Q85L98j81O2
2605B21n02l19J203L03j479j97J068J4o82N33n21m24J383N3j327L53P28l74k3
$$ plain form
2473 924 640 -771 -287 519 377 121 85 -658 -98 984 44 -934 -35 568 -86 36 -44 -658 112 755
2493 755 -498 -974 386 367 203 461 -292 -641 720 1185 -506 -502 440 278 239 -26 -781 69 1053 180
2513 180 -1332 -88 617 22 76 -336 -905 302 1141 -402 -1007 362 622 -2 223 -417 -569 1066
2531 1066 884 -1105 -514 580 348 3 -153 -999 -394 1145 54 -1161 -28 552 141 139 -540 -870
2549 -870 630 1151 -637 -635 603 561 -172 48 -496 -673 969 512 -1254 -269 711 83 300 114 -621
2568 -621 -165 1460 128 -1058 -135 555 -39 241 -312 -716 301 964 -466 -767 261 387 -143 24
2586 24 -230 -699 927 657 -886 -451 775 158 -126 26 -895 -168 1013 7 -943 -58 340 159 221
2605 221 -281 -600 603 906 -573 -770 298 312 -370 163 -358 -782 601 654 -673 -320 408 34 11
2624A1J97p51J19J236o42q20O13K51l52P06p07q03J180O58j297j49J108m23l78
2643b43O02p30l40J233j8j054J40Q18k50OJ19r45M71J602j405o77R64J2p04Q22
2663D23k3j432J075Q51q40p80O52M41m08L98q46q7J373j24j377L98N87l73O43
2682E51j48j392L86J857p06j534O69O60m63L49k91q21R41P84j119l54P60k93M90
2701C26Q2r38k50J519J54j604J56R36l03Q5J56j205J22K075p58j290O80K27K44
2720D14n3m07n15Q83P50j735MJ128k99j52L06p65j92J495l4j350j25P07j44J05
2740B1L28j149M02J065o05o36P45n0k94N54n00r25J102J211j591n13Q09J75k54
2759a05K18m42l59J430L4j126Q7M39l17M93o2r46L23J264j208n02R73M37p76N23
$$ plain form
2624 11 208 -543 -424 812 170 -650 -37 214 -138 568 -139 -942 238 896 -401 -550 558 135 -243
2643 -243 359 -371 -711 522 504 -550 -410 408 158 164 283 -662 -191 1411 6 -671 293 305 -399 423
2663 423 400 -1032 43 894 54 -726 -74 367 -41 357 -489 -576 797 673 -704 -306 281 -92 551
2682 551 403 -989 -603 1254 548 -986 -317 343 -120 229 -62 -883 58 842 -277 -631 129 -164 326
2701 326 408 -530 -780 739 893 -711 -555 381 78 163 319 -886 -764 1311 553 -737 -57 170 414
2720 414 361 -46 -561 322 1072 -663 -659 469 170 18 324 -441 -633 862 828 -522 -647 60 -84 21
2740 21 349 -800 -398 667 62 -574 171 121 -173 381 -119 -1044 58 1269 -322 -835 -26 149 -105
2759 -105 113 -329 -688 742 776 -350 -263 176 -141 352 290 -656 -333 931 -277 -779 194 631 -145 378
2779C78l12p27N46J049j002m94O54K7O5L15j194j87J410J4r99L54N99q28N17K14
2799C99r32R8J172r96m00O94Kq0M84m09p14O96N62o75j99L73p00P39P46j229n41
2820i10J227M29j307L46N94o25M6N23n65q6R50m56n35L74l9j48J069q22r92R44
2840A7R92j331j34P96p86L10N55l22q01J254j0p95J06N17l09K91p1j125N18J141
2860H13o97k44K28k03J15O55n16r46M74J321j037m47P50k36J53K39o43l72R18
2879C25N50j075QQ3JQ37n01j184N55J236p06m13L44L1m8M43j84r85N20R12q66
2900a17l13O96m82L75N69p28n84J559m21j069L65L49l51N3P77j492J37J386m28
2919B81n84J59M1l24N81j22p93P45M75p14K9L56j22nL67q71k05J159J99j273L78
$$ plain form
2779 378 66 -661 -115 934 -68 -562 92 119 184 499 -695 -882 528 542 -457 -103 496 -332 185 399
2799 399 -533 -435 737 -259 -659 35 37 -43 441 32 -682 14 576 -99 -298 75 -625 114 860 -369 -910
2820 -910 317 746 -561 -215 379 -246 -200 323 -242 -328 622 166 -369 5 -34 -182 887 65 -927 17
2840 17 1009 -322 -456 340 -446 -136 419 97 -704 550 540 -255 -149 368 59 350 279 -846 -328 813
2860 813 116 -128 100 -103 12 667 151 -795 -321 1000 -37 -484 266 30 183 422 -221 -593 325
2879 325 875 -200 -192 -109 -108 729 228 -956 -401 835 129 -284 60 91 43 486 302 -683 -163 749 -117
2900 -117 -430 266 -216 159 728 0 -584 975 554 -515 -150 199 -152 -99 678 -814 -677 709 281
2919 281 -303 -144 -103 -427 154 32 -761 -16 459 -255 -226 130 8 3 370 -501 -706 453 652 -621 -243
2940b43M37o94R29J26r20J22Q43l59p15N03Q2j37K79Mj226J095L37j084L18Q80
2960E77n43m5M70p63k91P19K78r31K99K40j16K95K86r53K13R73p68k32P34l91
2980E1l88Q70j16j285O90O33m49j72L60m96L46P90j281l80J251l36k94L90r9l66
3000b81N81M42j186K69P35k20q38N82j83q4N56j09r43O13L66k30m54O09p58N45
3020A2O40q69l81P13r8o49R63j04m47J72P77j217O8O57J06p36O80l85j49M99j66
3041H6n11N02M46q91K76J82m61M15N75o24l99O00M36r03J88K93q00Q76j62o46
3061e22N9Q28r9l72K62j58l32P63n45n09Q41J40m65q1M80n45K01M54o18j08N72
3082B46J36m33J36J11o20N86O0l74QQ93n45l05M73o76K9P34j92n77M36O6l17l0
$$ plain form
2940 -243 194 -500 429 555 -365 -243 600 241 -474 29 111 -26 253 257 -969 126 463 -621 -303 577
2960 577 34 -11 459 -304 -595 124 402 -529 -230 10 -106 189 475 -478 -265 708 -60 -292 442 51
2980 51 -337 533 417 -868 -178 455 6 -166 194 -302 44 834 -447 -827 424 88 -206 184 85 -281
3000 -281 300 742 -444 -175 560 340 -498 84 -99 -183 373 264 -679 -66 300 70 -384 225 -533 12
3020 12 652 -217 -598 115 17 -632 331 227 -220 -48 729 -488 -420 237 343 -393 287 -98 -247 252 86
3041 86 -425 77 523 -368 -92 90 -371 44 619 -5 -404 196 632 -271 -83 210 -590 286 124 -522
3061 -522 -463 365 266 -106 156 -2 -334 429 -116 -625 216 356 -109 -190 290 -255 -54 400 -218 -326 246
3082 246 382 -51 85 196 -424 162 222 -152 -144 749 204 -101 372 -304 -275 459 267 -310 126 192 -125 -155
3104a55K77n27N27J25n72k48R18j77n87O76P9o11K47O67j105L35P45o06r4K25
3124A39l17m07J020j28q44P13N79j161K80L21l73j6Q19o08m02O13j36m86O14Q
3144B28o67M12L60m28k32M05l45m2Q19n54k93P43L5j191P33K45p12O77R7o69L82
3165CL10l86l88M66P5m90N73k43l35K15O40j005Q05N2Rn13P06k59q44J099l46
3186A44m12L01J32o24L64M28m72P4O08o76l27P51l2l46N20l28n76K27P02p27o2
3207c31O38k35l55N41l13j61O80m10l69N71j03p70O07L57o76L29N31n59n41R85
3227D16j66m23K39L39p84Q22q4l71j0L01o11k53J126m29n21N54l63l95M61M87
3247C35o23J49M96l32l18P06o06j72N38k11n47N04R2m59L37M66m04P0L11l51M4
$$ plain form
3104 -155 122 -405 122 247 -325 -573 345 168 -419 257 336 -275 -28 639 -466 -131 614 8 -86 139
3124 139 -178 -585 435 307 -537 176 755 -406 -126 195 -178 -194 625 17 -385 228 92 -394 220 228
3144 228 -439 -27 333 -95 -327 78 -267 -309 510 -44 -337 406 441 -750 -17 228 -484 193 290 -379 3
3165 3 313 -73 -461 5 80 -410 163 -80 -415 -200 440 -565 240 292 301 -212 494 235 -609 490 144
3186 144 -268 33 165 -459 -95 333 -139 -65 543 -133 -460 291 259 -87 433 105 -471 -244 458 -269 -331
3207 -331 307 72 -283 258 -55 -216 464 54 -315 256 153 -617 -10 347 -329 0 531 -28 -569 416
3227 416 250 -173 66 405 -379 443 359 -12 -22 279 -332 -585 541 112 -409 145 -218 -613 -152 335
3247 335 -288 -139 357 25 -293 413 -193 -365 173 -38 -585 -81 11 -448 -111 355 -49 21 332 -19 25
3268B5L92m53o26J127n66q7l4M37m09K01K55p14K26N60k46l65M26j84m58O16r2
3289C1l05M63J87o99J65N12m77j40O14l17n12Q15j66q31P17K04n24K27L09k29
3309D4p6K76n85L01M47k84m28O23l08o61R90k44n76M93K55n25L11K64m99k74N65
3330A09Jm44N66J3k43r3K53k64J1M81n70j17Q60p82M4N99l03o45R20J18p00m4
3352b30L95l3n21N20r8J15M7k58o4J31K65n52K78K57m68J04N95o88Q4M58o50P9
3374b34M52K70o33K44K13l28m3n6p7J12L50m86J04M83k87m59N19K44r18P73J45
3395C88o25K89L33m90k69M96m3m85O45o4n72M35J90m04K30N53r41J70N36o45J21
3416a52O16m74j25J94N5j95J65K30m27j10M09n67L64J45l51k41O22l2l94N58o6
$$ plain form
3268 25 417 -36 -662 465 -101 -188 -222 215 -194 7 262 -452 -226 334 88 -277 149 -35 -493 123 31
3289 31 -274 189 376 -323 -158 354 -123 -263 351 34 -478 337 171 -660 57 261 -263 -36 273 44
3309 44 -32 244 -341 -40 407 123 -305 318 10 -651 339 95 -481 12 267 -258 53 317 -182 -456 109
3330 109 110 -334 232 245 2 -91 162 -102 -91 390 -180 -297 563 -219 -175 424 121 -524 396 514 -186 -230
3352 -230 165 132 -389 131 33 148 195 -63 -127 4 269 -283 -5 252 -216 -112 483 -205 -121 337 -313 -234
3374 -234 218 488 -145 99 312 -16 -59 -115 -192 -80 270 -216 -112 371 84 -375 144 388 -530 243 388
3395 388 -237 52 385 -105 -374 122 79 -406 239 175 -397 38 228 -176 54 607 -334 -164 372 -273 -152
3416 -152 464 -10 -135 59 114 -81 84 314 -113 -223 186 -381 -17 128 -223 -464 158 126 -268 290 224
3437B24q18N12N56n12j39M32k57n06Q12p1l85L27K23o23L00L27p16N3L52j88j9
3458a16M96l31j50M79k75l61N86J35p89M2M62n4k79N48m00j52R2j09j11P16j55
3479B74n99K15N14m84j06K61J30n99M93m3k66M54j24n26K11J93k6J59j87k23Q3
3500a96O83p16j21N81k9n40N60L94j103L23L90k81l2L24j17k22K72j74j55L52
3520A93l73p9M87j06m04J33O00p24K4M22j15k03N26q5o99R16l80m14L08K14n97
3541c56M65J40o38J64M68j49n68P11j18n68N63J94o57K96N79n27k44O38m38J03
3561E8K06j79l27L89k30JK51R6o34K82P04o21l67O12k29n96R78k32n61N02J15
3582B18m59J48N30o01J83L34m26k52N89k5o24N91M6n44M34j1l44J15N89n75j69
$$ plain form
3437 224 -594 -82 474 -38 -177 255 -2 -508 304 233 -152 175 398 -225 75 402 -314 -261 91 -97 -116
3458 -116 380 49 -101 378 103 -258 328 463 -326 -284 178 124 -155 393 -7 -159 -67 -176 -287 429 274
3479 274 -325 -110 404 -80 -186 75 205 -394 99 56 -210 244 120 -406 -195 -2 -28 131 -56 -279 -196
3500 -196 487 -229 -350 231 202 -338 222 616 -487 -164 226 -55 -87 237 120 -102 170 -4 -159 193
3520 193 -180 -259 228 122 -282 -149 451 -273 -249 173 58 -145 381 296 -403 513 133 -281 27 241 -356
3541 -356 109 249 -389 -225 243 94 -474 237 119 -449 114 308 -349 -53 526 -1 -245 393 -45 58
3561 58 264 85 -242 147 -83 -82 169 265 -369 -87 617 -4 -371 241 12 -584 394 162 -399 103 218
3582 218 -241 -93 437 -164 19 353 -73 -325 264 239 -385 206 252 -292 142 131 -213 -98 491 -84 -253
3603b53P40n62r1K97L7n26L01J4j73J80L79p06K73M94j34m63L91l63j69K70K28
3624A64o91J97R30p13J32L4l62L09K26m94L29K84j37m09K96L05q02J93L98k93
3644a04j21N31m13j24M18j34M0l7R2k61J21J04M6j14J17j84j35N68o25K65N1J79
3666B80o00M34K9k93j65N41l65L4K17j40j22M30m53k27P97l36m71O30j23l95K38
3687f0N52k78n68M57l69J13Q8l0l80P11k27j05N1J51l98J56M46l25j32K88k32
3708i1o6N60l22l62N2M19m33P9O63p94K91K63m56J09L05j4m23N45j93k82L4L18
3730B02k07J24K9l55P8M88m50m22O52K36p17L15K93p79L00O53m09j32M51n14R3
3751g1K77j62l28L11K35n41J90L37m92Q9M73o53J83J06l7j00K46k3l15M79Km72
$$ plain form
3603 -253 487 -75 -166 131 168 -358 -57 -43 -216 -36 343 -363 -90 404 270 -193 198 -165 -334 -64 164
3624 164 -527 -330 600 -113 19 53 -309 0 226 -268 61 345 208 -201 95 400 -402 -209 189 -104
3644 -104 -225 306 -107 -231 187 53 93 56 148 -113 8 112 158 44 161 -23 -158 410 -215 50 101 280
3666 280 -320 114 143 -150 -315 226 -139 -105 112 -28 -150 280 -173 -400 397 61 -410 220 97 -298 -60
3687 -60 492 214 -354 103 -266 -153 -65 -95 -475 236 9 -96 -45 106 -292 -136 310 -15 -147 141 -91
3708 -91 -157 403 81 -281 -229 190 -243 -164 499 -295 -4 259 -197 -88 217 203 -220 325 132 -150 -116 202
3730 202 -5 119 148 -207 -129 359 -91 -513 139 375 -342 -27 266 -513 -213 440 31 -101 350 -164 -71
3751 -71 206 44 -284 27 262 -279 -89 248 -244 -155 318 -335 -152 -46 -83 -183 63 40 -275 204 206 -266
3773b66J75R6M6j45L54m88o7O51k24o58N17K3k75J39J34k47J95O0k9k25N23l50
3795f1m67O09r8j12K26J78l33JK84n18r8O61m40K6K25M71q60N62o5j014J098Q3
3817C58p21L54L83l36j44L60k67M0L04k36l75N6M65k27L0J69k08R5K53l45j30
3838a22K41j95k97L59M6k52L47J43n29R8M84m49r2K89P2k46P0j0k75P28m40p3
3860a03K2M00m95l5L09l91PL72j77k08L61j13k09J33N02p42K12O60m51k57O04
3881D01n05J55L33k88j34KN9k63K25J60j84m5K79l05p6O12l53k29n5J22k62N54
3903B03O6m93K63J96m38J79J72l12r9N23op73P17m4l08J12L57l84r3L57j03k72
3925a80L45o0%K64l83l07N50j33k11L23L85q38J80L75l67k11J40q0j8K96K31l27
$$ plain form
3773 -266 -91 5 51 -94 260 -228 -295 356 132 -526 -9 14 -261 -122 12 -235 -40 20 -9 -234 289 -61
3795 -61 -528 81 -17 -129 97 275 -58 -57 227 -291 -389 272 -168 -142 83 554 -306 256 191 -823 275 358
3817 358 -363 -9 374 38 -106 254 -13 27 331 95 -280 -224 241 14 44 213 5 100 353 8 -122
3838 -122 119 -76 -373 -14 32 -220 127 270 -259 -161 323 -126 -218 71 143 -103 -33 -43 -318 410 -30 -103
3860 -103 -81 319 -176 -211 98 -293 -286 86 -91 -299 62 -51 -260 -127 375 -367 -155 505 54 -203 401
3881 401 -104 51 384 96 -38 -36 23 -240 -15 145 -39 -84 195 -110 -186 426 73 -156 -211 -89 -351 203
3903 203 269 -224 39 235 -203 -24 148 -164 -263 260 254 -519 198 154 -154 -42 315 -69 -162 195 92 -180
3925 -180 165 105 105 369 -14 -321 229 96 -115 208 593 -245 -65 310 -57 -268 -128 -208 -226 70 301 -26
3947b6l19M10j39J28N0r1j11N66m82j49J93J96m72oO69n27j55P13k73k89K37j56
3969c3k89L73k4m34L51K42n69J39L0L24k64K03p3p0O69l80o05K21N27m29L53m7
3991B15l22R0M15l93k27L81j85j62O29k79k98L63j32k84N3L29n26J64M28m09O3
4012h7L72j19o7q6K58o87P07m14L1l3K10m62L46Q8l42L1M99j49k44K70j14j50
4034a42J51J93m20mJ62j58J99L18l97q7L61k09m8K19M0n46L65L21m11j17L31l0
4056I1l28O52m87l51O71j69k3J30j42j51l6L94p87N19j09J37pK35L5n50P08k85
4078A47o69M91L30m45j07M96k07l78O44k77m65N23Kl09J87J29n16M68J32l28l70
4099e22Q47P2p99N15j05k55L6L37l87L95k16j03K01J47m07L73Qk08R6N33m65m41
$$ plain form
3947 -26 -345 65 -74 54 104 13 -98 468 -14 -163 30 226 -246 -252 417 -110 -265 448 175 -114 123 -33
3969 -33 -322 51 27 -407 -56 186 -383 -244 -214 110 -154 49 -24 -94 575 195 -410 -189 338 -91 262 215
3991 215 -107 -17 398 5 -222 159 -26 -188 441 162 -136 227 95 -189 -136 193 -333 -169 259 -150 -87
4012 -87 285 166 99 13 271 -416 291 -123 -92 -125 85 -377 -31 57 -285 -254 245 96 -148 122 8 -142
4034 -142 9 202 -218 -222 -60 -218 -19 299 -98 -185 176 -33 -81 138 178 -368 -3 318 -93 -210 121 91
4056 91 -237 415 -72 -423 248 79 56 186 44 -107 -143 251 -536 -17 -126 11 4 239 274 -276 432 147
4078 147 -522 -31 299 -146 -253 243 36 -342 302 25 -440 83 85 -224 -37 92 -424 44 176 -152 -522
4099 -522 325 397 -402 113 8 -247 -211 126 -261 134 -82 -185 16 163 -244 129 137 -71 25 558 93 -348
4121c48J75N41n52J97L41j56n13L48J10k98L30k38K9j16K68l58K85N13p44j02
4141b88L83l63q7M93K0n20O53j31m39K61K28j95R8j27k41J2J59P7o0J82q7j8J19
4164A29J67l74m9O95q47J12K66l07J17Q4L69o07K79L10m12J29L22o99M49qj42
4185a7k2J74l08L0K15j63m07N32L52m94J0N14o19O2L45l39J43L33k58qK85k50
4207A10o34N87o0j74R2M05m33k75N79k34k95J40K82j13K74L3l73n1L16k98J53
4228C1j0l3K6K22l04o0L86k70m47O56O7m39K61L12m63k77M52j65K1L9R9k16M61
4251C49l37m06J43L79m69K13K54j68l98P47j21p0K40k96j62m3N18k23j69M23o30
4272b26j4P4L22m23M80k03j81J05k9k80N34J80n48J32M32k96l21L75k4j54J25
$$ plain form
4121 -348 -173 368 -184 13 354 198 -315 33 143 -155 175 -63 -34 -150 118 -240 45 558 -186 -288
4141 -288 95 -268 -355 138 158 -362 291 160 -279 -18 210 15 113 -14 -255 -243 -84 -7 -67 115 28 10 129
4164 129 296 -78 -127 568 -279 -167 99 -208 -91 -7 362 -245 34 344 -68 61 383 -316 133 125 -17
4185 -17 -39 135 -173 -143 72 -91 -498 34 386 -108 -98 416 -203 -141 204 -135 8 341 83 75 360 110
4207 110 -524 63 3 -171 -79 326 -107 -382 197 -37 -332 -192 90 -23 251 284 -89 -140 176 -122 31
4228 31 21 -12 14 236 -68 -128 258 -12 -459 197 264 -175 86 398 -65 -342 110 -55 -34 5 104 -112 349
4251 349 12 -394 -251 128 -341 -128 126 -42 -440 307 186 116 356 60 -102 -145 373 150 -19 404 -226
4272 -226 -240 -166 156 -267 213 10 -171 -66 -95 -375 159 339 -209 -77 355 59 -262 113 89 -65 60
4293F0q9j23N8J95j36K62K17m06j69L73k6m73M23o4k65N13J17n57K04J17j87j53
4315a09J67N5l42L57j63k63J30M62m58K79K9m62K31K73l34K24n0J19l13K94J21
4336B47p84Q21m27j11J49L34l82j69P86p51K99O3L5m39J34K97l28L17k90K35J7
4357E3J81l35L9J8j21q2O11n23m99Q40ol42K35K78o62M29j36k01J06L73j42l82
4379b68P39l40m07M70j95l1m4J05j59K26J90k84m7J21j39r9L70M3l70L58Lm41
4401a99J46J60j76l1M63l73k07J08n0lK18J45l34L24L29p88QJ42J9o0M0K94k67
4424i2J06K25j49k98K86k45J71J54l49l5L66l86k42P36l01k4J77J3k92K28m8n5
4446e4Q1L13l90n08M60K21p4k7J02m33M39r5k81K74J07l75k8O66n23R9M55n68
$$ plain form
4293 60 -29 -152 -94 101 -35 227 444 38 -131 242 216 -257 166 102 -163 350 467 -90 114 231 44 -109
4315 -109 58 113 -229 128 -35 -298 -168 294 -164 115 144 -318 -87 186 -148 76 26 145 -168 126 247
4336 247 -537 284 -143 -254 -105 229 -153 -322 464 -287 12 75 110 -329 -195 102 -226 91 -199 36 53
4357 53 234 -101 -62 -44 -165 -247 364 -159 -658 182 176 -166 69 347 -315 114 -22 -223 -117 256 114 -268
4379 -268 471 131 -276 194 -1 -32 -76 29 -130 96 286 2 -45 76 -63 -162 208 251 -119 239 242 -199
4401 -199 -53 107 -69 -100 363 -10 -217 -109 -159 -162 56 201 -133 191 520 -268 -260 -118 -99 -159 -119 175 -92
4424 -92 14 239 90 -208 78 -167 4 158 -191 -226 140 -246 -488 248 -53 -77 100 113 -179 49 1 -54
4446 -54 27 340 -50 -558 -98 123 49 22 124 -309 130 35 -246 28 135 -240 -268 398 -125 -26 429 -139
4468a39j90M04K77l91o7M43m08J64K91m36J09K0q8j26l4K22k56L96J16n28J5L69
4490A63k6l81K99m83L74K36n4n30K12N26m70L89k0m95J78K34j61L7j63J6k4J45
4512BJ90m67j43N20j32p5L6O1K1K40m21P8J04J62L1l4R4m55M47L2n51K86L3k0
4536C9r2L5k17rL66j12k26L22q8R8l60L97j47k40M62j68j95J7R7j92J79J23k47
4559a58l8K88j16l34N72m04j00N08l17j2J03j48j43O83l71p3l7L4k37J51K55j69
4581f3k64M63J60m80L09N9l09L8K53l82l2J93O0n65O89j27n6M65o8n34L99m8m80
4604c20L5L46j2l58L71k21K36j54K49Jj36N0j41L4%J21j23J09m51N26K73p53L19
4627AL00m34J47K27j03j66r6J98n05K92J92q6o6P2J50k53K96j82l65N13k37J5
$$ plain form
4468 -139 -329 75 352 -39 -106 337 -71 93 384 -52 57 77 -11 -137 -171 51 -205 191 307 -221 -206 163
4490 163 137 -244 55 -428 -54 182 128 -402 -190 336 -134 255 235 -260 -82 152 -9 28 -135 -119 -143 2
4512 2 192 -275 -418 102 -30 -105 -69 -8 13 253 -168 -90 14 176 207 173 267 -188 259 291 -260 26 59 39
4536 39 -53 -18 -235 -244 122 10 -216 106 18 116 -244 153 6 -234 228 60 -135 -118 -21 -213 -34 89 -158
4559 -158 -196 92 -24 -358 214 -190 -290 218 -99 -111 -8 -156 -299 384 13 -60 -97 -63 -300 -149 106 -63
4581 -63 -327 136 296 -184 125 184 -125 -87 166 -216 -248 -55 5 -560 129 2 -54 411 343 -191 208 160 -320
4604 -320 -285 61 49 -309 62 -159 77 -77 172 173 37 87 -54 -20 -20 101 -22 87 -364 162 435 -318 1
4627 1 301 -133 14 241 138 -28 -124 74 -431 -139 53 -33 -99 -27 123 -130 166 -16 -381 132 -105 -90
4649i0j07O12m65l46M74j17p6K0M95m43J47Jk88M60j95k27NL52r5M6l0M2m07L29
4673I7J52n21L49n2k22J34M19m22K39k67Rj98M24n9k54K46kl68J01M25n24K48
4695d6J58j3l88J60K39m73L04J11j55J32M37r47O03O9l30J94L15k95r7J67m33
4716b88n5M66l43m6L04M1n62M56m2j69J3N18k02k98J28R6j83J62K45o42N35M14
4738E48p37J48M35l90L15j62k92n6K00M05o11J40M26o87L72J86k49m3J64Jl20
4759b07L21K04n11O5L41n30L39J48m60K22K07m59L22K86k79l8J38K11m31Q2J46
4780A17j41j19J47l30L60Rj2PK2J63k71J08J16l10O5J74o39N46K04m81j69O79
4802B45j11o49N34R9l4l29N53n04L32q0m28J66Q1M3j31K30J11k81L08J66n69K66
$$ plain form
4649 -90 -197 415 -50 -396 78 -39 -115 -95 400 -43 104 105 -183 277 82 -145 -140 212 117 163 133 175 -232 97
4673 97 249 -272 77 25 -197 -63 356 -66 173 -94 -85 -283 141 82 -172 74 72 -296 -195 230 -294 -46
4695 -46 112 99 -289 -129 110 -363 -59 52 -103 29 466 -481 122 191 -139 55 370 75 -22 145 -288
4716 -288 -343 123 -220 -266 38 79 -483 -27 -69 -238 -225 293 91 -207 -79 17 -166 -4 241 -401 134 548
4738 548 -189 -41 394 4 319 157 -135 -191 9 414 -197 -57 369 -318 54 240 -9 -52 112 113 -207
4759 -207 114 318 -193 -128 213 -317 22 170 -290 -68 139 -320 2 288 9 -29 109 320 -111 -29 117
4780 117 -24 -143 4 -326 34 43 31 38 60 223 -48 60 176 -134 -69 105 -534 12 216 -265 -434 245
4802 245 134 -515 19 118 84 -245 308 -196 136 56 -372 -206 -125 -82 -213 17 128 -153 155 321 -248 18
4824A8J98l37Q4L71k66k82J87j35L8N7K84k44j37jJ20K8P4k05J40J83k13J60q3
4847C9J16k44M08J16o80M03J35l06N7J17j85l30N18J04m06K82j65l71J92K59j57
4868i8J64J79m46J78L72k43k34M37n98K07j49L29m36K13J00l3p5M57l61j62K40
4889D1k14R6M5m9j2K13j64l91J95N46j84m88K11J96k27K18l37K56j29J12j57R6
4911a27N59p74O3N51m00Q9l9K75l55M72o7l89J10l0N7L83k93l12K09J22j7j13
4933b6o2l5J20q1O19p74L14K60m81K7J09l7k00L87K01l13r6K27p1Q8k99J60j10
4956g3N71p30L79L6l00M1L50j78m08P68j41j21l98O72o87P0K24k70M76j95k33
4977a47Q5Q7Q8k30J49K48o33L89m8k06k7M77k82J5R9R1k04J93j49j44L38L4j68
$$ plain form
4824 18 216 -121 -37 334 68 -214 -27 -162 -124 -67 217 -27 -164 -165 -45 -17 57 -148 -8 175 -38 122 39
4847 39 155 -89 319 435 -245 158 293 -13 44 161 -24 -354 164 268 -138 144 -21 -392 -200 59 -98
4868 -98 66 245 -201 -23 349 106 -128 309 -289 -82 -231 98 -338 -125 -25 -58 -133 324 -37 -199 41
4889 41 -173 -77 -32 -81 -93 120 -44 -435 -240 306 122 -366 -155 41 -186 32 -305 -49 -178 -66 -223 -127
4911 -127 432 -342 -279 272 -128 -39 -78 197 -158 314 247 -142 -32 -62 -5 378 85 -227 -18 104 87 -26
4933 -26 -88 -123 -3 -84 535 -239 75 335 -146 -119 -10 -47 -247 140 341 28 -68 159 88 176 -123 37 -73
4956 -73 498 -232 147 183 -117 -76 274 96 -312 456 315 194 -204 468 -219 -149 75 -195 281 86 -147
4977 -147 -62 25 113 -117 32 280 -353 36 -12 -218 -245 232 -50 -35 64 155 -49 144 -5 -149 189 223 55
5000E5j33N2j16R3J30o5P0j63K18j61j19J77k48P7K35M6m65O71j32j41l0p3j75
5023a97M40m08j7J76nK28j19j21k76L12N8j24J45K68l67k02K00l2J7K51k99pJ82
5046A03j06J10k45J49J15m53K26Q0K9J60r7q8J27M5l02J98K81l45Ok2j07O6J14
5069D4L1P5k85J67j39P6N7K04k50p2K00k52K99j7j00Q3j94p7L30j25k69J9N8Q1
5093e6j94N95k11m15L23N1m63K11M70o32N5M43ql10J97J36l77J90k96K17o2K39
5115A03k37k2K14k22j30J10K76l02K23K10l52L57j31m12m2N17j19l77M79k86J57
5136A4P9k98j51O16k48l3k33J42O6nJ48j3j9J34k61l0J44l3r0J1P8j50n6K27l61
5161c22K17N53j25m46l0L8K04K27k57j72L11k20l40L37K32k92K03j75L01l02J72
$$ plain form
5000 55 -78 -26 -142 -49 81 16 86 -77 141 -20 -139 38 -210 -133 102 148 -317 354 222 81 51 -22 -197
5023 -197 243 -165 -182 -6 -11 217 98 -23 -299 13 71 -53 92 360 -7 -209 -9 -41 -24 227 -72 -79 103
5046 103 -3 107 -138 11 126 -327 -101 -21 8 168 71 -17 110 155 -147 51 332 -13 -7 -29 -136 -70 44
5069 44 75 150 -135 32 -107 -31 26 230 -20 -92 108 -144 155 138 38 121 -73 -150 180 55 -214 -195 -137 -56
5093 -56 -250 345 134 -281 42 93 -370 -159 311 -321 -266 177 169 -141 56 192 -185 5 -291 -74 -136 103
5115 103 -134 -156 58 -164 -294 -184 92 -210 13 223 -129 228 97 -315 -357 160 41 -336 143 -143 14
5136 14 93 -205 -356 260 12 -21 -254 -112 -46 -51 97 84 65 199 -62 -92 52 19 -71 -60 18 -132 -188 39 -322
5161 -322 -105 448 323 -123 -153 -115 89 316 59 -113 198 -22 -362 -25 207 -85 118 -57 244 -58 114
5182A14j8k55L86k56k12L70j3K08k04l54J04M6j3J83k53K48K17k79Q2j27J6k03
5204b13K49m9K42m90K84mm7P4m01L59l2m01K78J07j01L67m55J76r0J21j54K57
5226G7J8L6j8R9k99R6N4J28j15O4Q7k39o2K02Q8p3q8J47m04L6K54k86L00K46m73
5251a25k0RJ62l56K34P2q1m0J31K2J25Lj43r6L39l39j84N15k44n3L85l06j66r2
5275b48L33q1j1J90j20k97L75k48J89q4p7o4J73MM1j24J70l32K85L0r6k27K86
5298F7m2RRP4n33L67K97l59j23K75J52k73K78j12k14K01J02o70L13O4K11j60K0
5321d7n9k98M93l36NJ25L26k32J44J19j17o9O2k68J58J8p6j07P7L29m00J78J18
5344A43j55J81J03k58m1L78l28k13J16k69N8R3K06n1j2K63J0m52J37J41q8j42
$$ plain form
5182 114 96 -159 227 -29 -241 129 116 324 120 -234 -130 -84 -97 86 -167 81 298 19 101 -26 -10 -213
5204 -213 36 -13 229 -261 23 19 -28 46 -355 4 -28 -429 -151 -44 -145 222 -233 -57 -147 -26 -180 77
5226 77 95 131 113 212 -87 9 63 191 76 140 227 -12 -74 128 216 143 55 202 -202 -166 88 -198 102 348 -125
5251 -125 -145 -136 26 -330 -96 -24 -105 -145 -14 8 133 136 -7 -103 236 -103 -287 228 -16 -69 316 10 -156 -248
5275 -248 85 4 -7 183 63 -234 141 -107 82 -2 -79 -143 30 34 75 -49 121 -211 74 104 8 -219 67
5298 67 25 34 43 117 -416 -49 248 -111 -234 41 193 -80 198 86 -128 73 175 -495 -182 -118 93 -67 -47
5321 -47 -106 -404 89 -247 -242 -117 209 -23 121 240 123 54 116 -152 6 24 -52 -159 -82 247 -153 25 143
5344 143 -12 169 272 14 -27 351 23 -190 -74 -343 -285 -192 14 -37 -49 214 224 -228 -91 50 -38 -180
5366a80j58K04K60k21k25L30J83m1j5J00j31j63L63m42lL12k02J02J18j5m56M4
5388b36K61k52M07l51J95O1j23N5%L5J74j30l06L13k73J35J30j31J95j61K04m97
5410b95M19k52J46j05J53k79L98j95m7j8L8rj57N81k10l54J21K79l45J53M3j57
5432i2O6o7n1L9K13k31M6J13l05R5R9K70l91N24k82r3N3M17m30j61M49k66o5L52
5456C02rl83K90r4J99j53k37k66M14P1o4k26J84M9l50L09j06Q2j19n2K79q9L18
5479C49l75J17K2j42l3K63k8j01n8j00o1K57p3k5l40L11j80J78O4j33O0P6P3m43
5503c22J76M00n69M91L2m34M31Nj18k59K31l8jqm2Q3j76M02j62k05L9j73L01L15
5527C99o50R0K85k80R2K01l5q6J04l68P7L6K41l51L71k13J91l42L59n9n85L90
$$ plain form
5366 -180 -338 -134 126 -95 -320 10 193 152 137 237 106 -57 306 -136 -139 173 -29 73 191 176 -280 -236
5388 -236 25 -227 180 -171 24 85 -38 17 17 52 226 96 -210 103 -170 -35 95 -36 159 -2 202 -295
5410 -295 124 -128 18 -87 66 -213 185 -10 -57 -75 -37 -46 -203 378 168 -186 -65 214 -131 22 65 -92
5432 -92 -26 -93 -144 -105 108 -123 -77 36 -269 -174 -75 195 -196 328 46 -47 6 423 -7 -168 281 15 -50 302
5456 302 293 -90 200 106 305 152 -85 -351 63 134 70 -156 28 77 -273 36 -70 12 -107 -159 120 31 349
5479 349 -26 91 113 -29 -62 201 173 72 14 -86 -147 110 37 12 -328 -17 -197 -19 45 -88 -28 48 121 -322
5503 -322 -146 254 -315 176 208 -226 205 210 92 -167 64 26 25 17 -25 58 -118 284 122 -83 -44 -217 84 399
5527 399 -251 -161 124 -156 -64 137 102 16 120 -248 -171 -135 106 -245 126 -87 104 -238 121 62 -523 -133
5549a33J90k9P6j61k9k3K49m1j51K18r5k82L39M8K3l49R5J68j37J87m20K52J25
5572A20j43O5o8K17o9l32K99l43L37r8j67P5P5M4j86L9J01k01K45J54j26J45J29
5595C12l95K97L19n73k42L46k88J9J52K96n11L82M54o16K01m11J39J93J11l40
5615a55N72l35K5p0m7L05l11J10l1j96J47K89l66o7J89O1j11j45J28K33j30Nk37
5638a37J67N8k51P6J27K2k82M98l56p4J68K30n70K34N66m97Q0k5k08K5J35j72
5660a86K87q9L0j86k8J45l50O75j95k46M8K20k90K24J78j37q8P3p8j68j05K37
5682b9qj15J87l19J31K35J23j98J57k39j7j1n5J11J39O4k31J27k0L3k47M39l87
5705a30oK13M8n33K03J90L16j11O0k07j78K98j51j63Q8Q6p4K0J58J2m39M07k49
$$ plain form
5549 -133 57 28 104 -57 -86 -109 140 99 -52 166 71 -211 128 176 199 -150 -55 113 -24 163 -257 -5 120
5572 120 -23 42 -26 191 122 -210 89 -254 83 -15 -182 -107 -32 12 -174 -135 -34 -235 10 164 38 183 312
5595 312 -83 214 533 -40 -282 64 -224 -205 -53 243 -268 114 568 -48 153 -258 -119 74 185 -155
5615 -155 417 82 107 37 -10 295 -16 94 63 -133 14 303 -63 -130 59 120 9 -136 -8 225 95 100 -137
5638 -137 30 88 -163 -87 40 62 -220 278 -78 -152 16 246 -324 -90 476 -21 59 34 -174 -149 -14 -186
5660 -186 101 12 42 -144 -172 -27 -377 298 103 -143 -95 125 -165 59 237 100 12 85 7 -161 -266 -29
5682 -29 -37 -152 35 -284 -153 82 205 7 164 -75 -92 -103 -158 -47 92 156 -75 52 32 65 -182 257 -130
5705 -130 -136 77 125 -408 -205 -15 301 190 250 43 -135 163 12 -151 -63 23 -51 -31 127 139 -300 107 -142
5728a42J82J72n07L62o8m2l19M47j8o3L61l59m6n8L07l66L77q1k50j29N39l16
5750a7l4mN7k81M49p7k53P8m2j48J84J66k44K61m7R7j45K53q7k08j3P6j4k20J2
5775b01K65r6j86p4R0J57K67k26rK8k69M33k91L43m53K74k83P1N33j48m57J39
5797i3K24l09K89K1l31j01K72K26j73Jk1o2L72k83q7o7J60l35K66P1J34j1m4k17
5821i8l5R6kk0Q5n9j64K94M8O1l61K86l34j1N01l24k89N33%j88J7n0l3J78P4k27
5847b2K54k20J67m41N34k28n8J53Qp2J03lk66J34M6j26J76k82n1J54J75K06l51
5870a0L03m74L53k20N13n78J18j3o0j23L06J40m70J66J35o6k04M40m53J33m5j77
5892b86L43J69j71j67J27k69L90j60K52k72k33N14j21q1n4jn7J59mj15K90l39
$$ plain form
5728 -142 40 212 -295 67 -1 -43 -362 85 67 4 365 6 -40 -98 209 -157 220 139 -111 -240 299 -17
5750 -17 -51 -55 2 -279 170 93 -160 -82 -124 -272 -88 78 -166 95 48 145 0 253 166 -42 -55 21 7 -213 -201
5775 -201 64 -32 -218 -292 -202 -45 222 -4 -13 15 -254 179 -112 231 -222 52 -231 -160 373 225 -232 -93
5797 -93 131 -178 111 132 -199 -300 -28 198 25 26 5 -57 315 32 -55 -122 38 -297 -31 40 174 163 119 -98
5821 -98 -133 -37 -39 -59 26 -33 -197 97 145 206 -155 131 -203 -214 287 -37 -326 207 207 19 36 -14 -47 131 205 -22
5847 -22 232 12 179 -262 272 44 -14 139 147 75 178 175 -91 43 89 -37 139 -143 -194 -40 135 341 -10
5870 -10 293 -181 172 -48 465 -113 5 -8 -68 -191 115 255 -215 -49 86 20 -184 256 -197 -64 -109 -286
5892 -286 57 226 55 -112 15 -254 136 -24 228 -44 -277 237 116 35 -19 -20 -77 82 78 -37 253 -86
5914h6J3J5K91J8l08J2l04L85K00j49k44K04J10J48o15L20K5q6J6j13M05j96j04
5937d3pQ2M4k60Q1K32k10M6L09l83k56M86q1k26q4R7R7LJ31J39l96K06k89K61
5961b1J57j30L66m43K75k76K55K0l90P1M75l37j17K01n8q7K92l40K34k39J44m06
5983c54M35J38l61K70Q3j07j5O5k88J88J83k09J4Lq8J58N2m2k05L00j73q5K07
6006A69j08k86L98k93M91n51M21m02NJ19K61l06j54J76K91k86K04l83P7K54l80
6027b83Q0K8K97k10N6K54j27K36j63J42m29J79O5j14l3J96j80J13o3j55P4m1j9
6050i7k20M99j49j3K7n8lJ21k60M2k1J33l3R2j11n2p2J96O9j20J85n2k88m1L22
6075I6j30J72j45k19M8L27L9l19q4J16j65J61L49j95N4k42P7J79J15k71rK82k25
$$ plain form
5914 -86 -73 -58 233 251 -57 -45 -349 36 236 87 -157 47 157 305 -310 10 35 -51 -35 -148 257 61 -43
5937 -43 -50 32 76 -184 -103 129 -81 -35 274 -109 -365 121 40 -186 -270 -173 -76 -73 58 197 -199 7 -282 -21
5961 -21 136 6 372 -71 204 -72 183 203 -187 -116 359 22 -95 106 48 -39 253 -87 147 -92 52 -354
5983 -354 81 219 -142 128 211 104 89 154 -134 54 237 28 42 45 -43 115 167 125 -80 220 47 -38 169
6006 169 61 -225 173 -120 371 -180 241 -161 -156 -37 224 -82 -236 -60 231 -55 149 -234 -157 97 -283
6027 -283 -203 -175 122 -88 -32 222 95 331 168 310 -119 60 125 11 -22 174 -6 107 44 -111 -37 -78 -97
6050 -97 -317 182 33 20 47 -11 -14 107 -153 -111 -132 1 -32 60 -51 -103 -175 21 90 -30 155 103 -185 -226 96
6075 96 -34 138 -7 -226 -178 149 188 -131 -215 -99 -264 -103 246 51 105 -137 -60 119 234 -37 -46 236 11
6098A1n7k32J58K2J26j8j79J24J17k94L03j38J62N0j64j34M8J89nj88J04k3JQ8
6122G1RJ35m36P9J50j21J04O4J03j31n4j5L50j79p4l7J40m7j95J73Q7l0j95p2
6146a21L9k4J98O9j40k5k24L45J82l80K87k67Q2j38J4NR8p6K47k96K03J32l21
6169a11n9K92K0p9J15j48k05J04K03k27J86q4l3j41M01q4j61K16M5j93K26k03
6191H0l93M86j62k22L13q2K55l93j5k3R6m0m8K19k01K70m6R1l10J72O6j44O5N9
6215I3O0k35p6L37j46k51L3L31Q0m38L26m62M19k64K50j20kK24q0J06k09r6J14
6238fJ11k43M01j43N6m01L92j91k3L6J47j93L20l13J54j76J47K23m01J22j64o8
6260b13L2J2J85j0J58l32K89K97n15J40Q7m23L55l03r8K75L05l26J06Po9J58k78
$$ plain form
6098 11 -46 -278 -120 -98 28 10 -169 -45 72 -222 81 -57 105 155 -9 -143 -95 94 89 -99 5 -18 -17 71
6122 71 80 215 -221 -142 8 -113 -9 55 158 27 -27 -42 308 129 55 18 158 111 -84 89 176 146 -49 -121
6146 -121 -82 -106 92 161 21 -4 -228 117 299 -81 206 -61 21 -117 -103 -98 0 -76 171 -125 78 210 -111
6169 -111 -170 122 142 63 178 30 -175 -71 132 -95 91 7 -26 -167 234 150 -11 205 250 57 283 80
6191 80 -313 173 11 -211 102 20 275 -118 -133 -156 -60 -100 -148 71 -130 140 94 185 -125 47 113 -31 34 93
6215 93 153 -82 -158 179 33 -218 -185 146 226 -212 114 -348 71 -193 57 -63 -65 159 79 185 -24 -120 -6
6238 -6 105 -138 263 120 176 -225 167 -24 -47 -11 136 -57 263 -50 104 -72 75 298 -103 19 -145 -213
6260 -213 -181 -169 16 6 164 -168 121 418 -97 43 130 -293 62 -241 -339 -64 241 -85 21 28 -41 117 -161
6283a61K62r0no7m9J26l80K58J42km3o2p6N3R6k93L12Q4L8l96L17j37j14L57j26
6308D4K25l13J55j84L71j65q6P2p8q9L47j91j61J05R8m61L29l4N8k9q9k15K59
6331c2J00n8l28M00n8m3J0o6K24k16J65j08O7K0k32K5L3K29J7o3j12r6K55N0l97
6356b14J06M43k23o0Rj02L1P6R2k14M2Q4M0L9j35k01K31K36m85M8K42j61K35k25
6380f6J88o7j01L63k68p6j57M25l18j17K43k79M37l08j77L2J6L8j3P0j32K12K27
6403A72m01M79l73J45K7k97J62j2N5K17k83P9Q0j00M3R5l32K40K79o5k84P9N0
6426E5K5J02l70N25j37q0r3M7k10J11j22K92l23q8JL62J07k03M8r2k01j10N38
6449A84r6K02q4k80J29j77m9K10j04j04N1K88l90O07n31J68k79K69k35L50k81
$$ plain form
6283 -161 101 11 6 -61 -110 16 -364 -106 36 34 -9 -71 -147 -94 2 -291 21 105 143 -253 64 -73 -187 170 44
6308 44 269 -44 111 -73 298 133 47 119 41 -48 299 108 -53 52 150 -311 18 -16 42 13 -76 -291 -32
6331 -32 68 10 -318 82 24 -19 -9 -75 149 -67 98 -10 57 77 -155 -130 -97 132 149 86 -26 -122 133 183 -214
6356 -214 -108 335 112 52 61 -41 -10 66 158 -56 -14 70 110 149 14 -187 44 280 -205 -157 85 -76 159 -66
6380 -66 122 55 -46 317 49 -27 -184 241 -77 -194 49 -230 207 -101 -278 -246 -230 -192 -205 -135 -267 -55 172
6403 172 -229 250 -123 22 49 -248 -86 -98 -43 174 -109 -30 50 -50 -7 88 -244 -4 275 210 -74 5 55
6426 55 80 182 -188 337 200 120 27 74 -136 -25 -147 145 -178 -266 -265 97 204 1 49 -43 -244 -354 184
6449 184 88 290 206 -74 55 -122 -171 39 -65 -169 -118 170 -220 387 -144 24 -255 14 -221 129 -152
6470a52L00k59J59J60l19j1K66j18p5o2J93j00J38K85k0n96J00J03L01q5l63L95
6492B40l17q8L17n61M84J63j75K22j43j06j19K2J56O7k31k31K32K81k13j56L46
6513A90j85J18n8j9q7k4J00k34K93l81N1J85l21N79J91n66K8K78P0k1k01K57m17
6536a74N0J47l11J16L88j48l5J89k61J12L7J18l55J34J32N8n15K54P1q1J33K1
6558H0j00J90o2j38l4j8J07m08N91k37n6M8P6R0p1j43K08k24J43k34K69J7j21
6581b7Q1j18l4J25Q9k26N4k7J30p0J04jn3K67m17L65l06Q6j11l7M03q9j73j10
6605i5j08R9J82J3J9l52N17j41j34j82J65r1n3M68j71j12Q9k28K14r7p1J58R5
6628A84j80r5J55k02N2J7Q1l21J98K74k69rQO4j02OK69k24l9R0O2nJ9j1k9j82
$$ plain form
6470 -152 148 -111 48 208 -111 -122 144 26 -49 -111 82 -18 120 405 385 -211 -111 -8 293 208 -155 240
6492 240 -77 -165 152 -409 75 238 63 285 142 36 -83 -61 95 162 -69 -300 -68 213 0 -156 190
6513 190 5 123 65 46 -41 -65 35 -199 94 -287 -236 -51 -372 207 398 -168 -140 138 208 187 -14 243 -174
6536 -174 -124 23 -288 -172 216 68 33 222 -39 73 110 228 -127 7 139 197 -318 -64 7 -74 59 80
6558 80 -20 170 108 -30 -64 -82 25 -383 208 -29 -85 -37 39 129 58 -85 123 -101 42 -192 77 94 -27
6581 -27 54 -64 -98 27 116 -110 -56 -83 47 -23 81 80 27 294 -123 242 -64 22 -89 -126 277 188 15 -95
6605 -95 -203 -104 78 91 110 -242 275 134 0 -182 -17 -108 -161 307 136 24 113 -115 99 2 -69 89 184
6628 184 4 -91 64 -138 -86 -69 12 -309 -111 163 -106 -115 -107 -43 -145 -139 130 -94 -133 -43 19 14 33 22 -7 -189
6654a89L06k49K39j61K87k25k77L23q8k6j76L25No4lJ25k84k5R3K34k63k8K34
6677A13o5j01j26O4L6J03K5R1l11L8O20k10l98q3K88j7j73J27n5J11j46M12j37
6700B06m29Q0q3j00L02L50l17k79K55q6n7L16k64J67r7o8KK47j82l2J11J88k49
6723a9j45J39p2r3Q0P0J53j52Q0K29l04O2N8j11J78j49k6R5p0J8K9k19Q8j20L77
6748A76l59J16j5J55j04r4pj16M13N2l38J10r7K1L77j32k68L5J33J3l24O4K35
6771D6m15M43k0L46o32K56j86K86q7j15R2J26o1k23K00J64k29J82Nk78K68K29
6793C97j38j78N3N6j69m8L02l27M20m54R4L08k00L3l4Mp6j6j28k5J05K36j90k70
6817b45J61m2l03N52k6J44j66N5j38j47K15J46q2k07k09L86J58n0j50j75N42n61
$$ plain form
6654 -189 117 -132 107 -54 233 8 -269 54 -34 -60 -236 89 94 30 27 152 -132 -157 -64 170 -93 -121 113
6677 113 48 -53 -179 -115 -79 24 49 140 -171 -133 487 277 -121 -204 84 67 -106 21 -34 77 -69 343 206
6700 206 -223 -143 -226 -326 -24 326 9 -270 -15 -101 -158 158 -106 61 -36 -104 -102 145 -37 -69 42 230 -19
6723 -19 -164 -25 -97 -190 -110 -40 113 -39 41 270 -34 28 86 -25 153 4 -22 73 3 21 50 -169 -81 -201 176
6748 176 -183 -67 -82 73 -31 -125 -132 -248 165 217 -121 -11 -108 -87 290 158 -110 -75 58 71 -253 -189 46
6771 46 -369 74 54 400 -232 24 -162 124 37 -78 14 140 79 -144 56 220 -9 173 178 -100 168 397
6793 397 259 81 134 190 21 -27 275 -52 368 -86 8 316 116 149 115 119 43 27 -101 -126 -21 215 25 -245
6817 -245 -84 -126 -429 123 97 241 75 130 -8 -155 60 206 124 -83 -292 94 252 202 52 -123 419 -142
6839a42K86Q5N5j79J49l09j44K37R9j50j67N1J68l5K30k25l3P9N6l84K30l2O1
6862a4k06K87k17r8L80J6m41M14j96l4Q1l5K40k68J54K9k56L10m7k9j18j23L30
6885A59P3k13j3J29J13k39n6q0J67j26jm2P2J23M9j25l45M22n19K35K22K1p2O9
6909B3M83m19J29l85J38K7k8n2J53l27L13j6J69k98J4K14l59L64N9j33k4j43J20
6932B2n1j87J08J3K51mk84K38RLk25J60k88K40j28J93J75j34K66n30J49o6K22
6955A52l85M84k84O7l33M06O2K1k46P2p0N4J64l01J06l1M5l25K65J1M1j15P3J55
6979H8q3J05K14k54k37j2L43j00q2J72n09K93K23J30K1l88j69K34j85K07L98m63
7001e4L69k37r3j33K4o0J61k1K00j60J20K46j64l47K2L65k08J28k96Q6K61l31
$$ plain form
6839 -142 144 229 284 105 254 -55 -199 38 137 -13 -180 -129 39 4 234 9 -24 55 111 -273 -43 -75 -14
6862 -14 -220 67 -150 -248 132 148 -293 121 -75 -109 -28 -63 177 -91 63 92 -164 146 99 70 -48 -171 159
6885 159 232 19 6 135 248 9 -47 -127 40 -86 -87 -129 -57 66 115 -10 -355 67 -452 -217 5 26 -46 23
6909 23 506 87 216 -169 -31 -4 -32 -84 69 -258 55 39 208 -90 -76 138 -221 143 202 69 45 -98 22
6932 22 -29 -216 -108 -95 156 152 -132 106 115 118 -107 53 -235 5 -123 70 245 111 377 -153 -4 -70 152
6955 152 -233 251 -33 34 -299 107 169 190 -56 16 -54 0 164 -137 -31 -62 -17 -342 -77 -66 -25 -140 -67 88
6979 88 5 110 324 70 -167 -179 164 64 -18 154 -355 -62 161 291 312 -76 -245 -11 -196 11 409 -54
7001 -54 315 78 -15 -148 -124 -184 -23 -44 156 -4 116 362 198 -149 -127 238 30 158 -138 -52 209 -122
7023a22j6K77j81K97l31l7L13J6j93pK03l43L9J87J64k49q8L67l78j53M68k75
7045d2k5o1k3L5K02k8k42K71l22L81m23L40Q3j11j30J6o1O8L17j91l6m2J26N4
7069A56j54j43m7R1p8K08J7n6k49L07m05J73J9K72j6o3k8r9J03J23r3N5q2k28
7093b17L00m57M27m31M78p9r8p1p6K4K56J10j99o2K1o8R3J1n8J1J12K69k64J88
7117B20k06j64K44k65J34j50l0M51l23j62L10J9l8J01k70J28K85l5m06O2k0K32
7139A17k12K30j22j95K12k02mJ85K2P3l1k69L1N41k44k85J02qP6oJ26m06Q4K53
7163F8O2k08j32L09k34j67L52q1P8q6j44L54k9j79j08K91k01J9o9K38l66N3n5
7186b35J02O0J48j19J89l59J92o8j73L53n9j37M7j7K1K48j48J2O3j13J20J91l43
$$ plain form
7023 -122 -138 139 -42 255 -76 -113 200 216 23 16 219 -124 -85 102 266 17 -71 296 -82 -235 233 -42
7045 -42 -67 -128 -151 -116 86 58 -184 87 -235 146 -277 63 146 35 -95 -79 -140 -72 245 54 18 -24 102 156
7069 156 2 -141 -188 -97 -175 33 50 -6 -255 52 -353 -180 -161 111 95 32 4 -95 8 131 38 93 11 -217
7093 -217 83 -374 53 -378 100 21 -77 -148 -224 -200 56 166 -33 -95 -74 -142 -49 -38 -96 -85 27 296 32 220
7117 220 14 -150 94 -171 -37 -187 -217 234 -89 -251 59 78 40 141 -129 -1 284 249 -157 -95 -115 117
7139 117 -95 135 13 -182 30 -172 -176 9 31 104 73 -196 -165 376 132 -153 -51 -59 17 11 137 -269 -185 68
7163 68 130 -78 -210 99 -135 -302 50 -31 47 -39 -183 171 142 -37 -145 146 -55 -36 -105 133 -233 -180 -235
7186 -235 -133 -73 75 -44 145 -214 -22 -90 -263 90 31 -106 -59 -76 -55 193 45 57 120 7 127 318 -25
7209b5P5M7k01L74k62J81j37l14L13j18l4k0k10L53r0j81L64j76L65l50L26k20
7231F0M6k47J97k9j74j15K36J49q2o8K01k28K6j8j41L60m15M49j52r2R5o8l1J27
7255H6k3N0p8K2q6Q3KJ34j73K92k10L8j85r3J05K99n18N30j61k21J73o0k12K20
7279A4j33q2J58j18J69L0O6O7k53J18l40M67M8k10Q5j28L9Q9n2j49J06k58N12
7302B45j79p8j78J83j39L17l58J25n9L05j81m4J03o1J51l12K65J25m81J38r1J90
7324a4l4K51o8m44K50J8j42M00k32K47j12k79M86k26j65J08R5k51j81P8M1M25
7346B51o14M45l77K60J18L6o5k5J12j83J50Q0l39J21j22J07J57m47L13K51l02
7367g3M7j11j07L46Mj0p6l0J5R6j37J21O1l35M05j84j16R4j83J6L07m04P9K3M05
$$ plain form
7209 -25 50 97 -104 270 8 189 52 -262 51 -67 -101 -121 -331 22 -68 -249 115 -61 304 -46 280 60
7231 60 106 -141 56 27 -147 -262 -26 123 41 -27 174 -54 -28 -46 -187 173 -242 207 55 -37 58 -10 -41 86
7255 86 63 113 35 57 -29 54 56 190 17 309 99 137 -48 -141 -36 263 -255 275 114 -107 66 6 -206 14
7279 14 -119 -201 -43 -161 8 38 104 171 -82 36 -304 163 211 1 86 -42 -3 86 34 -115 -9 -267 245
7302 245 66 -12 -190 -7 -146 171 -187 -62 -121 184 3 -41 62 1 152 -160 105 230 -251 -113 -204 -14
7324 -14 -48 203 135 -309 -59 -41 -183 217 -15 232 120 -159 327 101 -64 44 139 -112 -293 -215 -174 251
7346 251 -363 82 -295 -35 83 119 54 29 141 -42 108 188 -151 -30 -152 -45 112 -335 -22 229 -73
7367 -73 -26 -137 -244 102 106 96 20 -10 5 101 -36 85 146 -189 216 32 -84 10 -173 -157 150 -254 -175 -152 253
7392B53k61Q8j68j25M35j81K61n46K42k0j28K95k40J39J95k35Lk85J07R6L9j6
7414e2k71q3N00k69J80K69j58k03L14m34L31l5J27k93o2J96n37M23O1J17r1j3
7436A7K43j96k72M69m51j79M71k45J29r9K54j97N2Q2k35K42J1J50k13O3l5p1K1
7459A1j06J57R2k65J12l4J5j34L02j63L9Ol0n7q7K74k62L9n8J14k16L24q4J32
7483A21j16L0J64m28p1M37r3op0L55k64l4j32L07j09k60L3K89q3k87M0L11K2j0
7507A46k92j9K70j66j08J57k12L94j28K58k33k36M6K2k9k4L81Q6n51J54L2N6J2
7530A6j02j7Q7j55K45R8L8p0o5L9J8k01M99k44k81L5J28m6j06M22p0l84jj82N59
7555B60k04N5J38k88j1j6K23j26J07k80J64L7k03J07n4J36jkK24k75j38J48N3
$$ plain form
7392 253 -8 80 -88 -213 222 41 302 -244 -2 -22 -150 145 -95 44 239 4 7 -278 -171 -75 -36 -52
7414 -52 -323 -406 94 -175 5 274 116 -87 227 -207 124 89 216 -77 -139 57 -480 -57 4 121 30 17
7436 17 260 64 -208 261 -190 -369 102 -143 -14 -113 141 -56 -4 78 -157 85 96 246 33 96 61 -10 11
7459 11 -95 62 154 -111 1 -33 -18 -152 150 -13 26 32 2 -55 -142 132 -130 -91 -149 -35 -251 73 -11 121
7483 121 5 35 199 -229 -300 137 44 38 -32 323 59 25 -107 200 91 -169 -136 153 70 -217 -177 134 156 146
7507 146 -146 -165 105 -61 -169 -12 -224 170 42 300 67 -169 -123 -101 -130 -154 227 313 -238 -84 -52 4 16
7530 16 -86 -103 -16 -171 74 172 210 140 75 114 132 -69 430 186 -95 -60 68 22 -84 338 268 -116 -117 -299 260
7555 260 56 111 249 -39 -50 -66 157 31 138 -142 22 59 -144 -37 -91 45 44 42 266 -9 -147 1 54
7578E4J98l91M0j00K24Qj41L9m5R4j8m3j03L82j30q7l3K45k49J33L1l38K36n8
7602e2k18N26j88j18n5M81n85J63J46m9K87j25j58j11M00o52Q2K53J77l07J33
7623C0j58K22Oj45O0j56N5J86j83J38n5k05J43R8O3k2J53l03N6k1q5J35J34m1
7647A05j28M2J28m25L51kJ02P2k36q5R8k5m1J34k78L98l67K4J74J64j68q4L39
7670B92m43l7N59m81K5K87l86J51K8NR1r5M6J28k20J86k80r6L14j11N8ok46Q9
7694a42J32J12l66L76j02o6j20L37l20L33k50n3l0J44J50j00k41N0jJ53J58n8
7716I6J21k49l6l8J30K34k00L1j59j28K96o9l15J25K55j42j54K66r0K8J45k38
7738i1J06PP6k3k10R9rq6L55J7j00j03p3l8l9L12k01P0k1j64k8J18N3o5J17m45
$$ plain form
7578 54 252 -139 -99 -199 25 33 -108 -69 -114 -20 -38 -81 -184 198 68 -19 -52 193 -56 77 108 -230 6 -52
7602 -52 -270 256 68 -50 -105 376 -209 -46 100 51 338 213 55 -56 344 -308 -226 27 204 -103 30
7623 30 -128 94 100 -45 15 -141 -86 100 -83 55 0 -205 -62 36 99 77 230 -73 -17 -38 -123 12 146 105
7647 105 -23 19 147 -278 73 71 173 245 9 -76 22 -3 -44 90 -188 210 -157 -133 41 205 37 -47 292
7670 292 -151 -188 371 -110 -85 202 -184 -33 -5 0 91 -4 42 170 -50 136 -144 -240 74 -37 21 15 -231 -142
7694 -142 -10 102 -264 112 10 -56 -176 161 -159 174 -76 -129 -159 -15 135 35 -206 -156 -157 -4 154 96
7716 96 217 -32 -68 -106 24 258 58 89 -70 -198 98 29 -286 -161 94 -48 -202 64 -26 2 147 -91
7738 -91 15 22 98 75 -135 -36 -45 -131 224 241 141 38 -35 -73 -112 200 -1 69 48 -116 -144 -26 27 -38 79 -366
7764c66L97p5P5J66j8j60j5m3P0K04J43l26j00J80o8M9k97K97r8J26j15o0pj39
7788a80K21k20M88k82o6Q6RP6P2j25N4K2K2j25pM7J86k55o0j14O8o8K25l83J90
7813a19J7J50q6m9P6l3j91J76K19r6o0j6J04o6p2J52j30K20k60M7J12l7j14J66
7837A10j03r3o0j02J94K16q4q2j05P9K78r9l42L50k27K00r0k8j12K24o4j07n0
7860i7J34K05j59R5k76K8k04L37P5R4J2n79M45mk29J5P6Kq6K25o5J52j63M8K1
7885A02k29J46k4mj95L24k87N5K58j81o5L8%k92K78K27J76m92J95P8n35M73m3
7908Cn2k2K54j3j0j81J08N5J5r8k46j4j22K47j33N7k68M20N0Oq0J53k40K09p9
7933A9k9j75R8P0K15k26L4R4R5L9j79K8k17J46n7q0J24R7J36l88J8J98J8m1j99
$$ plain form
7764 -366 31 -44 31 197 179 19 4 -39 31 235 378 52 -48 132 64 113 -184 113 15 141 26 -34 -41 -180
7788 -180 41 -179 309 27 -39 47 56 132 204 79 133 155 177 52 45 92 278 23 -37 -151 -83 -151 74 -309 -119
7813 -119 -102 48 -38 -87 -11 -44 -235 -59 160 64 4 -12 92 26 -46 106 -24 196 -64 -17 95 58 -56 110
7837 110 7 -86 -146 -248 -54 162 78 -4 -109 -30 248 149 -193 157 -70 130 40 12 -100 124 60 -47 -97
7860 -97 37 242 83 178 -98 -70 -274 63 138 232 244 -335 110 106 -123 -108 -32 -30 -116 109 44 196 33 81 102
7885 102 -127 19 -5 -9 -204 120 -167 -112 146 -35 -100 -62 -62 -354 -76 151 327 -165 30 108 -427 46 3
7908 3 -49 -71 183 170 160 -21 87 142 157 59 -187 -201 -323 -76 -209 -152 -420 0 50 56 -24 129 -111 98 19
7933 19 -10 -185 -87 -17 198 -28 6 100 195 234 55 83 -134 12 -45 -125 -1 96 232 -156 -138 60 78 37 -162
7958a62L53l63K76J6R2j75KJ35j22k33Pl3OM33J06k60l1P4l67K68j2j2N7J38k80
7983h7j5J00R2L9J03k8n10M64M4p1l52J65J83j8j31J16k9j85oP5J58j67M29l14
8007E5j09K61p4l29J02j49K26j63J08J21J08p1r6k13L00k76J84N0K71l86j0k7
8029a17J49K23m20J6J31J8J51k8k26O4o5J13j96M54j94j01q6jk9J29K55l82k92
8052d34N23j75o4P8N7L48m41r2M18j48m51M09j22K31l5m09J43L60k95K89rl34
8074a53J63J59m96L51L17n71R3p8K5L60n2pK7J14m91K26O4J2J28j3k22J39j24
8097b9J44m3k66J52J12J43l27j05J50J80K7j40j0j0L4J97k93k27K91O1K5k73K70
8120F3l63L79J85k66L50k61k62O1J22Nm7l04K54J32M8j35J01J65N4j90k2j42J80
$$ plain form
7958 -162 191 -172 104 120 212 37 39 174 52 -181 -174 -207 -201 232 338 78 47 121 -246 22 10 -2 55 193 -87
7983 -87 -102 -2 90 129 232 204 -306 158 202 131 -221 -56 127 109 -22 94 65 -120 -126 -51 107 -60 369 55
8007 55 -54 207 133 -196 -94 -243 -17 -180 -72 49 157 86 -10 -223 77 -199 -15 35 306 -80 -90 -117
8029 -117 32 255 -165 -149 -18 0 151 123 -103 -39 -104 9 -187 267 73 -28 -114 -115 -144 -15 240 -142 -434
8052 -434 89 -86 -150 -72 -15 333 -108 -200 218 70 -381 28 -94 137 102 -307 -164 196 -99 190 181 -153
8074 -153 10 169 -327 24 341 -230 -137 -215 -190 170 118 111 138 252 -239 -13 51 63 191 178 -44 95 -29
8097 -29 115 72 -194 -42 70 213 -114 -219 -69 111 138 -2 -12 -22 12 209 -84 -311 -20 41 66 -207 63
8120 63 -300 79 264 -2 348 87 -175 -114 8 13 -34 -338 -84 48 96 -39 62 227 281 91 69 -73 107
8143A07n06N94j97K94l59j62J95N8N1N5k65k4J53J37j61o1j08K10K26j98km11
8165c74N16k76j40J92p5J35K2j18J09M5KJJ5r2j70J86R9j13J00k65P9L52l23J78
8189H5j87N3
$$ plain form
8143 107 -399 195 -2 292 -67 -229 -34 24 75 130 -135 -159 -6 131 -30 -91 -199 11 237 39 37 -374
8165 -374 142 -134 -274 -82 -157 -22 0 -118 -9 36 38 39 54 -38 -208 -22 77 -36 64 -201 -122 230 -93 85
8189 85 -102 -49
8191d9
$$ Imaginary data points
##PAGE= N=2
##DATA TABLE= (X++(I..I)), XYDATA
0@%%%%%%qJ6j6J6j6K4l2L7m5N6o8P6q8J05j25J47j70J94k23K56k91L32l76M23
30B24m76N35n99O69p47Q32r26J030j142J267j404J553j719J901k104K339k603
47a370K898l240L639m110M681n383O266p430R035j1393J5213k2414M0611j67152
61a40149l76822L17924M14754M0370k57955j64422j1068P9561Q9705N9785n1617
72F6j01061j4996R2362K7347n7438J284M9067n7755o4365J01046J34116o1828
84D7845j64673l6533J21382J11420j2070q3856l7952J3356Q535J4899M9638L6095
96F8086k9728r4372q1771O3859J96407P3308j86415k08231K7977J96782J38972
107A64874l6228j63480j25044M2441J52175Q4427o6352j17025j0609Q6523K1542
$$ plain form
0 0 0 0 0 0 0 0 -8 8 -8 8 -8 16 -16 21 -24 32 -36 40 -48 57 -68 79 -91 103 -120 136 -155 177 -199 224
30 224 -252 283 -316 353 -394 438 -488 542 -600 667 -737 816 -903 998 -1106 1233 -1370
47 -1370 1528 -1712 1927 -2183 2498 -2885 3381 -4049 4986 -6407 8806 -13608 27003 -140149
61 -140149 -516971 -199047 215707 256077 -1878 -166300 -177368 -97807 -8102 51683 66
72 66 -100995 -115991 -23629 3718 -53720 -52436 -3369 -61124 -125489 -24443 109673 47845
84 47845 -116828 -153361 -31979 79441 67371 -16485 -54437 -41081 -32546 -17647 31991 68086
96 68086 38358 -56014 -137785 -73926 122481 195789 9374 -198857 -170880 25902 164874
107 164874 128646 -34834 -159878 -117437 34738 119165 52813 -64212 -74821 11702 33244
118C3244n5032J5038O3274m2918q7580M7169J17737L00j02340n3560M4817O4227
130D4376K1656j070j3840o2326n7413O1046J17479P23r6540n1003R826K9623O3166
143F5703M7140o6785j30532k5752J31180J30874m2850j66024p3964P9235R2314
154D0539K3270j6551n1075o3596m728N0061M0078J4320j1034m7458l9558K1765
166d3967N2516K3339k3948m1682n468L5439K1365n503j695j4122l5496Q882O2732
179C2392L4834k4788n5166n5881P119J09002R4742o1427j58215n7164J20964J48500
191A34912j3845j44276p1559O0054O9210J3845j1059k9397l3084L209J7900N5
203d035J5038L2909j3979o7475l4786N4357Q6649j42r7115n2259O4603O5632j7483
$$ plain form
118 33244 -21788 -6750 56524 13606 -73974 -26805 90932 91232 -11108 -64668 -19851 44376
130 44376 66032 64962 51122 -11204 -68617 -7571 109908 110631 14091 -36912 -27086 2537 65703
143 65703 112843 46058 -84474 -110226 20954 151828 108978 -57046 -131010 -51775 40539
154 40539 63809 47258 -3817 -67413 -72141 -22080 17998 32318 21284 -26174 -65732 -43967
166 -43967 8549 31888 7940 -33742 -39210 -3771 17594 12091 10396 -3726 -39222 -30340 32392
179 32392 67226 42438 -12728 -68609 -61490 47512 142254 80827 -77388 -134552 -13588 134912
191 134912 121067 -23209 -94768 -34714 34496 48341 37282 7885 -25199 -21990 -4090 -4035
203 -4035 11003 43912 29933 -37542 -72328 -17971 68678 68536 -28579 -80838 -16235 49397 31914
216C1914l7856p548J46M153J2810J2867J3552o386n0646l7368M8295Q8132J5646
229H7711q9725j02924J6337J36887P9240q8674j28322q136R1926P2522j8756p9312
241c1226l5385M6200L7456k6696k4056K5689K5627k5273n2115n295O9981N3950
253E8857n1049q4891J102O9646M6413j2713n2554l6858K4938M9354J0227j8209
265D263j2110j0575p081J1506K8209K6695j0578o3351l7770O5955R0899j2758
277G3304r3534n4702L8028Q5143L7898n2623o8962q73M3134K6083l799j6569n576
290F952Q942j0505k5668J7256M9142l50n1559k7654K2972M4078J8653l4830n0470
303c3041J688M4325K9768m191l0344l5365j785L2715K6453O281j3444m1878k8359
$$ plain form
216 31914 -5942 -13490 -13344 -9191 3619 16486 30038 23652 -26994 -64362 -16067 72065 87711
229 87711 -2014 -104938 -88601 48286 127526 38852 -89470 -97606 -5680 66842 48086 -31226
241 -31226 -66611 -20411 17045 -9651 -33707 -8018 17609 -7664 -59779 -65074 4907 58857
253 58857 7808 -77083 -75981 -6335 40078 27365 -25189 -62047 -37109 12245 22472 4263
265 4263 -7847 -18422 -25503 -13997 14212 40907 30329 -33022 -70792 -4837 86062 73304
277 73304 -20230 -74932 -36904 48239 86137 33514 -35448 -36321 6813 32896 29097 12528 6952
290 6952 15894 5389 -20279 -3023 46119 45769 -5790 -33444 -10472 33606 52259 17429 -33041
303 -33041 -31353 12972 42740 38549 8205 -27160 -28945 3770 30223 36504 23060 -18818 -47177
316d7177L5166N5040J322m5302l6745L660M2679L1192k1196l8664r101J2484J6248
329c94J4420k826j5209q819j0942q085K5644L7053j1428m4783j9827J9041L4713
342H558J6736k3167l4254j50K1085J5201J0034o628k8093j7150J4877K8137K4942
355C0128k853m7712m0378L0376O4100J6670m1821m9501j757N1663L6370k7501
367A7784l9951K919K4011J1605m223j0155K516J2010j2338k7640J5517M8693J0424
380E1172m3890m3736N124N3603L9850k9458n3931l982L3479K0796l963j7161j2777
393d874N353O579m516R156J8919j6331m1561o835M1155M1390o944n9239m2379
406f0127L5840O2877L040m7424l0322J2791L2343J0385k6866j7303K1796J4545
$$ plain form
316 -47177 -12011 43029 44351 -951 -37696 -34036 8643 39835 18639 -20025 -29126 -16642 -394
329 -394 14026 11200 -4009 -12828 -23770 -31855 -6211 30842 19414 -25369 -45196 -26155 8558
342 8558 25294 2127 -32127 -32277 -11192 4009 14043 7415 -20678 -37828 -22951 5186 30128
355 30128 27275 -20437 -60815 -30439 33661 50331 8510 -40991 -42748 8915 45285 17784
367 17784 -22167 -19248 4763 16368 12145 1990 4506 16516 4178 -23462 -7945 40748 51172
380 51172 7282 -36454 -31330 22273 62123 32665 -21266 -25248 8231 29027 25064 7903 -4874
393 -4874 479 7058 2542 11698 30617 14286 -27275 -34110 7045 48435 41491 -17748 -60127
406 -60127 -24287 38590 41630 -5794 -36116 -23325 9018 19403 -7463 -24766 -2970 11575
418A1575k2604j6274J9566K6242k941l7760k8606L0558N6740M16n3745l3568J9276
431c1125M1985K0610k3913l4587K474K2482L021m119O028l16j2664j0228L771
444a6581K3785K1113k2524m4408j06M4725K7399j4698l7804j9907K3994L5563
456B0551k951k6051m410J0231J971k672M95Q093J0339j0373k7320M138L7170J6684
470C5895k3294l0810o974K6477L5029l698l5006j4766J3735J4572P682q20j1018
483G004q881K61R71J0084J5782j0654k8219m899K2156J8684m68k2402k4085P765
497a6901K7372O321j3518p871m076l113M566O636N897N204j1523k3273L456K8633
511G810J3032j4197k1418q972J6341K6699j028k3819q209P895O413P310M361n714
$$ plain form
418 11575 -11029 -27303 -7737 18505 15564 -22196 -50802 -20244 36496 36912 -16833 -50401 -31125
431 -31125 10860 31470 7557 -27030 -24556 -2074 947 -3172 2856 2540 -10124 -20352 -16581
444 -16581 7204 28317 5793 -38615 -38721 6004 33403 18705 -19099 -39006 -15012 20551
456 20551 17600 -8451 -12861 -2630 -659 -3331 -2836 5257 15596 5223 -22097 -17959 19211 35895
470 35895 12601 -18209 -25183 1294 36323 32625 -2381 -17147 -3412 11160 18842 18022 7004
483 7004 -1877 -1616 -645 9439 25221 14567 -13652 -18551 3605 22289 21821 -581 -24666 -16901
497 -16901 10471 16792 3274 -4597 -8673 -11786 -7220 -584 5313 10517 -1006 -24279 -20823 7810
511 7810 20842 6645 -14773 -23745 -7404 19295 18267 -5552 -13761 -5866 547 7857 12218 6504
525F504p654n216m087J3556K2092n783k9330j1112J6382K3299P163k0853k6452
538b1491P490K6463M486j3890o400q29K019K403l041L173J3282l529k5649o821
552b2334K3819K1907m366k5733k0430J5325L3752K007k5647j1885Q576J0865N752
565A1608m998p416M878L151j2774l029K0253J0569j6146k1221k844K2314K3416
578B7761j2373l4837o459K5806J6308o753j7609j1062Q569J4451o664j0819Q970
591d711Q297j4034j3934O062J8948J2651j5105k9084k42L0105J6120j3940j9128
604a7995o342J3142J8892l039j6939J421J2528m160p367P277J0108p29j0416j1874
618a5493P068K4444N006k2856j6798Q499J9502J1985j1213k2598l38K0300M041
$$ plain form
525 6504 -1150 -6366 -10453 3103 25195 19412 -9918 -21030 -4648 18651 25814 4961 -21491
538 -21491 -14001 12462 16948 3058 -3342 -4171 -2152 251 -2790 383 13665 10136 -15513 -22334
552 -22334 1485 23392 19026 -6707 -27137 -11812 21940 23947 -1700 -13585 -5009 5856 11608
565 11608 6610 -806 4072 7223 -5551 -8580 11673 22242 6096 -15125 -17969 4345 27761
578 27761 15388 -19449 -25908 -102 16206 9453 -8156 -19218 -10649 3802 -2862 -13681 -4711
591 -4711 3586 -10448 -24382 -18320 628 13279 -1826 -30910 -31152 -1047 15073 1133 -17995
604 -17995 -24337 -11195 7697 4658 -12281 -10860 1668 -2492 -9859 -2582 7526 6797 -3619 -15493
618 -15493 -8425 16019 21025 -1831 -18629 -10130 9372 21357 10144 -12454 -12792 7508 11549
631A1549j0087p87L897k833l603j619L913J2770P61j9762r962J5002J7752K60
645A7251j4363j5525M618K1029M889j3554l856M509j921k05M888L008J632k263
659A0137j2488l026J8127J0540j2453j5094j719J2301J4280m654k0262m621J3418
672D486N403m130k135l727k810J633j749n85J0286K603j7250j1017J0124J3816
686D948L620q763j5095j323J4598O093o149k848k34k880J813K303L38O609J571
701D601j4133o711J6312J2240p276j3309m936Q706J6028Q9j7146p403R836Q350
715E248J468m256o826N02N631m861m348J2047P239j2946j2550L377J0571J0259
729A0555k705j6449p168J2880J0195m010o246k826L021M648l619l569Q815O015
$$ plain form
631 11549 1462 675 4572 1739 -1864 -3483 430 13200 13961 -5801 -15763 -761 16991 17251
645 17251 2888 -12637 -8019 13010 17899 4345 489 4998 3077 2872 7760 10768 12400 10137
659 10137 -2351 -5377 12750 23290 10837 -4257 -5976 6325 20605 15951 -4311 -8932 4486
672 4486 9889 5759 3624 -103 -2913 -1280 -3029 -3614 6672 9275 -7975 -18992 -8868 4948
686 4948 8568 -195 -15290 -16613 -2015 4078 -2071 -4919 -5153 -8033 -6220 -3917 -3579 3030 4601
701 4601 -9532 -16243 69 12309 5033 -8276 -13212 -4506 11522 11611 -5535 -12938 -3102 5248
715 5248 6716 2460 -4366 -3864 1767 -3094 -7442 4605 11844 -1102 -13652 -10275 296 10555
729 10555 7850 -8599 -15767 -2887 7308 3298 -2948 -5774 -2753 1895 -1724 -5293 3522 9537
743I537j3069r593J1407J2549j02r919j2714J240J9893R463j5130j4714L599J1802
757D249O625n551j0559J816Q874m133p439O616P193n060p066m379K324J3599N211
772A2320j5854j2673Q703J2101J449o179p607n01P986J228n014L577M480o658
786b642o271L856O460P133j273j5223p500J6734J5092q083j3574l442P218J1534
800A0019N59j1575l811Q185K613l898MJ490J455R0p444l568J2165Q890j0839j2780
816h445K699Q945O267l03j0620n639P316N055l425m19K584k849l561j104K018
831a481R509K341j4447r071J1664J2468k607r324p512J345J2973N504j1715p495
845g848N569M957j378j712j352K538K813o820o407Q957R120n927q809k475K874
$$ plain form
743 9537 -3532 -13125 -1718 10831 10729 810 -11904 -10664 9229 18692 3562 -11152 -7553 4249
757 4249 10874 5323 -5236 -3420 5454 1321 -6118 498 7691 2631 -4435 -8814 -6490 7109 12320
772 12320 -3534 -16207 -7504 4597 6046 -133 -7740 -8241 -255 973 -4041 -464 4016 -2642
786 -2642 -8913 -5057 1403 8536 7263 -7960 -15460 1274 16366 8283 -5291 -8733 -1515 10019
800 10019 10578 -997 -4808 3377 5990 2092 2096 3586 5041 5131 -2313 -5881 6284 15174 4335 -8445
816 -8445 -5746 3199 9466 9163 -1457 -7096 220 5275 1850 1431 4015 1166 -2395 -3499 -1481
831 -1481 8028 10369 -4078 -13149 -1485 10983 8376 -948 -8460 -7115 5858 11362 -353 -7848
845 -7848 -2279 2678 1300 -412 -1764 774 3587 -3233 -9640 -683 8437 2510 -6299 -8774 -5900
860e900R220M642r865r203O113O007j924n86Q35k297r16j352o4P552M114r778
876c402q860O236R223L344l663j1256l487J3468R418r483q737L242N155J813j258
891A753m323J633O112l469p200L904P859N88n187o293j622J0899P649r107r694
906f498L985O201M86j11k686k575K801l29l542M574O354n487q245M09N813P496
922H646m03j2127o698J1189R599n781p782j397K922N591R33p212j843P004N3o711
938d017q3M714L474r04p523n655Q623R924n517q485m77L031L688L003m567m966
954e737M109J931m055K284M639k540m583j467J811O780M081r154q703O467Q773
969D636j12m670m985o64Q068L779q150l548O605K618m608j801J058L827L661n286
$$ plain form
860 -5900 3320 7962 -1903 -11106 -4993 1014 -910 -1496 -661 -2958 -3874 -5226 -5290 2262 6376 -3402
876 -3402 -12262 -6026 3197 6541 2878 -8378 -11865 1603 11021 1538 -7199 -3957 1198 3011 1753
891 1753 -2570 -937 5175 1706 -5494 -1590 6269 6857 1670 -4623 -6245 4654 12303 3196 -6498
906 -6498 -2513 3688 4174 4063 1377 -1198 1603 1274 -2268 2306 8660 3173 -5072 -4663 1150 8646
922 8646 8243 -3884 -10582 607 10206 4425 -3357 -4754 -1832 3759 4692 -2520 -4363 2641 2694 -4017
938 -4017 -4100 614 4088 3184 -4339 -9994 -1371 8553 3036 -5449 -5926 -2895 793 3796 -771 -5737
954 -5737 -1628 303 -3752 -1468 3171 631 -3952 -5419 -3608 3172 7253 -1901 -10604 -4137 4636
969 4636 4524 -146 -5131 -5795 2273 6052 -2098 -5646 959 3577 -1031 -2832 -1774 2053 5714 428
985D28q735N109J0301r95o233l734k89O297N721n678n640M112K536k999R06K834
1001C941j327j277j979j798N518O111n973q837K600O706K899j889p288k780P438
1016B065N475o557m467L900K094j035j785k787K178O467l108q871J720P431J786
1031D506l148m541m026N706P730m249o038J362K001j20J426P8j801J284m11m403
1047d644L498O941l480o509o7L132M256K465p059n772N942O095l140l931O38Q78
1063g57K364m05n034M18P375m24p787j047M673L272J258n542o180M415Q773j886
1079C486o467k76J635J361K670k253k470L318j0m551J837N863j258m044j204m98
1095b861M443M860n371o863L660N740r80k628j851k72L588J241n513r31O463Q62
$$ plain form
985 428 -8307 -3198 7103 6108 -125 -3859 -4148 2149 7870 2192 -3448 664 3200 201 1107 3941
1001 3941 2614 1337 -642 -2440 3078 9189 3216 -5621 -3021 3685 6584 4695 -2593 -5373 2065
1016 2065 7540 983 -3484 416 2510 1475 -310 -3097 -919 5548 2440 -6431 -4711 2720 4506
1031 4506 1358 -3183 -7209 -1503 6227 1978 -4060 -2698 -697 -817 609 687 -1114 170 -241 -4644
1047 -4644 -1146 5795 2315 -4194 -4261 -1129 3127 5592 -1467 -7239 -1297 4798 1658 -2273 -1635 -757
1063 -757 1607 1202 -3832 -3414 3961 3537 -4250 -5297 -624 2648 3906 -1636 -7816 -3401 5372 3486
1079 3486 -2981 -3257 -1622 -261 2409 156 -2314 1004 994 -3557 -1720 4143 2885 -1159 -2363 -2861
1095 -2861 1582 6442 1071 -5792 -2132 3608 2628 0 -1851 -2123 1465 2706 -2807 -3738 2725 3587
1111C587n564j880R77L356M373m052p972K482P727J91m138k023j108K892M587
1126C435k712l992L008J193l562J359L064n96n64j085l261L278O097k834o068
1141c240J090L815J388p3k749l008M309L545m588k409M119J269j706j776k201
1156b215J893O717j653q390n66O574K313j367l316l815K996N724k518m187J891
1171H1J436j636R56M55m65J258m42m667J468O363j349m663l87J293J848K441k844
1188A146m464L350L456l234j782J746P68M41q87l956N51O797l06o978j320L765
1204i07J671J555k558n679J805O356j018l486R5P7j52K003p97j495K556K80m976
1221d670Q59N347o04k388m46j638J964M433j769n430K228L519j331q67o3k39J936
$$ plain form
1111 3587 -1977 -3857 -2880 476 4849 797 -7175 -4693 3034 3225 -913 -2936 -4044 -1152 3435
1126 3435 723 -3269 -261 932 -2630 -1271 1793 1197 633 -452 -3713 -435 5662 2828 -3240
1141 -3240 -2150 1665 3053 2980 231 -2777 1532 5077 489 -1920 2199 3468 1762 -14 -2215
1156 -2215 -322 6395 4742 -3648 -4214 2360 4673 3306 -10 -3825 -829 4895 2377 -1810 81
1171 81 1517 -119 837 1292 827 2085 1643 -3024 -1556 4807 3458 -1205 -1592 -299 1549 3990 1146
1188 1146 -3318 32 3488 254 -1528 218 986 1427 540 -3416 -2865 3932 3626 -3352 -4672 -907
1204 -907 764 2319 -239 -5918 -4113 2243 1225 -2261 -2166 -2089 -2241 -238 -1035 -2530 26 306 -4670
1221 -4670 -3811 1536 932 -1456 -1902 -3540 -1576 2857 1088 -4342 -2114 1405 74 -793 -856 -1095 841
1238H41Q38m580n16O012P57m239j811K52K218M576k040o801Q17O172L26l132n07
1255h17n15O82K386j450k181L313R03m510M06L265L21l94o14l886J466O351j650
1272C076n315J135K945n89J40q75j517K440J903m184j458M143J593j908j733k260
1288b464J533N983j096p175q2N089P21j025j105k751Q99M259j135l787J965J194
1304A023j576l7K89k59L038l84n150L19N313k35l307L7j85P21K812j154l887K167
1322d55L174k059k433J456J259R10p36m048M30O029J37n270j487K920J099J654
1338B580r88m867N51N441o33l838O53J613n54K91q32j246K972P94m351J31L182
1355H99N4j043J00k265J75M546q72m511J551L228j971j464J503n26P39J101k884
$$ plain form
1238 841 1679 -2901 -3417 2595 3352 -887 -2698 -2446 -228 4348 2308 -4493 -3676 2496 2822 -310 -817
1255 -817 -1332 -650 1736 286 -1895 1418 2321 -2189 -1783 1482 1803 1409 795 -3091 -1625 4726 3076
1272 3076 -2239 -1104 1841 1252 1392 517 -1000 1440 3343 -841 -2299 1844 3437 1529 -204 -2464
1288 -2464 -931 5052 3956 -3219 -3301 1788 2509 1484 379 -2372 -1473 2786 1651 -2136 -171 1023
1304 1023 -553 -590 -301 -560 2478 2094 -3056 -2737 2576 2341 -966 -929 -1114 -393 2419 1265 -2622 -455
1322 -455 2719 660 -1773 -317 942 1852 1116 -2932 -2502 3527 3664 -1606 -3093 -173 926 2580
1338 2580 1592 -3275 -2724 2717 2084 -1754 -1101 512 -42 249 -583 -1829 1143 1937 -2414 -2283 899
1355 899 953 -90 10 -2255 -2080 2466 1594 -2917 -1366 1862 -109 -1573 -70 -596 143 1244 -1640
1372a640r43L784R70l066q30k48R30L551o09n249P44M759j195k289R94r4p22J843
1390F90n59k225K007J861k605r63J401O32P53m60k662M87M091j297l412J855J349
1407I43j409O05O25k260J527K583k907k346L442J742j636q19k061J030M279r74
1423B364m384L87L428p32q23L29j283O19K897k098l259K889K173k375j293Q66
1439b95N57J198n4l195L85L633r55k257J000R9j78J574j204l120K593L349l247
1456a17k619K459J525n78m4k102l03L166O05l220l38J265M0J254l94k803R21L716
1474B433j977l132K739J257j513j37J62j599J934K137l192j329K409P08n25k10
1490A65j570k2L657j303l668K355K614k285q15Q44o62J505J379k619k824L514
$$ plain form
1372 -1640 -2583 1201 2171 -895 -1725 -1973 -1043 2508 1899 -3350 -2606 2153 958 -1331 -337 -431 -1153 690
1390 690 131 -2094 -87 1774 -831 -1794 -393 239 992 532 -2130 -1643 2448 1151 -2261 -406 943
1407 943 -466 139 764 -1496 31 2614 -293 -2639 803 2545 909 90 -1971 -941 3338 2364
1423 2364 -2020 -1633 1795 1063 240 569 -714 -95 2802 704 -2555 334 2507 132 -1161 -295
1439 -295 262 1460 1406 -1789 -1404 2229 1274 -983 17 116 -62 1512 308 -2812 -219 3130 -117
1456 -117 -2736 -277 1248 670 626 -1476 -1779 1387 1992 -1228 -1566 -301 -261 993 599 -2204 -1283 2433
1474 2433 456 -2676 63 1320 -193 -330 -168 -1767 167 2304 -888 -2217 192 900 375 165
1490 165 -1405 -1427 2230 927 -2741 -386 2228 -57 -872 -28 -690 815 2194 -425 -3249 265
1506B65K216k495r92M7L12K578n39l352P51L212j493j803J505l07k2J613j268
1523B28k746K677K845l038j693J842L42M40K63j932o11L024o74k496J453J037
1539I61j210M62J0j847J618K367k498k412K457J777j580k46o41o53K323M41k535
1556a206K05J606j004mR74j560K78K573k011k543K959J666k383p25R30l63R29
1573C21J313k385q50K452L7j521N40j12k47J261o56k260J834K598k390k379K168
1590b76N26J15Q70k094j586K959J309k507n67J406j95K01L09j705P87K195j836
1607h9k240K427J527j555m5j93j111J872J871k933j221K318K18j171L77l60p5
1624c83J662q29k029J579J780j680j000R87p63R67J658k329k097K883J405j966
$$ plain form
1506 265 2481 -14 -1006 -959 -647 1931 1392 -1960 -1209 2003 510 -1293 212 -95 -117 1496 228
1523 228 -2518 159 3004 -34 -1727 115 457 897 1160 -772 -1383 1641 967 -1529 -76 961
1539 961 -249 213 223 -1624 -6 2361 -137 -2549 -92 1685 105 -141 -782 -1435 888 1329 -1206
1556 -1206 -1001 605 -399 -403 571 -989 -711 1862 -149 -2692 267 1933 -450 -1175 -245 -608 321
1573 321 1634 -751 -1601 851 888 -633 -93 -205 -452 809 153 -2107 -273 2325 -65 -2444 -276
1590 -276 250 365 1235 -859 -2445 514 1823 -684 -1251 155 -40 161 470 -1235 -448 1747 -89
1607 -89 -2329 98 1625 70 25 -168 -1279 593 2464 -469 -1690 628 846 -325 52 -308 -383
1624 -383 1279 450 -1579 0 1780 100 -900 87 -676 291 1949 -380 -2477 406 1811 -155
1640a55l39M11o77J297R18k327J49J946j023j459J300O34m10Q96j276k077K374
1657A82K158k188j547J551L2j05R66j405j073K608j20k252P03J596j091K51k55
1674A1j300J383K111k174j846K149P55r95L47m95j179K083O78k742j8K166n73
1691C61j055O15j29j03J479j064k179K036J876j971o38M52n95J072J300k288r02
1708a733K281K62j939M18R26o11R93k41k056J139K393k109j333J380J53J70Q19
1725I12j421j612K325J257k171l4J399j020r2Q71j167n2K290j117k077J662P74
1742G27j097L74K75j919K001J521k517j069K597M9j290N43m61p01K202m98k398
1759a661J134K174j247j052N98k51N92J493j691j850J936J320j786K3N16o85P02
$$ plain form
1640 -155 -494 -83 -760 537 1455 -872 -723 1223 200 -1259 41 675 265 1161 -115 -2192 182
1657 182 2340 152 -1395 156 188 83 1049 -356 -1429 1179 1059 -1193 -490 1106 15 266 11
1674 11 -1289 94 2205 31 -1815 334 1089 94 441 -54 -1233 850 1528 -1214 -1232 934 361
1691 361 -694 -79 -208 -311 1168 104 -2075 -39 1837 -134 -772 -320 -915 157 1457 -831 -1733
1708 -1733 548 810 -1129 -711 215 -396 597 356 -1700 -561 1832 -277 -1610 -230 -77 93 912
1725 912 -509 -2121 204 1461 -710 -744 655 -365 -457 414 -753 -805 1485 368 -1709 -47 727
1742 727 -370 4 279 -1640 361 1882 -635 -1704 893 942 -348 195 -266 -967 1235 737 -1661
1759 -1661 -527 1647 400 -652 -54 -305 287 1780 89 -1761 175 1495 -291 -268 248 -437 265
1776B65J100k332K36K393j184j709J482N52q99J015n05j871J795J403j830p37
1792h26J404k48l90P97j038o88K170O5k747J132J309q51o7Q0j108P39J902j468
1810A67j943J795R30r75R3J67j233J172J176k055k72K018n49r67L32J52o19J588
1828I77l07k358J526J562j569k37M50n17N21J047j466j076J989K94j869O20J194
1845G81p10L89l37j795P09K530j228j873J018Q54j74M69q90j574K118Q53k022
1862h82K97J291r15l5L70r11j65J843j24k116J045J376j220r4M40j269J104J130
1880A165j585j056K037k04j312Q53N99j070J136L77k471R63J898j014o29M93p89
1897f09M04J492j089j402J385Q38j454M17N74j114N58R17j533k18K027k19j571
$$ plain form
1776 265 1365 -967 -731 1662 478 -1231 251 803 -96 919 414 -1457 338 1741 -89 -826
1792 -826 578 330 -60 737 -301 -989 1181 1246 -1501 -369 940 89 22 102 -1006 -267 1635 167
1810 167 -1776 19 949 -26 67 234 -999 173 1349 -706 -978 1040 491 -476 -144 8 -611 977
1828 977 670 -1688 -162 1400 -169 -406 44 -473 48 1095 -371 -1447 542 836 -1033 -413 781
1845 781 71 460 123 -1672 -963 1567 339 -1534 -516 338 164 633 -257 -1831 287 1140 -882
1862 -882 -585 706 -209 -244 126 -785 -950 893 769 -1347 -302 1074 -146 -240 200 -1069 35 1165
1880 1165 -420 -1476 561 357 -955 -102 497 -573 563 940 -1531 -568 1330 316 -313 180 -609
1897 -609 -205 1287 198 -1204 181 1019 -435 -18 556 -558 0 917 -616 -834 1193 974 -597
1914e97L37O65m59O53L2j803R68J547j564n54J610k07o25M57m18o49J568J02k279
1933a216M59K025q81q13R54j182L56J745j213j841J610O93j178Q93q6r26J128
1950E27N32j967K31J793r57j166R37K28o25J301k12j794Q74J471j327k58N30r2
1968B6n7M93j138J1J747o09j624N35J235q08L01L87j756L44J974o48j477R74N58
1987D68q29J013l16j537J612N30j584rJ360n89n92J072j045m21K212l68k075L22
2005g76J795q39k97L51j025P00J450j524r80K099m58j090O20n2l35J583j08k550
2023a436L90K266m39j448N85k42RJ262o38j406J092N66p88J83L08o70N19P14j713
2042h86j43K164m89j766O84R19r34M09Q75j681j98J593m51o99J002k21m55M07
$$ plain form
1914 -597 -260 405 -54 599 631 -1172 -204 1343 -221 -775 835 628 3 460 42 -607 961 1063 -1216
1933 -1216 -757 1268 387 -426 528 -654 -298 1447 234 -1607 3 696 -482 411 325 -601 527
1950 527 1059 -908 -677 1116 159 -1007 -70 158 -467 834 622 -1172 -298 1173 -154 -412 118 26
1968 26 -31 462 -676 -665 1082 473 -1151 -616 619 -189 112 499 -1257 -913 1061 413 -1064 -90 468
1987 468 -361 652 336 -1201 411 941 -643 -652 708 119 -473 599 -446 -867 1345 977 -1098 -776
2005 -776 1019 180 -117 234 -791 -91 1359 -165 -1145 954 496 -594 26 -26 -361 1222 1114 -1436
2023 -1436 -1046 1220 781 -667 -82 -324 -315 947 309 -1097 -5 561 -227 -44 264 -406 113 827 -886
2042 -886 -1029 1135 646 -1120 -436 483 -451 -42 833 -848 -1046 547 96 -603 399 178 -277 130
2060A30J25p54J229q9j618O31J226q20k48Q66j167l96K114o27j399M87N64o51
2078c97O22K37j140Q46N59j178k9J138p07m58R10l45r96J843N1j572J32J407p80
2097A43k78P96n75p13Q63m25K3P63m70j057P77J007j167L47L69j293L30J913j323
2116C0j284R30Q26j189K29J019r23K78L51j044N12R93m90q25Q55q54L38J214o87
2135B79j814J416J359j716MJ026q02k49J082q14k48Q96L89j294J34N16j54O13
2153F23o67j424J153J858j277p56Q64q8q47J377k86j681J089J392j451m51Q94
2170C22j57Q5J80j150r9J833k15j586J4J030l07Q86m07j475O74J864j099j742
2188a349J256Q55q43K56p37K18J031L27k216J75J727m08k92K75j336K06K441r07
$$ plain form
2060 130 255 -499 730 641 -977 -346 880 60 -188 678 -489 -885 1229 602 -797 -310 254 -397
2078 -397 225 462 -678 168 727 -451 -480 658 -49 -507 403 58 -938 905 956 -616 -484 923 143
2097 143 -135 661 86 -627 236 -189 -166 597 127 -930 -153 854 -313 34 403 -890 -560 1353 30
2116 30 -1254 -324 502 -687 -458 561 -362 -84 267 -777 -265 728 238 -587 268 -586 -248 966 279
2135 279 -1535 -119 1240 -476 -472 554 -248 -497 585 -229 -477 419 808 -486 -352 164 10 623
2153 623 -44 -1468 -315 1543 266 -490 374 286 -561 816 530 -1151 -62 1330 -121 -572 322
2170 322 165 250 430 -720 -819 1014 799 -787 -773 257 -50 836 429 -1046 -372 1492 393 -1349
2188 -1349 -93 762 -81 175 -562 -344 687 1014 -1202 -1027 700 292 0 275 -1061 -855 1586 679
2206F79k381J195J542j177j6J51m34M34N48o47r55J225P6n73K93j98l34J077L46
2225H51j874K78J384m60n73R25j049n4J467m56j021L72P61n70j94L39q60R09Q83
2244A058j597l87J497l37r73R52k86n94J064N91j645K32Q64k66p91Q74m18k2P46
2263E62j47r85O70M22r46N42M15j102M58R28q49q31J409k07q19J221m27j189Q08
2282f7O96n72n16N48n66M92Q14r63o06J259q7q63N38J43p91P37M55j394j34J627
2302G50k68j094M50L20k55O10m06j101R56Q53r55k18O74p00O20N68j409n37J894
2321G52j58j348L63L84k49Q33j66j439O16J305n14j028M09L1%J120q46j351J496
2340B10R28j540k54O45k17N80P03j743m51J705J76j044j70O25l6P45m33j712R74
$$ plain form
2206 679 -1702 -507 1035 -142 -158 -7 -441 -7 541 -106 -1061 164 240 -333 -40 -238 -572 505 851
2225 851 -1023 -745 639 179 -394 531 -518 -572 895 439 -582 -210 551 -19 -213 126 -734 175 1058
2244 1058 -539 -926 571 234 -739 213 -73 -667 397 988 -657 -425 439 173 -618 256 -162 -184 562
2263 562 415 -570 100 522 -424 118 533 -569 -111 817 -32 -863 546 339 -480 741 314 -875 -67
2282 -67 629 57 -459 89 -477 15 829 -134 -740 519 432 -431 107 250 -541 196 651 -743 -877 750
2302 750 482 -612 -162 158 -97 513 107 -994 -38 815 -140 -358 316 -384 236 804 -605 -1142 752
2321 752 594 -754 -391 -7 -256 577 411 -1028 -412 893 379 -649 -240 -209 -209 911 65 -1286 210
2340 210 1138 -402 -656 -11 -228 352 1055 -688 -1139 566 742 -302 -472 153 117 862 429 -1283 -309
2359c09J685j047j105P96j8L59L02j010r60J635R97j203r96J009j87L73o3j281
2377a023p6K214l31j751M93N28k26N31k67j306R28J547j323p42P54j45K44L90
2395D39n83j125J418R48j588m3P62m46L95O14j434NJ484k29j240N38M93q19O81
2414B70m4j069N69J236r55o58O46K27n60J164p41r58J192N55j176p0P11m15J89
2433A13L74n52o11J473n0j569N40L97l68O26J89j382M19J309r53k73O22l72K7
2452d1P95o04j074J123L65q59J32N23p37N74M13j035n38J318K5o84j8J37l42J143
2472F16K35j922N01R56j83m28K79l65J59J011p05j498J388P58j149rK94n07P84
2491B15N07j192o22J478M94j274L30l32q4J105K30j704N0J503m05n67O66j133
$$ plain form
2359 -309 1376 329 -776 20 2 361 663 -347 -1307 328 1325 122 -874 135 -52 321 258 -1023
2377 -1023 -1099 1115 784 -967 -474 54 -172 359 92 -1214 -286 1261 -62 -804 -50 -195 49 439
2395 439 -144 -1269 149 1097 -491 -534 228 -218 177 791 -643 -638 846 617 -623 -85 408 -411 270
2414 270 226 -843 -274 962 7 -651 -5 222 -338 826 85 -873 319 874 -302 -372 339 -76 113
2433 113 487 -65 -676 797 747 -822 -282 115 -253 373 562 -820 -401 908 -45 -318 304 -68 -41
2452 -41 754 150 -924 199 564 -295 -163 360 -377 197 610 -425 -963 355 380 -304 -322 -185 -527 616
2472 616 851 -1071 -570 386 203 -225 54 -311 -152 859 154 -1344 44 802 -347 -356 -62 -569 215
2491 215 722 -470 -1092 386 880 -394 -64 -396 -480 625 855 -849 -799 704 299 -268 398 -735
2509g35O15J294j089j115J203N56p47l1l58k24P78Q69j557n65J540L22j018o8
2527c30Q0J1R79j84j693N73J231j19r55K47k19K80J017p83j435J337R32q35l41
2546b07N4j57N80Q40j415p66J772M7j289K72k25l2J426j19j708L41J355n59m60
2565b50K42n41N09R15q85j127J188P31o67l13K35k94M10O93j128p12J559j09p12
2584b56P2J28l63J222k80j632N73J520j101k32J16J16N7P73m59j566J499Q01q12
2603A76m67Q3L8L86L01r47m35J214K99q58L27l53l61J148j06j174K77J012l49
2622B11m21L44l35j2J107p56j129J009O11o69j97L72r93J235L74j312n04J184
2640A19J83n98K37l1m50Q87M30j081k17J079k52l19j10m09K76J208p46j172P60
$$ plain form
2509 -735 -120 1174 85 -1030 173 729 -18 -49 -407 -631 147 1016 -541 -1106 434 756 -262 -330
2527 -330 -250 -239 740 556 -1137 -564 667 548 -407 -160 -379 -99 918 135 -1300 37 969 134 -207
2546 -207 -153 -310 270 1110 -305 -1071 701 748 -541 -269 -494 -526 900 781 -927 -586 769 210 -250
2565 -250 -8 -549 -40 875 -10 -1137 51 782 115 -198 37 -257 153 846 -282 -994 565 456 -256
2584 -256 -184 -56 -419 803 523 -1109 -536 984 -117 -349 -233 -117 -60 713 254 -1312 187 988 176
2603 176 -291 -208 -170 216 517 -430 -865 349 648 -210 117 -236 -597 551 445 -729 -452 560 211
2622 211 -210 134 -201 -213 894 138 -991 18 629 -40 -237 135 -858 377 751 -561 -1065 119
2640 119 302 -296 -59 -90 -540 347 777 -304 -521 558 306 -13 -123 -532 -256 952 206 -966 -206
2659b06O16m49KL48j012P37J236j459o29Q88L20j98m55J18l16P24N80j586J40
2678f01J264n43lJ16r59K07J440n81j192L27Q99k15O1j55p70Q15Q88j131p54Q70
2698a7M46o13K52l65q9J161L10j894l2J498k72o01L15o62K30J049j38j362O09
2717a75N08l02l2P3n15N35O53j380j17J221J15q78M03o50k58J231L63j638m8J208
2737C17j60l26K87o75K49R21n95n16N02J57j06K08k52p67Q07J024j530o11J887
2756H21o2q58oj90l37J098K65j088L6K63j10j25O37j058L07J449j028r75J097
2775A36N92r61M47j55m82M50O76q35n17O85L01k59Rl96m84J155J31q31K64O19
2795E45o63k41P97q47j35J423q46j129R93M94j63j59k28n70N64O57n56o22P76
$$ plain form
2659 -206 410 -39 -37 311 -701 36 1272 -187 -816 72 392 194 -261 -143 -459 265 845 -741 -601
2678 -601 663 120 117 233 -726 -519 921 340 -852 -525 374 159 220 65 -705 110 998 -133 -887 -17
2698 -17 429 -184 68 -297 -386 775 1085 -809 -841 657 385 -216 99 -563 -333 716 578 -784 -175
2717 -175 333 31 -1 72 -443 92 745 -635 -752 469 584 -294 109 -541 -799 432 795 -843 -891 317
2737 317 157 -169 118 -557 -308 613 18 -498 4 161 55 263 11 -756 51 1075 -455 -1066 821
2756 821 759 -99 -105 -295 -632 466 731 -357 -321 -58 -168 -293 344 -714 -407 1042 14 -961 136
2775 136 728 -233 214 59 -423 27 703 -132 -649 36 337 78 87 -309 -793 362 493 -338 -74 545
2795 545 -118 -359 438 -409 -544 879 33 -1096 -103 391 228 69 -159 -729 -165 492 -64 -686 90
2814I0J26n14N76m42r25J516M31j404Q1O91n13J62N50r87n8J342l50j000N52L13
2834B37j95M01o42q26J000J276j295p85J071J06o86P45m17q53J148L31q85j38
2852d07L96K38l56M39p14K23J055o07r42N76J3l94R32k07j131M53J593j329l35
2871e04R09k12r3q1L8o03J141Q1j071m4O37k0J3lj007L15J459n19j027M89M04
2892C02k96O7l3r12P00O63l65m00M57J1j8o3m92r3Q80M16j456N35M63m46K42M62
2914F24r05o14J568k50q63K62L37k73M14k70n23O16M07q86m3O56o11R4M68j76
2934C2q09J449J44j237R6N24J6k81L55o62N9P40p5p58O07J02l60M34k71p70R11
2955B46N08r17j58N42q9n00P85m82m55O71K60p09R9O39p27N51K48r18N4R95n92
$$ plain form
2814 90 216 -298 278 -164 -1089 427 858 -546 -465 226 -287 -125 425 -562 -620 722 372 -628 -76 237
2834 237 42 443 -199 -1025 -25 1251 -44 -829 242 348 -338 407 -10 -863 285 616 -269 -407
2852 -407 -11 227 -129 310 -404 -181 874 267 -675 -99 -86 -480 452 245 -886 -433 1160 -169 -504
2871 -504 405 193 100 19 57 -546 595 676 -395 -439 198 178 191 188 -819 -504 955 436 -591 -102 302
2892 302 6 73 40 -872 -172 491 126 -274 183 194 176 113 -379 -472 408 824 -632 -97 366 -80 162 624
2914 624 -281 -895 673 423 -440 -178 159 -114 300 30 -493 123 530 -356 -399 257 -354 -260 208 32
2934 32 -777 672 816 -421 -325 199 215 -66 289 -373 -314 426 351 -407 200 302 -58 376 105 -665 246
2955 246 754 -163 -321 221 132 -368 417 -65 -520 151 411 -298 -199 440 -287 264 512 -406 -352 643 51
2976E1l13P22K0j031Q26k78l90L54L79j62p37N40j27J44P33o61j035R21L69k53
2996G2l20O34m70J11N49j089n1J476r09p43Q18K30n08K44J44p96O07O61m87l78
3016b05K83J4m97Q28m91o42J126J07q07P6L73m04K82L53o71k58J076n70l91M84
3036F6Ml23N47k0o37L07M24l74l75O43o72o8P79k00o32Q15K08p40J51K85p24N51
3058A5O39r18R9N96k10n15L26j36m6M17J15r89M71R27j101j21N25o3m26Q93n23
3079b5o31R01L13q72K97K14q00P39N62q92l46R77k30p11N98k83r0M56K71j045
3099e97O15O33p46k61N73l82QM60l87m14P45J7o36L21J71k42M50l2r64K47R80
3120E59m71m13L78m8l27K94M33j054P23N46p55k21N24j80kM40m24o06J147o8q02
$$ plain form
2976 51 -262 460 480 -551 275 -3 -393 -39 340 178 -559 -19 -146 -2 731 70 -965 -44 325 72
2996 72 -248 386 -84 27 576 -513 -564 912 3 -740 78 308 -200 44 188 -608 -1 660 173 -205
3016 -205 78 92 -405 423 -68 -710 416 523 -284 -208 165 -239 43 396 -275 -533 543 -27 -418 66
3036 66 70 -253 294 274 -363 -56 368 -6 -381 262 -410 -478 301 101 -531 284 492 -248 -97 188 -536 15
3058 15 654 -264 -165 431 221 -294 32 -104 -150 267 382 -607 -136 791 -310 -431 94 31 -395 498 -25
3079 -25 -656 245 558 -314 -17 197 -603 136 698 -194 -540 437 207 -504 94 -189 -279 177 448 -597
3099 -597 18 651 -95 -356 217 -165 -157 303 -84 -498 247 264 -372 -51 120 -122 328 296 -668 -421 559
3120 559 88 -325 53 5 -322 -28 405 -649 74 620 -135 -356 168 -12 -14 426 2 -604 543 475 -327
3141c27J82M9m82M16O77p21J4O51n23NkR4n35M66M85r31M56K74k25l19N03n89
3163c82J37M79k26k99L16L68q58M54J27m79L15P67r49J31L97l11m02P91l11n84
3183e19R55J30r96K97M44q13K93L79k04j30L64j96o76Q10R8n07M13L7m19J18N43
3204D21q55J13O58l54j51M30l63l54O82Q2p52Q05L5l34j30J58r6j29P33n40p02
3225f43P66J55p73L84O14p88J0O75r22J85O78m39l59P13j73n47R35q1p65K04P44
3246E73p57M6J47q0n4Q36m61p62P47K44p82L85K62n76J64L65k93L8L32j20n97
3267c43Q27o99M0K83kl24L40L83q20L09M22m97m6P98o07m51M86N7n45L90N1m84
3289d32M79L38n63J8M93o86Q1Q43k09r24R60J8j000N65L74n01J7M36o98J62P43
$$ plain form
3141 -327 -145 -96 -578 -162 515 -206 -192 459 -64 -59 -61 33 -502 -36 449 -482 -26 248 23 -296 207 -382
3163 -382 -245 234 8 -291 25 393 -465 -11 116 -363 -48 719 -230 -99 298 -13 -415 376 65 -519
3183 -519 436 566 -430 -133 311 -502 -209 170 -34 -164 200 4 -672 138 236 -271 142 179 -240 -122 421
3204 421 -434 -321 337 -17 -168 262 -101 -455 227 309 -443 362 397 63 -67 91 -5 -134 599 59 -643
3225 -643 123 278 -495 -111 503 -285 -275 400 -522 -337 341 -98 -457 256 83 -464 471 390 -375 -171 573
3246 573 -184 -138 9 -71 -125 711 250 -512 235 479 -303 82 344 -232 -68 297 4 42 374 254 -343
3267 -343 484 -215 -175 108 106 -218 122 505 -315 -6 416 -81 -127 671 64 -387 99 156 -389 1 52 -432
3289 -432 47 385 -178 -160 333 -353 -272 571 362 -562 398 416 -584 -19 355 -146 -129 307 -391 -229 514
3310E14j55o92L52J64o81L60L23m55K97L23m69j22O95p37N9P40m03o64O10K55
3330C14o56N3M76l21J36K49l87l6L55k28j70K68j96k71O23p3o41L62K74k96k14
3351c79P00n12j54N06m3j65M39n00n02R54Q1o91J94K35o17L62K94m17J79J64j57
3372b9k92K90L81q10L60N43m83l4J96j76L5J66m30j72Q71j57j64j88J35k12J14
3393e6N31q06mQ11m50j35K69k44k29M60j1m62N17R0n98K6Q21n02n69R02m78l38
3415d55O50J52n19J34O5j06J30L19n44p7K69rR7P4k45p8J14L93n32M02Q4o84O2
3438c04M11m8j83N49m35l07L99j75J78l6N6o35N37K21n27K68M50n78p5Q92n64
3459I4n36O02ok67K81K17p68r9N54Nk05L46j86l06M17j32R7q0M07n96J89K82l83
$$ plain form
3310 514 359 -333 19 183 -498 -138 185 -270 27 350 -119 -241 454 -283 -224 516 113 -551 59 314
3330 314 -342 -289 187 -134 2 251 -136 -172 183 -45 -215 53 -143 -414 209 136 -505 -143 131 -165 -379
3351 -379 321 -191 -345 161 118 -47 392 -108 -610 344 425 -266 -72 163 -454 -92 202 -215 -36 128 -29
3372 -29 -321 -31 350 -460 -100 443 -40 -74 122 -54 -19 147 -283 -455 416 259 95 -93 42 -170 -56
3393 -56 475 -331 -335 476 26 -109 160 -84 -313 147 136 -326 191 281 -317 -291 530 28 -541 361 -117 -455
3415 -455 195 347 -172 -38 27 -79 51 370 -174 -251 18 9 106 180 -65 -143 -29 364 -168 234 318 -366 -304
3438 -304 107 59 -124 425 -10 -317 82 -93 85 49 105 -530 7 228 -299 -31 419 -159 -234 658 94
3459 94 -442 160 154 -113 168 385 -383 -482 72 77 -128 218 32 -274 143 11 108 28 435 -161 28 310 -73
3482g3l62O69l12m96R68j29m64K85L43n86J60K4k10J33o3j19K32N92l48o03P70
3503D11P6n81J50L42q93K36M49l30m7N14o3o31L85J1m13N06j15l90L67M10m73
3524g9L84K48o73j03N39m20l58O13J64o12J59O27n75j77M31qk31K23l30k07O57
3545B72m10k57Q19Q8j015O66K76l75m6M06o62O3J43J44j68J80j85j99L26J12j49
3566B9M3J17m31J60P79m67m72M54k20k48L97J86q69K30M85l21J66J61m05qM57
3587B23o90L67L18j08l33K24M01p69M86K69o78Q0P15l89l15O56n9r37M77K64l59
3608a57K29K70k54j84N46l55J5L75m64n19P14o4n32M41K9k18J50K13m86k14O89
3629B24j19m45M90o9m52P07m34k56O31K32q53J49K10j23J06M5l18j09O91j94k46
$$ plain form
3482 -73 -435 234 -78 -574 394 265 -199 86 429 -157 3 27 -183 -50 -113 -232 0 592 244 -359 411
3503 411 487 -94 56 398 -495 -259 190 -140 -187 327 264 -367 18 29 -384 122 7 -383 -16 394 -79
3524 -79 305 553 -120 -223 316 -104 -462 151 315 -297 -138 489 -86 -263 168 160 -71 152 -178 -385 272
3545 272 -138 -395 424 512 -503 163 439 64 18 424 -238 -175 -32 112 -56 124 -61 -260 66 178 29
3566 29 72 189 -242 -82 697 230 -242 212 -8 -256 141 327 -542 -312 173 -148 18 179 -226 -234 223
3587 223 -467 -100 218 110 -223 1 402 -367 119 388 -290 -210 505 116 -199 457 398 -539 -62 202 -157
3608 -157 72 342 88 -96 450 95 110 485 21 -498 216 152 -380 61 90 -128 22 235 -251 -465 224
3629 224 105 -340 150 81 -371 336 -98 -354 277 509 -344 -195 15 -108 -2 43 -275 -384 307 113 -133
3650a33L18L1n91M52J07l15L88J86l66k17O77n06m44N67Q5o83L85K36l58J90K16
3671B25l23K8L61j8n24L45j88k8K86j96k44L14L98p03J56L24o22L85J57l7l18
3692b22J81L00l3k17L58m92j56L73K20l97m6J45j49M80k30m75N52j12k05j52O34
3713C57o97K29M69m97J33l2P5j99O2J45l14N47r6m71M42ol44j27N58j41k23K94
3735A64K42m91K07R4k53J36J21M5o05M75k10k10L71p1m94Q24l0p21O88k67j86
3756a71mM19k30k70N47k99o2L19m07q8L36K35m67j81N04m16K00K29j55j88N37
3777C88n68M6L27J63o05J36L73n24J09K85k65J13r1QQ9n6K12j96R1r4o1J00L90
3800C70l96m7L84l10r1K2K54m82L89j3m06N05k9m49R7L77k14k07M72Mm61L75j51
$$ plain form
3650 -133 185 216 -375 77 184 -131 257 443 77 -140 537 31 -413 154 239 -444 -59 177 -181 9 225
3671 225 -98 -70 291 273 -251 94 -94 -122 164 -32 -276 38 436 -267 -111 213 -409 -24 133 96 -222
3692 -222 -41 259 226 9 367 -125 -281 92 312 -85 -131 14 -135 345 115 -360 192 80 -125 -277 357
3713 357 -340 -111 358 -139 -6 -38 37 -162 -100 45 -269 278 182 -289 153 147 -197 -324 234 93 -130 164
3735 164 406 -85 122 216 -37 99 220 265 -340 135 -75 -285 86 15 -479 345 315 -406 282 15 -171
3756 -171 -175 244 14 -256 291 -8 -70 249 -158 -246 90 325 -142 -323 181 -235 -35 194 39 -149 388
3777 388 -180 -134 193 356 -249 -113 260 -264 -155 130 -135 -22 -113 -105 -16 -72 140 -56 35 -59 -120 -20 370
3800 370 -26 -73 311 1 -90 -68 186 -296 93 80 -326 179 150 -299 -202 175 -39 -246 226 230 -231 144 -7
3823gm43M31J46j08q6J0m00M13M15l97k97M81j91j20K80j96j85K86J99k79j03
3844a51J44O7j39L46k25j37K87m23L11l9L14n89K04L91n46L34L86m78l0K3r0l07
3866c47L27L60o01L16L88n66L1K55m70J86L67l86k00O42l31l47Q66l53j49o4O6
3887a0j24L1J26N0k58L25l40j02N71l39l66L22K40n3q0p4j94L75J23k95j36L15
3909A07L30q57P99l81j04Q5M80n14qL16j56j39L4J71Q9r3j90j76J11J29j92J71
3931A2K37n77J06M87m79%L85j98j75Q6J49k58M29Q5n11L48q3n13K52J98p2j65
3953b57K95k59J1L35O4m41L08M07o26r4L70l5l38N04k24j21K83K33r09N49k9n2
3975b6m5K18rj99J28j14j16M88L5o59L30j49k06M24K75m63k45M79ll89L48N8j39
$$ plain form
3823 -7 -450 -19 127 19 -67 -57 -457 -44 371 -26 -323 158 -33 -153 127 -69 -254 32 231 -48 -151
3844 -151 -7 60 -79 267 42 -95 192 -231 80 41 355 -234 -30 361 -185 149 535 57 27 50 -40 -347
3866 -347 -20 340 -261 55 443 -123 -92 163 -307 -121 246 -140 -340 302 -29 -376 490 137 -12 -76 -10
3887 -10 -134 -103 23 73 -185 140 -200 -302 269 -70 -436 -114 126 73 -7 -81 -275 100 223 -72 -208 107
3909 107 437 -420 379 -2 -106 -21 459 -55 -63 253 97 -42 -8 163 252 159 -31 -207 -96 33 -159 12
3931 12 249 -328 -222 265 -214 -214 171 -27 -202 -116 33 -225 204 289 -222 126 43 -470 -218 -20 -92 -257
3953 -257 38 -221 -210 125 189 -252 56 463 -163 -257 113 78 -260 244 20 -101 182 415 -494 55 26 -26
3975 -26 -71 147 138 -61 67 -47 -163 325 360 -299 31 -118 -324 100 375 -88 -333 146 143 -246 102 160 21
3998B1K5j97l02N73Q2n15M33j34j00rO27m95r0M70l88j14J39j00j4J09J72m15
4020b22K13M05m59k2J54Pk65J88o9j39K92N7k29J43K72k18k94L13j44j03M61o2
4042B79o28K41P4q9R3M22n31L18J93k28n42M76j90k44M68p4m2Q0J57l29K20k08
4064h4L71m04K28l9l36K60oj57N29k95m80L75O5l76J71R9J19k10K90K08q76K43
4086c05N13m12M10rm23lM90l52p3P17o35P2M31k60l51L43k0m36J18K66j04j31
4108a54K73l49L14M08n74j79J36m2P9L66J5m46N0J34k32J61L43j70m90L53R8m04
4130c10L16rK9L0J41k08J50mk93j70M70j59j05L78m27m73O85J73l07J14J38k86
4152a27l4L90k3m45N71j87k55L62j59k39M08N0n84M89l67J80j46L01k73l49L74
$$ plain form
3998 21 46 -151 -453 120 202 -313 120 -14 -114 -123 504 9 -81 389 1 -113 26 -74 -88 21 193 -222
4020 -222 -9 396 -63 -85 69 76 -189 -1 -70 -209 83 140 -89 54 326 108 -186 127 -17 -120 341 279
4042 279 -349 -108 -34 -123 -30 392 -139 179 372 144 -398 78 -112 -356 112 38 -4 76 233 -96 124 -84
4064 -84 287 -117 111 72 -264 -4 -10 -167 362 67 -413 -38 27 -349 -178 -79 40 -170 120 328 -548 -305
4086 -305 208 -204 206 197 -226 -229 261 -91 -164 553 -82 -10 421 161 -190 153 133 -303 -185 81 -23 -154
4108 -154 119 -230 84 492 -82 -261 -125 -167 -88 278 293 -153 -103 31 -201 -40 303 133 -357 -4 94 -310
4130 -310 6 -3 26 56 197 -11 139 135 -158 -328 142 -17 -122 256 -171 -644 41 214 -93 21 159 -127
4152 -127 -161 229 206 -239 332 145 -110 252 93 -146 262 312 -272 217 -150 30 -116 185 -88 -437 -63
4173f3P7l99M85K5l07J81j07J32k59L21k68J85K55k6n12J65N86p95N23o6k11O3
4195a5L31k40j06J12K6l47J24k07K30O4J49k64j64O12p69K74M39m10m6N21k1o03
4217c10J47N82l94k66K98k51n5N07n97J44M65k98L31m5l20l20L23L26k96L49n9
4238B61l98J41P1N2m5r9J82k2J80j70l15K08L57p27J23L54k91J49L17n74j7K92
4260B9J47n74P01o5n34L79j36P0Q4j13j67k2K33k48K68O6j89k06L38L87n44l04
4282d00P09n44J9L91r3k10K95k0j86P8K58n13R0M39p39L34M79n73j46M59Nl67
4304b35L03J38n49L19N42n69o9K71j57M1K44j69n47N49j84j20N54m91k99O11k76
4325i3Q5j81N02m25r8K29J49l90N1L02m30J55J68m30L86r2j99L71K68k54l91Q16
$$ plain form
4173 -63 14 -385 100 125 -182 -1 -108 24 -235 86 -182 3 258 232 -280 -115 471 -324 199 133 -78 -15
4195 -15 316 76 -30 82 108 -239 -115 -322 -92 -28 121 -143 -307 305 -464 -190 249 -161 -207 314 293 -310
4217 -310 -163 419 25 -241 57 -194 -249 258 -339 -195 270 -28 303 258 -62 -382 -59 267 -29 320 261
4238 261 -137 4 75 127 82 -17 165 143 323 153 -162 46 403 -324 -201 153 -138 11 328 -246 -263 29
4260 29 176 -398 303 238 -296 83 -53 17 101 -12 -179 -201 32 -216 52 118 -71 -277 61 448 -96 -400
4282 -400 309 -235 -216 175 82 -128 167 147 -39 39 297 -216 -126 313 -426 -92 387 -186 -332 127 132 -235
4304 -235 68 206 -343 -24 518 -51 -120 151 -6 35 279 110 -437 112 -72 -192 362 -129 -428 183 -93
4325 -93 -8 -189 313 -112 -210 19 168 -222 -171 131 -299 -144 24 -406 -20 -112 -311 60 328 74 -317 499
4347D99p19oP2L70k02j49K23l03L83j00j01JL78k46r5j09m0J55J52k40o5K06L57
4370D21n91O0K72k10M1J35k7m19O84l41k75M05p1m34K21L54m87j27P96o57r1M94
4392A53K7m31K70K09k78j36K41j57K60O9m66O8J21n7k07L20J03k4L12k49k50k19
4414c21N73k46m41Q39n27J13lL42o12L39J9j80K08K89k49m90L24m8j97L25J53
4435B10n09N69l8l88L40J70m12o1K01n2l4L89l73j14J58k05J59n9K31l39O9L74
4457B86l25p5N07k51k67K27m23K44K90m1l42K78R8l82K51L59m64J59j53K67n40
4478b97P32k83l20K97R9m82O4L37k12j1O6mj42L36k29m7mK69l23LN00j68o9j06
4502Fp5r1j00M47k51Q9J59j89J49j27k30K20L27m14j54M49m97r7O09k06m15N31
$$ plain form
4347 499 -220 -226 -154 216 14 -135 88 -215 168 68 -33 -32 346 100 5 -104 -144 11 163 -77 -142 64 421
4370 421 -170 -110 162 -48 -7 128 101 -318 366 25 -250 155 84 -350 -129 225 -262 -389 407 -250 -341 153
4392 153 180 -251 19 228 -50 -186 55 -102 158 227 -239 -171 -50 -107 -314 6 109 85 397 148 -102 -321
4414 -321 252 6 -435 404 -123 -10 -13 329 -283 56 75 -105 103 392 143 -347 -23 -71 -268 57 210
4435 210 -299 270 232 -156 184 354 -58 -119 82 30 -4 385 12 -102 56 -149 10 -49 182 -157 -88 286
4457 286 -39 -114 393 142 -125 102 -321 -77 213 172 -170 108 206 -176 75 434 -30 129 -24 243 -297
4478 -297 435 152 -168 129 228 -254 -190 147 -65 -76 -10 -14 -156 180 -49 -96 -100 169 -154 -151 349 181 112 6
4502 6 -69 -160 -260 187 -64 25 184 -5 144 17 -213 7 334 -80 -234 215 -282 -379 230 24 -391 140
4524A40J49o52L42J85l02N4L41n86J40L20J63n25M28Nm67M92k48kJ81N6n49J59
4546a76r6J22j93N72j44m06K72J22k3L05k82j71o6J73m34N51Q6l97JJ88J25k62
4568a33K05k0l11J98K47l56J67L83m89k6K32m08J80L03j45j40m6O12p80M02l5
4589D0l50J56O08n67j20L22j24j39K10K0l00n4L31j56P3L31n32K10Q9l07j03L93
4611C1n1K82k42J7l95K45J95j71j13N85l80k61M48K3l23L19k8l78J66J1l9l6J6
4634g9j68L50K66N5o98K35K1k90J90P6l2j02N45l25k83L13J39KK7l18K0K85j25
4657A04l83J91L49k28j92J10k90K94R8k66K88K31l4m96K93J95n31j4M96l36K5
4678i6j27J81j61K35p2K1j1K32j83L59k15l78M50l30L9J2J5K28l65L28j23j26
$$ plain form
4524 140 289 -363 -21 164 -138 -84 257 -329 -189 131 294 -231 197 202 -265 227 -21 -23 158 214 -335 -176
4546 -176 -272 -150 -343 229 85 -321 -49 73 50 355 73 -98 -164 9 -425 126 212 -185 -184 4 129 -133
4568 -133 72 52 -259 -61 186 -170 -3 380 -109 -135 97 -311 -131 172 27 -113 -159 453 -327 75 40
4589 40 -310 -154 454 -113 -233 89 -35 -174 36 56 -244 -298 33 -123 -50 281 -251 -41 48 -259 -362 31
4611 31 -20 262 20 37 -358 -113 82 -89 -202 383 3 -258 190 213 -110 209 181 -197 -31 -20 -59 -95 -79
4634 -79 -247 103 369 424 -274 -39 -18 -308 -118 -42 -74 -176 369 44 -239 74 213 215 242 -76 -56 229 104
4657 104 -279 -88 261 33 -159 -49 -339 -45 53 -213 75 306 272 -224 69 264 -267 -281 215 -121 -96
4678 -96 -223 -42 -203 32 -40 -19 -30 202 19 378 163 -215 235 -95 -56 -44 -29 199 -166 162 39 -87
4700h7J05K8j24m9L09l13J74K50l30%K87p3k01K40O2n93L62L88m13n2rJ62k96
4723a73K47Q6m27L78j63n8J15J2l54M44K67n60P1K24j05n0R1j5K2J12n5l16L58
4746A51k22J61J90J92m39O2L45m11j67K49j16J63j52L7J02k36L51l06MJ08j85
4767a19J4J08j06l7L45j85j25J25k0Q3j63J16j54j54N10k38k08K64q2N1R0k47
4789a32q3k2L04k05M78q7l13K43k10J04J61j27O8k58N5N72p66K72J12l13JJ55
4811IK18l02K25r5m26N61J75m53r5M42m16R7N6ol16K48Q5j27L99k19k88k4L57
4834A05k60J6L53m54K3K70m4j69Q2K47m53o0M15l46L78J35n48J16J85K23J5r3
4856A36P8m73L25R4m33K99k46K26K80n8Nm89N38l40J96J54j93k11J62j3l64K56
$$ plain form
4700 -87 18 46 -78 -127 182 -131 43 293 -37 -37 250 177 -24 216 278 -315 47 435 22 -30 -39 123 -173
4723 -173 74 160 -267 111 -52 -110 5 17 -337 107 374 -186 -115 109 4 -46 45 30 52 164 109 -207 151
4746 151 -71 90 280 472 33 95 440 29 -138 111 -5 158 6 43 145 -91 260 -46 -42 66 -119
4767 -119 -105 3 -103 -140 205 20 -105 20 0 83 -80 36 -118 -272 238 0 -208 56 -26 25 115 -132
4789 -132 -215 -237 67 -138 340 253 -60 183 -27 77 238 111 179 -79 -24 548 -218 54 166 -147 -146 9
4811 9 227 -75 150 55 -371 190 365 -88 -183 259 -157 -60 -4 -10 -326 -78 7 -120 279 60 -228 -252 105
4834 105 -155 -139 214 -240 -217 53 9 -160 -78 169 -284 -344 71 -275 103 238 -310 -194 -9 214 229 136
4856 136 214 -259 66 160 -273 26 -220 6 286 228 233 -256 282 -58 138 292 99 -112 50 37 -327 -71
4878g1J55j44KK21L6j48Jo0jK1K23k50J57k20J11k08L55m47M32J3m23k3J22J38
4902hq6K41r8M0j62J81k26m4K25j26K7J10j63l1M93j93m22K05L81k80r9L32m67
4925a70j28M89j58j05j65L51j58R5N5m14L04j6r0J01K60m97N8N43k86m73J98N00
4947B94m59J71J65q0j25k02M00o8RL5k7k36J18j59K64k68l54N36K11m30m0O04
4969C59m59J5O9j61o2J32L10l54J39o7L48J1p3k98J37O3k18j77M76j54k70K12
4991b2K4l65L23O2j27J26J61m6j08N7K18k13k13M43m44K28Q5n19L97Q0l55P7J27
5014dK80j71q1M6k08J54K56m86L95j27k9L6j98J79p6J39r0j44J13j19k1o7K67
5037D4j8M5Q2k62p2J57L40m6k11k33K75J80Q7q51N58R0k55l1k8J49k50K27M06
$$ plain form
4878 -71 84 -60 -58 163 199 51 52 -8 -9 12 235 -15 142 -78 33 -175 180 -267 165 178 -245 -268 -146 -8
4902 -8 -94 147 49 89 -73 108 -118 -162 63 -63 -36 74 -89 -120 373 180 -242 -37 344 64 -35 297 -170
4925 -170 -298 191 33 -72 -237 114 -44 51 106 -308 -4 -20 -110 -9 251 -246 -188 355 69 -404 -206 294
4947 294 -165 6 171 91 -34 -236 164 96 105 140 113 -123 -5 -164 100 -168 -522 14 225 -205 -245 359
4969 359 -100 -85 -16 -177 -239 -107 203 -151 -12 -79 269 280 207 -91 46 109 -109 -286 190 36 -234 -22
4991 -22 2 -363 -40 22 -105 21 182 136 28 85 303 90 -123 320 -124 104 189 -330 67 147 -208 -131 -4
5014 -4 276 105 24 70 -138 16 272 -214 181 54 25 61 -137 42 -34 105 15 -129 -16 -135 -156 -223 44
5037 44 26 71 153 -109 -181 -24 316 270 59 -174 101 281 368 -483 75 165 -90 -121 -149 0 -250 -23 383
5060C83n46k9J31K89k30o0l20L46r3K4J62k17J87J39k09K7O1o7J68k47j08J35
5082g4Rk13M74j98j05j44L33k10K55k20m1J89J35l51J30R9j62J00K35l89Q9P0
5104A1k87K21J87L4j30L29n27p3o2L49k25J84L01l63p3K01L0k06J28j33K27m5
5126G8j46k01L17K96m95o6M27k56m2R8%j81J39L66n80J87J13J50k55J78k99j00
5148b72N47m52J15P6J39j94L1K39k44q8L82o2j54Q4r3J11q9k09J03l4q5q9R0K21
5172G3k17M7L88k86k57L90k06j83J22N44m04Nm3J5N7Q2l25J25j09J17l30M15K6
5195D6k04K19k56J34L46m96R5J08Q1n18K71K59P4m48K05K2k53J72M29m26J35l0
5217c5j39K23n5m4j89L75Kl65M2M28j45R9q4m9K86N8o72N7N1L9j08K15Mj83K65
$$ plain form
5060 383 -163 -192 -61 228 -2 -62 -382 -36 -129 -105 57 -160 27 166 -43 -16 45 -22 146 -101 -209 -74
5082 -74 -65 -278 196 -2 -107 -251 82 -128 127 -93 -134 55 190 -161 -31 68 -94 6 241 -148 -59 11
5104 11 -276 -55 132 166 36 365 -162 -235 -297 52 -173 11 312 -51 -124 77 107 -99 29 -104 123 78
5126 78 -68 -269 48 344 -151 -217 210 -46 -88 10 10 -171 -32 334 -246 -59 54 204 -51 127 -172 -272
5148 -272 275 -177 -62 14 153 -41 -10 229 -15 -103 279 217 63 147 54 165 76 -133 -30 -64 -149 -238 -148 73
5172 73 -144 -97 291 5 -252 138 -68 -251 -129 415 11 16 -27 -12 45 127 -198 -73 -182 -65 -395 20 46
5195 46 -158 61 -195 -61 285 -211 -116 -8 73 -445 -174 85 159 -289 -84 -62 -315 -143 286 -140 -5 -35
5217 -35 -174 49 -6 -50 -239 136 138 -227 -185 243 98 197 113 64 350 408 -264 -207 -156 -117 -225 -10 -6 -189 76
5242G6r9l38N13M7k20k45O7L31m9q0m0j74m4M34k32M2m8k13J95O7J82k54K2j27
5266a87M3j97M11k1l4L2k41l3K23l73L72p3J05j22L75l60J13P6k46j4J21P8j20
5289g2L9k51L86j45K54j65j17o5R1k21L71k03L5l05O51m51m0L84j45l12O04l02
5311B1j1J38j05k30K98J5k81J09J45k49mO7K59p0mk65j9L13ll40K22L84k98J09
5335B01N4l73M1M2r1K32j50L08k34p3J15k18M1L58j11m48N60M4l55m2M4J11j10
5358e4L63m60qL62m13J00K09l0j85L03n4l92L05q1m7L55j29n61M65j56n4L1J09
5381b2K15k66K37l28K16Q9k78K51k72R1l7o4K97L3j71J45j25k04K53j20j58PJ66
$$ plain form
5242 76 -23 -361 152 199 -21 -266 -199 132 83 3 -37 -211 -255 179 -53 -11 -59 -272 -77 -10 172 -82 -60 -187
5266 -187 -144 -341 70 49 15 47 -194 -227 -4 -377 -5 -78 27 -95 280 -80 33 109 -137 -151 -30 48 -72
5289 -72 -33 -284 102 -43 211 46 -71 -136 -45 -266 105 -98 -63 -368 283 -168 -208 176 31 -281 323 21
5311 21 10 148 43 -187 111 126 -155 -46 99 -150 -154 -87 172 102 98 -167 -186 127 124 -216 6 390 92 201
5335 201 255 -118 -77 -35 -126 106 -44 264 30 -43 72 -146 -105 253 142 -306 254 298 -57 -99 -55 56 -54
5358 -54 309 -151 -159 203 -210 -110 99 69 -116 187 133 -259 46 -35 -82 273 144 -417 48 -108 -162 -131 -22
5381 -22 193 -73 164 -164 52 141 -137 114 -158 -67 -104 -168 129 162 -9 136 11 -193 60 -60 -218 -211 -45
$$ [...]
8191a09
##END NTUPLES=NMR FID
##END=
