##TITLE=1H_CA-8412x
 DMSO, 8 sc, 
 23.10.2019
##JCAMPDX= 6.0         $$ Bruker NMR JCAMP-DX V2.0
##DATA TYPE= NMR FID
##DATA CLASS= NTUPLES
##ORIGIN= UXNMR, Bruker Analytische Messtechnik GmbH
##OWNER= root
$$ XWIN-NMR		Version 3.5
$$ Wed Oct 23 16:51:02 2019 Russian Standard Time (UT+4h)  she@DPX200
##.OBSERVE FREQUENCY= 200.1315
##.OBSERVE NUCLEUS= ^1H
##.DELAY= (6, 6)
##.ACQUISITION MODE= SIMULTANEOUS
##.ACQUISITION SCHEME= undefined
##.AVERAGES= 8
##.DIGITISER RES= 18
##SPECTROMETER/DATA SYSTEM= spect
##.PULSE SEQUENCE= zg30
##.SOLVENT NAME= DMSO
##.SHIFT REFERENCE= (INTERNAL, DMSO, 0, 15.7039)
##AUDIT TRAIL= $$ (NUMBER, WHEN, WHO, WHERE, WHAT)
$$ ##TITLE= Audit trail, XWIN-NMR		Version 3.5
$$ ##JCAMPDX= 5.01
$$ ##ORIGIN= Bruker BioSpin GmbH
$$ ##OWNER= she
$$ F:/spectra/data/she/nmr/H-F/1/audita.txt
$$ ##AUDIT TRAIL=  $$ (NUMBER, WHEN, WHO, WHERE, WHAT)
(   1,<2019-10-23 16:50:09.34 +0400>,<she>,<DPX200>,
      <created by zg, POWCHK disabled, PULCHK disabled
       configuration hash MD5:
       00 E9 B6 7A A2 85 ED C7 34 08 36 98 17 FE 4E 26
       data hash MD5: 16K
       1A F3 F6 DF A5 50 0F EA 42 A7 67 D9 36 1B B4 D6>)
$$ ##END=
$$ 
$$ hash MD5
$$ 61 26 31 4F 8B 49 DC 20 52 10 46 28 79 36 12 9B
##$RELAX= 
##$RELAX= 
##$RELAX= 
##$RELAX= 
##$RELAX= 
##$RELAX= 
$$ Bruker specific parameters
$$ --------------------------
##$DU= <F:/spectra>
##$EXPNO= 1
##$NAME= <H-F>
##$PROCNO= 1
##$TYPE= <nmr>
##$USER= <she>
##$AMP= (0..31)
100 100 100 100 100 100 100 100 100 100 100 100 100 100 100 100 100 100 
100 100 100 100 100 100 100 100 100 100 100 100 100 100 
##$AQSEQ= 0
##$AQ_mod= 1
##$AUNM= <au_zg>
##$AUTOPOS= <>
##$BF1= 200.13
##$BF2= 200.13
##$BF3= 200.13
##$BF4= 200.13
##$BF5= 200.13
##$BF6= 200.13
##$BF7= 200.13
##$BF8= 200.13
##$BYTORDA= 1
##$CFDGTYP= 0
##$CFRGTYP= 5
##$CHEMSTR= <none>
##$CNST= (0..31)
1 1 145 1 1 1 1 1 1 1 1 1 1 1 1 1 1 1 1 1 1 1 1 1 1 1 1 1 1 1 1 1 
##$CPDPRG= <>
##$CPDPRG1= <>
##$CPDPRG2= <>
##$CPDPRG3= <>
##$CPDPRG4= <mlev>
##$CPDPRG5= <mlev>
##$CPDPRG6= <mlev>
##$CPDPRG7= <mlev>
##$CPDPRG8= <mlev>
##$CPDPRGB= <>
##$CPDPRGT= <>
##$D= (0..31)
0 1.2 0 0 0 0 0 0 0 0.06 0 0.03 0 0 0 0 0.0002 0 0 0 0 0 0 0 0 0 0 0 0 
0 0 0 
##$DATE= 1571835008
##$DBL= (0..7)
120 120 120 120 120 120 120 120 
##$DBP= (0..7)
150 150 150 150 150 150 150 150 
##$DBP07= 0
##$DBPNAM0= <>
##$DBPNAM1= <>
##$DBPNAM2= <>
##$DBPNAM3= <>
##$DBPNAM4= <>
##$DBPNAM5= <>
##$DBPNAM6= <>
##$DBPNAM7= <>
##$DBPOAL= (0..7)
0.5 0.5 0.5 0.5 0.5 0.5 0.5 0.5 
##$DBPOFFS= (0..7)
0 0 0 0 0 0 0 0 
##$DE= 6
##$DECBNUC= <off>
##$DECIM= 24
##$DECNUC= <off>
##$DECSTAT= 4
##$DIGMOD= 1
##$DIGTYP= 9
##$DL= (0..7)
0 120 120 120 120 120 120 120 
##$DP= (0..7)
150 150 150 150 150 150 150 150 
##$DP07= 0
##$DPNAME0= <>
##$DPNAME1= <>
##$DPNAME2= <>
##$DPNAME3= <>
##$DPNAME4= <>
##$DPNAME5= <>
##$DPNAME6= <>
##$DPNAME7= <>
##$DPOAL= (0..7)
0.5 0.5 0.5 0.5 0.5 0.5 0.5 0.5 
##$DPOFFS= (0..7)
0 0 0 0 0 0 0 0 
##$DQDMODE= 0
##$DR= 18
##$DS= 0
##$DSLIST= <SSSSSSSSSSSSSSS>
$$ [...]
##$SUBNAM2= <"">
##$SUBNAM3= <"">
##$SUBNAM4= <"">
##$SUBNAM5= <"">
##$SUBNAM6= <"">
##$SUBNAM7= <"">
##$SUBNAM8= <"">
##$SUBNAM9= <"">
##$SW= 24.0689530833862
##$SWIBOX= (0..15)
0 0 2 0 0 0 0 0 0 0 0 0 0 0 0 0 
##$SW_h= 4816.95568400771
##$TD= 16384
##$TD0= 1
##$TE= 0
##$TE2= 300
##$TE3= 300
##$TEG= 300
##$TL= (0..7)
0 120 120 120 120 120 120 120 
##$TP= (0..7)
150 150 150 150 150 150 150 150 
##$TP07= 0
##$TPNAME0= <>
##$TPNAME1= <>
##$TPNAME2= <>
##$TPNAME3= <>
##$TPNAME4= <>
##$TPNAME5= <>
##$TPNAME6= <>
##$TPNAME7= <>
##$TPOAL= (0..7)
0.5 0.5 0.5 0.5 0.5 0.5 0.5 0.5 
##$TPOFFS= (0..7)
0 0 0 0 0 0 0 0 
##$TUNHIN= 0
##$TUNHOUT= 0
##$TUNXOUT= 0
##$USERA1= <user>
##$USERA2= <user>
##$USERA3= <user>
##$USERA4= <user>
##$USERA5= <user>
##$V9= 5
##$VALIST= <valist>
##$VCLIST= <CCCCCCCCCCCCCCC>
##$VD= 0
##$VDLIST= <DDDDDDDDDDDDDDD>
##$VPLIST= <PPPPPPPPPPPPPPP>
##$VTLIST= <TTTTTTTTTTTTTTT>
##$WBST= 1024
##$WBSW= 4
##$XGAIN= (0..3)
0 0 0 0 
##$XL= 0
##$YL= 0
##$YMAX_a= 164988
##$YMIN_a= -285010
##$ZGOPTNS= <>
##$ZL1= 120
##$ZL2= 120
##$ZL3= 120
##$ZL4= 120
##$ABSF1= 10
##$ABSF2= 0
##$ABSG= 5
##$ABSL= 3
##$ALPHA= 0
##$AQORDER= 0
##$ASSFAC= 0
##$ASSFACI= 0
##$ASSFACX= 0
##$ASSWID= 0
##$AUNMP= <proc_1d>
##$AZFE= 0.1
##$AZFW= 0.1
##$BCFW= 1
##$BC_mod= 2
##$BYTORDP= 1
##$COROFFS= 0
##$CY= 11.3945322036743
##$DATMOD= 1
##$DC= 2
##$DFILT= <>
##$DTYPP= 0
##$F1P= 20.1720416913024
##$F2P= 0.152960286110954
##$FCOR= 0.5
##$FTSIZE= 0
##$FT_mod= 4
##$GAMMA= 1
##$GB= 0.15
##$INTBC= 1
##$INTSCL= 1
##$ISEN= 128
##$LB= 0.24
##$LEV0= 0
##$LPBIN= 0
##$MAXI= 10000
##$MC2= 0
##$MEAN= 0
##$ME_mod= 0
##$MI= 1.114404
##$NCOEF= 0
##$NC_proc= 0
##$NLEV= 6
##$NOISF1= 3.799351
##$NOISF2= 2.8
##$NSP= 1
##$NTH_PI= 0
##$NZP= 0
##$OFFSET= 15.70392
##$PC= 1
##$PHC0= -9568.16
##$PHC1= 5.600803
##$PH_mod= 1
##$PKNL= yes
##$PPARMOD= 0
##$PSCAL= 0
##$PSIGN= 0
##$REVERSE= no
##$SF= 200.130013532006
##$SI= 16384
##$SIGF1= 3
##$SIGF2= 2
##$SINO= 400
##$SIOLD= 16384
##$SREGLST= <1H.CDCl3>
##$SSB= 0
##$STSI= 0
##$STSR= 0
##$SW_p= 3612.71676300578
##$SYMM= 0
##$S_DEV= 0
##$TDeff= 0
##$TDoff= 0
##$TI= <>
##$TILT= no
##$TM1= 0
##$TM2= 0
##$TOPLEV= 0
##$USERP1= <user>
##$USERP2= <user>
##$USERP3= <user>
##$USERP4= <user>
##$USERP5= <user>
##$WDW= 1
##$XDIM= 8192
##$YMAX_p= 0
##$YMIN_p= 0
$$ End of Bruker specific parameters
$$ ---------------------------------
##NTUPLES= NMR FID
##VAR_NAME=  TIME,          FID/REAL,        FID/IMAG
##SYMBOL=    X,             R,               I
##VAR_TYPE=  INDEPENDENT,   DEPENDENT,       DEPENDENT
##VAR_FORM=  AFFN,          ASDF,            ASDF
##VAR_DIM=   8192,          8192,            8192
##UNITS=     SECONDS,       ARBITRARY UNITS, ARBITRARY UNITS
##FACTOR=    0.0002076,     1,               1
##FIRST=     0,             0,               0
##LAST=      1.7004516,     0,               0
##MIN=       0,             -285010,         0
##MAX=       1.7004516,     164988,          0
$$ Real data points
##PAGE= N=1
##DATA TABLE= (X++(R..R)), XYDATA
0@%%%%%%Lj1J6j6K4l2M0m9N7p2Q8j05J25j49J77k08K41k74L14l62M16m75N39o10
30c23O87p73Q68r72J086j212J348j499J667j848K047k266K507k779L078l409L785
47A992m210M697n260N917o696P643q822J0334j2354J5209j9591K7253m4494J53603
61A25221l8758k95549P2979J78354J22741n9380j02889p3222L2649M8638M3438
72E4222k557m1799n3051J8843L3766J3290R495l754p4168m3027P2992R9688r111
85G4829r6862q4095L0512J16211N3226p4470p7023J753L9324L4267J6289j6885
97A7076k2503j5896k5181J1280Q0372M1095p3308r0392l044P4326Q3349J423j00863
110b2266p9771M4176J00466M2292n6297j01930k4042R8637Q2252m0976p6898k3030
$$ y = [0, 0, 0, 0, 0, 0, 0, 3, -8, 8, -8, 16, -16, 24, -25, 32, -40, 48, -57, 68, -81, 96, -112, 129, -145, 169, -193, 223, -252, 287, -323, 364, -409, 459, -513, 573, -639, 709, -790, 877, -971, 1076, -1190, 1317, -1462, 1616, -1793, 1992, -2218, 2479, -2781, 3136, -3560, 4083, -4739, 5595, -6759, 8450, -11141, 16112, -28382, 125221, 86463, -209086, -136107, 42247, 164988, 105608, 2719, -70503, -37854, 10784, 54222, 51665, 9866, -43185, -24342, 9424, 22714, 32209, 28455, -45713, -88740, -15748, 83940, 74829, -22033, -106128, -75616, 40595, 93821, 19351, -57672, -55919, -16595, 17672, 33961, 17076, -5427, -21323, -46504, -35224, 45148, 86243, 12935, -77457, -80501, -6175, 77174, 78597, -22266, -102037, -57861, 42605, 84897, 28600, -73330, -97372, 1265, 83517, 42541, -34357, -57387]
122e7387J4108L4295M2873N438l7399m1959k0697L1042O8307J7403n5530m6545
134d6051k745K5022N4716L5480n0506p7637j921O1853N5966O381n5683n9529Q791
147d5863M8497L3796J3860k3174o2158k2020N1446M9870K812l0746m8279j7632
159d9591M9605N3662r943m8773m3124l224O0250O2110k6514p9238l5165L1349
171c8596O5566M0017m1709p6518q937M8444L3495N746j8382l6805j1144K6724
183a2099J7929L885N817j6436l1920j27K8624K8371J1861l4093n6879Q963P3584
196B7480L2281m1314n3436j5456M0048N8499K46n6225k9776J5041K4981K6287
208B8656P987l0596k9431k48J1334K6709L4542j6335o2809k5118L8581N6859K1496
$$ y = [-57387, -43279, -8984, 33889, 39327, 1928, -40031, -60728, -29686, 38621, 56024, 494, -46051, -48796, -23774, 30942, 66422, 15916, -61721, -63642, -1789, 54177, 60558, 4875, -54654, -45863, 2634, 36430, 50290, 27116, -35042, -57062, -5616, 44254, 47066, 16320, -31959, -49591, 14, 53676, 43733, -5040, -48164, -51388, 8862, 70972, 44458, -34780, -69945, -38596, 26970, 66987, 25278, -51240, -60177, -11733, 21762, 27508, 9126, -27679, -38823, -12099, 5830, 9715, 15532, -904, -32824, -32951, -4327, 24044, 35905, 1812, -55067, -46104, 27480, 59761, 18447, -34989, -50445, -10397, 48102, 48348, -7877, -37653, -22612, 2369, 28656, 36643, 6047, -23384, -23632, -12298, 14411, 48953, 32618, -30191, -55309, -16728, 40131, 61627]
221F1627m8784p1843P212P7718L3870l8500m6551j2238K9664M0920n042l4784
233f731l118J5084p427m844J7718J3713k880k4203l3275J4445O3323J8479n5961
246D323n0665R641N1536M4266k0042o7821k0627M6888L6793n060k1789k3994o348
259b2899J9344J2967J491P911j1867l7375n136M0518L0343r047l7927l7370J7428
272c1619O2358J6145n1977m0421J2066L9100K8694j5876m4975p762L1106J3144
284I983p022J33l037r068k830l355O685K9557O592m0635k6308K3101L3918J3985
298C1699j8140m2046r214M2838L0421j7015k8535j4560O149K9958J7636j8247
310A0944j9648k244k086J0275K5142J22k6020j4041J982J5665K7648J130l8909
$$ y = [61627, 12843, -59000, -51788, 25930, 59800, 21300, -25251, -37489, -7825, 33095, 28053, -6731, -9849, 5235, -2192, -7036, 10682, 24395, 21515, -2688, -35963, -21518, 41805, 60284, 4323, -46342, -36701, 14835, 59101, 39059, -28762, -49389, -2501, 34292, 29232, 7443, -16551, -22899, -3555, 9412, 10903, 18814, 6947, -30428, -35564, 4954, 35297, 26250, -11677, -49047, -31619, 30739, 46884, -5093, -45514, -33448, 5652, 34346, 18470, -26505, -34267, -3161, 9983, 2961, 3094, 57, -9011, -11841, -15196, -8511, 21046, 27638, -12997, -39305, -16204, 17714, 31699, 13559, -28487, -37701, 5137, 35558, 18543, -9992, -24552, -18403, 11555, 29191, 10944, -8704, -10948, -13034, -2759, 22383, 22505, -3515, -17556, -15574, 91, 27739, 28869, -10040]
323a0040k1670K1084K7913J2023j1733l4650j3131K9128K4403m879j1949j4473
335g974j0661J5635K0182n361q856k807j0444j264J9752R829j0302j0632j1824
348a4727l619K5370K1647j5576k6399j0964O722K8647K2472k3281l7490L90K4881
361a927J8498M226k1202k7596Q377K8945N414r043q869j2525j075J7298Q317k195
375F643n8j4944j8197J5405K8632Q74j8118j8217o783K2785K8788j3479l2760
388a9429k300J8293J2686L804j1627j5832O813J0928p368R79J5651k866j8383
401h651p595P141J9373J8130j9455l7327N230L8252J5719j7209k7852j3211K4434
414c021L3761q752l1022m651J2335O836M591l011p282L987K55j3957M051K3247
$$ y = [-10040, -31710, -10626, 17287, 29310, 17577, -17073, -30204, -1076, 23327, 18448, 6499, -7974, -18635, -3000, 17182, 11821, 2965, 158, -10286, -11550, 8202, 18031, 7729, -2903, -14727, -18346, 7024, 28671, 13095, -13304, -24268, -17546, 11101, 33573, 10292, -27198, -26808, -1927, 16571, 20797, -405, -28001, -19624, 9321, 14735, 5692, -3177, -15702, -16777, 521, 8838, 6643, 6585, -8359, -26556, -11151, 17481, 18355, 237, -17980, -24763, -1978, 26810, 13331, -19429, -21729, -3436, 9250, 13054, 1427, -14405, -7592, 3336, -4032, -3053, 12598, 9732, -8651, -16246, -9105, 10268, 28398, 8943, -28384, -23154, 15098, 30817, 13608, -14244, -27455, -3021, 30740, 21988, -9034, -13685, -1350, 5486, 10077, 7066, -216, 3771, 4026, -9931, -5880, 17367]
428A7367J34k2296j2436O201K1376J7692j8621l5289L574L1329J1600j1288j6404
441g061j0160J0959J7787o467j1618P056L742j1661j610Q897P007L915j1955k2036
455b3205Q571L3147M534k5524j8636K731K1008K2407j0817l0877k620K0442Q348
468I509k497n047r568J297R954k975k549J0192k473j7284K18J3813Q022J799j1883
483E28j9847N593K6506N318j5974j0582l092P699J5920r65j5377j552O158k607
497b274L236Q820n016p755M9j811N351J5262l019k0705m030J1896R691N960o942
512H713j9151j290J8159O770m362m631r376m256J3742Q637p391m981l726n752
526h895P525J3084m605j0699j278j577K605J1210m52j2811k220K806n1Q212N568
$$ y = [17367, 17501, -4795, -17231, -11030, 10346, 28038, 9417, -25872, -22298, 9031, 20631, 9343, -7061, -17221, -6262, 11525, 5058, -6560, 496, 4238, -7423, -9033, -136, 6871, 10786, -1169, -23205, -14634, 18513, 23047, -2477, -21113, -18382, 2626, 25033, 14216, -16661, -19281, 1161, 9509, 7012, 1965, -7603, -6306, 3648, 673, -1876, 8316, 5843, -11441, -11223, 2590, 10612, 12411, 528, -19319, -13726, 12780, 18098, 2124, -8458, -11550, -3851, 12069, 11104, -4273, -5825, 333, -2274, 962, 9782, 4766, -2989, -2940, -4751, 600, 15862, 12843, -7862, -11892, 4, 9695, 15655, 8713, -10438, -11728, 6431, 13201, 8839, 4208, -5168, -9424, 4318, 12955, 5564, 583, -3143, -8895, -1370, 11714, 7109, -3590, -4868, -6445, -3840, 7370, 6918, -5893, -8113, -5307, -5358, 2854, 8422]
541H422j2202r431N849N014N345M866j1155j3264Q087J2687k00k604n300q084
555a1970N243J2208k326n343K264n008m685R447O572l856k537o601o231J2994
569A71J4202r306j5038n33O251R575O237j2269j4036Q475J1949k541l197j451
583a511m298L091M492l840J559P947p672j1631O170J1375J795k290r640r532J2479
598a506J6764o519j3891j756L997P639N684p781q601O851M703o538K261N945l675
613C577l781r76k493P203J1418j0391j6343M694J3372M315k897j1447r256J0690
627b315J4568n638j0742L89N26J875O058l533m693N277j330r161M832J1805k838
642E080p133m394j855Q879J1800q002j4745L552Q948K121J425n104q039N584Q424
$$ y = [8422, -3780, -13211, -7362, -2348, 2997, 7863, -3292, -16556, -8469, 4218, 4018, 1414, -3886, -11970, -6727, 5481, 3155, -2188, 76, -4932, -9617, -170, 6402, 2546, 9, -6592, -12823, 171, 14373, 5067, -9971, -10504, -4253, 5322, 11559, -710, -14746, -6271, 5678, 3137, -60, -1511, -5809, -2718, 1774, -2066, -507, 7440, -232, -11863, -5693, 5682, 7477, 5187, -4453, -13985, -1506, 15258, 8739, -5152, -6908, -2911, 4728, 10412, 2631, -5970, 881, 5584, -954, 1307, 7252, 3577, -204, -1180, -3673, 3530, 14948, 4557, -11786, -7092, 6280, 10595, 7698, -3749, -13005, -2315, 12253, 6615, -4127, -3738, -3212, -1337, 4721, 1188, -3505, 1772, 442, -8719, -3887, 7918, 5080, -2053, -6447, -8302, 577, 12377, 4375, -10370, -6818, 2130, 4251, 5676, 572, -7467, -1883, 6541]
657F541m726k729N025k756n013L694K475Q79L958n748j1598O325J3754j379p621
672A081m832l104O888J0709n418j0778K479L576r81M408P85o916j78K921l334
687b694L086P334n580q692L818M007J421K894m785r069N475R775k822m197J97
702A68l339J105O962j277m467K409j881n528O376O972n403m267m26k367M761P399
718G197n445p780L110K284q03M324r69p475J258M032k392J807M462p038n384O208
734b604M071j098J054n724n793Q288P897o031n167J571r73L202N040m421l683
749d371M332j181l853N655M476n709j853J013k334N114O612p557p427N476M685
764C078m47J269m146n222O043M525n347m90L442l767k030M929k7n73K516n050
$$ y = [6541, 1815, -914, 4111, 1355, -3658, 36, 2511, 3390, 7348, 1600, -9998, -3673, 10081, 8702, 1081, -3751, -6855, 33, 10742, 5324, -5454, -2975, 601, -380, 4028, 4813, -2103, -2281, 640, -2694, 392, 7726, 2146, -6546, -2728, 1279, 2700, 5594, 809, -8260, -2785, 6990, 4168, -29, 168, -3171, -2066, 4896, 3619, -848, 1561, -320, -5848, 528, 7500, 2097, -2170, -2596, -4963, -202, 7197, 1752, -6028, -2918, -634, -1437, 2887, 1918, -5557, -4299, -267, -2659, -852, 3610, -3428, -8812, -2604, 1467, 369, 1423, -4301, -10094, -1806, 6091, 60, -5107, -3536, -4509, -1307, 3733, -688, -4371, -39, -1220, -5073, 582, 5058, -651, -2504, -1491, -3825, 1289, 7901, 344, -7083, -1607, 3078, 2631, 3900, -246, -5468, 575, 5100, -247, -737, 2705, -1062, -3092, 1837, 1810, 1237, 3753, -1297]
780a297n857Q318P253n905m961r37j02O636N457q526o200N982K954j886K366j582
796A713m441L694J679m583K667N885o161m950M612K104O49J613n614n644P671
811H94N624n103k646M23k313L176M935m790l211M836k058m432N254K990l679r04
827a004r66l210O230O394p576o798M231L381J492J634n833m735O456M490n084
842h98k99K953l874J22L368j672k16L717m055m839O348M245m213j550m93k384
858c740N329M931o760l743M670L46j671L497j482l153K863%m277M290M843n711
874B32m067L231J036J706K804o196n232P600M459n046j552J89k116L907K959n209
890a295r15M558k888k917M785J616l919P87q62k478N456L779o947l796M780J018
$$ y = [-1297, -7154, 1164, 8417, 2512, -2449, -3386, -3488, 3148, 8605, 79, -6121, -139, 2815, 929, 3295, 1713, -2728, 966, 2645, -1938, 729, 6614, 453, -4497, 115, 2219, 2868, 4481, -1133, -6777, 894, 6518, 1415, -1231, -808, -3121, 55, 4990, 200, -3011, 1825, -233, -4665, 589, 3579, -100, -1004, -1970, -5180, 1050, 7444, -132, -6930, -2699, 682, 2174, 3808, -2025, -6760, -304, 4186, -898, -1197, 1756, -2118, -1996, 1372, -300, -516, 3201, -854, -5693, 655, 4900, 687, -863, -1356, -3740, 1589, 6520, -240, -3983, 687, 1033, -638, 2859, 1377, -1776, 1087, 1087, -3190, 1100, 5943, 232, -3835, -604, 432, 2138, 4942, -1254, -6486, 1114, 5573, 527, -1025, -836, -2952, 955, 3914, -1295, -2210, 2348, -540, -3457, 1328, 2944, -975, -188, -1050, -3528, 1928, 5707, -1240, -5036, -256, 762]
906G62N6J562m043k551N862P87n090K262K895m172o27L054j957J290L397n119
922a632m327O554L183l554j365j237j815N835L725o643k680M461r28j69L564k453
938E19l603L745J3l596M710K420n953j547L691j2J461J769n822k717O939J829
954C846m508O31Q84l217L346K052m468K32M378l516k964M773O84k132J629k112
970d62l317O040L792o816k737L233L19J708K472n326k914N582P74l943K380J130
986A915m219J223K780k608J045K697m919l054O383J634l696J40j312j828M970
1001A151K078o016m91M526j657j096K662k061j480M007j676m483N230L223n052
1016a135j734K320p67K439K732n981k600N940J137l203J218l70l226L793J957
$$ y = [762, 818, 2380, -1663, -4214, 1648, 2435, -2655, -393, 2502, -1670, -2297, 757, -1200, 90, 3487, -1632, -5959, 595, 3778, 224, -1141, -2378, -4193, 1642, 5367, -1276, -3956, 505, -423, -592, 2972, 519, -3084, 661, 674, -2922, 1788, 4208, -1745, -3292, 399, 387, 1848, 3617, -2205, -4922, 2017, 3846, -662, -31, 853, -2364, 982, 3034, -1434, -1202, 3176, -340, -3304, 1469, 2153, 21, 1650, -462, -3779, 2261, 6053, -763, -3500, -267, 52, 1760, 4232, -1094, -4008, 1574, 2348, -1595, 785, 1915, -2304, -1081, 1699, -909, 136, 2833, -2086, -5140, 1243, 2877, -819, -679, -1991, -3819, 1151, 3229, -2787, -3278, 1248, -409, -1505, 1157, -904, -2384, 1623, -53, -4536, 694, 3917, -1135, -2869, -549, -1316, 1123, 3855, -2126, -4726, 1214, 2351, -852, 366, -4, -3230, 563, 2520]
1031B520m369R83L415l816j828N147n8k331J361k239j897N732J587o163m94L555
1047A105r70P82K191n058m95N720j327m368L128J786l863J338J432k742K374L126
1063D159n300k021N360K59k146J342k204k123M811J795n129L58L283k998k52L628
1079B822k256j649K823j580k738M891R69n132L90K238j363J725J600n269o09N605
1095B467n41l587J917l33k305L083R13l999J718K961l978o96L990n34j978J659
1111G57j810j931M813J180n250J121K467k467R54L014l632r42L774j982k305M315
1127B076J96m323J238J475j886K691J281n406n73N082j93k701J425k000r02M232
1143A712M63n188J852K718k697j0K777k635m70L697l359j679M483O05m284J211
$$ y = [2520, -1849, -866, 2549, -1267, -3095, 2052, 1994, -337, 1024, -1215, -3112, 2620, 4207, -1956, -2450, 1105, 135, 917, 3108, -1950, -2445, 3275, 1948, -2420, 708, 2494, -1369, -31, 1401, -1341, 1033, 4159, -1141, -3162, 2198, 2457, 311, 1653, -551, -2674, 2137, 3932, -1197, -839, 2444, -554, -806, 2822, 566, -1083, 1740, 160, -2578, 2313, 3282, -1850, -1460, 778, -585, 1140, 2740, -2529, -3138, 2467, 1926, -1661, 256, -77, -2382, 701, 1614, -2385, -667, 2294, -1684, -2380, 1610, 1076, -902, 757, -1053, -2984, 1829, 3009, -2241, -1120, 1347, -1120, -166, 2848, -784, -1726, 2048, 66, -2239, 2076, 2272, -2051, -813, 662, -1224, 1467, 2748, -2658, -3231, 1851, 1658, -1043, 382, -1618, -2520, 1712, 2175, -3013, -1161, 1557, -1140, -1150, 1627, -1008, -1478, 2219, -1140, -2819, 1664, 2269, -2015, -804]
1159h04J055k009K544J521m569k7M906k026k341K741j090j981L121k36l617L211
1175C99K006m472n03L773n19o47R05k795j127N339N2n205Q70K325j484J789J086
1192A792m495O99M442k642k481L185M66k945J895Q3k393L413J778n386L82M326
1208B119j410j307J846k081j055M480q76m287K596K234l302N16K182k225Q31K390
1224B651l387j604N006q4l747J422J24j373K985Q70n067N15M210j482j466J798
1240A371j780j077L199l94l522L045J546l851L03L102k023qJ934l026o12M258
1256B465m43l900K321Q81k599K368J164l740Q14L288l160r22L478j007k580K417
1272H45k75k471L261R77m779P89L377j763l45J905k546q64L979j086l150K587
$$ y = [-804, 251, -1758, 786, 2307, -2262, -2289, 2617, 591, -1750, 991, -99, -2080, 1041, 805, -2812, 399, 2405, -2067, -2570, 1203, 684, 37, 942, -1853, -2980, 2359, 2411, -2794, -1924, 401, -1083, 706, 1792, -2703, -2004, 2438, -204, -2685, 500, 966, -1979, -84, -1, -2394, 1019, 2797, -2589, -2207, 2119, 709, -598, 1248, -833, -1888, 2592, 1716, -2571, 25, 2259, -1043, -527, 1655, -570, 261, 2651, -736, -2340, 2666, 2582, -1165, 257, 381, -992, 1993, 2863, -2204, -1689, 2521, 1039, -427, 1371, -409, -1486, 1713, 1319, -2203, 842, 2388, -1463, -1160, 1942, -81, -89, 1845, -1181, -1793, 2465, 2022, -1878, 443, 1324, -1275, 1093, 2257, -1483, -669, 2619, -541, -1463, 2015, 1008, -1572, 845, 570, -1901, 1360, 2337, -2442, -1653, 1724, -39, -384, 1521, -1025, -1889, 2090, 1004, -2146, 441]
1288D41Q00l306J604K210k499J40K001k961l55M183j384l391K647M83k371K849
1304A091M05l752J473L099l416l62K996j471j691K989j301k400L797M28m231J465
1320h81J997j840P81J287l255K77M347j764k699K140L37j883J943M24l100J660
1336b29K417l440l95L512j648j532J905q05j231L449o50m782K305L346k709o2
1352e49J475k417O15L618k673k851L731Q38l096J715K79k027K108J622m469L89
1368a692M632j996k207J806o41j338L435r81l926K624K517l042j74J981j859J84
1384f77K478k318j609L679L6l774J968J265j444R61P69l544J194M205k630k483
1400a924K718j66j453K567j047k760K484J842l465J24K753j753m75K004k125r26
$$ y = [441, 1241, -2065, -461, 1749, -750, -610, 1391, -1570, -1925, 2258, 874, -2517, 130, 613, -1758, 1091, 1496, -2256, -783, 2316, -1100, -1462, 1534, 63, -1628, 1361, 60, -2340, 1457, 1885, -2346, -881, 1116, -724, 57, 1344, -1911, -1634, 2713, 949, -1750, 390, 727, -1156, 787, 1211, -1889, -229, 2188, -1252, -1647, 1865, 217, -1315, 590, -215, -1446, 2003, 1353, -3429, -1124, 2222, -487, -549, 926, -1491, -876, 2742, 69, -2782, 949, 1787, -1309, 406, 685, -1342, 766, 2388, -2081, -1692, 2940, 944, -1263, 543, -98, -1436, 1999, 1018, -2908, -284, 2233, -809, -983, 998, -861, -677, 1801, -517, -2126, 1553, 1589, -2185, -217, 1048, -396, 565, 1334, -2210, -1016, 3189, 559, -1924, 794, 628, -825, 1742, 695, -2065, 419, 2261, -1204, -1080, 1673, -80, -555, 1449, -676, -1602]
1416a602L679p01l712K159J515k048Q47J112k969N73L380k465j463L012r43k124
1432a750K785J08k437J898J131l527R44K905k134j122K225j276r49L317j019l339
1448b240K582J138k758Q44K083k998N62K541k272j165L170p66k989K582M20j961
1464a227J675R22l198J393K471k588m98K778j590j884L055n59k287K472M76l152
1480a741J522K199k512m13K115j937j94K936j862k509L019O45k794J688R30k509
1496a417Q65K626l110J44K621j615j515K437m60j808K549j85l185J911K297k924
1512g69l57K368j247p38K501j652k254L003Q21l225J443J664k700P41J608k390
1528a183L57K927j881k390K452P57k049J534N6k606K117K282l286n10K824j059
$$ y = [-1602, 2077, 1376, -2336, -177, 1338, -710, 137, 1249, -1720, -1147, 2233, -232, -1695, 1317, 374, -1750, 1035, 1143, -1294, 604, 1735, -1792, -848, 2057, -77, -1199, 1026, -250, -1199, 2118, 1099, -2240, 342, 1480, -1278, -434, 1649, -1349, -787, 1754, -518, -1683, 1487, 721, -2268, 314, 734, -1227, 448, 1370, -1828, -435, 2036, -552, -1050, 1728, 138, -1746, 1309, 750, -1537, 935, 1411, -1741, -219, 1980, -532, -945, 1170, -767, -961, 1975, 113, -2396, 623, 1268, -1526, 162, 1092, -1417, -552, 2074, -1036, -892, 1729, 114, -1401, 1036, 576, -1232, 1317, 1132, -2053, -142, 2155, -769, -1126, 1242, -5, -743, 1758, 106, -2148, 855, 1676, -1549, -106, 1558, -1142, -401, 1207, -1183, -826, 2101, 220, -2170, 282, 1039, -1010, 524, 580, -2026, 91, 2373, -913, -1423, 1401, 342]
1544C42j525K694j613j726L090j10l113J921J787k442J99J517k266N60K878k639
1560d46j606K979r0k078J539L59k262J842J549k925j50L056j590j567K087o02
1576I5q96K208p86k667K396J771k885j46K202k232M36K139j996j575K705L89k872
1593a714K229N52k267J244J019k601Q17K733k210j421K514n56j615K279p68k243
1609b008K187J852l232N92J918j487l23J968j619j363K763p51k580K146J317k631
1625a251J323P97k430J097K408k231j671L266q72j898K086Q3j874J483J180k898
1641a402O78K327j989m51K247j446j096K644j092k052J949J025k326Q83J154j933
1657h80O25J775j964r23K822q74k182K041N01j923J497M36k241Q56K570k666o59
$$ y = [342, -1183, 1511, -102, -1828, 1262, 1152, -1961, -40, 1747, -695, -496, 1021, -1245, -685, 2193, -446, -2052, 927, 837, -1241, 298, 657, -1605, 237, 1786, -1139, -1289, 1767, 177, -1390, 697, 95, -801, 1407, 621, -2046, 350, 2121, -764, -910, 1292, -940, -504, 1635, -361, -1936, 769, 1158, -1714, 515, 1067, -1200, 44, 1063, -1538, -721, 2012, -198, -1619, 895, 339, -1276, 1003, 235, -2008, 179, 2031, -1201, -609, 1309, -178, -501, 1467, -152, -1515, 1248, 497, -2083, 63, 1380, -1251, 72, 869, -1561, -464, 1944, -287, -1958, 1308, 436, -1462, 624, 707, -1167, 316, 1496, -1402, -724, 1603, -386, -837, 1410, -36, -1132, 1512, 420, -1632, 317, 1342, -984, -101, 1053, -880, -255, 1520, -444, -1367, 1455, 581, -1601, 440, 941, -982, 515, 951, -1290, -434, 2136, -530, -1189]
1674a189K237r44j074K146r44j572K368M72k847J226J628j810J8J464j831l34
1690i86K727j396k034K306O33k070Q22Q12k076J153K073k872o23K689q89j216
1706i47K021p07j668K226R0k761J729K173k788l91J953j157l91K053j219k251
1722b035L016K44k328J197J018j655L68J400k012j54K719j733j609K140m9j697
1738a170J965K0k235J787J211k443k60K357j336p61J847j069j617K674J76k739
1754a593J340J397j988O90J142j896L76J928j500j437K585k35j904J422N11k372
1770a534J871R39k509l5K436j507o93J672l47j367J993l34k483K042J224k215
1786h47M44J781k129q1K079j424j344K527j70j968J255Q27k230J387J361k528
$$ y = [-1189, 1048, 104, -970, 1176, 232, -1340, 1028, 1500, -1347, -121, 1507, -303, -285, 1179, -652, -986, 1741, 345, -1689, 617, 1250, -820, 2, 814, -1262, -109, 1964, -908, -1531, 1158, 269, -947, 1074, 367, -1301, 925, 1015, -1746, -17, 2156, -632, -1023, 930, -227, -618, 1435, 216, -2035, 981, 1225, -1103, 94, 1112, -543, -175, 1225, -787, -941, 1778, 45, -1564, 576, 527, -1170, 795, 815, -1420, 367, 1578, -865, -1125, 1232, -104, -865, 982, -87, -1704, 970, 1146, -1593, -253, 1144, -844, -154, 988, -908, -532, 1396, -104, -1541, 1044, 809, -1095, 327, 838, -1534, 337, 1276, -1233, -1268, 1168, -339, -1032, 640, 293, -1074, 919, 585, -1898, 144, 1368, -847, -403, 1378, -751, -832, 1247, -177, -1521, 1006, 836, -1132, 123, 950, -1280, 107, 1468, -1060]
1802a060K76K305j937p25K092p06j570K325l12k058J664J109k412K93J796j394
1818c14p00K419j477j160K364m33j845J551N55k099J269P24j884N56K134j835
1834a75j070K142o60j303J669j09j751J979M00k180N76J905j918k16J815q96j226
1851a018J838k29j876J674O90k095P30J376j861L26J943k078m75K133q17j505
1867a244J673J86j813J641P75k488J045J483j975n10K058r30j014J809n71j675
1883a550J889Q50k380R02J296j626K34J512j363q88K567q62j776J788J53j781
1899a035J086P83j835J042J303k254l31K366j199j197J986j85j744J792M9j711
1915a084P71J634k102M4J368j366J42J753j149j523K190M91k362J281Q07j840
$$ y = [-1060, -784, 1521, -416, -1141, 951, 245, -1325, 1000, 688, -1370, 294, 1403, -1009, -716, 1080, -314, -1014, 1405, -72, -1232, 1132, 699, -1146, 405, 960, -1139, 130, 854, -1030, -474, 1660, -175, -1245, 897, 237, -1066, 603, 494, -1257, 722, 1122, -1058, -482, 1423, -495, -711, 1104, 208, -1018, 820, 591, -1285, 389, 1079, -1016, -286, 1090, -771, -445, 1498, -580, -1055, 1078, 261, -1244, 429, 615, -1198, 443, 1218, -1270, -225, 1258, -717, -1227, 831, -99, -1113, 696, 125, -1550, 339, 1189, -1191, -289, 1007, -619, -385, 1127, -236, -1124, 1443, 581, -1195, 593, 746, -1035, 51, 834, -1001, 41, 1344, -910, -1241, 1125, -74, -1271, 715, 530, -1214, 578, 627, -1084, -313, 1321, -781, -737, 631, -735, -593, 1160, 11, -1512, 678, 1169, -1193, 88, 895, -945]
1931i45P26J504j934j10J979r70j113J529j84j508J660L57k275J192J081j656
1947f67k50J789r67o54K063j542j291K368J60k411J300J205j690N73J265k005
1963g54kK195j335j175J809m07j227J683p6k058J234J256j673k02J498o88o97
1980f19K079j246j623K157j47k011J572Q21j790P05J005j451K1K060j454q47J763
1997I95p13j016J051K35j536J219J040k087M1J748j288l18J669n84j676K002j31
2014F51j756J232R26k070R56J058j949K90J569j033j040K100m44j572J493M91
2030I02j861N72J445j350M7J157j223o22K154q75j455K077k98j698J509J03j616
2047a032Q50J651k011l05J725r21p49J798q43j179J663m3j908R48J489j603L0
$$ y = [-945, -219, 1285, -649, -759, 1220, 250, -863, 666, 482, -1026, 634, 991, -1284, -92, 989, -667, -917, 872, -95, -749, 1314, -228, -1519, 849, 1009, -1402, -102, 1103, -587, -14, 1251, -754, -756, 1439, 104, -1071, 738, 331, -896, 787, 711, -1347, -113, 1143, -530, -732, 766, 78, -619, 1460, 214, -1409, 748, 601, -1410, 162, 983, -807, -102, 903, -548, -527, 1533, 79, -768, 995, 282, -734, 317, 552, -984, 235, 1275, -812, -771, 977, -311, -629, 1040, 456, -1220, 782, 651, -1105, 127, 1053, -1017, -61, 997, -952, -662, 907, -126, -1166, 934, 490, -1082, 411, 902, -959, -387, 1058, -292, -245, 912, -311, -933, 1221, 346, -1109, 968, 670, -1028, 481, 584, -1032, -182, 1469, -542, -847, 878, -43, -792, 1006, 163, -1016, 647, 604, -1304, -356, 1133, -470, -440]
2064d40J496j512l53J971r45j403J416O98j733R97L06j683J163J346j937l10J785
2081H62m23j179J473m99j568K108M49k668P33J860j371j0Q90j208Q8K155j190
2098E02j738J674M50j579Q75K71j402J091J340k064m98K070o36q60R97o28q44
2115i79J823L9k062J060Q99p73l0J97o45k00K132j496j464J698P44j463N68L68
2133D16j326J145J190k242n94K443n73j090J191m99r66J871J26k276N94J641j211
2150a60m39J561j734M25J721j247j393J441O06j532R47L73j684R17J538k016p99
2167a475K721n86j216R80m24r21J909r5k244R80J441r99k47O45j173q6K177j143
2185B44k088K427K06j296O26L29j634J420J050k114l87J955k76r39Q94o24j034
$$ y = [-440, 1056, -456, -809, 1162, 217, -1186, 230, 928, -805, 192, 498, -1185, -22, 1324, -613, -923, 862, 439, -740, 733, 234, -1334, 774, 1223, -1445, -712, 1148, -223, -233, 657, -551, -463, 1692, 502, -1236, 438, 888, -691, 184, 455, -947, 144, 1484, -580, -1078, 992, 356, -504, 493, -135, -979, 844, 883, -1179, -119, 780, 7, -23, 174, -471, -671, 1461, -35, -1499, 199, 943, -520, 48, 416, -910, 235, 1425, -817, -1411, 1032, 459, -631, 560, 61, -905, 966, 1092, -1184, -590, 1051, -160, -599, 962, -772, -347, 1374, 127, -1266, 175, 781, -751, 196, 569, -1115, -198, 1340, -676, -1475, 1246, 660, -556, 424, 0, -921, 988, 893, -1351, -371, 1070, 71, -176, 469, -704, -790, 1387, 244, -1844, 583, 789, -507, 119, 448, -1186, 234, 1284, -830, -1217, 738, 462, -477, 417, -207, -1241]
2202a241K190n3k028M96J741j436J36R52r37k89K099j380j609J750L55j108N55
2219A93J51j603J238J305j780n54J310K47r55O18m36p56J977K47k302L20J320
2236E40o95j61R95j383J14K023j184j717J306R35j486J420o80j503J478J427j620
2253a91p61J280P5m61N96r22q09K214L25k202M7J505o75m5O93k032M19K494j262
2272B88j537J214L22o56Q15k54j549J191K149k088j334J768J18n34Q59j247p34
2289a209K123M03j997o9J234o18K63M13j501L74K310j322k028J294J158p99K98
2306C27k82j697J509J725j691j090J309O8j60R75j488j108K546N60k432M12J297
2323G80o65N2N91j817j21K698p76k006P95J019m65M13m68j784J742J649j836j246
$$ y = [-1241, 949, 896, -1132, -636, 1105, -331, -195, 757, -180, -469, 1630, 250, -1359, 391, 746, -362, 193, 344, -1259, -21, 1284, -496, -1050, 260, 507, -448, 170, -266, -1022, 955, 1202, -1100, -780, 540, -155, -316, 679, -704, -590, 1433, 249, -1468, -162, 773, -713, 707, 27, -1476, 2, 1429, -191, -952, 328, 403, -58, 538, -384, -1193, 1021, 1346, -856, -809, 696, 21, -24, 669, -1363, -944, 1550, 288, -1249, -35, 287, -369, 446, 192, -1357, -166, 1983, -105, -1439, 329, 447, -87, 772, -475, -1209, 914, 1317, -680, -749, 485, -133, 130, 543, -958, -584, 1726, 404, -1624, -330, 828, 29, 327, 45, -1652, -143, 1582, -109, -1199, 110, 178, 18, 993, -495, -1603, 943, 1503, -929, -517, 780, 115, 167, 758, -1059, -1180, 1518, 742, -1264, -469, 550, 85, 498, 30, -1754, -12, 1637, -199, -1445]
2341a445J581QJ32P28j637q33K307L65k018J66R94J9K58K09k264M08K549q90k061
2360a424J156P20o39Q75n08j590R37K039j793j204J575N9m37J048j400q31K410
2377I93L81k471N7J344n15N45K31j613J30K400n70k183J221M26l89P54m12j903
2395a574J567J680j763r16P95M76l47R81j246j264K473N47k021l38J303k72M98
2412E79L47k063r7K430k35k072Q96M50p74J381l44k350J733J890j616j417J200
2429f2j0k3J165j452j187K159J006k377o3Q43l18Q21N30k038j17K266j5k089L74
2448e87P61l87R48k46j979J016K026j382q45R59m68L64J279j937j518K572Q46
2465A422j843k37N89k3O43L20k048j18K546j24j912L73K49j55J314k21k373R88
$$ y = [-1445, 136, 144, 276, 1004, -633, -1466, 841, 1206, -812, -646, 348, 367, 625, 834, -1430, -1022, 1527, 637, -1424, -268, 452, -187, 688, 180, -1410, -473, 1566, -227, -1431, 144, 203, -234, 814, -586, -1417, 993, 1374, -1097, -1040, 304, -211, 334, 565, -1048, -918, 1482, 912, -1271, -50, 376, -13, 741, 329, -1574, -7, 1673, -90, -1006, -211, 265, -82, 899, -347, -1611, 862, 1409, -612, -950, 353, 81, 579, 926, -1137, -1234, 1196, 961, -1111, -215, 235, -539, 842, 498, -1852, -119, 1771, 155, -1262, -62, -72, -95, 1070, -382, -1569, 590, 1596, -781, -844, -1, -319, 502, 1032, -1006, -1123, 1143, 1128, -961, -587, 174, -213, 735, 489, -1490, -474, 1552, 170, -675, 284, -184, 180, 1459, -478, -1996, 576, 1422, -421, -658, -69, -92, 551, 871, -1177, -1295, 1251, 1127, -785, -412, -163, -318, 996, 775, -1598, -610]
2483f10J989r53j439O53L03J03J112j312j210K071P29j537n82O05j23Q83N39k465
2501a244j81K799n28j408N8K37J5J132l12k138J196J840j114j366Q66n09Q65P04
2519I12j062j663J937J324j837j93K92m7R07O12k511R2K388m87j382L35K11j63
2537c35J471p2k755Q08K487j168r89O78n99P64R02j328j510J875J102j582k20
2554d71L41l34J058Q15k325p00K901m67j382M37j14j54J727m43k689J307K205
2571A712j526p20N58l13K13J503j372j920K050J273j546l92L82o97J539P16k593
2588a133k21K042M24j767M89O6m50J519R4k978J151K031o30j132M00l63M62J317
2606A321j362j393J534J107j136l62P4q81J750P18k108o17K369n8j093j58l78
$$ y = [-610, 1379, 426, -1013, -360, -57, 46, 1158, -154, -1364, 707, 1436, -101, -683, -78, -201, 682, 1221, -1244, -1425, 1374, 846, -562, -504, -267, -252, 880, 568, -1570, -374, 1466, 352, -1014, -148, -657, 208, 912, -150, -1813, 124, 1448, -389, -582, -290, -337, 570, 1182, -1329, -1237, 1151, 664, -718, -383, -172, -335, 1136, 1064, -1691, -883, 1604, 436, -553, 125, -474, 290, 1192, -136, -1646, 229, 1331, -251, -471, -130, -464, 594, 1409, -916, -1616, 1285, 818, -564, -127, -241, -395, 1332, 889, -1800, -493, 1712, 186, -534, 24, -289, -76, 1427, 55, -1865, 185, 1458, -88, -480, -98, -795, 744, 1460, -1133, -1354, 688, 1112, -655, -166, -100, -550, 969, 1063, -1915, -764, 1267, 637, -495, -95, -458, 4, 1321, -41, -1434, 100, 1207, 71, -291, -217, -1098, 652, 1370, -738, -1355, 1014, 956, -137, -295, -673]
2623f73K79J753j85k998R88J991p04p36J43o00P02J543j247k093J877J147j439
2640b52N7L3q20J719R28k445r54K454Q1j161M06l22l08K097p28k395M70K454q23
2659D91p57J80n65N25J723j300k218J621J712j428j02k86p08J606J048k307q33
2676a598K038L96j001M29p30o26K325k42k438M30K195p70n68J87q08L91J953j232
2694C31k152J611J381j222k91K82q16J356J046k184o40J598L80r15M56p14lJ541
2712A045N4k160J30J919q06k33L92j106N45J817j037j955R55J301n60j71j06j101
2730a077J442J104j924j119K007M26r01M04j030n53K125L33k333k0K080p00m25
2747a61L80p68N16J460p51k037J222R16q22K02k58p72R78J067j463j187J954R1
$$ y = [-673, -394, 1359, 1174, -1824, -836, 1155, 451, -285, -142, -742, -40, 1503, 256, -1837, 40, 1187, -252, -195, -162, -982, 737, 1665, -780, -1734, 720, 801, -360, 46, -276, -584, 1513, 785, -1610, -1140, 1314, 491, -266, -86, -651, -126, 1597, 297, -1921, -300, 1412, -16, -118, -404, -1112, 494, 1542, -765, -1598, 440, 836, -165, 264, -466, -1092, 1233, 991, -1447, -1017, 1178, 408, -160, 27, -781, -390, 1563, 331, -1821, -210, 1171, -51, -342, -60, -876, 480, 1526, -658, -1298, 300, 680, -235, 221, -493, -496, 1045, 1099, -1061, -931, 988, 182, -51, 341, -765, -220, 1597, 560, -1395, -440, 861, 301, 130, 24, -1077, 365, 1469, -455, -1574, 433, 859, -42, 362, -668, -1221, 904, 1237, -1096, -1116, 964, 264, -161, 219, -549, -33, 1427, 676, -1361, -139, 777, -45, 157, -101, -873, 105, 1172, -291, -1478, 476, 567]
2765E67q12O70q12n21J948L00k474L12J563l57k49M31j386P0K132r10j626J152
2783bQ91r94M56k44j095J256J406j995q46J197L54n06M69q33p29K031M95k143
2801h32O2J863q92M0J89j229j6K033p57j816J058R87n60L12n11j177J370J179
2819A303j239j388J499M85o86O66q08j093J836N86j648l95J412o43L16L02j467
2836i62K35K208p48j948Q20Q98l15J97k86j282J195J264j367q81J374j29l02O11
2854E82q68o26J574P46k225m2J417n20J69N34j639J08K125n07j521O38N57l89
2872A13K55p1j527J092J547j455j037J302J2m73O88o50r41J970J92j873J8R92
2890A54K8p1P91j659K34J805l82j752R39M59p19O70j71j303Q28J446j425o92R97
$$ y = [567, -245, 425, -387, -908, 1040, 1340, -1134, -822, 741, 384, 135, 566, -820, -750, 1382, 472, -1154, -2, 889, -105, 351, 107, -988, 268, 1674, -321, -1167, 30, 384, -122, 347, -486, -1215, 816, 1311, -832, -770, 1093, 201, 241, 430, -799, -815, 1218, 461, -1355, -297, 690, 130, 442, -69, -1246, 124, 1303, 64, -1324, 175, 660, -26, 640, -168, -1261, 575, 1161, -487, -882, 530, -113, 203, 505, -962, -727, 1481, 733, -1215, -395, 503, 188, 385, 99, -1183, 12, 1276, -91, -972, 402, 273, -29, 582, -286, -912, 662, 1408, -817, -859, 558, 38, 207, 741, -898, -790, 1335, 828, -693, -55, 502, 113, 368, 297, -1230, -138, 1409, -46, -1083, 219, 231, -242, 446, -204, -1145, 825, 1017, -856, -838, 154, 182, 111, 902, -757, -523, 1282, 900, -852, 87, 546, -173, 497, 326, -977, -149, 1297, -128, -820, 177]
2909A77K30l82Q04j273l91J614L19j765L31R00n03J25L36j157P0J575j0k272J096
2928a76O48p27P61j34j385J029J411j632p50J391l40l46Q24r47q60J643N31j751
2946h10K94Q43m09J02P38j454m06K096q11j039Q04N59q24Q45q2j681R82J454j382
2965a81n29R01j25j75O85p82j067J613O10j532J5Q70p62N11P85j619q3J692l24
2984E03j162R13kn41P30lj458R80R60j230l32Q56k22l18R72q70q83J672J93r96
3004b38o3N75j103R03P22j508qJ667n18j477J078J32n29P92J13j366N79J384j236
3023a01n04P63k99l53J228n70j185J478L79j217p0P60n11J96P98j573m0J420Q3
3042F82j298O20K2l99Q34O4j389M02J217j079JP88o71j24J090o77j012J073P84
$$ y = [177, 407, 25, 829, -444, -835, 779, 1098, -667, -336, 564, 61, 186, 522, -635, -565, 1010, 1000, -1272, -176, 472, -255, 506, 372, -1013, 16, 1427, -205, -955, 436, 96, -250, 574, -373, -1233, 410, 941, -810, -516, 327, -82, 20, 758, -696, -1102, 994, 183, -856, -52, 507, -317, 528, 446, -1235, -253, 1201, -181, -710, 191, 66, -109, 576, -206, -1273, 340, 950, -582, -567, 303, -459, 52, 837, -782, -865, 827, 503, -659, 254, 252, -289, 441, 438, -1020, -40, 920, -310, -642, 214, -8, -326, 646, -224, -1107, 565, 758, -238, -301, 274, -829, 74, 796, -712, -720, 947, 429, -1048, 30, 162, -367, 425, 538, -828, -249, 1135, -101, -605, 158, -141, -494, 734, 164, -1021, 457, 836, -381, -451, 309, -202, -6, 792, -781, -821, 599, 682, -616, 4, 26, -373, 461, 525, -864, -462, 755, -324, -323, 465, -206, -330, 760, 83, -929, 144, 928]
3061I28j277J88N67p45L80Q12j199n59J644m85r74Q92p0q01J174j1j428P36R93
3080G65q64m72Q44n54p2R22p39p31R43O58q27K37L21j124Q26R59j127p56J517
3099G26n52r84J174k65m66P63Q1j262O57J059j297j49R05m87j22J112j061o46
3117h14J062M48j251Q19P0j056O06R02j027m29J277l85q61Q80k26n49N72O71j608
3136h99Q00J051j088J0N13o39jR31o15j069J063M73j099P07L46j010K47J345j527
3155d61r1R16k89q95J049p7o76Q41R1j232O48Q37o67k99Q61p50m63J521p89n87
3175e12R58K74r97M54K98j197M56Q37j074R8R21l67p65O07K97j027J226J89j291
3194f15M75Q50r61J97N71o38l92R80p55m97J265j7j065O43M42j139M31J186j069
$$ y = [928, -349, -161, 406, -339, 41, 853, -346, -905, 739, 254, -720, 172, 102, -699, 475, 464, -964, -228, 765, -99, -571, 273, -281, -353, 569, -170, -901, 42, 700, -127, 110, 431, -693, 133, 1092, -35, -791, 726, 174, -810, 364, 99, -367, 396, 477, -785, -128, 931, -366, -515, 390, -97, -219, 893, -168, -814, 248, 696, -555, 264, 334, -722, -116, 786, -241, -670, 607, 222, -639, 241, 15, -534, 38, 709, -899, -99, 952, -136, -126, 387, -252, -253, 678, 63, -1006, 57, 530, -569, 138, 484, -526, -279, 1066, -461, -552, 364, 75, -820, 229, 152, -524, 317, 408, -824, -176, 661, -6, -305, 556, -194, -657, 864, 75, -512, 446, 720, -277, 177, 475, -722, -266, 571, -503, -405, 516, 149, -616, -9, 288, -739, 487, 676, -615, -140, 710, -251, -54, 517, -121, -513, 467, -288, -785, 480, 463, -602, 41, 483, -656, -225, 961, -108]
3213a08n40J007j07p88O96J00j028R64P04j701P05P82j063L04N56p90l01J210
3231F02k98r81R40J52p77L93P88j268L46R41j210l26J254n30m25J025m80o95Q69
3250C20J70r42J73P53r03J22Q05q08j95J157m49r61R15L01r35L55M77r34L93P77
3270E91p78r7R59o90o70J100k05r85R83J47o49L1R77q05m64J149p19m69J088j52
3290C42j144J111j5r39R63J74o16J62Q17j057m00J351p86n12J006q2j049J076
3308D02K34j252O16L77r44M63N92p87k13J407q23p16Q37P4p64L56N01r31K55R99
3328F83j060j40J033n73m76Q89m52n49O73K22q53P33J14p23L18O96m97q01J110
3347C47n01m07Q04M0p70L39P77r93J09Q68p79j17Q81m82n50Q49j71p48M54N56
$$ y = [-108, -648, 359, 252, -536, 160, 260, -768, 196, 900, -801, -96, 686, -377, -73, 483, -307, -608, 602, 304, -677, 263, 415, -362, 31, 819, -449, -103, 838, -372, -698, 556, 26, -399, 626, 146, -549, 320, 490, -452, -279, 474, -429, -307, 498, -310, -505, 652, 203, -758, 157, 458, -477, -122, 355, -579, -186, 591, -187, -284, 675, -15, -685, 415, 210, -775, 208, 355, -294, -263, 714, -91, -555, 594, -125, -594, 494, 342, -802, 309, 294, -645, 318, 492, -124, 38, 855, -202, -602, 749, -37, -549, 457, 375, -674, 402, 636, -616, 0, 377, -567, -104, 488, -299, -512, 895, 72, -644, 193, 267, -497, -141, 360, -571, -316, 683, -377, -517, 516, -57, -533, 356, -96, -645, 28, 250, -603, 130, 244, -479, -161, 535, 38, -763, 347, -154, -561, 243, 283, -487, -148, 629, -364, -255, 613, -166, -283, 598, 116, -434, 415, 244, -504, -50, 506]
3367E06j050M20Q60p55k61Q45o96j57R03m73o59P72J4r29P02L45p94M24P22r33
3387a94k70Q07m80l51J098l45q13O91N96j620J092L73j010j42J153p01m30R94
3405D48j61p14O49M30j078M15N28j038N04K50l19j12O62m86j87Q11m76n34O87
3424B79P8r96P12M48j026K06P00l68p10J208j37p62P65R4p80L01M01r14K50N51
3444C00m77j94P93p11l63J236m81o56P48L47j319K41J094j042K15R30m78m92O36
3463C27n00m75R33k26n67O03M47r56K74N84o85q6O90m83m34R05k01n86P03Jo57
3484c89N34M47j109K85Q06p83j93N20mm52M67L3m85M37K80q23L49P88j114P5Q04
3505D73n35m82R06k66m89N27K95p97M99L72q08J30N29n20k05Q69m38l97N29R8
$$ y = [506, -544, -124, 736, -19, -280, 565, -131, -288, 615, 142, -517, 255, 269, -660, 42, 387, -407, 17, 739, -194, -464, 343, -137, -488, 610, 265, -548, 143, 739, -881, 211, 584, -426, -568, 585, -116, -546, 448, 287, -427, 222, 652, -426, -11, 517, -521, -17, 233, -86, -198, 464, -22, -209, 602, 126, -408, 279, 357, -639, 73, 521, -505, -299, 401, 33, -677, 531, 394, -368, 397, 491, -289, 12, 413, -501, -251, 300, -177, -371, 422, -289, -652, 584, 103, -553, 195, 542, -777, -536, 558, -484, -269, 661, 183, -309, 327, -173, -648, 285, 59, -508, 95, 542, -414, -140, 444, -241, -327, 363, -120, -554, 351, 150, -436, 267, 268, -389, 145, 592, -517, -232, 574, -209, -402, 118, 114, -338, 129, 162, -323, 114, 394, -429, -80, 708, -406, -331, 473, -62, -544, 362, 96, -393, 134, 429, -368, 131, 503, -305, -175, 354, -166, -371, 498, 60, -337, 192, 290]
3525B90q02O37K74p90L09L18n05j20O09k98n10J217n87n39O63J46n42jP92r82
3545d21J66Q86q06m03R24k46n92M56L22q27O96M18r19J99Q50q96N6N75l30l89
3565b81P85m64m37J072k62o94J12M31n07J08M73l64k44P29m99m36Q04j27n43M20
3585G6M11q02K48M11n82j09P96m14m22N06J7m78O16J71q56K02M48m85J8Q12p78
3606a94k38R72o36l76N52J85o25N49P7p51L12M50n85N6P40l51n51Q36l99m82N63
3627A04K56j007P33K99n18J33M38p17l9R41p57k57P10O5p06M46N3k79qN37q12
3648c85K05L82j79k28K99J56o03N50J38n61K34L74o16K13M05l87m54N58N7k94
3668a36L30J00p79O31L09q31K32N12n33k61O97j46l82O74l82m73O84K37q22J94
$$ y = [290, -512, 125, 399, -391, -82, 236, -269, -389, 220, -78, -588, 629, 42, -497, 166, 312, -230, -231, 561, -421, -255, 631, -175, -578, 346, 100, -492, -36, 286, -541, 155, 573, -346, -147, 703, -193, -137, 438, 108, -281, 504, 40, -397, 675, 413, -281, -169, 262, -245, -137, 336, -28, -272, 457, -42, -478, 326, 199, -344, 76, 487, -315, -67, 344, -238, -347, 449, 35, -387, 119, 136, -342, 274, 445, -411, -209, 239, -246, -228, 584, -194, -432, 540, -96, -472, 80, 265, -360, 189, 266, -485, -173, 277, -308, -252, 488, 137, -414, 422, 23, -459, 104, 360, -647, 86, 385, -133, 0, 438, -279, -318, 623, -134, -391, 319, 384, -322, 124, 177, -102, -110, 427, -385, -180, 202, 23, -205, 94, 250, -353, 197, 335, -226, 8, 382, -234, -21, 384, -3, -457, 101, 158, -136, 194, 294, -485, 146, 455, -376, -144, 368, -165, -426, 271, 125, -257, 417, 35, -438, 246, 483, -339, -145]
3688a45Q53j035K22M92l45k28L84j08o57Q03J25n15M55j25m63K84M37p99kP12
3708C45k39m81O70l0o12L75N26o61O0L42o88K45N80o64m07J200n22m56P54m6q81
3729e90R76K20j101Q9P91m26l18R07o49j91N17O8o70N67J88r86N94K57o63N50
3749A30K18p26J16L92k73l72O73J98q51P36J24o99K61N54p46J5N77k66o16O82
3769A27J05n91O78J95q46J75P72q92K64L21l65j79O48j18n73P97l35r01P02L37
3789C21n99K59N19l84m43N13l03k38N45j4q09O73N90r23N59K44p87J52L11m83
3809b97l5P73n59k66N31J24m86J53N89r76M51K74m37k3N68k84j04j71J59m95P00
3830A89o1p58N13N39p35K64L92n80j81O40l54p1M91M2r55O28K56n70L64N06j049
$$ y = [-145, 708, -327, -105, 387, 42, -186, 198, 90, -567, 236, 361, -154, 301, 176, -287, -3, 434, -365, -367, 345, 106, -375, 295, 265, -347, 28, 554, -107, -47, 295, -393, -148, 432, -232, -639, 561, 39, -417, 337, 291, -590, 386, 606, -495, -406, 385, -41, -359, 548, -101, -292, 225, 293, -377, 190, 378, -608, -14, 243, -420, 130, 348, -378, -262, 130, -143, -515, 158, 356, -495, 241, 365, -334, -73, 481, -265, -250, 327, 61, -555, 127, 232, -359, 319, 514, -332, -157, 615, -277, -13, 308, -57, -236, 412, 294, -279, 518, 183, -718, -16, 321, -278, -19, 500, 116, -327, 186, -117, -355, 190, 176, -633, 40, 630, -293, 266, 510, -277, -125, 186, -297, -332, 441, -118, -384, 147, 271, -215, -62, 527, -449, 2, 276, -161, -184, 384, 100, -4, -175, -16, -511, 189, 128, -630, -117, 422, -313, -49, 343, -237, -418, 222, -132, -203, 288, 330, -625, 3, 259, -311, 53, 559, -490]
3851d90K39L70l38j69O48j06o48R01r4p78N45M79p23m00J068o88m43R44j22p20
3871e25O29K23p58P59R4j035M67P35q48J02O94n69l65N52j87k55K81K06o35L53
3891h2L62m49L4L56m35k40P88k60o06N49K57p52O14Pj07l5K96m95K5L40n01L29
3913eK64k25o10Q44J65r07M61L56q49L91N21n50k35N96r3m70M51L39q17N42K56
3934D25r33L95Q18q33k30O08k92n58M42J84o46Q04J65r17N49N31o99j39P83o31
3954a74k21N91k96o6M61R0p90O43M4r53P20J32j49j61L89k61j30P55n36o06O53
3975A35J77q77O42J18m35J89N40n79j10N70l48j79K62J83n34L51M10o89J45M07
3995C78m67O4J84m16k90J067m59n56L76N01p59N92K46p35R6M35k96m56P94j48
$$ y = [-490, -251, 119, -219, -388, 260, 154, -494, 407, 313, -465, 80, 559, -164, -564, 504, -184, -627, 317, 195, -525, 104, 327, -431, 328, 422, -613, -146, 589, -259, -157, 537, -32, -397, 155, -32, -287, -6, 200, -435, -82, 280, -169, -135, 221, -214, -454, 334, 74, -532, 17, 274, -478, 136, 143, 36, 1, 297, -198, -173, 167, -334, -5, 259, 34, -576, 268, 433, -474, -13, 343, -506, -115, 406, -144, -379, 217, 124, -346, 105, 444, -373, 169, 425, -508, -113, 705, -128, -358, 250, -42, -600, -158, 26, -620, 184, 349, -568, -19, 512, -187, -326, 457, -174, -395, 196, -100, -166, 295, 385, -405, 238, 282, -671, 49, 181, 32, -129, 260, -1, -131, 624, 88, -518, 135, 312, -565, 77, 195, -240, -51, 489, -90, -200, 370, 22, -157, 105, 288, -246, 105, 515, -174, -29, 378, -89, -25, 159, -257, -547, 520, 61, -495, -119, 382, -377, 215, 461, -274, -178, 257, -39, -495, 299, 151]
4015A51o81P45l91j68N43K33p56J87K37l23j44L24j11n15Q80j50l40L26L79q77
4035d51M32K60l97j14P90p28J50O12o75k98P88k64l52K90J68n52N58K00m62N1
4055FL61k93p20J209m52q08N76M91q82L55O90q17K09K25k19k14P75k35p74P47
4075B30J8o30L97K35o11K5O34o25M37J81o39o1Q89k54o40N35J56p91J024k50n69
4096c09J57N45o16J96K24k07j69K10p8n30R27j58k49O5K52m80L04K53m43k92O38
4117B40k96k09N07kn75N00l55P3J00K31k36l21N52k34k92O96l54l86K60J21m86
4138d66N08N44q46J75J83k90j74Q60n10l06M07K23n52J34N41p31L97L66n67m2
4158a46M41l35k14L41J45p10P86j05o78O13L10q09K45O34o16j66N04k55j73K31
$$ y = [151, -530, 215, -176, -344, 199, 432, -324, -137, 100, -223, -367, -43, -154, -669, 211, 61, -279, 47, 426, -451, -19, 241, -156, -270, 520, -208, -58, 554, -121, -419, 369, 105, -247, 43, 211, -341, 217, 417, -45, 6, 367, 74, -646, 563, 111, -697, -121, 370, -512, -157, 533, -284, -75, 150, -69, -283, 492, 257, -517, 230, 248, -382, 15, 250, -361, -336, 298, -327, 110, 291, -348, -409, 480, 226, -414, 121, 277, -514, 510, 260, -309, -152, 393, -223, -27, 197, -10, -179, 31, -47, -577, 350, 192, -57, 8, 260, -220, 84, 337, -106, -398, 240, -56, -265, 242, 240, -335, 165, -190, -117, -17, 214, -22, -343, 209, -25, -317, 379, 25, -361, -101, 20, -466, 42, 586, -260, -85, 98, -192, -366, 494, -16, -322, 85, 308, -244, -110, 431, -300, 97, 463, -104, -146, 295, -40, -254, 87, 232, -478, 308, 203, -475, 138, 448, -361, -116, 518, -98, -264, 240, -15, -188, 43]
4178D3L53p46M60J49o49K83N90p63M3P45o31k42N97k0l94K48K66n55K27K89l96
4199a03j37O56l53n01Q07l73l72N57o1m84N50J01l18l21O60n67L2M19o7l23P89
4220E91k23n57L74K11o85K43N45r14J90O41l98m29P25k69o0J88P4m12K36K15n88
4241c02J62M51m46K8M39k25k22J86L84r37P26k1m69L77K94q08K83M03k33l57M30
4262A43J99q63P55j91l12M5M60m29J9N70n25l65P08k39k82L81L42q16N31K78o32
4283b23L46K63n84j04O65o34j87O24n1j92M82J55p33NN18p17K83K35k54p7L92
4304B12l72J72L7J04l95J09N08o30J81L06m86j12N81o4m87Q45o05k05N25k22m41
4325d39L47O60q51Q6M77l78j38O16n61l9J19O0m46P61q0m02K2O38m67j61M40r0
$$ y = [43, 396, -350, 110, 259, -390, -107, 483, -280, -237, 508, -123, -365, 232, 212, -182, 66, 332, -223, 4, 293, -103, -240, 416, 63, -438, 369, -4, -376, 181, 120, -364, 186, 287, -31, -352, 308, -259, -227, 192, 125, -198, 591, 368, -189, 185, 396, -289, -46, 499, -415, -225, 416, 18, -411, 314, 45, -15, 173, 247, -165, 71, 286, -302, -140, 311, -135, -107, 332, 107, -115, 71, 455, -482, 244, 223, -246, 131, 425, -383, -100, 303, 70, -287, 143, 342, -521, 234, 43, -269, -224, 236, -193, -174, 396, -129, -494, 214, -25, -307, 74, 416, -400, 131, 409, -223, 123, 386, -198, -302, 363, -271, -458, 166, 115, -77, 405, 560, -173, -168, 350, -367, -84, 151, -103, -180, 212, -160, 12, 49, 153, -242, -133, 375, -255, -74, 232, -254, -366, 215, 151, -336, 509, -96, -301, 224, 2, -439, -92, 568, -283, -197, 280, -98, -236, 380, -181, -220, -101, -41, -487, 274, 194, -208, -186, 452, -15, -176, 264, 174]
4347A74l86L89R1m27L98jo28L40J17j08M0j6j4q0J33J10n12L55K86m45Q4L70m80
4370b10J25Q71j378N09N31n31j79N29k02l85M65q1n39J44O38l69o6L20l92o7M40
4391A73j19n58O98l26R3K70l89l36O20J14k54k13M71m52j60M43J84o39M53K34
4411C07n61N22j33m05K92L20l21l89N79m92j42O64r5k91J96J75o05M40J95p84
4431e28L64O19l82m11R67q46j11N09J36m60J82K19l58K25j91j25Q1L06k75k34
4451c13N60k07l61L80J96m21J28J14l57j7O84n10k01M23k32L00j47K34n40J51
4471a36N52r52N29M16n01j52K10j26j05J63K19m66J70K19Q3N4k3m65J64L07l56
4492a96J02M8Kl73N63R9n42M46K23q97O74Mm87L14J38j54j16L89K8o47O69L8n29
$$ y = [174, -212, 177, 268, -159, 239, 238, -390, -50, 67, -41, -1, -17, -31, -111, 22, 132, -380, -25, 261, -184, -100, 270, -210, -85, 786, -592, -83, 448, -83, -262, 267, 65, -320, 145, 64, -475, -331, 307, -62, -128, 192, -200, -267, 173, 54, -504, 194, -132, -39, 231, -158, -494, 126, 240, -14, -227, 244, -208, -368, 75, 259, -380, 73, 307, -254, 268, 135, -270, 22, 342, 21, -368, 211, -281, -423, 241, 146, -145, 51, 226, -379, 61, 256, -528, -164, 455, 73, -338, 629, -217, -328, 181, 317, -143, 39, 258, -100, 125, -66, -191, -110, 196, -79, -313, 247, 40, -321, 59, 255, -166, -38, 76, -281, -298, 386, -124, -325, 98, -134, 166, 19, 253, -287, -136, 416, -536, -7, 409, -92, -244, -34, -160, -265, -102, 117, -349, -179, 40, 123, 177, 154, -311, -147, 160, -196, -94, -46, -44, -417, 146, 245, -297, 149, 372, -525, 149, 153, -334, -20, 118, -36, -152, 237, 265, -382, 287, 325, -204]
4515b04K93K64m75M5N10m36k36K58k02K03K11k10m83L47K50n36M5P11k79k00M53
4536C29k93p3K12j37k27K73L7m97M01K61n16J70M47k31n61Q22n90k52P14q6m71
4557b68M00J41l59J62K7m14K1M41q5j65J29k03j60L12K05n58M54j1k81M59J01
4578C48n10n6L54o4k03J08J37m18K83L46o04K16O34p23j4M40Oo48N79j34q6L03
4600B94k64q7J66J48n88J91M53n43o4L19K37n44N22k94p3J16J48l59L25L76p15
4621b36l4P17l53l33Q19m08k03J29n10K63N4M84j082N85L13m98J12M26k17n68
4641e40P93l17j89M45j23j8j65M27k36k20J88j19K31R4l29j96P49l07m14J1N47
4662C12l53n0L71m92k36N64k50k58N49J01o47M68J88l79J82K8m17J96K61n2q5
$$ y = [-204, 89, 353, -122, -77, 433, -3, -239, 19, -183, 20, 231, 21, -462, -115, 135, -401, -356, 355, 76, -124, 329, 36, -37, 175, 38, -189, 84, 121, -376, 25, 286, -230, -60, 387, 156, -405, 417, -173, -425, 289, 203, -268, 132, 273, -86, 76, 103, -311, -290, 151, 66, -99, 30, -173, -333, -21, 184, -374, 80, 69, -212, 247, 348, -162, -218, 136, 72, -131, -23, 114, -304, -21, 325, -279, -63, 571, -152, -166, 274, 280, -368, 211, 77, -9, 294, 30, -57, 109, 257, -331, -140, 313, -230, -294, 25, 262, -282, 240, -54, -127, -11, 137, -222, 103, 479, -236, -270, 447, 94, -239, 580, 172, -31, 98, -412, -149, -95, 389, -693, -108, 205, -293, -181, 245, 28, -540, 253, -64, -253, 192, 69, 51, -114, 313, 77, -143, 45, -74, 157, 251, -78, -274, 475, 168, -246, -235, 312, -41, -91, 280, -212, -448, 116, -134, -392, 157, 258, -389, 79, 267, -112, 70, 98, -319, -123, 138, 86, 1]
4683AK30l30J32J68k03o9M7J18k66J5L90m69J05L54k58k77M64k44p2K34J81l51
4705a00k7J38j73j06Q34m23l30L07k99m2J54L15m45N52o0o56M28pO0j68O3J75
4727A90n15N54m39rJ30M29j55l61J66J08l18M07l03p8P18l96j94J63L7k73M10
4748B71j03l78J8N58l42r7K75k66j41L80o1o67O13K39o92K9N86l53l2M64k78j28
4770a05N15n87m0M05l30j53J18K80l46O7L27j28m16N07j67o4M24j2l67J23L25
4791C76q73L22M93k74k83L89l46k84P65m9m86L86P8j65LL15p05P13q0k69k92N98
4813C32o74R9M43r7m85M98J78k56jL4nj47O31k48l96L78k22l34L29M4l19M92M17
4836F91q41K5J2J96k23P32n43l42P37k57l93L05J22k55N4J17k60l6J84o2l17L28
$$ y = [1, 231, -99, 33, 201, -2, -71, -24, 94, -172, -157, 233, -236, -131, 223, -35, -312, 152, -92, -164, 70, 251, -100, -127, 11, -162, -268, 566, 143, -187, 120, -179, -221, -67, 248, -197, 355, 295, -361, 67, 60, 120, -48, 15, 190, -325, 229, -210, -219, -89, 340, 185, -176, -10, 98, -220, 187, -116, -194, 524, 128, -66, 97, 134, -139, 271, 168, -210, -192, 366, 24, -73, 202, -64, -205, 175, 114, -553, 60, 299, -393, -364, 222, -131, -163, 301, 23, -105, 410, -177, -217, 188, -142, -295, -177, 103, -243, -176, 151, 23, -393, 114, -53, -117, 307, 295, -72, 51, 376, -497, -175, 318, 44, -239, 150, -196, -480, 285, 236, -250, 136, 214, 49, 52, 367, -338, 375, 295, 26, -266, 332, -342, -243, 200, 103, -382, 116, 294, 38, 37, 71, 66, -81, 550, 302, -94, 284, 62, -272, 57, 101, -218, 274, 691, -150, -125, -113, 83, -140, 592, 49, -293, 444, 187, -206, 99, 221, -34, 20, 137, -123, -159, 25, -37, -354, -26]
4858b6K27l32p0J82P8K86k92l81L75N69l83l78K91j26oJ67j15k44M28K4l76o5
4880a67M82k45k10K78l06p9L29j16K7j06j34K60J8M49n76j54L56k11L26k68j51
4901a98q0L92L8o66O15L3O1l76J57j21L6M58n97K51L33k05k89L60l15l03J81O34
4923C99o47q7N67n32j11N40k57N0P3M7k91K79L91p22M45j10j70L9L19j53k23L83
4945B29j18l83K33l9k8K04R4k83OJ35o0k52L73j64j91N00q9o64K92M70n02K70
4967C3J02l12K39O5l10oK93M0n58N32j25k53M20P1j69k73L91k77m7L29k97J67
4989E5J2j10m46N78J55l74K97Ol13o4M99n38q8M24M0k60J40j71K41R1K8l84RL84
5013B11l19O2J19p7L5K67j47n13O16k82j52M36P0k60l88N11Q6n76L30j17K04R
$$ y = [-26, 201, -131, -201, -19, 59, 345, 53, -328, 47, 616, 233, -145, 146, 20, 14, 181, 66, -178, 250, 274, -102, -167, 315, 70, -140, 138, -168, -247, 82, -34, -7, -113, -247, 13, 31, 480, -96, -250, 106, -105, 221, -47, -198, -278, 114, 152, -514, 101, 134, 195, -181, -24, -145, -109, 349, -248, 3, 336, 131, -158, 202, -113, -416, -235, 399, -248, -335, 232, -300, -411, 129, -128, -78, -5, 42, -249, 30, 421, -301, 144, 34, -136, -97, 222, 69, -154, 229, 111, -272, -39, -78, -106, 98, 192, -91, -85, 50, -10, -262, 111, -53, -244, 256, 167, -497, -205, 265, -237, 33, 135, -177, 62, 127, -183, -189, 104, 144, -414, 118, -7, -260, 160, 231, 62, -211, 180, -97, -144, 185, -112, 55, 67, -43, -489, 89, 244, -130, 167, 173, -140, -204, 295, -243, -331, 93, 133, -127, 13, -158, 83, 174, 202, -182, -173, 211, -108, -46, 73, -4, 31, 298, 151, -362, 254, -28, -180, 256, 326, 66, -322, 189, 275, -301, 29, -88, 116, 125]
5035A25nk33n4M11m16J81K26m41R2J56m12J21M94k92j31J19Q1k24K24M4k8r1L41
5058B88k85l43L06R8k93N87k0l99n0L08m33R3M71l63o2K55l30j84N09k87J39j84
5080a79J29lJ77O5o40N20l5j13j8K51j24P6R1p2l87M48p6j88k19O90l25j8Q6l68
5104b32k29P15k71j13J23R2l10K75K18n05L07L66k73n45L54O7j3l0J20m97O51
5125B70j25k61k5O83m89J2K71n04Q1L50r5l37L44j75j0J23j91j25k02P89l97j06
5147a19K73j90J18l1O3j95K10L21n43K9L90k34j49J39%l48Q20m83m16L73J45n4
5169A19J76p5n89K79K68k92l12O37m57L8N17j03l82L46M5l26J69m2l04M25m2j
5191I4m05M03p4j87K31J37k64J70l2o95M99L41k35k42M39j00k77L77m70J14J46
$$ y = [125, 120, -113, -167, 244, -172, 9, 235, -206, -114, 42, -370, -249, 245, -47, -178, -59, 22, -202, 22, 66, 38, -53, 288, 3, -340, -34, 64, -229, 358, 338, -61, -111, 197, -236, -143, 328, -35, -97, 158, -172, -356, 153, -134, 5, -179, -50, -53, 124, 189, -451, 69, 34, -79, -97, 154, 30, 106, 197, 125, -262, 186, 110, -78, -297, 393, 68, 50, 136, -232, -461, 254, -17, -130, -7, 85, -225, 50, 268, -237, 70, 436, 163, -382, -28, 39, 26, -4, 116, -381, 270, 145, -116, -141, 542, 53, 65, 336, -168, -87, 263, 168, -169, 175, 0, -10, 113, -78, -203, -405, 384, -13, -119, 154, -36, 82, 51, 114, -81, 129, 450, -93, -64, 326, 92, -57, 82, 82, -266, 554, 71, -345, 28, 173, 119, 295, 220, -369, -90, 178, -114, -426, 211, -246, -208, 309, 206, -176, 170, 215, -111, 58, 16, -288, 137, 95, 94, -311, 92, 18, -169, 62, 199, -65, 105, 73, -622, -123, 218, -17, -259, 180, 80, -197, 180, -290, -176, -30]
5212c0L69n15J58J4n6J84j03J70k47K42m84J42J97Q1k37K20j75q6J71K61k61j21
5234a06L98j69L6J7l70M4K14N9L9q1j06j76J93P7Qm15K71j64J87OLnJ39qk93L19
5260A17J94j86k2m3M3j93J33J4m43M05L52l89P7N0j22n6J92o0k86K67N0l10O8
5283a48L01k75K76M13q76K68K21j16o7K37l77j74M21j33j27K59J53k60m71P81
5303C06l02J95J55n28J09K8J51l55J58L9l9RL04l95Q7K9M4m1K27l11n7M20k25
5326Hj00J10K57o05M83K1l18J52j5j16m36O51l1k66J44L01k98L47l1l80%L86k67
5349cr7N2J59j10J26j63k95M66J67k48J16K6l32K96K8j97j7J48m6k46J54J88m97
5372c25L37N9k29M22M4k27j15p2K66l29J78O0l99J94L93m84L43k22J04K12m9k84
$$ y = [-30, 339, -176, -18, -4, -60, 124, 21, 191, -56, 186, -298, -156, 41, 122, -115, 105, -70, -156, 15, 276, 15, -106, 292, 123, 159, 176, -194, -150, 64, 123, 162, 81, -25, -201, -8, 69, 77, -338, -67, -231, -44, -38, -35, -40, 99, 91, -202, 117, 311, 125, 103, 60, 103, -90, 43, 57, -386, 19, 371, -18, 59, 109, -13, -69, 123, 63, -223, 44, 94, -216, -148, 153, -122, 154, 567, -309, -41, 180, 64, -3, 234, -143, -317, 104, -29, -156, 103, 256, -4, -475, 306, 4, 199, 354, -174, -65, -37, 114, -241, -83, -44, -83, -74, 230, -165, -78, -49, -5, -46, 181, -130, -187, 233, 8, -92, 18, 275, -330, 153, 174, -144, 8, -7, -123, -559, 92, 61, -205, -61, 240, -58, 289, 258, -122, -122, 264, -3, -100, -48, 111, 1, 127, -36, -331, 135, 302, 54, 170, 196, -136, 160, 188, -9, -26, 122, 76, -170, -16, 172, -325, 12, 71, -158, 264, 308, 81, -34, -106, 160, -169, 9, 69, -330, -136, 257, -227, 116, -106, -2, 210, 161, -123]
5394a23j51O65m06kj69J02m46O48j45m07J92M80j67j37K54k51k78N92l08m06M24
5415c9J18P4j42J12l35J46K83k46j0J11p9q3K01P1m99M01k62j99j5Q89o62O2L78
5438B75m93K9M19l42j94M59J22l48l3L11j20k96L64l59l42P26j97k68J67L39j82
5459C7k43L30k86K21R7k03J52J18j80p4L81k05k45K73o38L33M33l3j65q7M7j90
5481a27k17O78j87l67M9Q2J3L21r5j71M4K53l27j19K69k00q9K80K8k25K02K61
5503C56n29K11J67l5m14M24k74k39L51J34k14J29j99J24j20J62j04k57L90k07
5523a44M09k27J14l26J38j15j30M56k42L8K44K5j48k6o8j11j45K31J05k26J07
5544d1M6n9M4K00n21K61M3M3J45J41n52K66L95m32M1p8j01K56j50j74M3O5K09
$$ y = [-123, -274, 391, -15, -17, -186, -84, -530, 118, -27, -434, -242, 238, 71, -66, 188, -63, -341, 251, -57, -463, -39, 79, 153, 11, 123, -212, -66, 217, -29, -39, 72, -7, -90, 111, 182, -317, 84, -178, -377, -392, 497, -165, -103, 275, -218, -189, 230, -112, -306, 153, 275, -73, -106, 205, 85, -211, 153, -206, -548, 178, -19, -287, -120, 219, 37, -206, 124, -162, 59, 156, -47, 105, 223, 43, -31, 350, 145, -100, 173, -465, -132, 301, 268, 103, 16, 63, -127, -344, 334, 147, -220, -171, -89, -76, 245, 150, -21, 23, 276, -51, -170, 99, -101, -190, 90, 118, -107, 95, 356, -173, 38, 205, 170, -244, 180, -94, -333, 18, 152, -62, 67, -132, -8, -128, 34, -70, -327, 63, -144, 265, 38, 152, -174, -36, -151, -281, 175, -67, -29, 215, 240, 92, 66, -2, -113, -258, -27, 78, -148, -41, 5, -54, -10, 190, -331, -70, -27, 16, 161, 302, -250, 16, 411, -21, 20, -58, -159, 97, -53, -227, -184, -119, 90]
5567I0Ok96K91k45j3L20j53j35K03K3j11k41J27K64q9L8l14K9M12k54j00Q8L20
5590B60j46M1Lk13P3M2J02m71N45m08m2K64l09K62J19k28k1J8J53k23K20K10k02
5613D9k45L54j90J15K1L87q11K25J22o6nJ73j41O1M0n9k40K39l04J21j3M00n89
5636c56Q5L17j91r8M05j60l80P34m17J82l04L76n01L32P4j4K0j46P5R2O8n12L61
5659D2J60j64n7K13K18o77L81J37n23K66J82j54m29O56k17j88M13j17l24K92j21
5680a1j91J94J48l65p3M08k67k17O83m09n0K08J29K5n94O06k44M0J6j03l4K58
5702A57k64j46J73J54j86l2O68p30J04Q0k77K77K03k43J46K52l37j1QL37n92L90
5724A31J24j20j26J52j34r2p2L82l90J39R6j32j32J98K79o1L1k41j51J00j48K8
$$ y = [90, 96, -200, 91, -154, -167, 153, 0, -135, 68, 91, -20, -261, -134, 130, 41, 79, -235, -206, 206, -48, -148, -60, 260, 114, 155, 158, -55, 18, 60, 162, -309, 236, -172, -214, 50, -259, 3, 122, -106, -127, -109, 44, -179, 41, 251, 49, -196, 158, -32, 83, 104, 491, -320, -95, 27, -39, -44, 129, -12, 49, 89, 30, -210, 29, -275, -154, -167, 233, -356, -271, 46, -145, -243, 162, 2, -378, 356, -61, 121, -183, 193, -308, 24, 98, 84, 104, -42, 33, 125, 193, -319, 42, 202, 38, -19, 194, 412, -265, 116, 253, -270, -4, 178, 24, -405, 251, 34, -154, 259, 142, -182, 110, -11, -202, -8, 140, -225, -298, 110, -157, -374, 309, -100, -150, 58, 187, 212, -382, 224, -20, 20, 36, -67, -101, 157, -107, -253, -80, 74, -112, -144, 524, -206, -102, -22, -299, -22, 181, -62, 84, 336, -1, -12, -4, 333, -259, 131, 255, 135, 9, 161, 27, -65, -137, 245, -145, -6, 90, -42, -174, 24, 303, 242, 273, 32, -119, -19, -167, -139]
5746a39J95L5m62L08J42k81L38L3j89r7K70j17K8J58k55k61L52k43K77j29l6j1
5768h4P1L94m19k31M44j92r8m5K79l69K63m1km1J84l01L1K07l08N68l51J63j07
5791A5j98L08j86M2J78l26L70J50n21J66L4R3l36R8L80k48J9R2j19k78L35j23
5813e5O8J30m59L36J03k5l27N62m18Q1R8J34l33L34k15L4k21J94O3j06J66k16
5835g2K28M3m01J83K17K1J81m34K39k46M7P8M9k78K76J16j82j02K08k40K48k76
5857i7j42J45pj64K09K18l36k1L71j31k05K84j89J00K19j49l49K39O0j8j66M71
5879C42j34k40k37N36n85P2O70m68r9K96l01j90K34L01k65R5q4O4M15l42k30M49
5901B99j5j39m17J63r9K7L04J18r0N4j93r1J9J96q0M2p6j35j78K04L24j0j97J90
$$ y = [-139, 56, 91, -371, -63, 79, -202, 136, 169, -20, -117, 153, 36, 64, 222, -33, -294, 58, -185, 92, -37, -73, -84, -13, 381, -38, -269, 175, -17, -115, -160, 119, -250, 13, -28, -30, -71, 113, -188, -157, 50, -258, 310, -41, 122, 15, -183, 125, -61, -19, 159, -167, 203, 353, -168, -2, 32, 125, -211, -113, 267, 19, 38, 130, 11, -267, 68, -55, 13, 143, -316, 20, 123, 98, -229, 333, -85, -4, 94, 228, -105, 229, 14, 48, -173, 21, 84, -22, 144, -72, 156, 199, -202, -19, 198, 219, 400, -34, 205, -41, 6, 84, 133, -145, 131, 247, 65, -37, 171, -69, 179, -97, -239, -94, -101, -265, -56, 162, -174, -195, 176, 45, -160, 124, -65, 35, 254, 105, -244, -5, 55, 37, -129, 342, 208, -32, -269, 267, -318, -246, 424, -44, -143, 153, -148, -338, -104, 197, -68, 27, -57, 7, 422, 80, -150, 299, 284, 145, -272, -109, -208, -181, 123, 241, 151, 205, 12, -79, -60, 136, 56, 98, 22, -113, -291, -87, 237, 227, 30, 220]
5925B20l97J62K3j4K3L21n65p6M51k98k12M16P5p9k80L13j58J99p5j18J09R3l37
5948b04j65L73R1j66Q8k41L6M07l35n9K54Ll45J90J06o3k17L04J49m45L22Mk28
5971a41j49M85j79N7M8j57k52N52m58J43J16M6O1N6l18k32K44J91q3J63j87r2
5993h6M2K82k4j43j67J21j24J17J36m73K75L26m57L8L05k91J36K0P0r2J4k23m1
6016b39J88J78k06n9L49K5m70M41l7j89j99N38n68K94o0k94K67L81k63K6n6j66
6038a19j38N92k53j49O3L2K7J33j3k33j95J06K33n59N66k27P6J07p9P9O8r3l41
6061c17M51J45k09j53J27J15k59J85j09J90q7j60j00J42N2K8l17K95J32l46L38
6082A43l48N3N38l49k7J13L7q3l68M67M0k77L17k86j1J89j01l37K18M67l33j21
$$ y = [220, -177, -15, 8, -6, 17, 338, -227, -303, 148, -150, -362, 54, 129, 50, -230, 83, -75, 124, 49, -69, 40, 133, -204, -369, 4, 95, -71, 17, -224, -188, 219, -116, -175, 79, 82, -263, -73, 33, -30, -247, 57, 206, -239, 83, 87, -141, -290, 195, 16, 73, 121, -36, -288, 264, -194, -51, 65, 111, 172, 228, -90, -322, -78, 113, 30, 193, 6, -86, -44, 238, 214, 71, -96, 25, -99, 18, 154, -319, -44, 282, -175, -137, 168, -123, 13, 33, 103, 11, 25, -198, -239, -51, 127, -79, -138, 211, 236, -234, 207, 170, -19, -218, 320, -248, 46, -14, -308, -41, 340, 77, 103, 47, -119, -257, 335, 82, -67, -4, 28, 55, 188, 175, -58, -253, -147, 86, -473, 93, -134, -58, 49, -30, 49, 117, 24, -317, 134, 279, 70, -83, 44, 159, -100, 85, -24, 166, 79, -81, -181, -39, 13, 41, -276, 19, 151, -195, 143, -205, -152, 386, 37, 10, 123, 160, 77, -291, 176, 216, -61, 256, -30, -41, 148, 47, -290, -72, 395, 62, -59]
6104e9K26j88k0P2q8j78L27l1j0l5R7l42K31J3K05k35K14j98pM42l60m17K73K06
6128A38j4j6j9K25m67K27l61L70K26n1l67K79k40L41l14J00J00j25m9k60K7N30
6150B80l42n2K39Rj22R8K14o05M22j30o1l3L04m4m82M28Pr5k94J4K01J6J39n38
6174d27M03L1m23N32j04p3N2M1k04L22j26N8J00M8k02l93Q4L94k59K86j56j25
6196a41n9L25N1l43L30j28k98L29l9l54L07J19M5k52j3Q0O0K71o1j92ln3j36K45
6220I0k38K6K16o7k19J58J40k01k67N56k21k57M71j88J10K5k58Q8L17k80L8k04
6242a65K04J4j59K35K6o2l7N1j69j24K56J40j91o2J47k7J2l8j27J05K13m15J86
6265A3J23j32j6j72J78k13K94p5j3L1K74k96L3l3mQ8q7J26o7j05J00j65L76j94
$$ y = [-59, 167, -21, -41, 31, -57, -235, 92, 61, 51, 16, 113, -229, 2, 15, 220, -15, 199, 1, -6, 436, 76, -341, -68, 138, 124, 108, 89, 314, -153, 74, -287, 83, 309, 258, -109, 170, -70, 271, -43, 57, 157, 32, -17, -277, -250, 280, -62, -114, 125, 134, 12, 110, 324, -281, 141, 11, -50, -83, 221, 177, -305, 123, 130, 35, -259, -245, -44, -28, 111, -427, -24, 7, -416, 116, 12, -61, -9, 32, -172, 150, 24, 82, 182, 230, 28, -365, -281, 113, -146, 140, -16, -141, -200, 125, 176, -167, 163, 35, -263, 66, 27, -327, -20, 99, 144, -108, -121, -41, 19, 290, 229, 37, 34, -19, -155, 90, -148, -122, 94, 27, -192, -34, 106, -95, -362, 194, -27, -284, 187, -1, 109, 134, -124, -36, 281, 1, 39, -165, 39, 53, -106, 129, 155, 93, 56, 107, -62, -186, 70, 210, 19, -43, 104, 77, 89, 51, -76, 29, 242, -173, 13, 136, 4, -12, -184, -6, -219, 75, 0, -13, 18, 292, -4, 29, -4, -8, 80, -7, 119, 52, -53, 47, -118, 258, 64]
6289F4l05J2J80m6nJ00j30K25J37k28j71L33l8r8q2o7j89L87J50k09k4K6j82J86
6313B6j74J61o2K9J18l97M46J44o13K89J16M6k09J93j4l05J92j5N4J52l5l77L50
6336A15J3l01L7K70l65J24P1q9J64K46o93L99p2J82j72n9L71m97R1K02kJ84l36
6359a17K34l57J32K06k79K76p4j08J17Kk36L38k56J98j81K84p2l63L50K18m44
6380a32K76J90l93j7l1r1J9L95J8k99K44m5m06M85j21k88j2N32l85n5L21j16n04
6403d15P28l99j96N37j34k51M17K4n42J23K53j62j81R3K81k88K53l46L06K2j04
6424A9j13R2K23k37r1K06k7j08K0j27R2O2J26l27l5J02K01n8j06j58K15K00j25
6447D6r2L90n69K13J67k37L79m29N06l03j47J43J23l22O1J69j00J9j98K5M94k91
$$ y = [64, -241, -229, -49, -95, -100, 0, -130, 95, 232, 4, -167, 166, 128, 30, -52, -119, -308, 79, 229, 20, -4, 22, -160, 26, -148, 13, -49, -20, 98, -299, 147, 291, -322, -33, 83, 129, -80, 113, 99, -206, -14, -29, 25, 177, 142, -235, 115, 128, -173, -136, 134, -231, -107, -36, -125, 39, 285, -408, -9, -81, 101, -71, -130, 241, -256, -165, 37, 35, 219, -117, 117, -240, -108, 98, -181, 95, 21, -87, 30, 32, -204, 134, -122, 76, -105, 179, 107, -256, 94, 312, -132, 144, 334, -59, -76, -107, -198, -179, 216, 234, -65, 179, 134, -272, 213, 92, -196, -208, 324, -61, -116, 205, 89, -415, 313, -86, -282, 255, 121, -130, 287, 311, -231, -108, 145, -17, -198, -105, 176, -112, 141, -205, 101, 123, 19, -94, -2, 221, -16, -107, 99, 72, -36, -16, -143, -51, 11, 137, -190, -225, -123, 78, 20, -86, -244, -29, 171, 46, -46, 344, -225, -12, 155, -82, 297, -132, 374, 71, -76, 67, 190, -132, -71, 98, -2, 17, -181, -156, 338, 47]
6469D7k0j90k0o8L05j80L25l95J76K4j59N8J79l15J12K36k95L3L84J52n03K40
6491A26q3l15K35J38O8l92P4N1jK13k64M31k29n3qJ09q0l76K31K83k44r4K11j05
6515g4J11L5K17n16L64k10j32J95j16J91J15j63o1k06L28l02j25L14oj28K02k09
6537a76M5J53M6j39n4L51k27N3l25O00p49M73j97pJ44o9J76j26J35j49p4N6j58
6560b18J78L02k80j15J1J23P1J39j25j13R7J87l07N5M0k81pM01p8k56J64J14l56
6583b54J10o1K77K03o7m29l2L19j71l5p9l6R4J50J98r8k55K62k12M4J14O4l43
6606b37L34j49j00M64j90o75N76K32k98K04J7j38o1J37k33j85N80j86k13K61L2
6627A72m57K09R7k3k11K38R1j44K66k03j38m7N37k59l72K23q1K29m8j08j43MJ84
$$ y = [47, 27, -163, -183, -251, 54, -126, 199, -196, -20, 4, -155, -97, 82, -233, -121, 115, -180, -147, 237, 389, -114, 126, 43, -272, -37, 101, 169, -223, -149, -98, -99, 114, -150, 281, 52, -1, -9, 100, 20, -356, -125, 158, -86, -180, 31, -74, 37, 72, 289, -227, 137, -73, -205, -10, -126, 65, 180, 17, -44, -250, 78, -224, -349, -35, -41, -169, 33, -176, -131, 22, 68, -71, -125, 226, -1, 52, -273, 327, -422, 51, -146, -153, -9, -78, 98, -28, 107, -42, -116, -60, -218, -40, 262, -18, -133, -122, 1, 72, 211, 86, -27, 70, 257, -50, 5, 45, -236, -243, 158, 80, -176, -12, 102, -254, -144, -205, 72, 275, 208, -221, -253, 66, -105, -140, -219, -255, -161, -11, 187, 89, -166, 96, -116, -72, 42, 106, -237, 97, -52, -152, 312, 122, -553, 23, 255, -43, 161, 178, 40, -21, 116, -117, -302, 278, 92, -121, 140, 172, -285, -76, 21, -2, -213, 25, 116, -28, 238, 35, -103, -150, 387, 128, -244, -21, -102, 127, 79, -29, -172, -168, 16]
6650A6J47k46k22L05q5M85k83m7m1n3q9L28k70m6J14J41q0j23L21n07J44L49j17
6673A41k38J88m5m8J09Mk66Q2K72j38O8k09K4O9j41o9J05J89m61J05K48j32l3
6696a76J93J24l31K74j52j79L11j06kJ32J39k50J31l93K15J01Q5k0k71O9L24k95
6718g7L44k07j67N2K08j06l09K83M4m6N3K4o7P4k35K33j93L1j57L57j27P3k31
6741a46J68j38k36J03M33k64J71P3m83J11L57k44Q2P8k06n1L13N3l85K9J43kj47
6764a88M58j81o6j96J51k6j35J87%j40M98j77j65J3j05J40O8Jl45Q9K37q3J3J60
6788B08n25J1K87J51l0k59J67k05K98k34j25Q2K22l32M6K63o6n5J61Q8k03J11
6810F1j86j83L67k21k49O21Q9l36j53O42l77j36K84k81J84nj42Q5k18L12n34N14
$$ y = [16, 163, -83, -305, 0, -85, 400, 117, 70, 29, -24, -113, 215, -55, -101, 13, 154, 74, -49, 272, -235, -91, 258, 141, -97, 91, 46, -2, 107, 111, -155, -73, 199, 61, 129, -80, -56, 13, -128, -197, -92, 97, -364, -259, -11, -143, -176, 17, 141, -190, 84, -68, -247, 64, -42, -44, 88, 227, -23, 108, -285, -70, 31, 116, 96, -175, -106, 218, -77, 267, 60, -107, -55, 153, 47, -262, 21, 65, 19, 72, 96, 29, 103, -132, 101, -92, -61, -218, 139, 12, 85, -146, 22, -116, -352, -249, 184, -80, 91, 164, -319, -208, 149, -95, -13, 65, -141, -192, 121, 174, -211, -182, -39, -41, -188, 270, 89, 23, -173, -22, -48, -183, 4, 4, -136, 362, 185, 20, 33, -72, 68, 136, 137, -208, -119, 118, 35, 48, 208, -317, -306, -19, 132, 102, -157, 10, -195, 103, -131, -256, -174, 48, -284, -238, 25, -41, -96, 65, 153, -50, 61, -125, -308, 59, -162, -411, 210, 299, -37, -190, 452, 75, -61, 223, -58, 126, 121, -21, 64, -154, 158, -376, 138]
6832A38j40R0j06K18j31J36j71j73NL25N9l84J40J80l38m3M56o66L91Q1K36m49
6854a46J34q4J50n11N79j56Kl40L68n7J24Ql75N91n6l1j05k6j41K7K31l15j43
6877b72J80k87M50j86K67m52J85J88l06K41l7j55j14L83K1k40L23J0m96J81J38
6898B2R8n2j06J09m2N8K9j57o2r7j48K25k30M20L27k57j70P1K44l59m3M9n3K52
6922A28K6J40j66m3k30L49l57L35l24J74R7m69L53J95l96J25J79l25N3L2JQ0M0
6945cJ83l95L31k3m27P9J08J62J00k48K53M9k19J79R3k45M2l0j43L69k60J50l57
6968b52K30k38L36L3K3k26J59l30K06K81j72j62j13n8m4M47n3Oj72K08j26j27
6990a44N57m49l0K92m62j2M70j42j7j87J37j49L13l73L36l87L38m00L23J8pp4
$$ y = [138, -2, 88, -18, 200, 69, 205, 34, -139, -134, 191, 250, -134, 6, 186, -152, -195, 261, -405, -14, 67, 303, -146, -12, -96, 54, -457, 122, -34, -32, -372, -4, -61, 63, 71, -304, 287, 231, 200, 95, 69, -72, -45, 186, -129, -272, -92, -379, 71, -115, 152, -300, -115, 73, -233, 8, -29, -184, -298, 85, 106, -134, 189, 199, -297, -116, 22, 120, 68, -38, 71, 29, 87, 116, -41, -103, -200, -348, -123, -353, 67, 394, 137, -33, 38, 282, -77, -120, -71, -124, 128, 154, 294, 128, 85, -145, 204, -153, 182, -142, 32, 129, -340, 13, 208, -188, -63, 116, -209, -156, -124, -123, -43, -3, 180, -215, 116, 93, -334, -255, -147, 15, 115, -133, 120, 169, -50, 129, 222, -23, 19, -11, -154, 215, -45, 105, -252, -22, -260, 76, 109, 132, -94, 65, -265, -59, 222, 50, -112, -225, -283, -327, 120, 67, 73, -99, 109, -17, -144, 413, -36, -66, 226, -236, -248, 222, 80, 63, -124, 13, -136, 177, -196, 140, -247, 91, -309, 14, 32, 25, -49]
7012d9J84P8m87J18J9K78l28K17k55J20J59m9k37N03l39l76L73j90N08m9j86j14
7034a02j71M60%j52L75o08N1J54j21J88j12J65k09Q8K60k68n8L59k70j43K59M5
7056A90l30J41l1l06K95J96j80J40j09P5Q5J39l26J50o0J1l5K93l69k57K20K46
7078A78n8k69O39m57k5K90j98k10J72l0N5mo1l4p8K59k49J13j6P8K5O4l59m0N11
7103B96j81o0N3l2k77J99p1j89M10l1l07N6J6J85k08l5J37J51J58j58J44j94K21
7126B83j35m37L95J28k44J01J62m50L95J41n21J62p8j5m9K81m5m73M32M0nl91
7148c23R9p0N53j38j68k59M67l3j32J09k65j84M48qk57M1O0K67q4P1l25K49k16
7171i8K30k83K76k91N9Q6R3K3k04J48k74o9L70r4O2K1k32Q0l20K83l9j6N16l70
$$ y = [-49, 135, 213, -274, -156, -137, 141, -187, 30, -225, -105, 54, 5, -232, 271, -68, -444, -71, -261, 247, 198, 12, -102, -273, 187, 187, 35, 410, -198, -147, 7, -114, 74, -38, 127, -82, 6, 266, -2, -60, 299, 29, -114, 145, 190, -140, 1, -30, -336, -41, 155, -25, 115, 6, 81, 166, 305, -21, 129, 69, 80, 45, 338, -31, -288, -68, 178, 120, -149, 490, 33, 8, 298, 100, -110, 62, 32, 87, 83, 22, -12, -90, 169, -80, 33, 17, 95, 120, 184, -175, -215, 296, 115, 55, 108, 76, -201, -2, -73, -262, 148, 117, -190, -134, -118, 67, -141, -176, -39, 112, 270, 112, 256, 62, 283, 148, -289, 106, 234, -10, 91, 253, -197, 198, 339, -182, -20, -98, -113, -162, 119, 74, -399, 33, 73, 68, -323, -224, -294, 259, 121, -47, -306, 161, 128, -4, 105, -160, -344, 104, 96, -161, -120, -60, 207, 123, 194, -131, 118, -98, 132, -151, 125, -166, -107, -21, 72, 95, -109, 39, -235, -304, 66, -28, 34, 55, -177, -97, -417, -134, -173, -189, 327, -43]
7195d3R2j23RJ5K12n0l05L60j22l74N09J05p02L16n8M42n04L59l09L3M8j4J08
7218DJ9R7j92k7K51Oj51K50l28j11L5L67k33k3J18l21J38K69k52K08k16J21J72
7241B01J8l11J69M9j33J80j02rK15k09Nj35J94J67k69M2J33k32K1j79N19n16K30
7264D8j27o5N5O2j06Q5K26k19QL8q0k30N66j91k67J67n5k3K07Om52K94k9j45J25
7289a02p7qo3L03M9l85L61J71k26r3lJ87j93Q8J70k18P1q7pK98k33j37K08J22
7313A96m15J98q0J65j5J90k85n1l8J3J25j88J46J2J64o7k06K5J61Q5k01M0K04
7336A78l98M82j81P7k69P5j38K05N0R7r7l9k7j20j56K69mO1j66j20J54j95j28
7359c90N98N7o13K84J06L6m42M81k51J35R0j25k2Q0l1o0J62j07Oj35L77k52O5
$$ y = [-43, 49, -74, -65, -50, 162, 112, -193, 167, 45, -329, 180, 285, -417, -101, -159, 283, -221, 138, -171, -138, -90, -104, 4, 23, 120, -72, -99, 152, 158, 7, 257, -71, -182, -147, 220, -13, -36, 82, -239, -101, 168, -84, 124, -92, 29, 201, 219, -92, 77, 126, -7, 173, 71, 62, 277, 68, 73, -62, 132, 299, 30, 72, 205, -27, -6, -185, 334, -182, 48, -79, -144, -89, -27, -133, -48, 178, -41, -33, 5, -75, -305, 261, 70, -197, -30, -85, -108, 99, 105, -347, -53, -82, -227, -102, -179, -187, -250, 53, 102, -283, 78, 249, 23, -70, -73, 114, -79, 9, 179, -39, 32, -55, -62, 236, 3, -134, 74, 196, -219, -21, -101, 64, 49, 239, -46, -97, -135, -122, 3, -185, -39, -27, 137, 70, -136, -111, 50, 135, -66, -26, 178, -220, 262, 81, 158, -111, -36, -174, 31, 81, 178, 81, 42, 15, -105, -261, 8, 4, 65, -101, -221, -67, -262, -390, 208, 265, -348, -64, 42, 78, -364, 117, -134, 1, 91, -34, -56, 24, -7, -67, 95, -12, -6, -141, 236, -16, 49]
7382D9P1J3l51K57o3l5m6L46n57L01k33M02o1m2j23L2K4m9R7j97J99k7n1Q3R9
7407A38j79n0J2j28%M79k31J0p6J5k79L25j11N1J47k26k38M12J51m2l71K58k77
7430b10K08K99l59KO3J99k61N0J8j19J7L35k19L2k8j34N4l1K92k84J32L6j40J37
7454H9l2j13o4M76l99J13J10k08l28L33K66j84j43J66j12j82J34k58K85LR0j02
7476f0L28l15K8K13k88L18M7q6k09J04j67K55l67K20Q5l96N73l19O2L11M2o84
7498c05K02K04j84k24L40l3k37L39j56p1J69Mj96J65j0j70J33J23n6J46J70n02
7520a49J81m8J1j36K6j00R1M14j39o9l21K43j66K37m7Oj38RM24m67J92l0q8K34
7544A70j1j43J19K10k93k08O1J81p1J53j21l17M49k22k32M71m05Q9Q6M15l56l0
$$ y = [49, 120, 133, -218, 39, -24, -59, -105, 241, -316, -15, -248, 154, 93, 51, -72, -40, -16, -65, 32, -165, 34, 7, -44, 39, 138, -41, -91, -79, -207, -207, 272, 41, 51, -25, -10, -289, 36, -75, -24, 123, -103, -341, 71, 222, 180, -191, 67, -210, -2, 297, -62, -60, 3, 202, -59, -9, 9, -110, -93, 242, 23, 55, 27, -107, -53, -84, 208, -76, 56, 92, -48, 89, 57, -56, -120, 356, -43, 70, 180, -28, -356, -23, 243, 59, -84, 82, -30, -212, -78, -336, -51, -48, 42, -60, 268, -47, -19, 194, -94, 224, 271, 185, -24, 80, -87, 168, -199, 21, 106, -290, 283, -36, 26, 337, 379, -305, -103, 101, -83, -307, 33, 0, -237, 102, -54, -125, 44, 48, -148, 17, 7, -163, -30, 93, 37, 183, 353, -149, 32, -16, -5, -141, -115, -215, -124, 290, 151, 82, -239, 4, -162, 75, 28, 34, -104, -95, 329, -138, 54, 24, -64, 170, 159, 16, 135, 345, 52, -156, -95, 86, 15, 168, 47, -270, 179, -43, -275, 196, -209, -120, -34, 381, 25, -5]
7566eK98l03J94m4k17j82K36L12n14j70N13o3P2j49Q7kl37K14K84j03k51K02j33
7589f1J19P3k84P9P8o3RK19k98J33J68k96J84j02m04O26j74R2RJ79j91k4J20q1
7613A10m05K46L43L3l68L19m00J41k11M97m73J07M9j56K38j9n8k78M65p3l4q4
7635a1k82K49K1r8K5J46j44j00K26p8m0m7M54m78O6K57l37K35L0M7k83K91o5J48
7659B32m62R4j10K01O5K83n42J19K06k02J63J46l87J44J60o3m4l8K9J07l8K8r8
7682gj77J00pL5L70k66lJ36l69J84J53j61j90J31M6L9mQ5k43L25J54j48N1m5k34
7707d5j40J11L9l3j31L18j41P8k1j01M8M2r5K16nk98j76L88j58k26M25k10K76
7730A61K3r1j74J93j85K44k66L84l61n2J94j27l86N53j18q0Q8J30j64O2m6q2J66
$$ y = [-5, 293, -10, 184, 140, -77, -259, -23, 289, -225, -395, 118, 55, 127, -22, 65, 63, -274, -60, 224, 121, -130, 72, -61, 58, 131, -153, -74, 4, -59, -50, 169, -129, 4, 172, -124, 60, -42, -446, 180, 6, 98, 107, 286, 95, 71, 191, 110, -295, -49, 294, 327, -41, 278, -122, 19, -192, 305, -168, -61, -12, -168, 70, 51, -7, -285, 180, 107, 73, -11, -293, -44, -23, -121, -96, 50, -94, -194, 32, -46, -86, -133, 321, -157, -91, 166, -171, 64, 94, 141, -142, 149, 84, 232, -230, -136, -246, -45, 20, 303, -239, -120, 86, -116, 47, 193, -194, -50, 110, 47, 3, -35, -6, 101, 63, 91, -7, -184, -84, -91, -56, 314, 48, 45, 181, -188, -4, 149, -12, -202, -71, -25, 14, 10, 95, -148, 177, 331, 183, 234, 189, -45, -185, -74, -35, -68, -199, 119, -22, 56, 35, -66, -18, 24, -71, 145, 140, -158, -334, 54, -104, -330, 95, -115, 161, 184, 93, -81, 112, -73, 171, -95, 289, -72, -124, 70, -57, -443, 110, -8, -88, 0, 130, -34, 28, -18, -100, 66]
7753F6R0Mm77N03j11j95K96M7l78J41K25l45l3L2n6m1N23J06l33J87k34j3J11
7776A15j15j15k14o5M08L23m35J17M8J42m7l96L30k1j45k9J49J08j13k86j09L16
7798c4n7K80l46J39l6q9J13L1J54k24o7J42K39k25J62k10J90k75J02n8K14l40
7820a95j4M3J3J56k47K94O6k6k45N3j4J15Q2l20L33l28K19n4j29L50k07K32k59
7843h2l4p9K66j81K88k24q5L04k03Q7O9pl74M39l11L79m14K14k38L63r1k29j6
7866a59K49m8O3j6J11n2k98L44l16M72j75l74R5K66j44J08m9J35m30K10O9j91
7888a30K25k64P4L65o11L82K84n0k25l69K84K58j37K11n25K64R7r2M1K77P1l65
7910F5R9J25l65Q4R2o5k80J79J5J72J69k68P5k55K92j50n8L05j43k67L61k6k83
$$ y = [66, 156, 160, -317, 186, 75, -120, 176, 223, -155, -14, 211, -134, -167, -135, -191, -232, 291, 397, 64, 251, 17, 4, 115, 0, -115, -329, -394, 14, 337, -98, 19, 67, 209, 162, -234, 96, 75, -70, -99, 50, 158, 45, -241, -350, -34, -91, 189, -157, -18, -54, -143, -30, 1, 155, -69, -136, 6, 245, 20, 182, -28, 162, -113, -11, -69, 145, -195, -209, -166, -153, 3, -244, 50, 116, 90, -155, -102, -116, -1, 81, -239, 94, -234, -15, -69, -198, 152, -55, 177, -82, -116, -195, 71, -110, 178, -46, -131, 173, -30, 57, 126, 119, -255, 184, -127, 252, -162, 52, -186, 177, 86, -143, -159, 90, 42, 105, 89, 200, 148, -150, 194, -122, 350, 175, -199, -104, 162, 18, 126, 77, 212, -218, -8, 61, -130, 95, -169, -95, 270, -341, 41, 325, 275, 50, -319, -35, 223, 86, 297, -228, 36, 133, 41, 82, 359, 430, 65, 164, 289, -76, 8, 100, 35, -245, -66, -51, 121, 290, 22, 97, -158, 134, -16, -74, 231, 88, -179, 182, 156, -127]
7933a27L00k6l31P6R9j86J61M2Jm8Qj36J5L45l15p1L89k51n1n6K83J3k07P5J74
7958A76l71L01J04l63j26K49o3j05L59m11M16k78m3LJ09j12J4j65N76m06K54l2
7980H6p4k40M02lk96L29l45M79k14k45J76l84M86q9P4j27J06k29R4Q8j90L35j28
8003I1P8l16L37l26K72o1r7J08K31k05k66K83O6m67K74J24l13n5L64j96L1o6J12
8026CM3J55j70j80N04l94L64j68J7k42L25L7j81j1n2p8m0O3J44k23j02K07n6L16
8050B81j89j06j5K33l75K81K2p4k87J73k0k89K21O29k88j31q5N0N3J15J18m82
8072a65J88J03k57K57n3nk35K45L9k44Nk66L17J29J44P4n2j02N7o4j67J02R4K72
8096D16m72q6J80j01j72J42k2jJ22r5k1P4J71k35L6N3j30J86j54J70k35K52n1
$$ y = [-127, 173, 147, -184, -108, -9, -195, -34, 8, 9, -39, -31, -167, -152, 193, -122, -193, 196, -55, -106, -162, 121, 134, -73, 2, 176, -195, 106, 210, -153, -279, -30, -93, -198, 161, -250, 166, -112, -155, -152, -43, -155, -141, -306, 270, -136, 118, 86, 12, -228, 174, 171, -125, 204, -141, 338, 124, -121, 55, -329, 157, 68, 142, 15, 121, -108, -14, 74, -116, 219, 91, 169, -147, 190, -136, 136, 75, -22, 86, 317, 112, -154, 129, 195, -272, 2, 126, -187, -242, 122, -74, -43, -109, 3, 46, 201, 31, -149, 355, -39, 325, 157, 174, -68, 257, 294, 113, 102, 50, -28, -68, -5, 139, -84, -186, 21, -35, 281, 92, -14, -29, 204, -171, 110, 132, 58, -229, -56, -76, -365, -144, 485, 197, 66, -19, 31, 84, 199, 317, -165, 23, 126, -131, 126, 73, 68, -167, 78, 117, -127, -122, -388, -71, 58, 202, 276, 224, 122, 179, 115, -52, 50, 144, 416, -56, -142, 38, -63, -235, -93, -115, -116, 6, -89, -110, -36, 135, -100, -64, -11, -141, 45, -109, 61, -174, 78, 27]
8119B7l74M00K32k53K50m1j12k72J91k29J54J1K25QP2n13R8J02J16J39k84J39
8141H6J57j89J67j54L1q8k81L84r3M8k07p1J53K01K42m60J1j48K13q8OJ94r7J5
8165C2J97j77j84p7K16J72k76L09j90L8m7l72J01L98j96K0J82j46K3K09o47N89
8187A74k96J09K7J25
$$ y = [27, -347, 53, 285, 32, 282, 241, 129, -143, 48, -181, -27, -16, 209, 217, 289, -224, -126, -24, 92, 231, -53, 86, 243, 54, 221, 67, 98, 10, -271, 113, 20, 68, -139, -210, -57, 144, 386, -74, -63, -211, 2, -86, -80, 114, 17, 32, 229, 52, -132, -209, 7, 179, -97, 212, 22, 60, 13, -359, -258, 140, -56, -36, 146, 0, 23, 232, -415, 174, -122, -13, 14, 139]
8191A39
$$ Imaginary data points
##PAGE= N=2
##DATA TABLE= (X++(I..I)), XYDATA
0@%%%%%%%%%Qj6J6j6J6k4L2l4M2m9N7p0Q0r0J04j22J41j59J82k06K31k62K95l30
33a74L68m11M57n08N66o27O95p71Q52r43J045j157J285j430J592j781K000k258
51a200K572k957L441m079M960o254Q349j2296K2265r1001k08810J70931K32198
64A18119M1722j37903j22133j7424Q0816O7510P965l6129m7611k6585M2955N2181
76B3483k610k4687j7428m2401o554Q8130P4351n5592j12593l9211P7625J16798
88G9311J6676j07401p8791L6138O9115K8889o584l3820l2237n144N532K5839O1059
101E8582J1618r0657p5124L9167R5043N2113l9428j04480m9696P6753J00208L307
113G7406q2363p8612J3324J05429N8940p1241q4554O871M7772L3539J8639j6842
$$ y = [0, 0, 0, 0, 0, 0, 0, 0, 0, 0, 8, -8, 8, -8, 8, -16, 16, -18, 24, -25, 32, -38, 42, -48, 56, -66, 75, -84, 98, -108, 123, -139, 156, -174, 194, -217, 240, -268, 298, -329, 366, -405, 447, -496, 549, -608, 677, -753, 839, -942, 1058, -1200, 1372, -1585, 1856, -2223, 2737, -3517, 4832, -7464, 14801, -76200, -285010, -114079, 118119, 159841, 21938, -100195, -117619, -36803, 30707, 38672, 2543, -45068, -71653, -28698, 23483, 20873, -3814, -21242, -63643, -70197, 17933, 92284, 36692, -75901, -115112, -37487, 79311, 95987, -11414, -90205, -54067, 15048, 43937, 37353, 3533, -28704, -33848, -28316, -2477, 58582, 70200, -20457, -95581, -56414, 38629, 90742, 51314, -53166, -102862, -26109, 74099, 77406, -4957, -83569, -70245, 35184, 94124, 22883, -61671, -54800, -7028, 26511, 45150, 28308]
125B8308m5649k5278J1706M1202M7906q113o7075l3747L0360M1109L1037K442
137E4208n9010n9644L0088P6820L0195l3098o4116l5752L7781O2300J4985k3168
149C1589l6290m3427L375O4340L9202k9494m8200k9036R740N7169L9089l6022
161B2035o0193j9029K8526O0387L5186n1436q1008n573O3355N9172P120o0329
173a787o6820J5434P0144K9051j9882k9663k7876R08L6319K0584q843p607j4144
186d182k1498J1005L5641J6917j1181l6095l7245K3680P1560J3235o1485m6690
198d6338J2713N0233M0919k0943o2898j7610L7955L0581P770j0022l3461k2152
210c3253J7420K4338J6401J1064k6351n3882k114N7293M3454j1093n8632n0399
$$ y = [28308, -17341, -42619, -30913, 10289, 58195, 50082, -16993, -50740, -20380, 20729, 51766, 54208, -4802, -64446, -34358, 42462, 72657, 39559, -24557, -60309, -22528, 39772, 54757, 31589, -4701, -48128, -44753, 19587, 58789, 29295, -18905, -47941, -38201, 18968, 58057, 22035, -38158, -57187, -28661, 31726, 66912, 15476, -65532, -71105, -7750, 51422, 58542, -1787, -68607, -53173, 16971, 46022, 26140, -3523, -31399, -30491, 5828, 26412, 17569, 9962, -4182, -25680, -14675, 20966, 37883, 26702, -9393, -46638, -22958, 48602, 61837, 352, -46338, -33625, 16608, 57527, 36584, -26314, -43924, -5969, 24612, 32382, 22360, -11101, -33253, -15833, 8505, 24906, 35970, 9619, -44263, -46377, 10916, 54370, 43277, -15355, -65754]
222f5754L0860Q1554J4941o2327m4430J2719M1163L0789j7162m2294j978K5308
234C389r3p227J4591O394j4706k0325j3849K3281N0922k86o5766l7273L6250N5549
248C0851J8908l9268o2500k202O2246L3391k6642l2363j3701O522K5740J3606
260A4588q884n758j0030k4124O183M3819J8616k8053l6781j4653L1273N4162l06
273D0052o1048l0282L3863M3108J0382k8933m0196L226M1288J3463j8605p146
285h28k22o006J102N664O075J7019k327l8186j6317L4905L2864m549k8774l0176
299b9756N078M6108K2146l3030l2935K27J8981K5355P735k6882k2334Q475J0271
312e61Q748J5087p447k9446p862J5805J7553J4024r649l6624j2125L2939K7197
$$ y = [-65754, -34894, 46660, 61601, -726, -45156, -32437, 8726, 39515, 22353, -19941, -21919, 3389, 3296, -3931, 10660, 17054, 2348, -17977, -31826, -8545, 42377, 42091, -23675, -60948, -24698, 30851, 49759, 10491, -52009, -54211, 8035, 41426, 14784, -17579, -31280, -24758, 982, 14588, 5704, -54, -10084, -34208, -28025, 15794, 34410, 6357, -30424, -45077, -13804, 40358, 40052, -20996, -51278, -17415, 25693, 36075, 7142, -33054, -29828, 11460, 24923, 6318, -828, -1050, -7056, -5954, -290, 5785, 22804, 20477, -17709, -34026, 879, 33743, 29194, 420, -29756, -24678, 21430, 43576, 10546, -22389, -22162, -3181, 22174, 29909, 3027, -19307, -10832, -561, 8187, 23274, 15827, -13619, -21481, -5676, 11877, 25901, 16252, -20372, -32497, 442, 27639]
325B7639m941k2243k6579j366L5359K1783j8061k1184p364N77J7552J7789j0575
338H386j7049K34r45J791J7245N314j7792j1520p82N224K1252J2917k3610k7009
352b6344L175J9259K1877Q320k8718l3573J3056L4361J0424j0905k2049j8070
364b9187J5807L1886p09k0085r250k559N078J7497O444j1399o137q035p986J7568
378a067K6145q200k6005j0202O434K2939J8968j9170l3470N457K7560Q672o462
391A1599j3416j1979R459J5078n281n095J1153l215j9035j516J4765J4539N334
404B2390k1978k9369J4013M0770N146l0090k3140J540K8004K5553j7668l4979
416a9808P24K2447P008k762n266p870K243M364q449L032J8946l675k4836n995
$$ y = [27639, 22698, 455, -26124, -27490, 7869, 29652, 11591, -9593, -16957, -16380, 1172, 18961, 8386, -8663, -8429, -9374, -7583, 9662, 14976, -2816, -14336, -15118, -9894, 11358, 24275, 665, -26344, -23169, -3910, 17967, 26287, -2431, -36004, -22948, 11413, 21837, 10932, -11117, -29187, -13380, 18506, 17797, -2288, -11538, -14097, -9019, 8478, 14922, 3523, -2614, -10649, -18635, -1067, 25078, 16878, -9127, -19329, -12895, 10044, 29012, 9842, -23628, -18171, 9389, 18061, 11599, -1817, -13796, -4337, 10741, 5460, 365, 11518, 8303, -10732, -12248, 2517, 17056, 22390, 412, -28957, -14944, 25826, 30972, 882, -22258, -20718, 7286, 32839, 15171, -19808, -19084, 3363, 10371, 7609, 2343, -5527, -3284, 1080, -7369, -4337, 14609, 10934, -13902, -19897]
430a9897J5424J7772N946k1773k8441J2313L5689N109k2883j5781k3J4401J6089
443A3945p988j5744N974Q010r634j569J1735L733l498r751j2958J1617K9582k528
457B0926l2060j2449J5432K1322J1322j6961k9027L913K6963O694j1452p395n527
470h299L495J1124j525o304N664l38j4437K421J6939M107p364j0782j1519R851
484f967K5398R1k3093r478P542J0064J0612l858j7279p47J1266j92o15N717n368
499C093r495K953M040L156Q257m972j9569n08J7588P626l200j0069j4119K702
513a2517K0595M459j2155p050l191R7J3148P274j1767q442J432j96O553J0332
527H572o809j3354J585N368K447P365j750j3678r04Q825J627L144K996j1347q207
$$ y = [-19897, -4473, 13299, 19245, -2528, -30969, -18656, 17033, 22142, -741, -16522, -16545, -2144, 13945, 5957, -9787, -3813, 4197, -5437, -7006, 4729, 8462, 4964, -4787, -17745, -6128, 23454, 20926, -11134, -23583, -8151, 13171, 24493, 7532, -21495, -17582, 9381, 16075, 4623, -2772, -8299, -4804, 6320, 4795, -1509, 4155, 3817, -10620, -8199, 8740, 12847, 5483, -5299, -16818, -6967, 18431, 18522, -4571, -14049, -6507, 3557, 14169, 10311, -6968, -7715, 3551, 3359, 2744, 8461, 3093, -6402, -3449, 591, 3747, 12004, 7032, -12537, -13045, 4543, 12169, 8969, -1100, -15219, -12517, 8078, 12537, 382, -6668, -9859, -9762, 3386, 10660, -1107, -9549, -8117, -8313, -1760, 8572, 1763, -11591, -10006, -4638, -2191, 5174, 3424, -10254, -11158, -2333, -706, 2438, 5434, -5913, -14120]
542a4120J0347Q449j17m05q906r674J0904J4841m287q560l085l222O320J1308
556I793l885r362J973n9k637Q283O306p831n976j044j324J0704J1129j2479j6444
571a2853N111J1316N595M36j2135j0886J1081J3848n457p969L52q02J843N547
585E027l094j662O120n020r670P645J2136k481p668o621l617J2684J4131j0459
599G451j6423K287R145N138J847q069q941P425O925o780j314O276l672n578J743
614b540J122M137O469r714j4772Q296J6079k81r403q476l493J1946J3326q860
628C836j3360L056N558J014L973k579o373M424J746o909L623J0699m097r642r88
643f019L247P410P113r091j4208N847J2940l76m208l982m992N293R213n257o080
$$ y = [-14120, -3773, 4676, 4559, 4154, -4752, -14426, -3522, 11319, 7032, -1528, -4613, -7835, -1515, 9793, 5908, -3454, -1481, -1540, -4177, 4106, 10412, 2581, -3395, -4439, -5763, 4941, 16070, 3591, -12853, -7742, 3574, 9169, 9605, -2530, -13416, -2335, 11513, 6056, -1913, -1561, -2363, -520, 5027, 1933, 271, 6391, 1371, -8299, -654, 11482, 9001, 1333, -5288, -8905, 3779, 17910, 7451, -8972, -6685, 2460, 7598, 9445, 1376, -7565, -140, 6785, 5, -1309, 4967, 1295, -4283, -2540, -1418, 2719, 9188, -526, -15298, -7002, 9077, 8796, -607, -9083, -12576, -630, 12696, 3836, -9524, -6468, -910, 104, 4077, 1498, -4875, -451, 1295, -5614, -1991, 8708, 4611, -5031, -6019, -2772, 4638, 11751, 2660, -11548, -5701, 7239, 6863, 2655, -1327, -6319, -1026, 8187, 2930, -3150]
658c150M451j22n314M048M464k385N67m011q212O800J3381l779j1918k114K724
673d570O106P959o500j2193L453Q081j673M37J099o005j052N585j054K18N226
688E117m774q838N375P261j398p02l280o732N367J0365m409p269J421j93Q51O234
704D396j426o849J584J427m207M988O732o979o245K893R00K596N669n944q341
719h806M051O173j978J272m87o327J413O607j552j237L467m791m976P445M926
734E200l820j518k236l245P709P605p992o693M056K457O62L591l704n148M082
749A006J972m256M449M084o902l180L229J79K633M152o920p455P092O066k834
764C315j788k253l742N518N663o323k521M351k155k919M980J396l520J259k028
$$ y = [-3150, 1301, 1179, -4135, -87, 4377, 1992, 2559, -1452, -9664, -2864, 10517, 6738, -5180, -7294, -4570, 1536, 9495, 2995, -9198, -5745, 2336, 663, 1100, 2199, -3806, -4858, 727, -327, -109, 5117, 343, -8495, -3120, 4141, 2743, 2041, -1239, -7971, -2604, 7761, 3352, -3917, -2496, -2689, -1838, 4396, 2970, -3879, -2295, -868, -5075, -87, 6645, -334, -6579, -3686, -2786, -190, 5479, -465, -8806, -4755, 1418, -560, 712, 225, -6102, -4689, 1918, 366, -871, 2596, -2195, -7171, 274, 5200, 1380, -138, -2374, -5619, 2090, 9695, 1703, -4990, -934, 1523, 2185, 5776, 2072, -3076, 1006, 2978, -1278, 3171, 7255, 353, -2827, 402, 581, 3214, 7366, 446, -7009, 83, 6149, 3315, 1527, -726, -4468, 1050, 6713, 390, -2131, 2220, 65, -2854, 2126, 3522, 2, 1261, -767]
779g67m745P522O791p500o754K629K381M468L041q321o702P466N157l931K9k33
795E31m139K829L709m309M6N496m597n791N537L762k139p6l533l781O961O173
811F679o702n019K931K28J463M419m318m495M530Q06m709M267L814m948k137J427
827a764q87L995N363p896o909O205N782j242p98l584m097O804N439o494k180M249
843A986k082j402L937m98k490K861k235m296N542M974n933l303K154l88K973M053
859E853o618m855O364J660l063J619M59m081J903K153l776K270N124n672n017
874e677N033K755o70R91m666m034P249N343o610l180K652o36K299L026m996l105
890d226N280l46l951M038K287m949o51J905j256K837L549o735l980O591K316k495
$$ y = [-767, -5512, 2010, 8801, 1301, -5453, -2824, -443, 4025, 7066, -1255, -7957, -491, 4666, 735, 764, 531, -3608, -779, 2930, -1379, -1333, 4163, -434, -6225, -688, 3074, 935, 859, -2674, -6455, 506, 6679, -23, -5042, -2111, -1883, -420, 3999, -319, -4814, -284, 522, -4187, 80, 3894, -1054, -3191, -1764, -2651, 1344, 6707, -1189, -8098, -1893, 3889, 2647, 1849, -1735, -5832, 972, 6411, -83, -2263, 1986, -96, -1498, 2439, 1941, -549, 2312, 77, -4219, 1323, 6297, 364, -2939, -785, -1173, 1800, 5853, -765, -5620, 744, 2404, -659, 960, 1419, -2662, -759, 1394, -2382, -112, 5012, -660, -5677, -644, 2111, 1441, 2432, -2234, -6268, 981, 6324, -286, -3466, -814, -1450, 849, 3875, -1121, -4226, 1054, 708, -3243, 795, 3082, -1867, -2518, -613, -1869, 968, 4517, -2218, -6198, 393, 2709, 214]
906B14K78k052k512N383K331n682O15M076l498j325L718n29r58K683l653m031
922d942O348M321n643k292P87k68M262K859p152l185O165R93k149J630o60l794
938b720L166J980l647J892L507n682k073N017Q56j584J434l908k368O842K419
953E131o355p20K818j648J435K359m111j264N000k706l242M023K202l896L3L58
969e83k567M483L512o551l682N507J172r43J900m052l065N599J884m530O18K468
985A170l437L41L757k203p06L213l784l079O129K590n317q11R83q02L433K131
1001C608n838j620N503n70k506K313m50k353L675k00m334L113M122n110k703M213
1017H63M50M17J528l957l164N678K365m526J76R09k302K724K487m584n42M570
$$ y = [214, 492, -1560, -4072, 1311, 3642, -2040, -1425, 2651, -847, -2172, 1546, 1017, 59, 2742, -911, -4942, 1406, 5727, 84, -2208, -1421, -1689, 2573, 5432, -1720, -4905, 1260, 2253, 104, 1734, 1074, -2720, 446, 2426, -1221, 671, 4178, -1504, -3577, 1440, 2296, 712, 2146, -1762, -4130, 2712, 5131, -1224, -1944, 874, -774, 661, 3020, -1091, -2355, 2645, -61, -3303, 720, 2922, -974, -941, -583, -3150, 1333, 4845, -1706, -5388, 119, 1291, 348, 2248, -1804, -4869, 730, 2614, -1916, -1298, 1170, -2267, -1926, 1831, -372, -1078, 2135, -1649, -4728, 1401, 3991, -1326, -2137, -1154, -1956, 1477, 3608, -2230, -3850, 1653, 1083, -1423, 890, 440, -1913, 1762, 1562, -2772, 341, 4463, -647, -3350, 863, 1313, 1730, 3258, -699, -3863, 1815, 4180, -346, -170, 739, -1563, 1161, 3648, -936, -1478, 3092]
1033C092k954k726M939P53m191J089k05j826M263K004o035j739N008M61j494J365
1049A804l043j520N539J25n263K153L061l308j92K306k085N83K856l883k929N335
1065A539J239l782O69K04k096L530J792n194o65M313j717k047L874j484l111K608
1081c28M98k948L555J658n460j16M147q87n49K017m017j257N989J55m857J423
1097i77J499k571K404J851l903J57L853l433j601M176J33l096J876n26k218M101
1113A725J424n713M31L951j647j155K916k677j679L880n98k915K935J404m707
1128b425R75K633j572P90J691m567q60N900m41m008J121K18j275L611N69n080
1144b720P63L984k655j220L288j331j362K670j152l004L970J819m736k30L319
$$ y = [3092, 138, -2588, 2351, 3104, -1087, 2, -203, -2029, 2234, 4238, -1797, -3536, 1472, 1933, 439, 1804, -1239, -2759, 2780, 2905, -2358, -205, 2856, -452, -644, 1662, -423, 160, 3016, -867, -3796, 1539, 2778, -1004, -335, -131, -2227, 1303, 3095, -2099, -2764, 1549, -168, -2215, 1659, 175, -2936, -328, 170, -2778, 777, 2435, -3025, -3141, 1006, 119, -430, 1587, -2430, -3687, 2302, 2457, -2400, -977, 522, -2049, 355, 2206, -1697, -1540, 2313, -1120, -2721, 1455, 1588, -1508, 368, -158, -2376, 1725, 3149, -2564, -2133, 1818, 171, -984, 1932, -745, -2424, 1456, 858, -2057, 878, 2282, -2425, -1450, 1183, -389, 401, 2092, -2475, -3335, 2565, 2124, -1884, -763, -545, -1820, 1791, 2360, -2720, -1957, 2027, -628, -1848, 1440, 109, -1253, 1417, 265, -2739, 1231, 3050, -1686, -1916, 1403]
1159A403j475M37J634l598q27M949r69l582K259J011l086K120J607l757J799K865
1175B790m294j094M458k56k377J238j421r83M387O24n652L88M037j546K67J151
1191A717l333j0M431j414l886L733J186l100O37J377j960J646K293m445j092N362
1207C142p50l427J876n63j510L731j02m528J663L226k874q80K627j414j049K546
1223A714j899k159M484O94m728N13K698j624J199J417m523m9M909j134l319K295
1239D88k25k043K840N79l926J986K647l781n02L620j566j396K187j790j476M092
1255A734j32m059J510K448k616O81K170l041k13L590k228k506L833Q8l459J350
1271h50J523k278J728J653m296L2M636j712k218K439j272j651L866N0m157J993
$$ y = [1403, -72, 365, 1999, -1599, -2426, 2523, 1554, -2028, 231, 1242, -1844, 276, 1883, -1874, -75, 2790, -1504, -2598, 1860, 1604, -773, 465, -956, -1939, 2448, 3072, -2580, -2192, 1845, 299, 566, 1717, -1616, -1626, 2805, 1391, -2495, 1238, 2424, -676, -39, 1338, -622, 1024, 3317, -1128, -2220, 3142, 2392, -1035, 841, 278, -1232, 2499, 2397, -2131, -468, 2758, -116, -996, 1631, 217, -832, 1714, -185, -2344, 2140, 2834, -1894, -1381, 1317, -307, 892, 2309, -2214, -2263, 2646, 1512, -1807, 488, 263, -1780, 1060, 1639, -2287, -301, 2346, -1435, -1937, 1683, 117, -1279, 908, -882, -2358, 1734, 1602, -2457, -947, 1501, -1115, -434, 1736, -1305, -1518, 2072, -156, -2662, 1171, 1259, -2200, -850, 673, -1605, 123, 1776, -2520, -2488, 2148, 436, -1782, 657, -615, -2266, 1600, 1650, -2507, -514]
1287e14J811l114O84L149k692q14K993k109j298L978m96l938J780K011k343J436
1303E24J106l525J198L431k876j662L592q21k495K516Q2k872K637J355l937N19
1319a228L301j604j442J734j750q35M275j042l707J895J750k384J127J642l062
1334a330O89K856k485j499L465m85k941J890P04j961K152N10m426J871L755k358
1350D07k008K392j139p24L407j761l431L206K048l675O00K046j797N70J744l000
1366a115p72M562j063l655J974J152j665J943M03m150J641L458k721j487K988
1381A493j558q61K251j173j862L121N56m005J188K950k191l24J214k415K19L939
1397B542j600l407K614J106k322J379Q91l047J477K926l756m76L492j125k329
$$ y = [-514, 1297, -1817, -1133, 2016, -676, -1490, 1503, -606, -1904, 2074, 1578, -2360, -580, 1431, -912, 524, 1630, -1895, -697, 2734, -142, -1804, 1788, 967, -1528, 988, 1070, -1802, 835, 2190, -1747, -1228, 2073, 469, -973, 761, -989, -1824, 2451, 1409, -2298, -403, 1347, -1037, 90, 1732, -1330, -641, 2215, -270, -1769, 1696, 1211, -1730, 160, 864, -1097, 1055, 1565, -2861, -990, 2765, 407, -1601, 791, -348, -1072, 2335, 574, -2857, 349, 2397, -1278, -678, 1368, -429, 141, 1885, -1115, -1887, 2675, 1612, -2043, -69, 1083, -582, 1361, 1764, -2386, -745, 2713, -8, -1495, 1493, -65, -926, 1325, 152, -1710, 1411, 1967, -2038, -850, 2100, -91, -415, 799, -1616, -1397, 2542, 942, -2465, 149, 1255, -1067, 312, 1203, -1844, -367, 2559, -1197, -1673, 1819, 694, -1635]
1412a635K530p92j497K752n8l631J608K785k557j56J813k366k24L330j483k686
1428b267K649Q90k919J688J437k891R44J869k750k1L649j864k300K658m44j803
1444a475K828l05l251J971K173k894rK368j772r31K744j346j887K859o4k895J679
1461b07J593k574R29J204k306L11L069k055j936L163k02k809K555O15k700J245
1477a05J777l026M99K705j954j383K644p80j412K423n74l176K619J620l060P53
1493d30J734k345J60K455j720j553K992n68k933K513P26k297J534R58k937J190
1509e21K780k578j570K986q92j507K589r37k397K491J538l636O98K560j971m61
1525h28K036j703o62L165j222l318L012J264k577M89J006j999J380K037k914q10
$$ y = [-1635, 895, 103, -1394, 1358, 1300, -2331, -723, 2062, -495, -651, 1162, -1204, -1428, 1902, 419, -2267, 382, 1272, -1647, 41, 1478, -1413, -469, 1400, -1350, -1371, 2278, 414, -1886, 772, 328, -1475, 1353, 1048, -2203, -232, 1941, -953, -962, 1406, -366, -1297, 1447, 101, -1786, 1073, 1009, -1886, -207, 1386, -1188, -259, 945, -1361, -1050, 2019, -36, -1972, 1191, 989, -1820, 735, 1350, -1350, -105, 1672, -1354, -855, 1850, -104, -1487, 1157, 377, -1035, 1388, 814, -2362, 257, 1877, -1183, -430, 1304, -1041, -881, 1574, -146, -1699, 1293, 725, -2208, 305, 1031, -1266, 268, 1226, -1711, -521, 2259, -319, -1889, 1097, 205, -1302, 1287, 350, -2047, 444, 1982, -1654, -956, 1604, -367, -828, 1208, -495, -1157, 2008, 786, -2532, 480, 1744, -833, -344, 662, -1337, 43, 2080, -834, -1644]
1541a644K941o86j899K052j87k121K377N42l138R57K820k438r13K138p83p10K346
1558A654j640k301K507J442k687N99J222j937R04K154k532r78L176j051k099J688
1574A21O63j803J413K62k300J304K771k872j081K573j485j86K343j733j852K677
1590H15N93k887J333J380j700Q0J788k067k86L024j824k161K515L79k020J308
1606B70L97k290J647K101k819n24K505j203j064K146r33j607K272K33k638J442
1622f5J995k417k99K097j854r2K072j300j793K580K74k311J107J087k262R69J751
1639A539k378j50K693j560j507K319m32j951K345j15k310J351K031k681q6K325
1655A433j707k51J812j572j700L562p15k294J552J075k545J432J111k517P06K305
$$ y = [-1644, 1297, 611, -1288, 764, 577, -1544, 833, 1375, -1763, -806, 2014, -424, -1337, 801, 18, -692, 1654, 14, -2287, 220, 1662, -1025, -426, 796, -1141, -237, 1917, -615, -1593, 1583, 532, -1567, 121, 784, -1019, 394, 656, -1644, -340, 2431, -441, -1522, 1051, -434, -620, 1723, -10, -1862, 815, 1408, -1479, -146, 1234, -466, -386, 1402, -665, -951, 2073, 249, -1912, 603, 982, -1038, 270, 667, -1623, 24, 2125, -694, -1218, 1287, 84, -980, 1166, 233, -1374, 898, 1131, -1507, -65, 1930, -487, -786, 1311, -543, -635, 1437, 137, -1656, 924, 1198, -1113, -6, 1081, -1181, -212, 1539, -839, -989, 1704, 144, -1363, 956, 524, -1427, 918, 803, -1507, -156, 1875, -806, -892, 1433, -274, -525, 1287, -285, -1985, 1577, 862, -1432, 120, 1195, -1350, 82, 1193, -1324, -618, 1687]
1671A687k030j489K988m13j951J529J28k034J767J460k749K40K485j828o85J897
1687A002j120j105K053k80k603K156J508k847O97J347j725M42K130j902j318K910
1703A345m54j790Q78J086k538J579R44k764R70K284j947j017K057n93j115J949
1719H74l54k478K662J069k879K33K096j871K50J706j789q94K600n52k223K040
1735D90M35j815P28J120k189Q25K240k288j068K727o90j696J675J16k233J958
1751C35R20k259K01K218k237j47J972j300o60K270j054k004K344Q29k589J021
1767a40J408k064P68K002k361j197L132p35k179J872K41j881J856K71k488J258
1783b37J857k143k23J766j169m03J733j098j806K782M20k866J246J389j759L87
$$ y = [1687, -343, -1832, 1156, 743, -1208, 321, 449, -1585, 182, 1642, -1107, -867, 1618, -210, -895, 1002, -118, -1223, 830, 550, -2053, 103, 1611, -1236, -539, 808, -917, -475, 1655, -247, -1565, 1345, 891, -899, -21, 1065, -1473, 106, 1050, -1714, -744, 1540, -407, -1424, 633, 40, -1075, 874, 520, -1958, 704, 1773, -1106, -873, 1223, -648, -398, 1308, -481, -1375, 1225, 673, -1550, 490, 925, -890, -162, 958, -1231, -406, 1834, -454, -1522, 1205, 515, -1181, 494, 610, -1623, 335, 1255, -1004, -803, 1415, -822, -969, 1003, -297, -957, 1313, 259, -1745, 599, 1428, -1161, -140, 1268, -796, -28, 1974, -387, -1584, 1548, 813, -1366, 506, 747, -1134, 722, 993, -1495, -237, 1620, -523, -746, 1020, -149, -552, 1181, 83, -1723, 1059, 1479, -1387, -141, 1248, -511, -124]
1799a24J476j651r09K343j080j357K004J81j751J301M39k249J272J466k082o02
1815a323K604j263j046J885q19j227K062J66k519J414J214j780L52J395j911K7
1831g69K352j575j415K292K56k262J325M73j740J276J324k534j94K539j450j215
1847a317K244o61j471J681M44k359J563J039j930j72K224j760n42J863o92j758
1863a604K433J07k448J437J015j821P00J381j902j24K296j606j324K270l55j492
1879a037J424L43j785J137J097k258L52K187j637q06J692p57q67J719j07k115
1895a418J649J014k116N56J229j550J61J711j649q67K364j8k394J412P06j813
1911a023J249R85k298N68J682j417q53J707l27j125J700m41j902J835J293k543
$$ y = [-124, 1352, -299, -1208, 1135, 55, -1302, 702, 883, -868, 433, 872, -1377, -105, 1361, -721, -1323, 1281, 18, -1028, 857, 38, -1189, 873, 1039, -1480, -66, 1148, -632, -280, 1115, -796, -769, 1583, 8, -1407, 885, 1141, -1121, 204, 677, -1063, 213, 1537, -997, -1191, 1348, -102, -1317, 927, 266, -1205, 476, 920, -1439, 124, 1163, -767, -939, 1285, -475, -1017, 846, 154, -1604, 829, 936, -1512, -75, 940, -881, -181, 1200, -702, -826, 1470, -136, -1460, 810, 455, -1037, 387, 730, -1055, 82, 1179, -1079, -727, 1460, -177, -983, 709, -48, -915, 804, 697, -1418, 231, 1245, -871, -315, 914, -636, -475, 1236, -413, -1280, 1084, 1066, -1328, 84, 790, -1023, 226, 1211, -1087, -519, 1163, -254, -1107, 600, 273, -852, 848, 407, -1495, 340, 1633, -910]
1927i10O07J199j537J72J591j394r10K325m98j748J309P83j782Q13J035k101P86
1944b60J945k038r03K403p75j318J592k74j713J479J382k355N21J347j795R2J529
1961H59j297p12K173m24k187J847N44j523Q08P39j634L86J961k019o24K062m16
1978E43j421J699k25j729J449J075k497O83J629j349k88J332j239p05K258o31
1994E84j713J832M0j634J220L78j540P33J591j501j138K159q54j351J601J20j677
2011a150J626O75j737J42J554j474q7J464j413o79K009l93j617J489J20j391J013
2028A51Q02j719R4J611j127n43J317m45r71J200K31k051J636R59j990Q39P87j521
2046g40L20J669j143j182J714J0j917J723J21j270J031P93j906N1K021j505p18
$$ y = [-910, -303, 896, -641, -469, 1122, -272, -1182, 1143, 645, -1103, 206, 989, -793, 20, 1055, -1046, -260, 1685, -353, -1256, 1147, 372, -946, 646, 372, -1341, 138, 1520, -835, -314, 1033, -762, -670, 859, -438, -1150, 1023, 599, -1588, 259, 803, -720, 88, 827, -807, -421, 1540, -479, -1103, 959, 543, -878, 821, 596, -1133, 316, 1391, -1106, -423, 1206, -143, -431, 901, -338, -1043, 1215, 584, -1129, 703, 743, -891, 329, 707, -833, -100, 1491, -10, -1148, 1011, 157, -1194, 407, 527, -1150, 476, 1151, -586, -444, 1110, -364, -451, 1013, -400, -1079, 930, 537, -1080, 409, 529, -862, 151, 953, -766, -672, 939, -188, -731, 586, 141, -830, 370, 601, -1450, 186, 1145, -845, -6, 781, -740, -420, 1249, 106, -1076, 638, 648, -1269, 454, 575, -695, 336, 1129, -777, -726, 1295, -210, -928]
2063i28J429m05j011K028o18j894J421J228j834K63J118j353K83J318j609o26
2079a190J963M1j603J170p2j082J333P12k422J72K265j364m38R99n35m68J651
2096A132m96k292J568J440k041J81J108j307l7K148j949p61K235l67j548R95O58
2113F67j407J380K06k187M33K436j233j070R89l43q45J958n54k033J527J532j912
2130d56k84J219j150N49J436j908q32K398M8j971J212q7q56J187M37j755j20K364
2148A431j368r28J245l28o93J607k07k046J308J376k016J67R75j302P60J451j833
2165d01j277K592k0j812Q92M24j231J419L87k338K88K265j284n60R05m41m32J784
2183A160q15j873J737J096j756J49Q24j169P52J221j589r41J730O66j806N57L57
$$ y = [-928, 501, 96, -915, 1113, 495, -1399, 22, 1250, -584, -321, 797, -556, -273, 1045, -564, -1190, 773, 814, -789, 381, 309, -773, 560, 1272, -1150, -978, 1287, -77, -515, 484, -51, -519, 1132, 636, -1656, -88, 1352, -689, -508, 600, -707, -744, 1404, -545, -1306, 929, 562, -986, 9, 667, -740, 640, 846, -1341, -908, 1528, 295, -775, 214, -129, -974, 984, 430, -1603, -76, 1456, -456, -740, 479, -671, -122, 1314, -594, -1426, 972, 1020, -951, 261, 174, -682, 505, 942, -813, -933, 1431, 63, -865, 380, 52, -641, 966, 759, -1287, 21, 1397, -619, -452, 523, -779, -19, 1432, -401, -1678, 914, 894, -918, -26, 398, -833, 586, 973, -1365, -1077, 1188, -96, -656, 249, -192, -624, 1160, 345, -1528, 209, 1305, -451, -302, 522, -647, 105, 1326, -263, -1204, 526, 1192, -614, -57, 300]
2200C00j088J041Q85k336N43J757q78j039J265o50m15J764n89j959J348J254j719
2217e16L91N02j017M85J608j847j033K231J64j658P95k5j276J797O73k295J21
2234i00J876p69p89J115o75j70J671n81k229J418J251j069l76Q06j221K41J955
2251A554j867j552K220N39j110P06o99q92J565R63k376j69J928o04p14J198r45
2268b55m79J862k04k507J009J469j107J36N39j638J078J599j822j443J884P57
2284H78j448J015r46o02J532R78k517R8J964n10k61M10j734N74J918o62k228R66
2302e75J748j086J7r4j058R36J855k086j562J933P87j038L59q23m77J672P16j952
2320g28o43K197l66p05N98j090j85K339o38k407R50J719r76Q5J15j288J087J679
$$ y = [300, -788, 253, 1138, -1198, -655, 1102, 224, -815, 450, -200, -615, 1149, 560, -1399, -51, 1203, -516, -125, 377, -640, -155, 1453, -394, -1427, 804, 968, -690, 105, 80, -1196, 601, 1274, -1021, -900, 976, 207, -582, 533, -142, -312, 1359, 778, -1451, -33, 1218, 149, -227, 579, -642, -401, 1554, -313, -1865, 355, 894, -216, 490, -209, -1101, 464, 1427, -949, -1118, 810, 206, -508, 690, -255, -734, 1128, 924, -1583, -574, 895, -212, -76, 463, -1175, -97, 1502, -320, -1763, 121, 878, -570, 445, -501, -1103, 429, 1407, -1110, -1012, 952, 442, 181, 591, -1143, -569, 1349, 687, -1541, -575, 1173, 87, 104, 10, -1048, -112, 1743, -343, -1905, 28, 815, -223, 136, -687, -1164, 508, 1224, -728, -1371, 826, 460, -245, 353, -737, -922, 1417, 779, -1628, -678, 1041, 65, 150, 265, -1023, 64, 1743]
$$ [...]
8191b7
##END NTUPLES=NMR FID
##END=
