##TITLE=1H_CA-8410-2
 CDCl3, 8 sc, 
 6.5.2019
##JCAMPDX= 6.0         $$ Bruker NMR JCAMP-DX V2.0
##DATA TYPE= NMR FID
##DATA CLASS= NTUPLES
##ORIGIN= UXNMR, Bruker Analytische Messtechnik GmbH
##OWNER= root
$$ XWIN-NMR		Version 3.5
$$ Mon May  6 16:52:29 2019 Russian Standard Time (UT+4h)  she@DPX200
##.OBSERVE FREQUENCY= 200.1315
##.OBSERVE NUCLEUS= ^1H
##.DELAY= (6, 6)
##.ACQUISITION MODE= SIMULTANEOUS
##.ACQUISITION SCHEME= undefined
##.AVERAGES= 8
##.DIGITISER RES= 18
##SPECTROMETER/DATA SYSTEM= spect
##.PULSE SEQUENCE= zg30
##.SOLVENT NAME= CDCl3
##.SHIFT REFERENCE= (INTERNAL, CDCl3, 0, 15.7039)
##AUDIT TRAIL= $$ (NUMBER, WHEN, WHO, WHERE, WHAT)
$$ ##TITLE= Audit trail, XWIN-NMR		Version 3.5
$$ ##JCAMPDX= 5.01
$$ ##ORIGIN= Bruker BioSpin GmbH
$$ ##OWNER= she
$$ F:/spectra/data/she/nmr/H-F/1/audita.txt
$$ ##AUDIT TRAIL=  $$ (NUMBER, WHEN, WHO, WHERE, WHAT)
(   1,<2019-05-06 16:51:26.46 +0400>,<she>,<DPX200>,
      <created by zg, POWCHK disabled, PULCHK disabled
       configuration hash MD5:
       00 E9 B6 7A A2 85 ED C7 34 08 36 98 17 FE 4E 26
       data hash MD5: 16K
       E4 FA 2B C0 C1 B6 94 12 74 AB 97 15 A5 35 B7 7B>)
$$ ##END=
$$ 
$$ hash MD5
$$ 97 84 BE 35 24 3E 8E AE DE A6 EF BF CF 93 F1 6A
##$RELAX= 
##$RELAX= 
##$RELAX= 
##$RELAX= 
##$RELAX= 
##$RELAX= 
$$ Bruker specific parameters
$$ --------------------------
##$DU= <F:/spectra>
##$EXPNO= 1
##$NAME= <H-F>
##$PROCNO= 1
##$TYPE= <nmr>
##$USER= <she>
##$AMP= (0..31)
100 100 100 100 100 100 100 100 100 100 100 100 100 100 100 100 100 100 
100 100 100 100 100 100 100 100 100 100 100 100 100 100 
##$AQSEQ= 0
##$AQ_mod= 1
##$AUNM= <au_zg>
##$AUTOPOS= <>
##$BF1= 200.13
##$BF2= 200.13
##$BF3= 200.13
##$BF4= 200.13
##$BF5= 200.13
##$BF6= 200.13
##$BF7= 200.13
##$BF8= 200.13
##$BYTORDA= 1
##$CFDGTYP= 0
##$CFRGTYP= 5
##$CHEMSTR= <none>
##$CNST= (0..31)
1 1 145 1 1 1 1 1 1 1 1 1 1 1 1 1 1 1 1 1 1 1 1 1 1 1 1 1 1 1 1 1 
##$CPDPRG= <>
##$CPDPRG1= <>
##$CPDPRG2= <>
##$CPDPRG3= <>
##$CPDPRG4= <mlev>
##$CPDPRG5= <mlev>
##$CPDPRG6= <mlev>
##$CPDPRG7= <mlev>
##$CPDPRG8= <mlev>
##$CPDPRGB= <>
##$CPDPRGT= <>
##$D= (0..31)
0 1.2 0 0 0 0 0 0 0 0 0 0.03 0 0 0 0 0 0 0 0 0 0 0 0 0 0 0 0 0 0 0 0 
##$DATE= 1557147085
##$DBL= (0..7)
120 120 120 120 120 120 120 120 
##$DBP= (0..7)
150 150 150 150 150 150 150 150 
##$DBP07= 0
##$DBPNAM0= <>
##$DBPNAM1= <>
##$DBPNAM2= <>
##$DBPNAM3= <>
##$DBPNAM4= <>
##$DBPNAM5= <>
##$DBPNAM6= <>
##$DBPNAM7= <>
##$DBPOAL= (0..7)
0.5 0.5 0.5 0.5 0.5 0.5 0.5 0.5 
##$DBPOFFS= (0..7)
0 0 0 0 0 0 0 0 
##$DE= 6
##$DECBNUC= <off>
##$DECIM= 24
##$DECNUC= <off>
##$DECSTAT= 4
##$DIGMOD= 1
##$DIGTYP= 9
##$DL= (0..7)
0 120 120 120 120 120 120 120 
##$DP= (0..7)
150 150 150 150 150 150 150 150 
##$DP07= 0
##$DPNAME0= <>
##$DPNAME1= <>
##$DPNAME2= <>
##$DPNAME3= <>
##$DPNAME4= <>
##$DPNAME5= <>
##$DPNAME6= <>
##$DPNAME7= <>
##$DPOAL= (0..7)
0.5 0.5 0.5 0.5 0.5 0.5 0.5 0.5 
##$DPOFFS= (0..7)
0 0 0 0 0 0 0 0 
##$DQDMODE= 0
##$DR= 18
##$DS= 0
##$DSLIST= <SSSSSSSSSSSSSSS>
##$DSPFIRM= 0
$$ [...]
##$SUBNAM2= <"">
##$SUBNAM3= <"">
##$SUBNAM4= <"">
##$SUBNAM5= <"">
##$SUBNAM6= <"">
##$SUBNAM7= <"">
##$SUBNAM8= <"">
##$SUBNAM9= <"">
##$SW= 24.9337058887773
##$SWIBOX= (0..15)
0 0 2 0 0 0 0 0 0 0 0 0 0 0 0 0 
##$SW_h= 4990.01996007984
##$TD= 16384
##$TD0= 1
##$TE= 0
##$TE2= 300
##$TE3= 300
##$TEG= 300
##$TL= (0..7)
0 120 120 120 120 120 120 120 
##$TP= (0..7)
150 150 150 150 150 150 150 150 
##$TP07= 0
##$TPNAME0= <>
##$TPNAME1= <>
##$TPNAME2= <>
##$TPNAME3= <>
##$TPNAME4= <>
##$TPNAME5= <>
##$TPNAME6= <>
##$TPNAME7= <>
##$TPOAL= (0..7)
0.5 0.5 0.5 0.5 0.5 0.5 0.5 0.5 
##$TPOFFS= (0..7)
0 0 0 0 0 0 0 0 
##$TUNHIN= 0
##$TUNHOUT= 0
##$TUNXOUT= 0
##$USERA1= <user>
##$USERA2= <user>
##$USERA3= <user>
##$USERA4= <user>
##$USERA5= <user>
##$V9= 5
##$VALIST= <valist>
##$VCLIST= <CCCCCCCCCCCCCCC>
##$VD= 0
##$VDLIST= <DDDDDDDDDDDDDDD>
##$VPLIST= <PPPPPPPPPPPPPPP>
##$VTLIST= <TTTTTTTTTTTTTTT>
##$WBST= 1024
##$WBSW= 4
##$XGAIN= (0..3)
0 0 0 0 
##$XL= 0
##$YL= 0
##$YMAX_a= 283278
##$YMIN_a= -398024
##$ZGOPTNS= <>
##$ZL1= 120
##$ZL2= 120
##$ZL3= 120
##$ZL4= 120
##$ABSF1= 10
##$ABSF2= 0
##$ABSG= 5
##$ABSL= 3
##$ALPHA= 0
##$AQORDER= 0
##$ASSFAC= 0
##$ASSFACI= 0
##$ASSFACX= 0
##$ASSWID= 0
##$AUNMP= <proc_1d>
##$AZFE= 0.1
##$AZFW= 0.1
##$BCFW= 1
##$BC_mod= 2
##$BYTORDP= 1
##$COROFFS= 0
##$CY= 11.3945322036743
##$DATMOD= 1
##$DC= 2
##$DFILT= <>
##$DTYPP= 0
##$F1P= 18.9103706918063
##$F2P= -1.10871071338519
##$FCOR= 0.5
##$FTSIZE= 0
##$FT_mod= 4
##$GAMMA= 1
##$GB= 0.15
##$INTBC= 1
##$INTSCL= 1
##$ISEN= 128
##$LB= 0.24
##$LEV0= 0
##$LPBIN= 0
##$MAXI= 10000
##$MC2= 0
##$MEAN= 0
##$ME_mod= 0
##$MI= 1.114404
##$NCOEF= 0
##$NC_proc= 0
##$NLEV= 6
##$NOISF1= 3.799351
##$NOISF2= 2.8
##$NSP= 1
##$NTH_PI= 0
##$NZP= 0
##$OFFSET= 15.70392
##$PC= 1
##$PHC0= -8855.603
##$PHC1= 16.80026
##$PH_mod= 1
##$PKNL= yes
##$PPARMOD= 0
##$PSCAL= 0
##$PSIGN= 0
##$REVERSE= no
##$SF= 200.130013532006
##$SI= 16384
##$SIGF1= 3
##$SIGF2= 2
##$SINO= 400
##$SIOLD= 16384
##$SREGLST= <1H.CDCl3>
##$SSB= 0
##$STSI= 0
##$STSR= 0
##$SW_p= 3612.71676300578
##$SYMM= 0
##$S_DEV= 0
##$TDeff= 0
##$TDoff= 0
##$TI= <>
##$TILT= no
##$TM1= 0
##$TM2= 0
##$TOPLEV= 0
##$USERP1= <user>
##$USERP2= <user>
##$USERP3= <user>
##$USERP4= <user>
##$USERP5= <user>
##$WDW= 1
##$XDIM= 8192
##$YMAX_p= 0
##$YMIN_p= 0
$$ End of Bruker specific parameters
$$ ---------------------------------
##NTUPLES= NMR FID
##VAR_NAME=  TIME,          FID/REAL,        FID/IMAG
##SYMBOL=    X,             R,               I
##VAR_TYPE=  INDEPENDENT,   DEPENDENT,       DEPENDENT
##VAR_FORM=  AFFN,          ASDF,            ASDF
##VAR_DIM=   8192,          8192,            8192
##UNITS=     SECONDS,       ARBITRARY UNITS, ARBITRARY UNITS
##FACTOR=    0.0002004,     1,               1
##FIRST=     0,             0,               0
##LAST=      1.6414764,     0,               0
##MIN=       0,             -398024,         0
##MAX=       1.6414764,     283278,          0
$$ Real data points
##PAGE= N=1
##DATA TABLE= (X++(R..R)), XYDATA
0 0 0 0 0 0 8 -8 8 -8 16 -16 24 -24 32 -40 48 -56 65 -80 96 -112 133 -154 177 -206 237 -272 309 -353
28 -353 398 -450 509 -572 640 -717 800 -892 991 -1103 1222 -1355 1501 -1663 1841 -2037
44 -2037 2258 -2505 2781 -3098 3460 -3883 4380 -4975 5706 -6621 7817 -9451 11819 -15597
58 -15597 22597 -39983 175257 168956 -211128 -114343 130930 283278 128194 -72461 -102257
69 -102257 94348 171926 22105 -149963 -94967 51559 107208 -1296 -138701 -140747 25542
80 25542 115511 692 -149788 -130790 -7067 78193 43158 -72494 -134574 -49230 45694
91 45694 14358 -62310 -60274 -21588 -14923 -41434 -69455 -48559 32286 50592 -51749 -120955
103 -120955 -45074 57023 62643 1277 -47096 -28872 40749 53615 -20693 -43468 42224 91075
115 91075 21563 -61269 -61700 15148 95816 66967 -66078 -121537 -13198 97161 71701 -28770
127 -28770 -90541 -57674 49180 102027 23783 -61438 -27392 51356 63706 20102 -23635 -13294
139 -13294 63944 100915 10614 -85388 -43503 66320 101443 42262 -50284 -89772 -21348 67033
151 67033 51476 -20884 -37052 -15396 -6853 1847 4766 -14464 -14902 6467 1015 -14672 -6607
164 -6607 -12454 -34294 -15685 15318 -6953 -44421 -39816 -16291 1729 1206 -43323 -84254 -34857
177 -34857 49649 45528 -30105 -77877 -62112 8006 78015 56199 -36557 -64133 1701 53178
189 53178 40486 -732 -29584 -4012 57321 48667 -39457 -70585 1791 65853 46859 -22329
201 -22329 -75094 -46569 44297 67813 -14309 -70133 -25672 32442 36880 4728 -32111 -29994
213 -29994 18523 35295 -9146 -29027 5930 19721 -4881 -21573 -23865 -11957 17930 20053
225 20053 -22354 -37011 -4761 6142 -9144 -4259 10142 11720 10778 -7372 -35899 -9501 56246
238 56246 55925 -13819 -52912 -26545 25558 54741 13854 -62296 -59103 26554 55569 -14142 -74892
251 -74892 -54792 13659 57239 11899 -78969 -77512 26711 76175 6537 -70543 -60948 15965
263 15965 80255 47282 -59028 -92236 -2365 76974 49201 -23237 -57448 -30108 30540 43320
275 43320 -17811 -52996 1062 54400 30358 -25603 -50120 -20383 48506 76540 13761 -52641
287 -52641 -31354 26198 44638 28358 -1807 -24454 -5597 26839 16282 -9952 -4082 3334
299 3334 -7897 -2954 11132 2830 -4969 1283 -3945 -6749 11261 14552 -2307 5817 23577 7825
313 7825 -13003 -4785 11430 26034 37196 11162 -34429 -28529 19630 38358 21995 -533 -24812
326 -24812 -25356 11747 31410 5606 -12510 -3014 1485 3288 10014 213 -9496 9672 21067 -2938
340 -2938 -15885 -370 8594 10316 10864 -10071 -31379 -10232 21522 17886 -2244 -20654 -38609
353 -38609 -23426 27071 42413 1168 -35222 -34415 -8505 29543 41369 342 -31542 -2800
365 -2800 28858 14012 -12189 -13180 9026 39972 36497 -23543 -59909 -8205 58569 52160 -5687
378 -5687 -49552 -38948 26759 71899 25023 -47886 -39002 25652 55976 31496 -14797 -36583
390 -36583 1862 50829 28879 -26163 -23831 21251 34988 5754 -34537 -45377 2040 56104
402 56104 30943 -43108 -62092 -18402 21380 28883 3676 -32487 -31447 2707 7596 -13905 -9897
415 -9897 7409 -316 -15362 -17864 -15507 -441 15606 -4219 -34698 -22730 9232 8861 -7555
428 -7555 -13177 -13454 -4050 9147 -1982 -17059 6563 32294 9800 -25270 -22946 8496 41703
441 41703 46216 -2039 -50243 -25230 38110 50581 11958 -22013 -25445 3365 34315 17025
453 17025 -23492 -15672 26697 31271 -1299 -23339 -17382 16423 47468 24986 -30304 -34344 16278
466 16278 44263 25627 -9236 -32483 -16440 30343 42143 -196 -30576 -17277 3081 13761
478 13761 14862 -3746 -19328 -3900 9161 -7116 -15859 -2201 5297 5321 4287 -15852 -34880
491 -34880 -17123 13843 14833 -1851 -20220 -39620 -31535 6487 18681 -10177 -31810 -28158 -15049
504 -15049 2232 6106 -20181 -34825 -7964 14995 1364 -15834 -15696 -6741 9777 15202 -10393
517 -10393 -25422 4178 31637 15634 -13246 -22021 -10357 19285 36697 8951 -26097 -16459
529 -16459 10573 14550 8100 3515 -3911 115 9443 -544 -12034 5463 20222 4652 -9234
542 -9234 -4830 -374 4413 8311 -3926 -11730 5217 13742 -8050 -18578 -105 13385 8133 -4573
556 -4573 -18397 -9867 25946 33752 -8791 -36949 -8700 31339 40717 14603 -25888 -30625 16939
569 16939 47098 12368 -28073 -16048 18429 30535 6302 -34643 -37804 17134 53634 10653
581 10653 -48518 -46727 3457 40440 27727 -25645 -53220 -8892 42664 23670 -28936 -38736
593 -38736 -4165 29975 28110 -15328 -45495 -10897 37661 26349 -18057 -29898 -3694 26225
605 26225 30852 -2455 -32882 -9926 33181 32244 1198 -10842 -2155 9795 17431 7826 -6768
618 -6768 5578 23206 5892 -19348 -11914 8394 14374 7600 -9460 -22062 -6998 13140 -817
631 -817 -21308 -10459 7024 3892 -8293 -18118 -17057 6331 21985 -3123 -30889 -13745 18319
644 18319 21712 2461 -19152 -22655 7549 36557 17911 -17721 -15887 9810 20895 16095 2049
657 2049 -8443 7608 30573 17139 -13679 -11635 14535 29137 25066 2829 -22978 -14135 21945
670 21945 30013 5075 -12902 -12434 -4510 9253 11492 -9349 -19218 -3145 5250 -4279 -8506 -9750
684 -9750 -12736 -4643 5150 -5797 -16475 -7389 623 -847 -841 -6914 -18526 -7419 16651 14686 -7554
699 -7554 -18767 -15161 497 22763 20076 -10851 -22754 -2136 13428 9827 3267 -3472 -2669 12751
713 12751 14797 -7697 -13658 9081 23502 14457 -522 -12325 -9058 15987 28512 4752 -16117
726 -16117 -5974 10436 15068 12127 -1310 -12521 158 16359 8318 -1870 5492 7366 -1006
739 -1006 -1726 336 2033 12154 14090 -5996 -17758 -2312 8746 2347 -1797 -3461 -7943 -5407
753 -5407 -4638 -16088 -14003 6314 7340 -15996 -27097 -16769 -2625 7595 -77 -25652 -31163
766 -31163 -1980 14450 -2520 -22204 -24015 -11320 7658 10447 -13870 -27672 -5177 14858
778 14858 3077 -15608 -16975 -1959 20993 22144 -11260 -33201 -5643 31094 30383 4777 -17427
791 -17427 -17448 10246 32856 15252 -12543 -7696 12631 14752 4281 -5589 -9257 5790 21674
804 21674 7224 -17753 -14364 5818 11993 6895 -5327 -17807 -9337 12989 11985 -9616 -16196
817 -16196 -8238 -1844 5347 5592 -8650 -14929 -3716 -459 -7401 -3512 2922 -2524 -5284 -3238 -8494
832 -8494 -7899 4713 7260 -2414 -3283 -1309 -7466 -3754 8464 6887 -1327 -832 -2244 -5750 3074
847 3074 10782 2085 -4138 745 -38 -209 8747 6913 -6126 -6631 4074 6921 7543 6988 -4219 -8853
863 -8853 5696 14230 2844 -2548 4094 6500 7246 5134 -6920 -8063 13608 24628 5106 -13362
877 -13362 -11126 1836 17420 19913 -3029 -21181 -4520 17816 12661 -4943 -12537 -7046 9585
890 9585 19576 -1085 -24505 -11819 15333 15835 -3911 -18047 -16214 4423 20868 2427 -27962
903 -27962 -21893 8551 18708 3552 -16088 -24044 -7713 16996 11921 -13613 -16328 2078 8886
916 8886 1406 -7201 -11753 -837 17389 11355 -13084 -16293 2805 12873 8918 633 -8807 -5541
930 -5541 11027 11306 -5690 -6411 8375 11188 2687 -1414 -3017 2773 14439 8844 -8460 -5163
944 -5163 13573 14549 726 -5837 -3813 5078 16127 9108 -9475 -5994 12384 11594 -2852 -6605
958 -6605 106 9759 16889 5532 -16305 -11621 13745 20199 5024 -6682 -8633 197 14922 12203
972 12203 -8225 -11415 6725 14475 4157 -4978 -8234 -2768 12176 13418 -6338 -13659 1754
985 1754 11127 5506 -1047 -7153 -7257 6858 13950 872 -10798 -5097 473 2273 6313 2754 -8336
1000 -8336 -6493 1667 -802 -4054 294 -1689 -4382 1931 1169 -10654 -10357 1535 4946 2204 -1273
1015 -1273 -10651 -13139 2449 11874 -678 -10777 -6830 -1274 3457 6137 -4116 -13318 -2220 10340
1029 10340 3389 -5839 -5178 -2934 2765 7522 -1094 -11088 -99 12597 4983 -7419 -7355 -1609 6537
1044 6537 12241 1616 -12511 -5437 8191 4090 -3486 -912 1614 1386 1989 -5340 -10600 2085
1058 2085 13133 1412 -12030 -7317 1916 5582 3992 -5734 -12370 951 13241 1003 -13183
1071 -13183 -7199 4261 6450 1853 -9190 -13070 4212 16773 -1111 -21658 -14041 6989 15959
1084 15959 6749 -14565 -24704 -3214 20697 8811 -16438 -16627 650 11365 6185 -11782 -21666
1097 -21666 -657 22696 9376 -18698 -21040 -672 15945 14072 -6244 -22607 -7084 19612
1109 19612 14979 -9061 -15370 -1689 12132 15040 1654 -14202 -5431 16267 13835 -5045 -8783
1122 -8783 3033 11883 12224 -126 -14360 -5192 16472 15561 -3773 -10031 -2520 3550 6820 2487
1136 2487 -7445 -3617 9093 3885 -11761 -9349 3366 6571 2110 -5946 -13505 -5350 9863 4235
1150 4235 -13287 -12217 1459 4505 545 -6287 -12048 -4979 8931 3594 -12622 -9567 4562 6490
1164 6490 -73 -7103 -11424 -2009 14209 8888 -10356 -12345 465 6399 5528 1721 -6409 -5053
1178 -5053 7029 5978 -6214 -5378 4493 5250 2198 786 -5409 -4763 6113 7727 -1842 -2888 2559
1193 2559 78 568 5774 2098 -3479 899 4685 2072 4772 5642 -3568 -5384 6224 10304 3403
1208 3403 548 -765 -1666 5596 9701 -748 -5121 5724 10946 2586 -3258 -4567 -1098 10489
1222 10489 13965 -2188 -13569 -2479 9733 7240 588 -5603 -7093 4179 11529 -1056 -12820
1235 -12820 -3243 8360 5568 -1179 -6219 -7347 3675 11327 -613 -11863 -2101 8943 6621
1248 6621 -327 -5197 -6127 4222 12940 2702 -8621 -455 8522 4098 -1064 -1267 364 8400 12028
1263 12028 -996 -11136 871 14095 8339 -872 -3769 -1680 7533 11995 -1143 -11783 1159
1276 1159 14272 6612 -5468 -7937 -2656 8157 11802 -3460 -15925 -3036 13516 7593 -6919
1289 -6919 -12239 -6508 6640 13899 -1374 -18408 -8603 8753 6972 -4730 -10117 -7941 3055
1302 3055 10419 -3154 -19398 -9956 8787 8704 -2991 -11663 -12110 -1520 10824 3062 -13127 -9841
1316 -9841 4546 5947 -1512 -6124 -8140 -1454 9221 4567 -9479 -7650 4114 5076 325 -1583
1330 -1583 -3722 -1028 8067 5976 -5621 -4797 4933 4844 2385 3231 773 -1336 4517 4114 -1933 1037
1346 1037 8204 3783 -2387 81 462 449 4917 4376 -3610 -2483 3908 941 -3645 280 1096 -1187
1362 -1187 1054 125 -6411 -4377 2935 -34 -4941 -2441 -1738 -3978 -290 740 -6186 -6325 646 -36
1378 -36 -3194 -360 -1930 -7289 -2773 2704 -638 -2876 -276 -2565 -3336 2393 1411 -5697 -1963 5795
1394 5795 2979 -1963 -2828 -3716 111 9253 5901 -6975 -7176 3564 6111 2175 -1741 -6132 -2652
1409 -2652 9082 7742 -6989 -10022 1516 6818 3617 -1624 -8046 -5479 7392 8405 -7644 -12352
1423 -12352 -431 7451 4993 -2745 -11736 -10146 5840 10637 -3953 -12123 -4039 2604 2247 -1279
1437 -1279 -8489 -7841 4936 8330 -5499 -12982 -3226 4592 4098 169 -7340 -8152 3738 8461 -3299
1452 -3299 -9628 -967 5496 3392 104 -5079 -4894 5678 8789 -3096 -8331 2701 9051 4239
1466 4239 -1406 -5533 -3015 9064 12453 -1418 -8917 728 8696 5906 472 -2923 -2140 8119
1480 8119 10879 -2504 -9983 1415 10799 7163 6 -5957 -4688 6700 12193 -303 -9633 -573
1494 -573 8158 5795 549 -4501 -5665 3644 10907 885 -8151 -1464 5608 2796 -196 -2704 -4404
1509 -4404 3016 9586 788 -7586 -2484 4312 2714 2691 1433 -3507 -1022 5191 1067 -3081 2078
1524 2078 4389 -222 -214 1936 -784 53 4416 1557 -1867 2262 3219 -2092 -869 3797 1717 -621
1540 -621 1730 169 -1122 3488 3176 -4128 -2712 4493 3816 -476 -605 -2749 -2639 3789 4255 -3587
1556 -3587 -3496 2549 1586 -2003 -1680 -1764 -1262 4286 2909 -6315 -5932 2845 2994 -1131 -1348 -2094 -1814 3080
1574 3080 2684 -5448 -4282 4556 3915 -2523 -2584 -902 702 4474 2261 -6196 -3495 7303 6220 -2893
1590 -2893 -4898 -1698 2586 6923 3428 -6782 -4929 7570 7362 -3055 -5635 -598 4475 7815
1604 7815 2200 -9842 -7077 8288 10615 -1425 -7404 -4000 2577 7984 3498 -9582 -8342 7683
1618 7683 10558 -1850 -9021 -5262 2593 8724 4044 -9612 -9845 6203 10473 -1353 -9176 -5705
1632 -5705 2115 8810 4936 -9134 -11328 3790 10050 62 -6656 -4043 1074 6419 3638 -7708
1646 -7708 -8774 5397 10232 -351 -7114 -4380 1235 6344 4930 -5572 -7692 4289 8373 -1502
1660 -1502 -6574 -2797 2041 5367 3403 -6694 -8501 3429 7857 -1830 -7482 -3210 1107 4017
1674 4017 1796 -7578 -9428 2415 7457 -2253 -7837 -4321 -217 1736 438 -7101 -8873 2327
1688 2327 6862 -3040 -9366 -5056 -523 2792 2482 -5312 -9119 55 5134 -1752 -6343 -2859 -54
1703 -54 1190 2162 -3473 -7483 -63 5282 -558 -4083 -732 -97 -62 2326 -1007 -4668 162 4962
1719 4962 263 -1917 1087 -160 -1500 2150 2606 -947 1001 2400 -2290 -1594 4017 1964 -2077
1734 -2077 1295 2365 -809 421 1692 -1746 353 5366 2229 -3996 -1210 2658 1285 1580 730
1749 730 -3271 -1111 5249 2087 -4291 -1807 2497 1661 1159 366 -3900 -1687 4883 2000 -5245 -1873
1765 -1873 3454 1625 366 -836 -3924 -936 6269 3159 -4810 -2556 2775 2144 410 -247 -2201
1780 -2201 448 6204 2650 -5299 -2615 5079 4711 1448 -704 -3167 621 7676 4143 -5034 -2894
1795 -2894 5124 5323 1627 -1286 -3827 534 7714 4398 -5379 -4419 4685 5430 880 -2930 -4958 -389
1811 -389 8728 5549 -6668 -7404 2009 5527 2408 -1547 -5666 -2155 6518 5041 -6231 -7134 2044
1826 2044 5434 2105 -2242 -6124 -3439 6046 6349 -4486 -6900 851 4327 2081 -984 -5025 -3462
1841 -3462 5467 6366 -3446 -6181 695 3554 1672 -26 -3090 -2532 4882 5785 -3285 -5884 1163 4885
1857 4885 2896 930 -2316 -3171 3700 6017 -991 -3428 2849 4388 1857 594 -1224 -1176 4621 6614
1873 6614 -409 -3914 1745 4261 2355 1647 -654 -1975 3268 6320 -198 -3679 1107 3305 1596
1888 1596 2170 -169 -2961 1515 4831 -885 -4060 -124 2398 837 741 -1628 -4967 -772 4134 661
1904 661 -3611 -1232 -611 -1184 990 423 -4128 -1694 3261 265 -3381 -1532 -554 -1089 1676 1460 -3856
1921 -3856 -3190 2072 1462 -1491 -520 -1268 -1456 2266 2932 -3042 -4000 728 1926 -114 508 -1414 -3683
1938 -3683 959 2980 -2373 -4205 460 1595 -270 -648 -2817 -4639 875 4074 -1463 -4983 -1272
1953 -1272 398 -471 59 -1760 -4191 -41 3494 -1893 -5717 -1520 1021 231 331 -2380 -4545 -59
1969 -59 3748 -1226 -5611 -1560 1665 640 156 -2537 -5025 -763 4305 -463 -5087 -1672 1290 134
1985 134 -226 -2120 -4590 236 5000 -100 -5629 -2721 936 994 1072 -911 -4145 -388 4887 917
2001 917 -4388 -1687 2098 2309 2355 -44 -4128 -457 5768 2909 -2923 -1130 1983 2518 2877 720
2017 720 -3566 -652 5677 3538 -2378 -1521 919 1043 2315 1522 -2617 -1498 4209 2623 -2856 -1891
2033 -1891 206 585 2188 1403 -3569 -3922 1792 2003 -1931 -1775 243 -1145 508 1291 -2644 -3504 1719
2050 1719 1656 -1561 -1209 -183 -1374 278 2316 -1328 -2675 1438 2267 -1051 -568 92 -1311 349
2066 349 2934 249 -2590 603 1688 -1049 363 1108 -883 159 2850 -118 -2930 391 2339
2081 2339 508 1225 829 -2261 -829 3219 1117 -2460 -213 1588 401 875 861 -2608 -951 3787
2097 3787 2121 -2452 -973 1405 391 1528 965 -2984 -1321 4135 2748 -2692 -2289 570 1138 2327
2113 2327 2021 -2126 -2460 3480 3312 -1556 -1638 813 1236 2202 1477 -2754 -2836 3650 4754 -268 -1992
2130 -1992 -49 1155 3181 3234 -1917 -2800 3549 5520 6 -1762 -153 1232 3551 3732 -1610 -3031
2146 -3031 3069 5248 618 -1716 -42 1190 3983 4198 -1431 -4234 1554 5371 1387 -1140 -672
2161 -672 54 2107 3142 -1265 -3867 1419 4960 814 -2448 -1526 -486 1768 3516 -1012 -4571 204
2177 204 3754 393 -2385 -1567 -1049 1195 2719 -1010 -4617 -381 3609 256 -2346 -1053 -799 821
2193 821 2673 -948 -5033 -947 3763 1282 -1504 -1688 -1683 -381 2745 323 -3919 -1235 3059 371
2209 371 -1937 -1503 -1546 -180 3076 421 -4170 -2162 1741 428 -1125 -1052 -2028 -1751 1761 974 -3904
2226 -3904 -2854 633 377 -1561 -510 -1887 -2479 840 843 -2843 -2554 933 -93 -1324 -660 -2118 -2941
2243 -2941 1248 2604 -1821 -2655 59 -160 -591 1207 -312 -2240 798 2313 -1092 -1572 566 562 342
2260 342 1774 -104 -2187 270 2890 -137 -1487 309 64 100 2026 357 -3028 -352 2803 74
2276 74 -1392 57 -766 -734 1735 21 -3113 -671 2793 86 -2344 -1077 -1622 -503 2477 680
2292 680 -4003 -2157 2249 748 -1308 -789 -1158 -461 2087 510 -3899 -2213 2123 1394 -1009 -991 -1501
2309 -1501 -937 2713 1596 -3576 -2422 2244 2000 -655 -1283 -2081 -1603 2435 2159 -2557 -2663 1533 1382
2326 1382 -772 -650 -1687 -1410 2216 2519 -2913 -3356 986 1698 55 -167 -1635 -2055 1597 2557 -1988
2343 -1988 -2622 1182 1729 120 -202 -1553 -2348 1442 2859 -1454 -3139 542 1572 -28 -152 -1526
2359 -1526 -2689 1109 3038 -1228 -3443 -295 717 -135 499 -670 -2382 807 2688 -1014 -3323
2374 -3323 35 1550 847 1095 -191 -2679 533 3815 720 -1531 734 1839 739 1942 1222 -1125
2390 -1125 867 4573 2050 -1210 662 2185 1333 2609 1888 -1025 497 4434 2301 -770 610
2405 610 1153 1046 3035 2165 -1615 -591 3161 1851 -608 76 898 128 2289 1788 -1903 -1440 3120
2422 3120 2771 -329 -45 -331 -769 2202 2798 -1320 -1776 2056 1850 -368 -45 -88 -660 1941 2801 -1412
2440 -1412 -2276 1489 1903 -136 13 -785 -1379 1328 2964 -1441 -3322 328 1712 170 201 -637 -1949
2457 -1949 521 2342 -1255 -3273 349 1954 -223 -664 -1267 -2357 962 3304 -209 -3307 -689
2472 -689 1953 404 501 -183 -1732 600 3137 -11 -2858 138 1761 890 433 -177 -1781 -24 3313
2489 3313 140 -3366 -1023 1601 524 303 -890 -3329 -1216 2920 344 -3210 -1457 298 -259
2504 -259 -747 -933 -3094 -1214 2690 640 -3789 -1994 579 322 244 335 -2815 -1572 2387 1584 -2088
2521 -2088 -1143 1172 551 929 479 -1451 -1154 2667 1760 -1572 -642 1030 596 1021 1048 -1246 -1550 2212
2539 2212 2312 -989 -951 399 -711 193 1615 -633 -1422 1348 1231 -1723 -1143 430 -584 -7 1168
2556 1168 -1348 -2329 809 1542 -1274 -950 118 -1371 -843 1324 -792 -2500 170 954 -812 -75
2572 -75 423 -1493 -1043 1395 -226 -2470 -43 935 -1083 -1193 -581 -1898 -1238 1745 370 -2960 -1470
2589 -1470 380 -996 -404 112 -2131 -1884 1242 -5 -2997 -1289 614 -383 -139 -60 -2139 -1913 1541
2606 1541 1352 -2257 -1931 -43 -106 392 702 -2378 -2310 1792 2078 -1460 -1411 190 20 672 930 -1646
2624 -1646 -1994 1891 2622 -1558 -2424 -43 276 1483 1873 -1824 -2932 1342 2831 -856 -1594 29
2640 29 124 943 1617 -1268 -2796 1577 3083 -348 -1454 -174 186 1339 2290 -1264 -2732 1606 3784
2657 3784 432 -1364 -330 493 1835 2768 -186 -2291 1134 3856 263 -1451 310 1008 1727 2523
2673 2523 -653 -2870 989 4015 1091 -1225 242 492 1510 2385 -319 -2581 1062 3820 1137
2688 1137 -1542 -325 373 1325 2682 716 -2365 78 3701 1287 -1156 -50 5 996 3189 735
2704 735 -2578 -103 2857 1244 -1213 43 -189 3 2304 770 -2548 -901 2699 975 -557 -138
2720 -138 -686 -725 2082 957 -2107 -1068 1842 521 -1158 -344 -374 -1024 1033 1397 -2126 -1202 1511
2737 1511 468 -833 119 -301 -1375 1324 1427 -1755 -1240 1417 587 -577 721 62 -1639 827
2753 827 1831 -933 -1225 1830 747 -805 932 367 -1274 940 1894 -545 -983 822 143 -608 1179
2770 1179 810 -1757 28 2080 -145 -1159 820 220 -112 933 365 -2082 -184 2148 -14 -974
2786 -974 561 171 -607 1630 629 -2328 -623 2057 657 -1048 551 -306 -873 1607 1232 -1583
2802 -1583 -911 2266 1023 -893 -98 -445 -480 1655 1510 -1978 -1724 1577 1481 -463 -131 -539 -1043 1711
2820 1711 1572 -2035 -1781 1553 1054 -573 -294 -1326 -1489 1237 1675 -2406 -2598 551 1007 -631 -782
2837 -782 -1618 -2314 697 1779 -1999 -2888 416 480 -1058 -837 -1115 -2086 726 1975 -2052 -3491 -427
2854 -427 909 -648 -486 -1130 -2255 216 2138 -1524 -2994 38 745 -654 -321 -1167 -2168 8
2870 8 1852 -1283 -2716 -176 1177 -201 -215 -1095 -2472 -108 2090 -781 -2661 -601 584 -623
2886 -623 169 -494 -2012 -18 1590 -799 -3052 -411 1109 -161 373 -316 -2379 -626 2414 79
2902 79 -2188 -106 516 -67 653 294 -1912 -462 2013 485 -1714 -266 723 -174 663 765 -1550
2919 -1550 -815 2458 1134 -1213 -135 254 -114 1271 1710 -747 -1186 1744 1244 -603 375 797 -112
2936 -112 741 1871 -511 -1089 1942 2035 -456 350 644 -377 768 2204 -371 -1028 1486 1485 -87 192
2954 192 716 -762 315 1896 -292 -1473 878 943 -362 -61 407 -849 206 1830 -432 -2067
2970 -2067 229 1135 -56 251 193 -1602 -663 1921 195 -1743 324 973 -513 -30 156 -1387 -223
2987 -223 2299 648 -1842 5 1187 -8 330 531 -1402 -583 2641 1072 -1603 -607 932 -6
3003 -6 1020 920 -1346 -715 2444 881 -1499 -428 1093 510 568 745 -1625 -1229 2032 1911 -1128 -622
3021 -622 420 141 969 667 -1411 -1121 1857 1850 -981 -677 828 158 730 1659 -757 -1470 1433 2433
3039 2433 -401 -845 659 307 1298 1748 -917 -1589 1476 2130 -34 -345 645 19 766 1501 -631 -1758
3057 -1758 1385 2278 -416 -483 282 -86 730 1722 -424 -1923 1006 2183 -225 -653 350 160 770
3074 770 1709 -279 -2149 529 1981 130 -612 426 -250 79 1773 -347 -2019 28 2122 44
3090 44 -547 454 -535 -137 1487 -124 -2119 -31 1548 -330 -953 18 -1099 -671 1259 -121 -2633
3107 -2633 -1205 754 -728 -1152 -370 -1361 -1492 697 103 -2293 -1381 733 -380 -1263 -302 -1408 -1336
3124 -1336 1125 569 -2348 -1466 453 -247 -768 243 -1061 -2095 544 875 -1675 -1283 435 -626
3140 -626 -961 247 -989 -1699 892 1000 -1480 -1456 -90 -276 -393 285 -743 -2061 453 1170 -800
3157 -800 -1055 636 -349 -245 1185 -330 -1936 137 1620 -939 -1338 327 -270 -391 1067 -232 -2018
3174 -2018 248 1588 -324 -1207 241 -191 -575 1563 591 -1973 63 1774 -35 -914 343 -426
3190 -426 -258 1367 331 -2113 -332 1891 543 -699 -176 -550 -539 1449 831 -1638 -404 1603 398
3207 398 -584 84 -342 -637 1262 632 -1395 -889 1791 780 -492 -104 -304 -875 1663 1447 -1432 -1419
3225 -1419 1156 537 -341 418 -492 -1278 1221 1081 -1500 -1406 908 826 -318 -219 -793 -1840 895 1441
3243 1441 -957 -1384 305 365 -369 166 -563 -1567 562 1756 -929 -1460 585 575 -142 349 -283 -1469
3261 -1469 672 1828 -690 -1666 309 950 107 758 -87 -1269 104 2042 -452 -1354 811 344 -2
3278 -2 619 -120 -1135 741 1961 -91 -1251 471 740 170 957 366 -1483 194 2461 330 -1267
3295 -1267 340 728 192 994 1085 -1050 91 2654 952 -1033 775 1029 484 1171 1155 -860 -416 2034
3313 2034 1516 -498 429 631 186 1076 1331 -610 -209 2216 737 -600 638 658 -27 848 1292 -445
3331 -445 -623 1576 1235 -204 593 489 -655 676 1513 -516 -994 1300 823 -600 271 669 -832
3348 -832 484 1198 -671 -926 1033 931 -363 250 140 -1039 356 1493 -201 -1189 499 517 -378
3365 -378 272 215 -767 -229 1559 -383 -1535 35 552 -590 58 197 -1473 -612 1048 -124 -1658
3382 -1658 -271 32 -747 6 385 -1410 -716 981 155 -1493 -186 54 -386 -80 79 -1506 -900 1476
3400 1476 57 -1725 -726 -213 -392 21 344 -1368 -1247 1016 327 -1097 -863 68 -721 170 619 -1616
3418 -1616 -1296 923 788 -1060 -564 -12 -520 404 995 -916 -1557 855 869 -1130 -640 115 -561 352
3436 352 882 -974 -1491 1070 1020 -916 -592 5 -403 475 1023 -846 -1723 740 1245 -414 -628 170
3454 170 -967 351 1141 -345 -1392 487 1171 -91 -495 -155 -660 332 1462 -415 -1722 322 1280
3471 1280 -126 -300 19 -753 -140 1286 -291 -1743 -44 1039 -378 -801 156 -267 -600 1248 -453
3488 -453 -1913 11 842 -301 -769 -158 -900 -644 988 227 -1466 -158 830 -57 -695 -48 -982 -843
3506 -843 1060 220 -1752 -520 440 -358 -693 118 -809 -950 1010 300 -1781 -687 567 -596 -405
3523 -405 467 -749 -1316 619 379 -1225 -435 780 117 284 492 -562 -1011 917 1482 -785 -639 546
3541 546 -55 -258 934 -97 -576 695 1006 -587 -368 686 -312 -127 1435 -12 -1228 811 1235
3558 1235 -134 -453 657 10 119 1531 339 -559 419 1385 132 109 788 9 -178 1106 448 -809
3576 -809 468 1403 496 -38 829 -32 206 1713 862 -886 246 1263 432 285 830 -2 -337 1780
3594 1780 991 -960 27 1756 521 165 698 -72 -238 1603 911 -1194 -408 1494 755 93 212 -445
3612 -445 -490 1528 903 -741 -594 976 650 -237 223 -458 -555 1023 1261 -1097 -767 924 600 167 297
3631 297 -625 -1045 406 1525 -975 -725 628 353 55 359 -442 -794 587 952 -508 -966 228 80
3649 80 -128 153 -560 -1389 531 1183 -631 -1064 221 66 -440 264 -463 -1352 216 1219 -567 -803
3667 -803 -69 134 -359 396 -426 -1140 99 957 -481 -1269 358 2 -476 398 -485 -1248 405 1159 -372
3686 -372 -871 337 177 -303 398 49 -1076 156 1492 92 -1007 59 -140 -222 435 393 -738 -234
3704 -234 1166 23 -856 295 565 -564 483 599 -960 -593 1290 546 -506 -28 256 -363 587
3721 587 528 -881 -509 720 344 -556 161 -133 -593 60 936 -644 -593 522 115 -761 -100 -208 -771
3740 -771 46 576 -662 -1047 163 113 -475 86 64 -1384 -632 864 -439 -1095 11 60 -784 -186 6
3759 6 -1712 -299 705 -300 -853 21 -60 -447 -37 -39 -1312 -388 750 -163 -1091 -107 152 -450 -51 202
3779 202 -1173 -779 828 -152 -1298 -179 432 -530 247 309 -1286 -686 762 181 -1101 -605 -124 -798
3797 -798 498 274 -1235 -1012 1014 396 -1112 -80 -130 -264 525 687 -1368 -723 1059 571 -661 -69
3815 -69 369 -215 642 737 -790 -764 1021 662 -365 -472 235 141 728 909 -589 -929 1228 1104 -191
3834 -191 115 348 -255 840 1410 -200 -723 828 1186 -52 216 94 -386 800 1384 -355 -1226 977
3852 977 1483 259 174 696 -274 352 1340 -2 -835 566 1477 6 306 412 -313 288 1222 -14 -832
3871 -832 766 1119 -37 -547 -2 -57 139 1150 -5 -772 257 908 -66 115 223 -357 124 928 52
3890 52 -827 512 882 -114 -112 274 -526 -31 1011 334 -879 23 804 -250 -96 241 -414 -498 1258 449
3910 449 -901 -226 721 -132 -376 314 -617 -1021 778 485 -1044 -224 335 -175 -48 569 -522 -710 697
3929 697 418 -548 -57 396 -142 28 817 -230 -745 666 613 -653 -61 479 -279 77 914 -155 -744
3948 -744 292 900 -266 9 572 -163 -141 1055 42 -787 359 785 -245 70 544 -404 -66 1199
3966 1199 217 -1162 310 962 180 -17 706 -605 -56 644 404 -832 58 572 71 -38 388 -308
3984 -308 -364 1199 495 -951 220 688 75 -76 199 -244 -444 1090 507 -947 -455 1014 -263 -157
4002 -157 337 -353 -566 755 509 -1355 -606 352 -200 -246 198 -660 -561 616 555 -1449 -717 264 -180 -577
4022 -577 336 -494 -987 482 441 -1300 -731 -201 -351 -502 -157 -725 -1331 258 624 -1061 -1047 285 -749
4041 -749 -304 107 -460 -1612 0 597 -920 -1057 189 -419 -559 362 -293 -1171 -242 571 -487 -1246
4059 -1246 112 -235 -686 386 -187 -1336 -106 710 -472 -918 159 -140 -176 327 -186 -1031 47 666
4077 666 -466 -740 -26 -79 -299 520 72 -1124 -310 927 -315 -862 262 140 -272 646 352 -736
4095 -736 -41 875 -247 -626 242 151 -49 597 623 -514 -307 830 25 -275 300 61 -200 720 692 -620
4115 -620 -261 843 506 -415 422 216 -333 703 851 -418 -416 733 622 -335 683 175 -373 541 934
4134 934 -504 -521 415 496 -377 342 -85 -484 390 947 -381 -413 483 206 -161 489 -6 -557 466 1072
4154 1072 56 -673 268 211 -462 37 303 -750 -230 1126 -305 -617 325 109 -152 438 115 -483 277
4173 277 920 -3 -826 231 -53 23 557 448 -801 -276 1314 16 -666 64 364 -10 275 423 -663
4192 -663 -170 1239 38 -505 447 422 -295 291 666 -764 -122 1150 92 -180 220 256 -43 397 731
4211 731 -405 -181 1383 765 -441 236 376 54 642 816 -299 -339 1203 537 -58 347 228 -183 681
4230 681 922 -191 -77 733 577 -284 301 113 -297 520 1301 -114 -514 976 584 -530 435 488 -397
4249 -397 127 865 27 -409 489 326 -311 459 216 -402 82 1056 32 -631 676 160 -577 194 332
4268 332 -692 -256 1042 -476 -835 180 163 -330 -306 388 -985 -540 606 -101 -880 215 43 -353
4286 -353 -32 134 -985 -702 541 -232 -1090 -247 331 -691 -218 63 -849 -662 348 -193 -1157 -447 305
4305 305 -614 -278 426 -666 -963 567 43 -982 -316 60 -645 -87 117 -402 -1038 297 280 -837 -588
4324 -588 356 -450 -290 525 -536 -813 202 375 -728 -498 -116 -613 109 738 -745 -1272 355 368 -979
4343 -979 -415 -83 -414 -65 368 -439 -1250 236 500 -312 -234 316 -431 -329 541 -18 -775 205 668 -365
4363 -365 -85 30 -204 -139 795 146 -698 129 516 -382 -31 442 -311 -437 379 157 -564 130 1001 -147
4383 -147 102 621 -585 -298 620 60 -609 -128 619 -149 13 570 -308 -463 634 263 -770 90 549
4402 549 -251 -183 218 -109 -507 757 190 -756 -337 270 -342 -482 363 -491 -569 298 183 -550 -274 421
4422 421 -98 -352 480 -360 -878 437 499 -755 -298 591 45 -227 5 -171 -1000 352 273 -125 -325 360
4442 360 -254 -95 531 -17 -743 311 563 -499 -292 508 -214 -10 418 -94 -674 9 730 -187 -211 617
4462 617 -158 205 901 99 -652 553 681 89 -255 698 204 -50 682 355 -367 292 828 -292 190
4481 190 531 21 -27 1000 414 -605 8 888 171 -277 521 18 -129 996 569 -553 265 890 144
4500 144 -77 405 152 -116 780 555 -699 175 1039 319 -88 521 -95 -178 792 699 -657 -24 934 100
4520 100 -80 595 138 -277 443 625 -730 -226 798 124 -192 477 158 -526 123 668 -540 -406 378
4539 378 -7 -374 340 -267 -653 388 740 -249 -346 202 47 -314 408 -144 -714 201 914 -283 -492 350
4559 350 -113 -411 190 373 -926 -31 429 -307 -603 342 -220 -1006 -4 -385 -671 -186 751 -325 -655
4578 -655 257 -242 -546 248 -86 -755 -292 723 -152 -484 158 -210 -619 230 501 -778 -272 325 21
4597 21 -275 44 -87 -304 418 330 -672 -465 747 -79 -605 -189 -99 -579 220 285 -427 -399 666 200 -92
4618 -92 -23 -129 -459 403 116 -838 -641 267 213 -471 239 -200 -657 537 546 -539 -766 515 156 -383 260
4639 260 166 -572 206 594 -342 -497 330 -99 -485 159 55 -567 67 538 -212 -715 177 -110 -325 -152
4659 -152 74 -821 126 659 -579 -836 207 160 -793 -54 -137 -701 -276 907 -376 -1094 284 1 -278
4678 -278 358 -43 -864 -133 823 -166 -986 -316 147 -238 -149 55 -887 -443 813 -240 -600 183 -65 -448
4698 -448 -170 372 -689 -265 410 -126 -842 18 462 -391 162 251 -487 -180 528 265 -615 309 196 -89
4718 -89 214 287 -453 -240 556 -24 -322 71 614 -306 -13 401 -291 -231 817 171 -437 271 437 -431 247
4739 247 581 1 -405 692 522 -213 307 672 31 173 904 337 -323 418 274 -274 330 605 -16 99
4759 99 747 83 -265 447 418 259 79 471 -269 5 788 349 -377 14 286 2 509 583 -124 -124 936
4780 936 186 -715 453 596 -223 205 393 -31 -192 863 32 -426 163 562 -72 -17 701 -194 -252 593
4800 593 659 -456 240 446 -90 135 611 -133 -234 584 224 -440 60 435 -95 196 630 -200 -481 440
4820 440 420 -358 -227 215 -140 -264 642 -160 -521 457 368 -187 -58 358 -32 -43 401 -188 -747 94 344
4841 344 -703 -399 307 -100 -151 569 -63 -625 413 566 -725 -386 20 -88 -48 787 109 -853 271
4860 271 728 -378 -223 540 4 -149 694 302 -607 188 589 -222 -283 290 -51 -316 623 181 -474 293
4880 293 464 -309 -226 71 126 -238 606 -103 -542 -214 259 -315 -119 296 -52 -384 452 -21 -533 148 200
4901 200 -223 -80 58 -345 -312 451 142 -532 -279 477 3 -538 9 -5 -491 286 235 -617 50 201 180
4922 180 -462 241 -121 -327 29 442 -473 -425 553 178 -520 243 110 -705 221 177 -762 -493 199 -331 -562
4943 -562 -54 -398 -709 300 564 -374 -516 511 -413 -447 253 61 -991 21 388 -388 -607 302 -327
4962 -327 -375 96 19 -493 -381 498 -523 -568 -14 -282 -422 175 15 -644 -433 287 -55 -314 663 -88 -584
4983 -584 341 44 -266 -262 702 -49 -144 565 179 -371 748 285 -427 -203 447 5 -92 -32 65 -313 666 369
5005 369 -219 -145 317 148 62 754 459 -297 609 486 -375 58 667 -18 -29 240 35 -655 470 388 -356
5026 -356 -18 424 298 17 191 64 -9 214 908 -221 -348 611 -155 76 727 176 -172 206 861 -170
5046 -170 -216 673 284 -14 284 335 -152 -22 935 -210 -214 370 390 -124 228 45 -247 258 644 107 -293
5067 -293 303 169 -117 592 509 -145 -141 484 90 -347 473 142 -64 369 219 -539 -147 721 -151 -397 287
5088 287 338 -312 291 580 -654 -410 392 -76 -275 427 268 -201 180 165 -208 -160 615 243 -554 40 20
5109 20 -240 310 362 -226 -334 515 -6 -340 225 314 110 427 222 -76 -95 430 491 -161 265 342 -231 352
5131 352 744 -310 -326 589 334 -288 378 137 -55 210 262 -301 -187 463 299 -247 214 191 -355 355 398
5152 398 -233 -501 372 309 52 236 172 -109 57 263 -505 -146 98 85 -66 47 69 -620 -176 767 -184
5173 -184 -643 57 53 -300 127 108 -599 -356 536 -158 -414 -40 79 -428 -84 -57 -270 -214 251 -204 -772 -79
5195 -79 -192 -164 -66 82 -181 -362 164 87 -738 -71 77 -272 -331 179 -206 -433 78 196 -106 -354 -113 -635
5217 -635 -127 -37 -175 -445 208 -187 -665 -112 -227 -262 -238 333 -245 -396 255 -116 -307 -86 71 -509 -304
5238 -304 214 -345 -542 355 304 -310 143 303 -117 -37 341 -80 -556 38 88 -166 -65 424 -314 185 397
5259 397 -309 -724 214 156 -333 -44 172 -198 -151 367 -342 -552 267 247 -483 -8 78 -17 -232 619 146 -268
5281 -268 -84 107 -57 195 103 -386 -111 762 173 -376 81 470 -99 168 432 -133 -286 565 449 -600
5301 -600 65 87 -410 49 133 159 275 638 49 -498 -49 615 -429 -292 217 -116 -350 563 348 -77 430
5322 430 187 -40 203 254 -17 -402 543 449 -571 -82 334 -320 -182 585 -173 -442 77 435 -91 63
5342 63 -120 -255 -57 214 5 76 404 318 -189 28 318 -85 -263 368 -40 -408 296 358 -79 -136 155 -65
5364 -65 5 256 144 -552 22 345 -256 134 272 -195 -256 580 51 -611 193 373 -290 5 394 30 -79
5385 -79 411 523 -361 -454 672 -81 -170 187 19 -49 282 398 -166 210 491 103 -8 303 -108 34 280
5406 280 662 -459 -20 392 -298 25 595 64 -144 690 333 -177 18 419 16 -92 427 126 -386 422
5426 422 615 -299 -198 245 274 25 217 -12 -235 156 472 4 268 256 -69 -132 171 -168 -463 512 222
5447 222 -329 -161 97 108 -98 419 -385 -182 362 244 -124 -488 76 -111 -364 275 -357 -599 88 35 -9
5468 -9 -221 -87 -311 -111 419 170 -531 -103 181 -85 -708 143 -129 -548 130 -100 -644 -416 586 -306
5488 -306 -435 -90 -183 -252 52 -88 -785 195 437 -111 -366 -165 -114 -328 -248 -135 -618 -176 225 -476 -429 -197
5510 -197 -19 -306 178 180 -173 -316 406 -336 -648 346 42 -141 -7 341 -447 -416 196 -60 -241 87 6
5531 6 -129 326 316 -331 -95 465 -77 -393 -237 184 -558 160 316 -270 -236 217 98 -11 158 274 -191
5552 -191 86 102 -97 -324 284 44 -318 133 288 -238 34 178 -119 -248 127 159 -205 66 320 -258 131
5573 131 416 -215 -380 11 77 -167 5 303 -299 -80 374 -14 -301 365 147 -337 13 78 -230 236 252
5594 252 20 -627 261 -95 -297 174 443 -365 -271 141 -50 -262 165 72 -416 92 232 -462 -251 333 169
5615 169 -175 50 270 -202 149 413 -365 -82 276 140 -470 149 163 -174 193 208 -150 -110 85 -51 -51 122
5637 122 329 -198 235 169 -225 -538 143 365 159 115 -57 -193 98 590 -134 -127 670 398 -347 217 161 -52
5659 -52 -35 717 151 -254 524 462 -91 156 650 -127 421 500 -51 -387 264 391 -60 515 166 -77 20 456
5681 456 28 -79 241 21 138 13 551 -12 -117 519 294 -196 157 431 -363 -126 214 -287 -2 509
5701 509 -255 -558 62 137 -119 -132 186 95 -149 315 346 -165 31 186 -9 85 183 -454 49 102 244 -273
5723 -273 48 168 -539 187 274 -468 -356 207 69 -398 130 208 -228 134 264 -524 -548 111 78 -646 -147
5744 -147 373 -74 -109 -93 -189 -292 141 -38 -448 217 187 -204 7 286 -183 -403 -13 79 -120 -9 426 -63
5766 -63 -186 523 -40 -381 16 96 -246 -59 59 -390 -16 215 7 -536 36 77 -133 8 37 -126 -15
5787 -15 283 147 -329 12 -122 -306 120 135 -247 -125 46 -95 -331 85 153 81 -188 19 21 -294 333 -45
5809 -45 -409 -144 14 34 322 277 -137 -94 285 38 -310 -163 345 -27 -9 111 -55 -267 19 73 -152 -135
5831 -135 160 -256 -246 148 -468 -250 158 127 -325 -250 297 -388 -444 272 -181 -298 286 -175 -140 -54 -149 -148 -335
5854 -335 33 -161 -493 102 178 -568 -400 241 39 -222 -124 -23 -478 -31 -72 -262 -249 188 -339 -224 291
5875 291 -202 -395 6 189 -234 -290 150 -34 -361 39 163 -225 -7 162 -172 -301 -8 -225 -320 155 36
5896 36 147 -52 362 2 -252 295 -81 -516 191 192 -272 -172 162 150 -177 46 -127 -31 231 119 -363 -23
5918 -23 144 -12 141 386 162 -146 307 207 -84 98 289 -171 -89 487 9 -245 335 200 -62 78 585
5939 585 94 105 188 172 -341 18 347 -85 -300 186 105 -297 273 174 -77 152 606 -39 73 244 61 -27
5961 -27 192 239 -16 -11 33 15 -448 341 167 186 223 329 -420 -59 241 -61 -284 164 -60 -569 407 257 -601
5984 -601 -28 302 11 -428 256 -6 -92 102 -132 -286 -176 691 -277 128 189 81 -133 171 -99 -101 -59 693
6006 693 -38 -383 33 158 -130 65 139 -118 -175 88 96 -315 246 -202 -136 256 361 -271 -417 298 115 -407
6028 -407 31 -153 -84 266 138 -367 -215 198 103 -293 288 152 -344 180 243 18 -178 459 121 -459 117
6049 117 198 55 -69 227 1 -323 53 478 -326 80 247 -29 28 564 -322 -154 420 154 -101 66 132
6070 132 -129 -45 398 -330 -39 311 -71 -116 -179 314 -222 25 -1 -166 -394 130 -159 -293 -25 463 -280
6091 -280 -247 -56 -251 -661 128 -166 -272 -111 36 -174 120 174 -347 -662 202 -157 -76 -86 66 -259 -443
6112 -443 179 -123 -381 15 -109 -402 33 62 -282 -332 206 -164 -191 93 -86 -338 -457 124 -304 -277 117
6133 117 -104 -453 -74 146 -402 -165 -95 -396 -401 251 -147 -324 -85 171 -391 -233 243 -286 -57 268 -216
6154 -216 -140 165 188 -39 -76 178 -68 -323 101 62 -176 -147 225 -142 -25 436 30 -135 3 96 -69 201
6176 201 213 -384 -46 255 249 -328 179 301 -50 340 102 -195 74 531 241 -158 128 -1 -371 7 319
6197 319 -138 -55 122 138 -74 203 469 207 43 247 15 124 558 -13 -231 29 202 -106 308 -46 96
6218 96 25 587 398 -426 -161 335 -106 44 27 210 -149 191 326 -2 143 96 151 -121 93 -358 86 458
6240 458 145 -401 -197 102 -56 77 -15 -169 -349 487 277 -318 -240 -93 -110 -5 324 178 -125 288 101
6261 101 -253 -387 259 -197 -33 206 -195 20 394 144 -247 -157 -67 -175 -101 140 -19 -229 273 -61 -272
6282 -272 -140 190 -250 115 10 -51 -97 273 452 -192 -136 421 -11 -182 245 261 -159 -41 -47 170 -57 345
6304 345 7 -51 400 224 -174 150 261 -431 -67 67 292 -361 -126 144 -84 281 153 -252 34 164
6324 164 222 100 207 192 -224 225 212 -152 -135 222 -79 -297 26 357 -143 262 521 -116 100 304 -141
6345 -141 -127 512 124 -453 -38 225 -49 94 128 -123 -557 88 177 -328 7 275 -240 -441 262 -279 -570
6366 -570 81 -42 -511 -222 15 -81 -238 156 -23 -277 105 -63 -471 -169 74 -28 -279 327 -312 -315 161
6387 161 -186 -304 -133 -112 50 -245 -131 148 -417 -265 28 -318 -276 -23 196 -26 59 246 -66 -16 291
6408 291 -245 -396 516 -214 -172 -82 -132 -266 -133 346 -364 -26 140 182 -182 71 -8 -124 -414 304 -273 -84
6430 -84 117 -162 -223 -34 351 -322 -326 -113 32 -209 285 274 -187 190 353 -90 -176 293 -140 -360 -179 118
6452 118 -253 196 -5 -357 194 247 64 13 285 165 -93 283 275 66 -45 181 93 -48 178 -23 -238 21
6474 21 484 -35 -173 162 119 -359 -126 87 -76 216 172 -269 -46 -21 236 24 -28 335 -325 125 310 -212
6496 -212 -105 123 351 -25 224 163 -307 89 223 -43 -218 73 211 -55 484 30 -90 166 160 -18 -69
6517 -69 -40 68 -238 240 -13 -128 63 295 171 -40 -45 287 -122 -52 398 -334 115 138 -298 -295 132 255 -137
6540 -137 278 -214 -224 93 323 -66 -427 36 -59 -91 229 310 -118 -284 17 182 298 82 210 -141 -70 -126
6562 -126 17 -142 11 250 -96 269 -3 -47 336 -3 -89 -98 136 -96 -28 143 55 -229 -94 189 109 -221
6584 -221 -32 127 -383 357 185 -415 -207 228 -159 -220 155 214 -208 133 475 178 63 140 -114 -14 74
6605 74 -117 -46 1 165 -34 109 314 -114 -142 -312 -51 -285 -31 162 47 -113 -46 497 -194 82 -31 -16
6627 -16 8 160 -467 -351 234 163 -106 -52 -366 -199 -8 44 -137 -331 163 22 -372 61 -118 -151 -117 129
6649 129 -201 -428 34 -174 71 -97 172 -43 -12 374 -217 -274 180 246 -303 -186 -249 -434 -197 -37 -118 -418
6671 -418 123 12 -38 35 170 -77 48 -22 -47 24 10 5 -484 -241 170 -236 -4 -25 249 -362 13 127 -105
6694 -105 -56 -178 -133 159 228 -176 -388 -207 436 36 101 46 -154 -214 252 240 10 28 165 3 -117 151 -217
6717 -217 -398 399 13 -240 24 123 199 -81 -263 -162 -218 283 -72 -125 279 -28 -29 159 194 -173 -319 -17
6739 -17 115 -103 105 -12 -145 191 318 -509 -245 43 -39 -353 14 109 -89 -192 -3 -137 -233 143 163 -300
6761 -300 -101 7 -239 -341 -43 339 -321 451 74 -267 65 114 -145 -60 -80 95 -11 299 -298 -251 -14
6782 -14 203 -19 -285 269 -29 89 -14 108 -481 -250 359 2 -541 199 52 -103 60 231 -109 -68 128
6803 128 -11 232 171 102 133 191 128 2 -91 109 163 98 178 -146 14 265 298 -137 -103 177 34 63 -42 -269
6827 -269 112 151 -125 393 100 214 379 -184 46 224 -93 201 59 -74 240 50 132 -157 253 196 -93
6848 -93 357 137 -262 100 -199 191 63 -11 17 141 281 243 128 -99 86 208 -350 441 57 -235 139
6869 139 21 41 70 73 -73 -28 89 193 -209 254 142 -111 -30 116 -178 -398 -36 48 -435 72 54 18 21 -94
6893 -94 -232 -466 170 -63 45 118 286 -140 -227 184 70 -135 -300 460 144 97 -288 -299 -6 282 23 -165
6915 -165 182 198 -42 -409 45 245 -55 278 -64 -414 20 187 -44 -6 56 -124 -225 284 119 -303 -121
6936 -121 -8 -150 -196 26 220 -105 530 394 60 -65 140 -112 -182 74 35 -256 -276 192 -45 -132 276 -258
6958 -258 -208 -245 11 -62 6 32 -105 117 -2 -350 -218 216 150 -305 36 279 35 89 354 -52 -128 190 -331
6981 -331 -88 -109 250 -38 49 -50 -439 -49 304 51 -547 -230 -7 -192 -357 299 -116 -122 99 -97 6 -95
7003 -95 -8 -331 34 12 128 -115 -126 324 -49 51 429 70 -46 154 -470 -439 156 59 -11 69 -179 16 -276
7026 -276 2 283 -322 -123 -10 -29 -252 0 -30 -12 161 114 -254 44 142 -128 46 -80 -166 -80 51 233
7048 233 97 -38 16 1 -137 -35 -226 -229 87 127 -362 -67 227 -111 -173 235 38 -290 92 -27 137 381
7070 381 256 -398 -223 451 76 116 45 300 -66 109 199 11 -250 157 278 -60 207 -15 -128 -217 306
7091 306 162 -228 209 -66 -228 116 9 -48 -5 286 50 -301 121 94 5 -219 33 -268 -130 -83 185 63
7113 63 -123 215 220 -88 169 -104 -43 429 -214 -95 33 141 -197 13 68 215 19 139 -88 -127 343 239
7135 239 -251 -96 185 -95 -312 306 102 -293 126 113 -414 -46 235 -171 -4 4 404 11 118 -14 -366
7156 -366 -80 42 -113 -124 106 415 -477 -12 5 -249 132 159 108 -108 -301 47 -94 -85 293 -58 -105 282
7178 282 212 -143 -107 116 -20 -133 -68 -95 -153 229 98 -221 -37 -16 25 -292 239 -144 33 102 7 -3 257
7201 257 -45 43 -211 33 -114 -56 219 -274 173 -58 28 -146 186 -172 -82 192 231 163 -211 -76 236 94
7223 94 -19 25 162 -163 356 -124 -200 -89 265 23 -191 -129 -18 -168 235 92 -100 12 384 225 -29
7244 -29 -33 -212 -125 -64 109 -79 -330 -85 23 -54 -61 14 20 78 145 -276 -11 -50 102 335 92 -118 205 80 24
7269 24 -273 24 -142 -88 12 88 -39 -322 118 -145 -199 -55 157 -165 -147 -30 -156 -191 76 121 -195 -119 55
7292 55 127 25 -193 -149 -119 367 149 -169 -141 108 -99 -20 -32 -222 -384 -138 -156 111 100 -101 -40 -273 -281 199
7316 199 -94 -128 177 134 -22 130 11 95 -47 154 -140 54 -59 185 -159 178 -207 -207 -15 156 -133 -96
7338 -96 273 -100 -14 92 -26 -170 54 -244 -278 -1 262 -115 149 132 -54 -208 5 159 -203 -189 301 92
7360 92 -27 51 291 -370 -165 368 -90 -82 -83 276 -80 -96 84 -182 310 297 -382 -183 79 85 7 -116 -35 -6
7384 -6 63 314 91 -263 -168 -111 -66 258 -49 45 279 42 154 455 -2 79 -220 -6 209 -94 -51 349 172
7407 172 -9 450 -14 -328 181 166 118 19 -168 265 19 -134 10 -12 228 253 -38 -46 -144 -230 -183 -214 -6 154
7431 154 29 67 -74 7 -127 54 135 -38 22 97 -213 170 32 174 241 331 -274 146 14 12 -54 -5 -248 308
7455 308 100 -3 -119 167 71 -353 181 53 -24 -298 106 -336 -11 -37 105 53 181 56 -75 24 43 259
7477 259 43 116 -50 -105 -125 283 -337 -261 315 65 48 54 443 -43 155 -69 -183 18 168 1 -124 -120 308
7500 308 -393 56 299 -68 79 306 204 -196 154 -10 -30 -67 328 -37 -49 0 -30 -58 406 82 -340 51
7522 51 -39 133 -368 -81 73 -27 137 -244 -75 -140 46 -100 16 71 74 -67 -387 26 -245 -239 182 -207 -146
7545 -146 -59 47 -132 44 -243 75 -235 36 -137 27 120 -379 -185 -69 93 -241 -97 43 -145 197 -11
7566 -11 -52 -369 -229 23 -129 -329 -32 -36 39 66 -80 -210 -119 -31 -170 72 218 119 -13 -148 165 -340 -307
7589 -307 59 -141 -164 40 -110 -351 104 -120 51 64 61 398 -269 122 342 -168 -39 -192 229 68 323
7610 323 271 -102 263 -13 29 -25 32 138 -326 282 -42 182 254 -163 -190 238 -77 83 115 -253 90 -39
7632 -39 199 244 -314 126 79 5 -137 154 -210 -160 -61 182 -344 126 -180 0 -60 100 75 -1 -115 -17 336
7655 336 -15 26 -116 0 -145 223 60 165 -99 -32 -68 235 -241 -56 294 28 95 155 124 -184 106 247
7677 247 -218 -137 295 91 -62 83 55 -165 100 -81 -26 -213 211 179 -91 372 103 58 -101 -3 47 -219
7699 -219 159 43 -226 -35 39 64 46 -159 270 75 -87 173 64 -65 361 -69 40 69 232 119 -81
7720 -81 400 -345 -116 209 -2 -93 292 -234 -225 111 197 -164 266 177 -99 111 68 382 -324 -60 321 177
7742 177 91 256 -136 -84 110 166 -61 269 65 263 -96 91 -40 -43 -64 306 22 85 57 126 -16 -145 -21
7765 -21 -249 89 -45 -111 164 -261 25 179 162 74 60 114 -89 88 -204 265 -233 25 51 -404 -297 85
7787 85 95 -155 49 277 -199 -174 262 -79 -86 -372 -78 -186 -54 39 24 -35 205 11 -405 128 -126 -208 -129
7810 -129 373 -273 106 52 -120 -544 -36 72 -79 61 -33 -302 -304 287 -157 -87 -121 -93 -316 350 23 -281
7832 -281 -122 30 16 -187 -95 159 115 -57 -199 -149 -300 -78 -121 -70 45 170 -48 -348 256 -164 -295 -491
7854 -491 53 -54 -7 -64 -144 75 384 287 -296 -34 -3 -41 -62 -28 -177 385 159 247 -413 106 177 62 -18 -112
7878 -112 -203 -163 262 -80 -195 207 -27 -100 239 17 231 -107 -38 38 -300 20 120 -32 18 -276 -23 -209
7900 -209 90 69 -49 -74 13 -63 58 250 -364 240 -2 216 228 -79 141 -125 -182 -12 -257 13 -153 -38
7922 -38 -10 36 93 186 -69 -210 -218 -134 -67 156 -102 194 -180 -21 -306 -136 -215 19 457 60 103 174 165 307 38
7947 38 -134 336 161 -358 200 -31 -120 -14 -2 -186 -10 -105 -288 164 -238 -258 -130 -140 -469 -39 87 -409
7969 -409 -13 38 19 27 -53 -56 -275 -207 64 112 18 263 146 111 155 -43 -97 122 74 -27 -63 -226 -200 63 -166
7994 -166 356 208 -146 -5 79 152 -57 182 -167 27 153 233 37 192 119 29 142 19 -26 -139 265 -94
8016 -94 -103 58 169 -40 -69 216 -72 -388 112 -180 -258 -12 118 -10 10 177 -20 62 -283 -126 -172 276 121
8039 121 -11 -128 -9 75 -189 358 -165 -116 58 226 -9 -68 13 -54 -169 172 28 210 110 116 -163 -35
8061 -35 55 -65 99 164 129 -61 2 -93 -219 -137 285 -272 -67 67 34 -134 -85 -9 1 -119 306 -194 -212 126
8085 126 -40 -61 -256 132 -150 80 -25 -19 -140 -5 209 -71 5 33 -32 -35 -126 248 206 -31 115 -306 42
8108 42 -38 91 -22 -240 50 -83 -169 124 145 -221 148 -11 67 -149 -48 -366 166 38 -48 -60 229 -122
8130 -122 253 110 -39 136 109 46 -110 26 47 10 -157 -69 -19 -92 279 -148 -26 -202 70 -258 157 -109
8152 -109 15 147 -114 -160 -296 -88 -4 46 -123 -126 -250 -129 37 139 -39 66 -101 262 -336 -134 -109 69
8174 69 312 -93 -48 144 -175 139 -36 -81 -213 92 -279 -301 159 76 273 -124 -433
8191d33
$$ Imaginary data points
##PAGE= N=2
##DATA TABLE= (X++(I..I)), XYDATA
0 0 0 0 0 0 0 0 -8 8 -8 8 -8 8 -16 16 -18 24 -31 32 -40 48 -56 64 -72 85 -97 109 -126 143 -160 182 -206
31 -206 229 -256 287 -319 355 -396 438 -487 538 -598 660 -729 810 -896 995 -1110 1236 -1384
49 -1384 1558 -1766 2016 -2326 2725 -3255 3999 -5125 7014 -10779 21200 -107597 -398024 -181919
63 -181919 126510 188135 -30585 -214285 -168015 40706 92481 -81728 -216133 -107901 53038
74 53038 53800 -86040 -188663 -135512 28777 78889 -64610 -189973 -113686 38033 82911
85 82911 3731 -98598 -109310 6548 101250 50630 -37077 -21321 35848 38809 9389 -4386
97 -4386 19977 72783 63544 -37638 -85597 8024 98534 61588 -26676 -57959 -17945 45124
109 45124 47586 -22751 -38555 45919 81495 692 -64207 -22289 64718 105319 45344 -70973
121 -70973 -85634 42542 129095 54852 -61745 -85957 -17198 72362 83378 -17171 -93371
132 -93371 -35928 51789 44077 -16667 -43910 -15376 46851 58674 -29750 -97289 -23252 87162
144 87162 80860 -15092 -89855 -83168 2087 71794 27273 -62773 -71492 -26751 -13212 -17187 -19427
157 -19427 -34145 -35745 -12235 -11062 -28095 -18261 -8630 -18972 -2240 27939 8406 -24830 -7519
170 -7519 26095 32271 17769 -15072 -34522 15911 80310 47595 -41332 -65141 -14439 51683
182 51683 81963 30417 -58978 -62683 23464 70208 32961 -14303 -23111 10683 55856 36827
194 36827 -40752 -50964 34140 81900 29331 -45862 -67992 -17352 57907 53905 -39447 -83308
206 -83308 -17447 43361 23936 -22577 -44165 -25599 22960 35735 -8971 -26490 15448 33271
218 33271 2827 -11484 1249 16305 32611 25869 -15045 -27260 9167 21535 -3877 -7595
230 -7595 4945 -723 -10916 -19971 -30698 -4220 45537 29516 -42612 -60919 -6706 44804 47535
243 47535 -1564 -57839 -35801 48309 60667 -21811 -68816 -21886 45616 55461 -6915 -78700
255 -78700 -54176 49567 75967 -14335 -79087 -34565 49157 79539 21333 -68490 -65778 42235
267 42235 105422 44947 -37463 -44193 6564 56929 50251 -13565 -40880 16590 59821 16453
279 16453 -42422 -42319 4062 53893 52070 -19845 -71371 -25244 43990 46412 8938 -19085 -24268
292 -24268 2232 33563 19848 -11002 -3511 12535 3378 1681 13565 4460 -8727 -2329 -1025
305 -1025 -5471 7362 10354 -9061 -7287 10244 -1898 -20013 -4274 18195 21693 16771 -7344
318 -7344 -37134 -18208 34028 41270 5257 -19792 -26977 -15688 17400 28160 -6432 -28731 -12167
331 -12167 -940 -4398 -1726 -8020 -16662 -1329 9975 -11846 -23207 -633 12716 5808 1401
344 1401 -10462 -20943 3000 31964 17627 -12626 -22009 -19598 361 37116 34826 -17491 -46893
357 -46893 -23910 11838 34033 26866 -15873 -39981 -4041 31237 10659 -16474 -7077 18110
369 18110 33227 17315 -30746 -46233 14575 68545 35062 -34231 -56890 -20416 38089 54703
381 54703 -6699 -70990 -42091 31185 43466 -3327 -45133 -44324 1149 39700 9703 -43963
393 -43963 -31585 20024 24655 -15018 -42248 -31334 15991 48472 7281 -62952 -60757 2967
405 2967 36642 18352 -17297 -43147 -30003 9378 15257 -10427 -9688 10387 4021 -10963 -5730
418 -5730 5404 15863 23781 6074 -19044 -2073 31330 24859 -1451 -5344 2427 9594 17004
431 17004 6753 -7962 8743 28578 3346 -27801 -11532 25317 41527 24971 -20118 -47778
443 -47778 -6673 53770 47394 -7718 -34884 -18728 13913 32661 8740 -29628 -18522 22933
455 22933 20166 -19874 -33783 -12255 17521 29474 -1478 -47453 -36208 21018 38890 2439
467 2439 -32109 -35156 -7237 31100 28603 -20387 -44132 -15748 11547 11514 481 -17087 -28450
480 -28450 -11752 3549 -11734 -21745 -6196 2206 -5865 -11576 -21952 -29534 -6271 23194 14512
493 14512 -11990 -23452 -24040 -6646 26025 28948 -6788 -26049 -8234 11904 20210 15650 -6975
506 -6975 -16737 11571 31770 10945 -9040 -1445 12499 21680 20256 -993 -10713 18133 40497
519 40497 15161 -14871 -10722 11572 32796 34515 1676 -28547 -9840 23339 21124 3385 -2966
532 -2966 -5703 -3123 5766 -562 -10970 3629 17123 -364 -15264 -4515 5773 6790 7706 -90
546 -90 -6187 8352 17018 -3026 -12395 8992 20379 6911 -6459 -10900 332 24967 23403 -19010
560 -19010 -37402 992 37473 26570 -9851 -36622 -25541 21826 41388 -2035 -39114 -15889
572 -15889 22388 21745 -9602 -36716 -24766 26014 44503 -8717 -59904 -35446 23542 43008
584 43008 9968 -38623 -46594 6377 49364 17511 -36223 -30529 15690 40239 21730 -18962
596 -18962 -33487 7863 49554 25710 -23682 -24866 11919 33057 21050 -12840 -32230 -3147
608 -3147 35675 23131 -17448 -25248 -5274 8028 8438 -1918 -13519 -4148 11573 -4372 -26189
621 -26189 -12545 11840 11296 -3414 -16604 -20516 -3619 14394 672 -20048 -7107 12499 5318
634 5318 -9128 -11396 -3012 15133 22827 -1915 -23562 -175 32082 24761 -2265 -15418 -6046
647 -6046 21771 38951 11825 -23561 -13778 18139 23699 7589 -6934 -11631 2442 19018 2192
660 2192 -26309 -17916 12408 18427 712 -20700 -32697 -15211 18078 18316 -14647 -29834 -16588
673 -16588 -2622 5378 2341 -16029 -22466 -3172 7202 -5765 -11814 -7512 -6821 -952 6528 -3265
687 -3265 -13315 -1798 8718 3640 129 -1300 -6069 3633 22687 14987 -9927 -14349 636 16004
701 16004 25665 15305 -14680 -20776 6511 21717 9579 -2342 -4972 -2354 8383 8834 -10680
714 -10680 -13971 9796 20754 3158 -12967 -13965 -4301 15804 20502 -6030 -23683 -6446 13600
727 13600 10570 110 -11248 -16622 -3133 11627 782 -13459 -6646 -1943 -10239 -10628 -4448 -2651
741 -2651 591 -917 -17276 -24216 -4182 7998 -2815 -10694 -9588 -10610 -8502 -4892 -10701 -9293
755 -9293 6636 5236 -18177 -23902 -4918 9403 10134 -1094 -19677 -17010 12938 25269 1704
768 1704 -16942 -7701 10280 22407 18428 -4860 -13544 11349 29042 11362 -8271 -2493 15037
781 15037 26791 18018 -12268 -24044 8819 39917 24482 -10032 -23006 -9837 17476 30112
793 30112 5904 -21726 -11499 12982 11219 -4712 -11311 -8045 4863 14190 -2475 -24926 -14863
806 -14863 9214 10281 -3156 -13398 -16912 -5663 13305 8711 -14920 -17238 -1051 6790 7179
819 7179 4312 -7092 -11053 2941 8635 325 1506 7847 2253 -2225 1553 1006 939 10992 11674
834 11674 -760 -3096 2791 429 2620 12547 9687 -1903 -1236 2582 1139 6819 12672 3107 -4573
849 -4573 2645 5609 3223 7716 6765 -5158 -4589 8266 10211 4635 1820 -5099 -7166 6565 13904
864 13904 134 -7302 1516 5334 1777 -1183 -6763 -5822 11621 16997 -5457 -21846 -10028 7668
878 7668 14717 8141 -13052 -24435 -4262 17539 6256 -15522 -16924 -4761 8132 10070 -9521
891 -9521 -26445 -8952 18337 12560 -12377 -20076 -8272 10678 18881 -2140 -26581 -12893 19899
904 19899 21960 -2368 -18225 -14404 5304 23697 12364 -14390 -13554 9637 14825 2115 -5070
917 -5070 -3171 7049 18953 9637 -13003 -11544 12297 19776 7804 -2404 -6425 -541 12712
930 12712 11475 -5655 -6479 9633 10517 -1374 -5032 -1931 3233 9666 4072 -10590 -6148 12660
944 12660 10924 -6590 -10277 -2135 5928 11364 2620 -13393 -8368 10341 7943 -9074 -10230 896
958 896 7536 6914 -4998 -19427 -10554 14820 15766 -6069 -16296 -9326 2199 10671 5167 -13722
972 -13722 -14198 6206 11648 -3584 -12489 -8571 -743 8909 6305 -11799 -16849 1110 10048 -887
986 -887 -9504 -9995 -6386 4477 8434 -6707 -17133 -6432 3192 1549 742 -2255 -11179 -8121 2244
1001 2244 363 -4934 -1586 -1067 -4687 -700 409 -8720 -7971 4906 7441 -1049 -5282 -8380 -7386
1016 -7386 6437 13154 -1194 -11543 -3046 4958 6020 4561 -3284 -9903 2223 13705 4214 -7778
1030 -7778 -4103 2276 4692 5862 -1844 -8992 774 12346 2538 -11352 -6546 2922 7285 7564 -3028
1045 -3028 -14086 -5009 9807 5047 -5590 -2723 1670 -480 -1185 -4147 -7034 3161 11666 -1457
1059 -1457 -14573 -6084 5765 5554 251 -6370 -8995 2779 12665 -573 -14708 -4799 8723 6880
1073 6880 -1171 -8199 -7684 6786 15764 -3212 -20782 -6630 16067 15905 -365 -16422 -17061 6318
1087 6318 24496 7039 -18956 -13389 9681 15291 4053 -10818 -12209 8646 25467 7045 -20024
1100 -20024 -13800 12578 22795 10963 -8693 -17302 2016 25404 14386 -12712 -13711 5824 16868
1113 16868 11238 -3230 -14308 -2784 17594 11754 -9854 -10558 5111 11145 4644 -6342 -14392
1126 -14392 -3392 15730 9758 -11711 -15313 -1678 4686 3212 -2563 -9583 -5713 5618 1162
1139 1162 -13391 -9144 6302 6571 -2190 -8424 -9539 -774 11534 4710 -12232 -8487 7486 8853
1153 8853 94 -4885 -5976 1871 12454 6018 -9555 -5248 10671 9951 -1023 -5472 -3718 5549
1167 5549 16034 7991 -11122 -9279 7844 12318 5524 219 -4108 -1485 8961 7461 -4483 -3946
1181 -3946 7721 7647 532 -763 -2468 -687 7480 8311 -2580 -4224 3575 2725 826 4370 2877
1196 2877 -2937 1141 6133 2211 1670 2975 -3138 -4384 6789 9583 -306 -4498 -2109 -1328 3309
1211 3309 5661 -2990 -7763 3059 7829 -3235 -9025 -4716 563 6977 7328 -8543 -16592 -1304
1225 -1304 11029 4280 -5522 -7840 -5252 3827 8642 -3754 -13252 -1491 10222 3901 -5026 -6374
1239 -6374 -3698 5432 9684 -1706 -11513 -353 11730 5110 -4497 -5559 -2532 5860 11434 402
1253 402 -10121 -858 9176 2818 -4483 -2357 1022 4823 5630 -5789 -13217 368 12083 2811
1267 2811 -9349 -7978 -2011 3378 4639 -6477 -14077 -561 10974 72 -12974 -10564 -1203
1280 -1203 5579 5029 -8885 -17482 -2368 12670 2211 -13878 -13619 -2441 7700 8617 -7057 -19232
1294 -19232 -6478 12007 6588 -8577 -10408 -2719 5687 7889 -4449 -16114 -4041 14914 9819
1307 9819 -6430 -11300 -5007 5451 12636 3107 -11334 -5978 10124 9279 -2098 -5252 -2107 4059
1321 4059 11075 5546 -8173 -4861 8816 8956 -40 -1479 -234 2184 7876 4864 -6020 -4520
1335 -4520 6600 6155 -231 -180 -684 -2484 1761 2690 -3609 -1947 4788 514 -6627 -3483 -70 -1049
1351 -1049 997 372 -6687 -5638 1574 -782 -6230 -2406 310 -2929 -2312 -1546 -6159 -4512 3005 698
1367 698 -5662 -2302 417 -1586 -153 1438 -3676 -4050 3562 3241 -1504 344 535 -3150 475 6591
1383 6591 2592 -1683 1265 925 -552 3800 3889 -2699 48 7358 3576 -3647 -2372 54 2923 7562
1399 7562 3577 -7730 -6956 5819 7345 -489 -4217 -4870 -851 7708 5249 -9191 -10057 4148 7836
1414 7836 371 -5351 -7069 -3035 7372 6204 -8534 -11501 3332 10135 2117 -5894 -9424 -3933
1428 -3933 9392 11201 -4785 -11782 270 8091 3148 -1657 -4257 -2047 7813 9228 -4495 -10054
1442 -10054 2720 10914 5561 -596 -3897 -2273 7764 10976 -1120 -7043 3746 10561 4419 -560
1456 -560 -2024 -259 7472 9393 -1951 -6341 5429 11133 2650 -3624 -3007 1315 9923 9998 -3720
1471 -3720 -10217 2313 10811 3632 -3139 -3387 -722 6469 7076 -5207 -10377 2439 11164 3195 -6125
1486 -6125 -6806 -2839 6046 8797 -3751 -11684 -596 9098 2988 -4556 -6046 -3499 4256 8405 -1726
1501 -1726 -10065 -1810 6910 1970 -3090 -3149 -2380 2957 7316 -1178 -9358 -2289 6477 3310 72 -705
1517 -705 -3023 -1408 4084 1544 -3666 417 4044 -871 -2692 940 -692 -1063 2964 686 -3568
1532 -3568 147 2120 -2991 -2667 2920 321 -3512 -1008 -551 -2568 676 998 -5285 -3855 3517 2288
1548 2288 -3908 -3446 -2519 -2352 2775 2795 -4728 -5121 1973 1371 -3930 -2216 102 -579 2808 1624 -6243
1565 -6243 -5486 4194 4552 -2174 -2340 -441 -592 2623 2381 -4078 -3565 5440 4547 -3461 -3151 1208 1705
1582 1705 3002 1243 -4961 -2426 7392 5472 -5325 -5688 879 3892 4070 291 -7494 -4434 6673
1597 6673 6011 -5927 -6702 1007 4857 4003 -2061 -10273 -5476 9024 8684 -5342 -10151 -2384 4236
1612 4236 5491 -772 -9989 -6655 7970 8798 -5846 -11488 -2726 5138 6835 217 -10473 -8121
1626 -8121 7462 10102 -4283 -10725 -2384 5550 7180 1261 -9631 -8910 6649 10828 -2299 -9088
1640 -9088 -2576 3788 4985 1081 -7612 -6886 7049 9793 -3494 -9681 -2755 4076 5142 1539 -6959
1655 -6959 -7475 4148 7512 -3653 -8537 -1472 3270 3179 -237 -6857 -7010 3956 7456 -4126 -9089
1670 -9089 -1786 3452 2599 -662 -7388 -7064 4611 8261 -3119 -8969 -1679 3441 2575 318 -4959
1685 -4959 -4875 4894 8426 -2638 -8081 -581 5174 4979 2656 -3365 -5400 3379 8700 496 -4698
1700 -4698 839 4489 3796 2614 -1134 -3682 3760 8723 1565 -2828 1396 3671 2109 3089 1391
1715 1391 -2143 2242 6553 1436 -1750 1781 2441 -189 2730 3621 -620 375 2608 -788 -886 3942
1731 3942 2767 -1758 468 2961 -242 -289 1748 -336 15 4291 1161 -4911 -1308 3904 1616 -215
1747 -215 206 -2068 -1327 4278 1741 -5210 -1541 4212 2042 -609 -611 -2258 -804 4854 2549 -4803
1763 -4803 -1593 4658 2258 -1304 -1298 -1853 691 6519 2831 -5011 -2546 4687 3194 -284 -310 -450 976
1780 976 4793 1760 -5746 -2366 6398 4781 -1178 -2507 -2120 1056 5445 2360 -6189 -3701 5593
1795 5593 4314 -2121 -4330 -3020 455 5689 1911 -7710 -5401 4690 4061 -3041 -5058 -3715 1029
1810 1029 7036 2009 -8900 -7376 3612 6368 -303 -4263 -4627 -768 5771 3710 -7063 -6333 4264
1825 4264 6925 -224 -4382 -4337 -561 7227 5548 -5272 -6831 2953 6499 1080 -2668 -3042 -426
1840 -426 5856 5731 -3963 -6701 2385 5442 1177 -1516 -2414 -663 4754 4740 -3974 -5922 2553 6371
1856 6371 1302 -1666 -2371 -1710 3602 5248 -1942 -4531 2345 4310 -254 -1639 -1556 -544 3505 4345
1872 4345 -3040 -5960 758 3839 52 -1897 -2195 -2651 1218 3335 -3082 -6355 -479 2517 -1172
1887 -1172 -2019 -2446 -4068 -777 2170 -2806 -6289 -922 1759 -1032 -2554 -2946 -4347 -677 3875 -633
1903 -633 -5370 -1889 708 -1143 66 -289 -3276 -1342 3327 198 -4288 -1481 1055 146 1136 1042
1919 1042 -3252 -2614 2884 1898 -2156 -1357 0 -981 1545 1899 -3601 -4337 1599 2986 -1400 -1377 -1373 -2731
1937 -2731 430 2844 -2172 -4236 873 2496 -967 -2252 -1992 -2334 1489 4502 -1486 -5482 -309
1952 -309 2653 314 -261 -819 -2380 1170 4086 -963 -4757 117 3546 968 -379 -847 -2483 1198
1968 1198 4459 -440 -4676 516 3996 1483 -321 -1246 -2411 1324 5142 731 -4236 169 3574
1983 3574 1723 -131 -430 -1268 2374 6151 829 -4568 -280 4774 2813 1488 224 -1806 1286
1998 1286 6116 2257 -3448 -13 4536 2935 1249 -167 -2476 826 5900 2242 -3700 -1221 2987
2013 2987 2451 769 -648 -3198 -424 5143 2500 -4069 -2756 1384 1103 506 411 -2839 -1931 3319
2029 3319 1593 -4000 -2782 1600 1187 587 191 -3300 -2995 2344 3005 -2137 -1979 714 -68 732 1600
2046 1600 -1408 -2340 2739 3015 -1211 -1262 824 223 578 2874 -272 -1904 1985 3197 -616 -774 1176
2063 1176 150 830 2917 258 -2898 854 2523 -220 -175 1526 -135 -86 2615 159 -2822 265
2079 265 2917 591 -219 177 -1191 -438 3414 1471 -2769 -440 2595 661 -75 438 -1629 -381
2095 -381 3667 2044 -3044 -1239 2136 999 171 105 -1921 -823 3520 2392 -3123 -2501 2169 1979
2111 1979 1554 691 -2437 -2131 3034 3333 -2108 -2100 2083 2028 1359 439 -2740 -1746 3944 4740 -1734 -3342
2129 -3342 546 1940 1953 1514 -2525 -2885 2842 4687 -1536 -3624 -74 1427 2316 1444 -2443 -3721
2145 -3721 2120 4185 -1829 -4150 -927 1215 1461 986 -3477 -5374 702 4021 -957 -3969 -1633
2160 -1633 -287 396 623 -2760 -4727 630 3665 -1614 -4871 -2171 -192 704 1314 -2556 -5213 -72
2176 -72 3342 -1100 -4016 -1845 -56 579 1267 -1692 -4767 -556 3510 -112 -3514 -1412 415 576
2192 576 1141 -1753 -4691 -514 4147 779 -3160 -2142 -743 -83 2040 -128 -3883 -1141 2909 163
2208 163 -3139 -1512 -466 230 1724 -221 -4299 -2015 2667 993 -2064 -1150 -811 -838 1829 741
2224 741 -3342 -2228 2105 1170 -1003 -539 -545 -1022 1473 1815 -2124 -1821 2821 1491 -746 -41 -144 -357
2242 -357 2316 3217 -934 -2034 1557 1629 405 1478 689 -1342 1284 3182 -573 -1763 1544 1477 289
2259 289 1252 383 -2171 271 3243 -281 -1873 678 570 -215 1236 -238 -2879 -656 2885 293
2275 293 -2105 -718 -146 -564 829 336 -2729 -730 3098 117 -2930 -937 231 425 1902 727
2291 727 -3258 -1215 2957 1634 -1746 -556 329 -101 2031 947 -3137 -1133 3711 2142 -1564 -1092
2307 -1092 -188 181 2070 1419 -3208 -2186 3323 2795 -1269 -1249 -628 -213 2750 2419 -2671 -2604 2595 2725
2325 2725 -863 -631 -194 191 2612 2199 -2565 -2748 2420 2868 37 -526 -684 -733 2147 3033 -1766 -2429
2343 -2429 2032 2655 -260 -626 -784 -975 1623 3046 -1414 -3146 1147 2650 56 -637 -480 -865 1814
2360 1814 3288 -766 -2932 952 2842 670 375 314 -888 1533 3451 -115 -2328 1940 3689 1348
2376 1348 479 335 -1060 1481 4318 1230 -1676 886 2839 1356 1199 775 -862 852 3615 1193
2392 1193 -2678 58 1772 636 540 631 -2168 -511 2798 662 -2574 -1135 1231 215 479 231
2408 231 -3105 -2078 1887 876 -2425 -1152 344 -544 37 312 -2849 -2079 2025 1651 -1975 -2036 -276
2425 -276 -929 715 1547 -1997 -3012 1360 1673 -1549 -1575 -717 -1059 348 1472 -2131 -3363 532 1602
2442 1602 -1015 -1800 -891 -1272 382 1575 -1797 -3848 334 1795 -669 -1532 -1039 -1519 42 2012
2458 2012 -1345 -3041 546 2406 -500 -1840 -970 -844 1085 2741 -619 -3897 -331 2360 287
2473 287 -934 -738 -1415 101 2292 -568 -3322 -681 2188 -57 -1051 -973 -2034 -476 2338 -611
2489 -611 -4237 -1251 1571 163 -1406 -1519 -2543 -947 2478 310 -3618 -1366 1872 121 -969
2504 -969 -418 -1323 -63 3135 819 -3193 -1232 2288 1591 287 463 -1673 -461 3014 1672 -2110
2520 -2110 -708 2358 1217 507 773 -1131 -1093 2409 1663 -2032 -1418 1455 794 -398 201 -1362 -1729
2537 -1729 1836 1504 -2034 -1990 167 -445 -555 778 -1113 -2271 514 1035 -2143 -1819 811 -66 -771
2554 -771 315 -1035 -2521 364 1723 -979 -1543 168 -401 -715 1349 36 -2312 33 1498 -781
2570 -781 -1041 715 -475 -977 1162 146 -2335 -246 1888 -660 -1475 47 -986 -424 1818 512
2586 512 -2689 -1236 1952 131 -24 779 -650 -859 1888 1093 -1929 -588 2288 871 -192 695
2602 695 -603 -765 2679 2089 -1666 -802 1900 1527 669 937 -665 -896 2986 3310 -1176 -1198 1470 1297
2620 1297 1077 1162 -907 -744 2391 2793 -1480 -1866 1289 2082 1631 1176 -1161 -1890 2366 3539 -322
2637 -322 -1614 1060 1589 1356 1272 -651 -1460 2353 4014 -81 -2041 638 2099 1671 1764 -719 -2064
2654 -2064 1880 4038 -158 -2191 437 1106 1453 2096 -466 -2224 1186 3420 -77 -2164 216 1627
2670 1627 1147 1343 -929 -2788 703 3705 28 -2510 -388 1009 509 1292 -617 -2718 679 3193
2686 3193 86 -2803 -570 434 893 1093 -868 -3220 -254 2953 332 -2660 -946 81 349 1109
2702 1109 -717 -3366 -839 2519 698 -2443 -949 -87 -311 885 -103 -2976 -816 2493 718 -2289
2718 -2289 -1399 -286 -444 1189 415 -2284 -1730 1809 343 -2245 -594 87 -716 910 781 -2097 -1747
2735 -1747 1561 813 -903 -254 451 -1027 795 1516 -1557 -1627 1837 1221 -893 -100 169 -1354 246
2752 246 1370 -870 -1582 1344 749 -936 28 230 -1266 287 2201 -752 -1895 575 189 -821
2768 -821 147 280 -1672 -450 1422 -868 -1590 770 776 -998 163 238 -2058 -759 1844 -50 -1952
2785 -1952 -10 354 -710 264 567 -2145 -774 1951 618 -1688 -276 26 -917 431 437 -2013 -1147
2802 -1147 1768 583 -1912 -897 -258 -708 1041 639 -2621 -2549 1539 893 -1612 -1056 -797 -1347 280
2819 280 676 -2457 -2639 1154 1159 -1657 -1349 -731 -1245 757 1038 -2435 -2942 1057 1549 -1161 -1114 -1162 -1523
2838 -1523 672 1684 -1323 -2727 704 1404 -934 -876 -560 -1004 1158 1933 -1396 -2653 695 2262
2854 2262 -580 -518 -451 -990 1077 2621 -820 -2393 1016 1899 -145 -474 114 -659 945 2500 -207
2871 -207 -2295 845 2231 -419 -9 -92 -593 917 2857 1 -2597 133 1991 418 99 759 -495
2888 -495 441 2626 141 -2047 675 2169 559 242 118 -482 750 3128 903 -1934 478 1855
2904 1855 1039 237 824 -464 375 2998 1363 -1480 60 2085 873 742 1426 -200 -284 2752 1253
2921 1253 -1491 -507 1423 541 765 1175 -856 -1115 2142 1924 -624 208 1337 -342 33 1478 -312
2938 -312 -986 1542 1496 -1332 -550 966 -128 169 1302 -374 -1535 833 1272 -1215 -726 404 -781
2955 -781 -477 1315 -547 -2183 255 1105 -1184 -938 728 -409 -504 1280 -426 -2302 292 1837
2971 1837 9 -607 283 -746 -398 1861 524 -1799 422 1676 -96 -444 472 -637 -261 2085
2987 2085 892 -2013 -195 1767 643 -162 243 -1025 -261 2196 1118 -2179 -956 1197 428 -196
3003 -196 224 -1360 -943 1624 1084 -1939 -580 1398 462 -146 152 -1366 -960 2283 1584 -1662 -1311
3020 -1311 892 338 110 530 -652 -984 2021 1643 -1614 -1453 1033 533 562 792 -1057 -1792 1244 2043
3038 2043 -1284 -1429 798 368 150 884 -1091 -1824 1205 1687 -1245 -1798 425 -16 -203 516 -1267
3055 -1267 -1732 638 1666 -1181 -1727 -168 184 95 665 -1046 -2125 416 1716 -944 -1856 40 10
3072 10 -318 456 -778 -2432 -373 1600 -706 -2052 -285 -247 -707 314 -880 -2786 -387 1361 -675
3089 -675 -2331 -628 -528 -813 805 -560 -2669 -1161 1245 -1134 -1915 -314 -914 -886 819 -157 -2436
3106 -2436 -1240 1217 -133 -1427 -553 -397 -861 715 316 -1552 -1025 1502 175 -924 -19 -70 -930
3123 -930 1076 808 -1591 -945 1529 794 -604 251 -58 -731 1152 2002 -1200 -984 981 535 -475
3140 -475 348 201 -944 1002 1369 -1205 -1423 943 860 -187 744 -32 -1107 669 2140 -288 -817
3157 -817 1045 440 71 963 372 -1067 935 1920 -244 -1067 978 617 54 1158 517 -1425 418
3174 418 1967 311 -1146 81 371 -34 1059 972 -1266 -13 1962 282 -1073 715 699 111 1229
3191 1229 481 -1451 -201 2031 1026 -982 145 554 -166 1382 1038 -1474 -591 1956 1074 -988
3207 -988 79 204 -3 1149 1102 -1391 -862 1716 1159 -967 -226 346 -532 1336 1438 -1501 -1424 1389
3225 1389 969 -664 58 -34 -996 491 1049 -1316 -1425 1336 1252 -692 -158 -312 -716 976 1532 -1160
3243 -1160 -1647 1171 1012 -31 348 -327 -616 1103 1682 -398 -1281 1064 1040 -235 142 198 -466 944
3261 944 2087 -433 -1648 950 1283 19 391 259 -862 669 2131 -20 -1329 728 1362 -216
3277 -216 57 261 -663 765 1961 90 -1462 699 1500 285 578 494 -905 186 2539 372 -1511
3294 -1511 240 1418 91 454 608 -759 -252 1557 448 -1457 -35 1049 -106 591 387 -1301
3310 -1301 -518 2027 709 -1502 -321 635 -382 172 551 -1213 -837 1049 437 -1833 -747 175 -599
3327 -599 -32 466 -1136 -1576 968 395 -1212 -589 -57 -854 -289 834 -1144 -1746 657 793 -1493 -797
3345 -797 292 -974 -399 989 -1102 -1913 348 490 -1437 -875 -197 -1098 -598 938 -638 -2040 -229
3362 -229 611 -842 -684 214 -1190 -727 645 -641 -1862 -89 544 -334 -266 -32 -1204 -977 917 116
3380 116 -1921 -383 787 -303 -525 -64 -1463 -981 1230 30 -1632 -374 853 -196 -244 220 -777
3397 -777 -700 1176 385 -1592 -583 1147 -85 62 365 -839 -967 1444 924 -1405 -315 837 -167
3414 -167 254 497 -918 -998 1310 1366 -1069 -709 825 -28 373 527 -783 -998 1450 1425 -820 -535 521
3433 521 168 242 1339 -459 -1019 1020 1551 -647 -988 597 105 191 1129 -486 -1577 1111 1714 -463
3451 -463 -752 461 -152 249 1140 -202 -1316 924 1485 -368 -767 639 154 49 1082 -211 -1534
3468 -1534 488 1340 -541 -816 203 13 -109 862 -524 -1746 189 1346 -227 -858 172 116 -213
3485 -213 962 -31 -1879 153 1375 165 -683 51 -162 -381 1363 136 -1384 -7 1246 340 -691
3502 -691 259 -341 -257 1143 626 -933 -256 1338 273 -184 304 -150 -112 1500 1093 -1043 -405 1318
3520 1318 758 -14 709 -264 -460 1140 1225 -592 -349 1369 558 -181 856 -171 -475 1294 1583 -414
3538 -414 -350 998 500 150 1048 510 -976 1231 1316 -360 -299 1207 413 45 1194 365 -620 608 1502
3557 1502 -367 -616 839 690 19 926 339 -678 82 1420 148 -620 827 324 -139 709 459 -1150
3575 -1150 228 1782 190 -690 762 497 -370 1065 801 -1253 -564 1312 325 -579 84 -44 -414
3592 -414 804 532 -1402 -357 1180 261 -932 -250 -133 -841 642 413 -1983 -1161 980 169 -1046
3609 -1046 -605 -334 -776 233 671 -1580 -1627 672 102 -1130 -466 -604 -676 567 531 -1336 -1477 580
3627 580 547 -825 -475 -485 -873 539 844 -1124 -1390 370 327 -812 -137 -317 -980 187 998 -831 -1628
3646 -1628 531 419 -361 -247 -372 -1193 108 1131 -1048 -1314 341 233 -248 82 -98 -1170 333
3663 333 997 -972 -1373 373 268 -354 -196 -314 -781 210 1309 -548 -1099 48 633 -260 -402 -14
3681 -14 -1026 157 1112 60 -1201 203 860 -463 -189 2 -704 102 1308 217 -1109 209 567
3698 567 -95 273 451 -799 -590 1194 -18 -1508 92 520 -529 -141 320 -842 -600 981 185
3715 185 -1037 -320 340 -512 78 411 -883 -873 448 484 -1041 -300 127 -936 -87 661 -833 -1132 185
3734 185 228 -641 -490 131 -735 -227 688 -388 -1118 208 517 -511 46 -124 -682 -141 521 -340 -1213
3753 -1213 161 790 -413 -62 230 -670 -65 1146 -167 -663 261 456 -288 267 367 -721 -127 1179
3771 1179 305 -979 -77 621 -78 544 501 -668 -285 1051 208 -990 -44 1126 28 291 699 -818
3789 -818 -451 1279 902 -606 153 599 -57 497 682 -371 -105 1306 843 -609 -157 732 546 771
3807 771 594 -632 -119 1604 1152 -408 -151 1103 196 958 1064 -94 -580 1794 1427 -479 -112 783
3825 783 542 641 825 -256 -339 1286 1621 -731 -159 465 317 621 1262 -514 -1124 1031 1344 -533 -417
3844 -417 508 84 279 955 -389 -1083 829 1113 -344 -416 612 83 -90 813 -533 -1252 670 774
3862 774 -461 -835 540 -161 -160 637 -233 -1564 238 811 -450 -744 302 18 -184 495 -340 -1072 173
3881 173 756 -404 -514 61 -453 -267 999 -93 -1306 -322 949 -460 -633 -242 11 -449 482 124
3899 124 -1450 -203 980 -199 -611 66 -326 -641 818 221 -963 -262 665 -384 -388 252 -405 -428 670
3918 670 730 -791 -352 772 -189 -89 510 -402 -889 696 676 -777 -650 429 -290 -115 600 -71 -1000
3937 -1000 399 552 -785 -496 511 -186 -819 704 18 -1192 320 1199 -398 -552 86 -235 -371
3954 -371 629 180 -1133 -2 935 -340 -782 194 47 -426 665 60 -1084 -203 780 -467 -873 -20
3972 -20 -354 -556 586 1 -1201 -532 670 -240 -593 -107 -402 -671 388 -256 -1198 -248 711 -558 -784
3991 -784 -9 -393 -663 686 228 -1390 -658 320 -60 -680 -353 -255 -865 222 240 -1476 -916 589 -162
4010 -162 -652 -207 -533 -590 450 169 -1439 -816 783 327 -988 -41 -622 -979 730 782 -907 -880 452
4029 452 202 -709 82 -111 -710 559 700 -615 -1146 425 655 143 506 -30 -1011 428 1015 -362
4047 -362 -607 564 136 -161 334 320 -551 335 1114 33 -811 532 382 154 366 364 -499 464 1393 -46
4067 -46 -472 774 505 187 797 394 34 318 1356 323 -331 613 924 -14 932 348 -703 365 1261
4086 1261 375 -638 476 752 32 679 560 -639 22 1174 284 -501 341 274 -235 340 526 -291 -29
4105 -29 1001 519 -743 306 537 -147 512 455 -866 -35 1052 293 -318 169 366 -220 295 708 -750
4124 -750 -605 825 489 -362 375 172 -449 261 614 -544 -678 688 514 -434 -152 322 -708 -12 705
4143 705 -414 -777 484 202 -657 263 128 -577 -177 736 -277 -355 356 572 -482 217 254 -546 -106
4162 -106 548 73 -762 381 765 -252 42 228 -540 200 1025 93 -979 11 194 -356 278 308 -566
4181 -566 -102 908 190 -794 79 609 40 342 489 -246 -333 797 346 -648 212 585 -86 286 375 -783
4201 -783 -277 834 417 -1183 -33 662 -77 124 575 -542 -355 1046 484 -622 -104 281 -251 226
4219 226 627 -737 -870 459 432 -575 -60 367 -164 -200 633 -457 -585 528 634 -447 -542 47 -376
4238 -376 323 773 -572 -684 81 429 -197 -230 23 -646 -92 765 -378 -1285 197 344 -556 -614 -104 -727
4258 -727 -270 188 -396 -1193 -83 338 -521 -577 87 -882 -582 427 -416 -1217 -190 344 -438 -660 -27
4277 -27 -990 -789 190 -368 -1120 -306 218 -792 -687 69 -448 -884 275 29 -1151 -188 435 -252 -418
4296 -418 493 -407 -698 687 11 -625 -107 703 -594 -311 452 -489 -465 555 295 -941 -246 509 -156
4315 -156 -138 545 -326 -376 786 956 -594 -449 318 -41 94 650 34 -610 732 968 -585 -645 301 40
4335 40 -132 682 -329 -591 363 811 -213 -270 356 163 217 862 132 -913 396 927 -181 -238 707 -97
4355 -97 -54 551 174 -840 142 899 -221 -121 389 14 -158 712 214 -655 136 852 -23 -329 612 -87
4375 -87 -299 609 196 -928 206 863 -49 -175 247 151 -353 558 131 -506 132 685 -119 -626 533 262
4395 262 -155 779 654 -834 -317 590 -26 -324 425 45 -522 774 386 -1006 -94 930 -88 -438
4413 -438 -1 -87 -382 386 547 -851 -240 621 379 -391 352 105 -604 686 918 -822 -482 761 206
4432 206 -102 533 373 -379 506 914 -80 -441 751 404 13 829 80 -417 228 737 -190 -147 644 127
4452 127 -126 533 193 -508 451 1154 61 -206 575 404 191 302 522 -443 290 944 -107 -590 645
4471 645 173 -202 396 336 -396 134 706 -388 -417 557 156 -46 317 552 -643 -192 942 -33 -686 465
4491 465 -273 -273 522 177 -711 -246 862 -166 -262 236 -88 -450 179 341 -1106 -533 632 -141 -964 -41
4511 -41 89 -473 10 406 -630 -604 450 -73 -817 94 92 -952 -51 372 -740 -655 299 109 -844 180
4531 180 -272 -843 -130 282 -746 -709 357 -233 -497 -197 -113 -501 -11 505 -498 -623 303 -244 -427 121
4551 121 51 -867 -347 376 -481 -880 -308 155 -540 -150 280 -746 -214 683 -243 -757 -96 -122 -249 148
4571 148 338 -730 -436 642 -295 -890 221 64 -340 131 652 -458 -475 807 -64 -368 296 338 -278
4590 -278 -127 435 -616 -133 763 22 -450 339 320 -379 238 317 -695 -368 701 309 -462 -133 367 -260
4610 -260 439 452 -694 -286 536 144 -680 -190 262 -209 332 453 -475 -396 542 295 -475 36 304 -163
4630 -163 354 540 -431 -538 558 291 -486 -227 222 -523 -299 602 -309 -638 389 504 -417 31 42 -354
4650 -354 50 455 -420 -695 438 188 -746 -137 321 -174 0 565 -204 -589 403 390 -222 69 118 -447
4670 -447 -127 563 -435 -714 184 390 -351 -140 180 -489 -147 733 -66 -395 221 438 -87 128 242 -374
4690 -374 -79 687 86 -307 315 589 -159 172 812 -191 -94 818 423 -261 66 338 -44 28 577 -177
4710 -177 -3 899 430 -350 186 876 108 99 551 142 9 735 383 -73 309 632 211 94 551 -154 -208
4731 -208 672 679 -289 93 553 66 91 795 119 -288 465 1192 -170 215 598 -233 226 633 179 -749 539
4752 539 745 -235 -46 408 -44 -184 533 115 -457 209 461 -621 -26 530 -120 234 588 -113 -509 -137
4772 -137 389 -377 72 300 -245 -2 301 -41 -892 3 201 -268 -296 264 -578 -392 286 -7 -399 115
4792 115 419 -261 6 157 -287 -417 561 -42 -1071 -332 494 -96 -1048 12 -381 -678 320 140 -747
4811 -747 -418 399 -161 -99 251 -190 -776 156 511 -718 -579 -73 -235 -505 -20 -173 -563 167 311 -692
4831 -692 -543 375 -351 43 618 -250 -567 279 302 -608 -525 655 -40 -23 316 55 -863 -56 807 -590
4851 -590 -376 315 -118 -584 291 -174 -451 -45 666 1 -194 631 -139 115 80 353 -621 229 759 -118
4871 -118 -308 178 -219 -428 36 -226 -501 44 351 -433 -471 -12 87 -399 299 337 -769 -89 584 105 -582
4892 -582 155 -37 -408 351 107 -617 -273 606 -256 -344 71 -3 -427 372 -31 -601 -362 505 -243 -383 491
4913 491 -35 -363 106 300 -612 -382 559 -39 -656 51 4 -422 45 603 -687 -461 558 -237 -680 -35
4933 -35 274 -358 30 314 -570 -449 488 261 -368 287 76 -514 -46 516 -285 -531 490 53 -334 294
4953 294 34 -569 72 501 83 -500 339 479 23 176 269 -213 0 1016 -140 -298 335 -8 -14 614
4973 614 355 -321 74 1027 329 82 616 533 -398 553 340 -405 -5 707 152 -301 263 302 31 696 540
4994 540 -175 161 734 270 -115 513 404 -279 473 499 -489 109 726 391 -174 267 379 -462 237 517
5014 517 -112 -409 670 153 -178 278 433 187 222 596 -251 -452 461 617 -215 80 131 29 454 493 -340
5035 -340 -580 488 424 -337 236 59 -184 112 450 -121 -334 180 346 -429 -222 225 -398 -31 646 -227
5055 -227 -666 404 345 -216 30 281 -436 -74 435 -146 -838 17 91 -291 108 -159 -342 -360 429 -241 -704
5076 -704 109 125 -203 58 478 -743 -68 303 36 -542 -186 203 -166 271 150 -453 165 173 -67 -405 92
5097 92 17 -175 -230 393 -386 -442 268 149 -298 204 164 -551 -44 346 -34 -246 485 117 -233 -175 -124 -212 -182
5120 -182 467 -139 -253 424 283 -517 4 271 -161 -127 232 -221 -622 482 103 -492 -35 256 -53 -98
5140 -98 442 -262 -852 355 120 -612 -322 326 -636 -207 80 78 -273 10 -99 -284 -42 186 -454 -526 261
5161 261 -63 -700 246 127 -453 -153 38 -573 -66 430 -226 -496 129 150 -530 6 -26 -388 -555 41 -35
5182 -35 -715 -329 112 -275 1 141 -610 -379 278 -10 -652 9 297 -291 -145 20 -615 -378 194 -190
5202 -190 -562 35 132 -104 -306 172 -494 -215 217 -116 -267 51 370 4 293 283 -221 -535 399 370 -251
5223 -251 -274 667 110 -31 544 169 -245 433 134 -266 4 340 10 3 129 -52 -576 347 889 -102 -91
5244 -91 428 -28 111 330 -64 -57 381 314 -181 -26 204 -118 152 734 258 -210 43 192 27 180 107 137
5266 137 14 519 -156 -274 70 416 52 289 502 32 139 260 383 -275 108 492 218 -45 51 24 -27
5287 -27 577 434 -686 85 450 -188 25 53 140 -320 465 141 -497 226 228 -130 -12 -69 159 -182 435 326
5309 326 -240 -97 562 -266 -54 265 199 -262 248 46 -349 -14 55 115 35 45 24 -305 51 419 -460 -65
5331 -65 391 1 -606 20 -67 -132 -20 219 -435 -313 534 45 53 -73 -118 -306 468 301 -247 -314 137 -167
5353 -167 -204 404 61 -260 388 522 -272 -244 162 78 -83 342 262 -319 79 797 -66 -376 229 178 -355 269
5375 269 227 -204 -4 414 -51 -19 282 142 -93 536 319 -361 210 515 19 -242 42 -126 67 291 58
5396 58 -487 -261 337 -333 -316 294 163 -146 166 17 -567 -44 301 -274 -327 273 -100 -480 -306 334 -519
5417 -519 -130 227 -381 -315 -21 -176 -488 345 475 -290 -377 381 112 -166 -171 11 -448 143 98 -483 -417 155
5439 155 -96 -792 44 70 -181 -352 215 -460 -382 10 131 -438 181 -56 -504 -349 411 -588 -696 -87 -50
5460 -50 -281 -94 -185 -511 24 154 -374 -384 -137 -37 -306 102 -42 -677 111 311 -209 -634 145 27 -467
5481 -467 -202 -91 -198 303 466 -19 -510 87 -1 -223 -37 403 -429 -194 374 7 -321 215 74 -191
5501 -191 22 347 -131 -48 270 159 -293 333 48 -317 245 181 33 -198 374 -94 -71 544 -56 -493 -76
5522 -76 665 -409 -15 239 58 -301 -155 489 -139 47 247 -99 26 58 149 -215 -13 230 -160 -49 366
5543 366 29 -184 503 158 -302 174 66 -254 325 334 -232 -383 245 328 -86 314 305 -237 31 493 158 -126
5565 -126 370 194 -413 -299 230 -283 -81 336 69 -401 -10 483 -163 34 522 -100 -57 504 33 -304
5585 -304 63 34 -267 206 342 -456 -94 430 64 -445 72 341 1 13 12 -142 -267 530 147 -459 106
5606 106 80 -153 174 334 -189 -397 271 344 -347 216 174 97 -126 318 -182 -161 292 348 -136 353 218 -141
5628 -141 30 448 19 -201 436 346 -320 -84 342 45 75 428 -144 -101 126 191 99 179 541 -295 108 184
5650 184 -66 -587 310 207 -333 -374 248 58 -119 221 -228 -462 440 334 -121 -112 174 -205 -240 144 -217
5671 -217 -381 200 580 36 9 415 -196 -112 317 -219 -686 -248 284 -246 -63 81 -304 -200 152 -23 -256
5692 -256 -173 434 -362 -195 280 -395 -235 -13 -172 -337 -19 140 -325 -46 191 -223 -259 -1 -137 -553 89
5713 89 41 -354 -331 -30 -137 -536 -52 96 -453 -433 382 -493 -208 360 -16 -497 180 121 -104 -114 346 -217
5735 -217 -328 327 -157 -753 96 134 -345 110 130 -147 -479 189 -89 -341 -14 137 -259 -263 189 -359 -235
5756 -235 271 129 -339 -42 230 -434 -94 140 -209 -67 400 -120 -143 152 103 -217 -104 -37 18 -395 514
5777 514 148 -399 30 223 -37 -82 231 244 -136 336 14 -250 120 328 -54 -119 137 -278 -79 420 305
5798 305 -147 39 435 -207 -112 54 125 -275 206 323 -345 118 294 -13 -174 333 -124 -118 146 429 -559
5819 -559 130 618 -116 -291 58 216 -62 643 71 -95 -357 122 -46 -156 581 -287 -39 115 648 -163
5839 -163 27 383 86 -411 56 -61 -186 52 176 -281 -51 -32 263 -84 -249 -39 9 192 144 -31 -18
5860 -18 183 183 132 65 429 -184 80 219 -80 -170 540 -144 43 334 191 -231 264 604 33 -421 27 105
5882 105 249 277 291 -364 -17 435 -107 -90 333 94 -252 -22 140 -322 378 550 73 68 94 26 -319 260
5904 260 240 -255 -104 372 -64 -103 367 -44 -536 -2 380 -92 5 517 110 -237 487 -17 -313 251 265
5925 265 -311 53 253 426 -71 -66 -95 -373 170 494 -238 -427 84 -161 -34 283 -146 -210 75 125 -255 -521
5947 -521 194 -249 -201 121 -14 -191 28 302 -211 -620 77 -123 -180 83 207 -286 -28 249 -362 -365 276
5968 276 -27 -244 -28 -36 -477 -102 750 -300 -409 266 19 -335 63 190 -275 35 217 -100 -172 125 325
5989 325 -211 -106 321 -310 -350 197 -7 -281 -20 17 -65 -129 242 -315 -231 355 -180 -94 157 62 -303 13
6011 13 496 -456 -316 190 -168 -260 29 213 213 136 273 -371 -129 246 -194 -607 -64 79 -144 49 165 -257
6033 -257 -221 332 93 -40 -283 358 124 112 459 -347 -443 262 -7 -335 -14 167 -360 -52 345 -207 -259
6054 -259 174 162 -410 75 65 272 109 257 -288 -94 117 -176 185 -82 -27 -295 -160 99 26 -297 95
6075 95 111 -212 -121 118 -197 -376 -28 37 -472 144 90 -215 -187 430 -299 -540 195 73 -265 -159 21 -299
6097 -299 191 218 66 -334 138 322 -245 -187 67 -624 44 191 37 -138 314 -127 -101 505 364 -529 20
6118 20 292 -54 -139 389 420 -292 27 349 -221 -185 317 -151 -275 62 233 -302 98 254 -92 -209 79
6139 79 -40 114 310 327 -194 108 351 -55 -122 248 7 -384 103 213 49 381 373 -91 31 241 260 -467
6161 -467 109 255 -214 233 573 184 397 456 135 -345 -83 479 -49 -32 253 -129 -106 572 415 -350 148
6182 148 583 8 -100 284 102 -74 374 197 -433 316 368 243 -249 177 -224 17 428 -153 -494 13
6202 13 269 -101 105 221 -290 -104 -40 130 -221 103 497 -217 -174 79 112 -258 219 -77 -126 -71 219 205
6224 205 -147 -64 378 -278 223 363 -497 -60 319 -82 -230 106 -236 -454 88 76 -155 137 82 99 -210
6245 -210 432 -224 -201 239 304 -80 -182 280 -273 -120 225 -87 -135 219 250 -312 5 433 -128 -394 -134
6266 -134 274 -350 -67 264 -327 83 130 51 20 175 -39 -377 202 223 -70 62 226 -170 125 74 -22 -284
6288 -284 54 171 -318 -36 110 -188 -74 101 472 -44 -59 -11 -174 -233 45 321 134 216 315 -347 -205 110
6310 110 202 -260 -150 -234 -191 180 73 -212 -97 228 48 -83 -94 -79 -248 113 299 -804 254 82 -134
6331 -134 -117 -81 5 -178 -84 105 -302 7 378 -167 -631 141 -78 -230 -49 -162 -447 -206 25 -335 -290 -29
6353 -29 121 -325 -224 33 -604 -101 36 -15 -22 78 -150 -369 0 175 -1 -232 211 -262 -213 102 -94 -111
6375 -111 229 201 -200 -390 272 -263 -99 113 339 -304 -208 357 -112 -151 116 64 -241 274 19 -244 211
6396 211 -122 30 82 441 99 87 374 277 -117 -39 273 24 75 276 51 36 195 -8 -152 -204 317 211
6418 211 -314 -22 12 124 49 322 73 95 387 116 -337 279 131 330 196 317 148 -90 652 215 -65
6439 -65 215 137 -108 92 388 155 -141 79 -74 -101 36 246 -342 154 435 40 -34 307 204 -171 338
6460 338 133 208 -136 307 -82 153 278 88 -217 173 -7 -224 16 80 192 -12 16 215 -350 149 107
6481 107 227 109 176 13 -280 355 82 -95 188 377 -54 -85 31 -249 -588 201 269 -117 -61 154 222 -172
6503 -172 339 222 15 -303 140 -207 -181 349 28 55 447 156 -80 220 163 221 -113 360 -201 -209 216 101
6525 101 -298 50 171 -277 -127 -47 163 -283 202 151 124 102 271 -26 -108 117 -118 -120 588 358 -60 -272
6547 -272 450 -167 -79 75 -129 -263 -283 -183 -331 -93 151 -189 -289 290 -98 -341 275 336 -275 -49 112
6568 112 -165 27 216 -245 -123 -10 121 -143 60 -153 -326 37 318 -19 -184 78 -91 -260 -92 266
6588 266 116 -100 443 -112 -871 63 -7 -227 -29 -69 -28 -304 56 76 -189 218 66 -9 64 -65 -94 -105 -137
6611 -137 -175 -488 20 -32 -77 -69 -26 -244 -344 206 -69 -262 -43 82 43 -360 54 -99 -260 202 347 -352
6633 -352 112 294 -294 -91 190 -59 -385 10 177 -165 -13 233 -200 66 -4 -116 -115 98 296 -202 -93
6654 -93 -45 -49 43 59 -361 -111 137 302 -349 -13 318 -209 311 162 121 -17 54 87 -165 -122 42 -228 -228 453
6678 453 91 37 26 91 -162 -201 424 -91 252 342 59 -71 73 106 232 47 182 -57 0 212 -74 61
6700 61 167 25 -229 -100 387 39 358 237 31 -150 -7 223 -214 -194 72 -47 -157 54 104 -254 93
6721 93 136 -282 26 212 1 -96 375 442 -39 -170 62 -67 89 217 17 -95 -180 -16 -122 -133 222 -171
6743 -171 -166 38 -259 -156 252 -73 -272 192 50 106 -155 257 -194 -288 177 383 -204 -80 294 178 -191
6764 -191 147 184 -330 222 147 -352 -258 244 183 178 404 281 45 152 543 -127 -79 147 225 -276 -73 24 -225
6787 -225 -158 448 119 303 357 -38 13 292 -61 213 123 318 -84 -152 -120 46 164 237 311 -411 199 540 195
6810 195 -29 327 234 -9 182 144 -97 207 205 -284 110 33 -82 -141 50 -118 68 -207 341 -112 -352 288
6832 288 95 28 231 -17 -124 -215 179 -229 -142 -72 -74 -227 -4 49 -105 -59 66 45 -475 188 149 -183 33
6855 33 149 -309 -22 157 -61 142 321 -172 -424 -71 184 -294 -210 220 -101 -352 -114 -207 -321 67 -120
6876 -120 -76 -147 134 -116 21 -4 -324 -246 -196 248 -143 -34 -188 -88 -182 25 158 117 -161 -15 -198 -308
6898 -308 -56 -47 -136 -36 -122 -218 -224 110 -74 -95 383 23 -330 -139 -18 24 -37 23 -16 -25 262 -146 87 -217 -6
6923 -6 -80 -222 84 89 25 175 -16 118 253 152 107 149 344 -204 -103 169 -10 36 -306 333 -129 -186 -90 190
6947 190 -2 -159 411 137 206 114 -161 -165 16 -22 -101 -14 143 32 -165 263 -142 -172 211 58 -108 284 10
6970 10 -387 86 -114 -134 -380 239 71 -150 134 69 -159 -211 61 24 -195 467 -322 31 278 140 6 -21
6992 -21 295 96 -103 6 -32 -292 185 -324 119 208 100 174 -353 -170 153 149 163 -13 8 -210 560 354 -313
7015 -313 -2 334 -298 228 278 -223 -116 223 40 151 428 -56 31 44 356 84 -61 255 315 -229 51
7036 51 -101 -52 -282 200 -51 -166 329 -7 -80 -33 269 311 157 46 -164 -117 298 -120 -216 294 228 177 -117
7059 -117 403 299 -218 217 156 -40 -74 283 -48 -118 140 164 181 421 79 37 -4 18 -207 -173 -106 -235 -15
7082 -15 311 84 -177 18 277 79 -34 335 61 -229 198 509 -151 172 88 -278 45 -18 -87 7 -187 113
7104 113 -147 -29 198 10 -72 215 157 -394 34 251 -43 1 422 224 140 -49 -56 -97 106 1 -136 -137 144
7127 144 -181 78 109 -117 -103 -47 124 -259 62 -344 174 1 -52 61 -114 20 21 -206 -45 300 -184 -329
7149 -329 58 47 -100 -247 -301 125 -28 136 -119 -101 264 -70 -28 57 137 189 88 260 -178 -96 226 -162 -120
7172 -120 -305 281 -239 -32 67 -99 -77 -296 87 223 -9 111 25 92 -65 60 -95 -335 383 38 30 -112
7194 -112 2 -90 311 271 -234 87 166 -127 -28 86 0 -208 -21 60 -8 37 -63 -34 189 -6 -65 229 -67
7217 -67 -60 -173 -41 115 154 -100 53 -328 -352 51 39 166 -186 214 150 -55 -124 21 197 -50 -87 -359 383
7240 383 134 169 -173 -204 18 6 -47 7 -148 -304 135 24 -228 17 187 -306 24 -134 -8 21 142 80
7262 80 -82 -35 -47 -203 152 192 3 91 168 -164 -155 246 -105 -52 345 163 -364 320 382 -12 -45 48 12 -119
7286 -119 152 -64 -119 -55 -169 -145 8 -60 174 238 155 188 63 60 -8 8 20 156 176 -28 426 -63 44 58 493
7311 493 -122 16 153 94 -38 20 132 -40 94 106 88 183 244 198 -334 -139 43 -131 -28 139 260 10
7333 10 138 90 -156 172 -10 300 21 208 188 -9 120 216 121 32 161 -9 -313 1 204 -199 16 39
7355 39 -82 321 -86 -260 -238 74 83 -405 96 367 115 -266 -67 -60 -75 -32 154 -7 -54 -149 -320 -295 25 -300
7379 -300 108 -140 312 -111 -18 194 -104 -235 -118 -134 333 289 -75 -138 152 -82 -87 22 -23 -289 -58 -75 414
7402 414 -48 -48 273 -301 -34 128 -149 -6 -94 -114 -107 -207 330 -236 33 -140 -311 14 220 158 -149 -99 243
7425 243 157 -144 59 -54 -71 124 156 -84 -129 -152 -13 -264 82 -43 134 -166 219 -147 -27 -32 -234 -90
7447 -90 -29 133 -126 265 174 -49 -65 91 -174 -64 101 196 113 179 286 -81 229 -191 18 -140 -251 205
7469 205 -176 -90 15 38 -35 370 272 -145 233 -57 -259 -7 312 -106 -64 109 -192 -297 290 -13 14 87
7491 87 258 -218 -480 58 39 38 32 -86 8 -280 -154 -273 -196 118 19 -284 -42 184 9 -85 357 -155 -312
7514 -312 159 -200 126 -418 32 -50 153 481 -85 -194 -223 122 -161 -120 121 -82 -36 -16 -155 -160 -109 -115 21
7537 21 -8 126 29 89 -429 163 -212 85 100 -158 42 -133 -169 312 -23 -124 -85 312 -20 -103 146 86 209
7560 209 106 238 70 -26 7 317 4 6 203 -31 -183 -234 -268 -82 -241 6 -248 47 121 -194 -158 249 -9
7583 -9 -181 91 180 -206 89 90 52 -222 -95 390 2 78 361 349 114 353 -85 -14 48 214 4 -272 181
7606 181 147 133 269 52 -398 -21 -19 162 -194 -30 -94 53 128 -181 337 214 92 -335 4 30 155 -95
7628 -95 282 191 -342 -10 -283 77 23 184 -25 137 146 -158 -179 49 126 238 -135 415 -114 52 208 214 174
7651 174 -39 12 153 112 -189 26 9 55 124 235 71 -27 31 -89 501 -149 -187 -85 301 -155 -138 97 -316
7674 -316 -276 96 -52 64 266 45 -152 -212 -29 -26 107 531 9 -115 242 -380 -238 -25 193 -280 233
7695 233 172 -169 106 145 -129 -20 -68 -291 -28 -47 -147 116 -204 7 186 52 -86 206 57 -218 -38
7716 -38 52 70 65 240 -343 301 -65 89 27 -214 286 -105 273 363 -326 -337 162 -311 -286 -181 211 48 244
7739 244 219 -260 45 22 -262 -14 25 129 -121 -75 198 136 -99 103 -98 43 -48 -297 -361 -222 -80 16 4
7762 4 -39 -9 -104 -5 -249 -370 -137 150 -139 -302 187 181 -213 128 111 -163 -213 141 -207 -411 70 49 -468 -385
7786 -385 110 -84 -342 -256 -9 -217 -92 83 -89 -215 -34 -142 -100 286 -242 71 -55 -99 -83 -272 214
7807 214 -103 169 289 -77 -257 14 98 -406 124 -83 -263 176 206 28 -97 33 1 -207 -166 -202 -94 177
7829 177 60 -165 -237 22 158 -221 -101 49 -28 -365 28 145 43 41 238 26 -106 154 89 173 271 21
7851 21 -128 338 -104 36 -5 520 -100 167 225 -316 -68 238 -8 245 58 299 -186 -188 115 173 -7 -128
7873 -128 446 146 207 4 74 -113 -121 -130 -209 -81 126 141 28 47 83 24 88 -96 107 -108 114 -345 138 103
7897 103 -197 189 -270 301 -195 -44 204 90 -197 -25 38 -99 -6 217 19 -114 -52 35 -101 26 -183
7918 -183 -188 316 219 151 16 -42 -1 -93 244 -15 -74 86 -197 -464 -91 232 71 -23 154 161 307 73 187 -60
7942 -60 -27 152 198 -28 134 -91 30 135 -35 -183 -67 43 -46 -128 156 -5 -157 178 163 -61 -66 8 41
7965 41 189 258 -54 -197 21 180 86 262 -48 -331 113 -69 72 -61 -126 71 -246 -95 295 -62 -132 -86
7987 -86 82 -199 162 57 -176 -80 -142 207 -34 -15 -240 39 131 -308 -70 144 -3 -324 -115 324 -86 -304
8009 -304 18 53 -6 -272 -24 146 -295 -83 137 -164 -49 39 -218 45 -297 -188 -434 120 -129 61 -264
8030 -264 -305 124 220 351 135 168 -255 44 -294 -176 1 -400 -100 43 -34 -282 14 160 140 -36 172 -58
8052 -58 -154 -8 144 -137 -98 98 -118 -328 -260 155 -180 -132 2 147 -25 -73 271 37 332 84 -492 201
8074 201 128 -210 260 -136 -16 -40 90 48 -185 -481 228 217 64 88 -118 -21 -84 531 -101 80 -133 -149 173
8097 173 201 199 -309 195 92 -150 82 121 58 99 13 -174 278 -139 -234 -117 160 203 267 150 -123 198 231 298
8121 298 198 152 -28 39 -198 38 397 93 174 19 60 56 134 -221 -22 -76 183 -129 189 260 27 -310 53
8144 53 -84 159 212 -139 -120 -62 -64 12 -12 -59 9 -143 48 -211 -176 -184 -161 -61 175 -41 51 -75 -154 -189 176 -40
8170 -40 -404 -12 341 -124 328 -235 -88 591 83 -183 -193 37 174 -117 -181 -453 -209 -80 -21 -77 -99
8191i9
##END NTUPLES=NMR FID
##END=
