##TITLE=1H_CA-8282-7
 CDCl3, 8 sc, 
 9.1.2019
##JCAMPDX= 6.0         $$ Bruker NMR JCAMP-DX V2.0
##DATA TYPE= NMR FID
##DATA CLASS= NTUPLES
##ORIGIN= UXNMR, Bruker Analytische Messtechnik GmbH
##OWNER= root
$$ XWIN-NMR		Version 3.5
$$ Wed Jan  9 14:11:41 2019 Russian Standard Time (UT+4h)  she@DPX200
##.OBSERVE FREQUENCY= 200.1313
##.OBSERVE NUCLEUS= ^1H
##.DELAY= (6, 6)
##.ACQUISITION MODE= SIMULTANEOUS
##.ACQUISITION SCHEME= undefined
##.AVERAGES= 8
##.DIGITISER RES= 18
##SPECTROMETER/DATA SYSTEM= spect
##.PULSE SEQUENCE= zg30
##.SOLVENT NAME= CDCl3
##.SHIFT REFERENCE= (INTERNAL, CDCl3, 0, 15.7039)
##AUDIT TRAIL= $$ (NUMBER, WHEN, WHO, WHERE, WHAT)
$$ ##TITLE= Audit trail, XWIN-NMR		Version 3.5
$$ ##JCAMPDX= 5.01
$$ ##ORIGIN= Bruker BioSpin GmbH
$$ ##OWNER= she
$$ F:/spectra/data/she/nmr/H-F/1/audita.txt
$$ ##AUDIT TRAIL=  $$ (NUMBER, WHEN, WHO, WHERE, WHAT)
(   1,<2019-01-09 14:09:52.35 +0400>,<she>,<DPX200>,
      <created by zg, POWCHK disabled, PULCHK disabled
       configuration hash MD5:
       00 E9 B6 7A A2 85 ED C7 34 08 36 98 17 FE 4E 26
       data hash MD5: 16K
       30 6B 6C 34 04 0B 03 12 3C C5 EC 5A 0C 49 52 66>)
$$ ##END=
$$ 
$$ hash MD5
$$ 55 47 0C 7D CD EF 05 F1 83 4A 11 D1 41 4A A6 D0
##$RELAX= 
##$RELAX= 
##$RELAX= 
##$RELAX= 
##$RELAX= 
##$RELAX= 
$$ Bruker specific parameters
$$ --------------------------
##$DU= <F:/spectra>
##$EXPNO= 1
##$NAME= <H-F>
##$PROCNO= 1
##$TYPE= <nmr>
##$USER= <she>
##$AMP= (0..31)
100 100 100 100 100 100 100 100 100 100 100 100 100 100 100 100 100 100 
100 100 100 100 100 100 100 100 100 100 100 100 100 100 
##$AQSEQ= 0
##$AQ_mod= 1
##$AUNM= <au_zg>
##$AUTOPOS= <>
##$BF1= 200.13
##$BF2= 200.13
##$BF3= 200.13
##$BF4= 200.13
##$BF5= 200.13
##$BF6= 200.13
##$BF7= 200.13
##$BF8= 200.13
##$BYTORDA= 1
##$CFDGTYP= 0
##$CFRGTYP= 5
##$CHEMSTR= <none>
##$CNST= (0..31)
1 1 145 1 1 1 1 1 1 1 1 1 1 1 1 1 1 1 1 1 1 1 1 1 1 1 1 1 1 1 1 1 
##$CPDPRG= <>
##$CPDPRG1= <>
##$CPDPRG2= <>
##$CPDPRG3= <>
##$CPDPRG4= <mlev>
##$CPDPRG5= <mlev>
##$CPDPRG6= <mlev>
##$CPDPRG7= <mlev>
##$CPDPRG8= <mlev>
##$CPDPRGB= <>
##$CPDPRGT= <>
##$D= (0..31)
0 1.2 0 0 0 0 0 0 0 0 0 0.03 0 0 0 0 0 0 0 0 0 0 0 0 0 0 0 0 0 0 0 0 
##$DATE= 1547028592
##$DBL= (0..7)
120 120 120 120 120 120 120 120 
##$DBP= (0..7)
150 150 150 150 150 150 150 150 
##$DBP07= 0
##$DBPNAM0= <>
##$DBPNAM1= <>
##$DBPNAM2= <>
##$DBPNAM3= <>
##$DBPNAM4= <>
##$DBPNAM5= <>
##$DBPNAM6= <>
##$DBPNAM7= <>
##$DBPOAL= (0..7)
0.5 0.5 0.5 0.5 0.5 0.5 0.5 0.5 
##$DBPOFFS= (0..7)
0 0 0 0 0 0 0 0 
##$DE= 6
##$DECBNUC= <off>
##$DECIM= 24
##$DECNUC= <off>
##$DECSTAT= 4
##$DIGMOD= 1
##$DIGTYP= 9
##$DL= (0..7)
0 120 120 120 120 120 120 120 
##$DP= (0..7)
150 150 150 150 150 150 150 150 
##$DP07= 0
##$DPNAME0= <>
##$DPNAME1= <>
##$DPNAME2= <>
##$DPNAME3= <>
##$DPNAME4= <>
##$DPNAME5= <>
##$DPNAME6= <>
##$DPNAME7= <>
##$DPOAL= (0..7)
0.5 0.5 0.5 0.5 0.5 0.5 0.5 0.5 
##$DPOFFS= (0..7)
0 0 0 0 0 0 0 0 
##$DQDMODE= 0
##$DR= 18
##$DS= 0
##$DSLIST= <SSSSSSSSSSSSSSS>
##$DSPFIRM= 0
$$ [...]
##$SUBNAM2= <"">
##$SUBNAM3= <"">
##$SUBNAM4= <"">
##$SUBNAM5= <"">
##$SUBNAM6= <"">
##$SUBNAM7= <"">
##$SUBNAM8= <"">
##$SUBNAM9= <"">
##$SW= 24.933730806125
##$SWIBOX= (0..15)
0 0 2 0 0 0 0 0 0 0 0 0 0 0 0 0 
##$SW_h= 4990.01996007984
##$TD= 16384
##$TD0= 1
##$TE= 0
##$TE2= 300
##$TE3= 300
##$TEG= 300
##$TL= (0..7)
0 120 120 120 120 120 120 120 
##$TP= (0..7)
150 150 150 150 150 150 150 150 
##$TP07= 0
##$TPNAME0= <>
##$TPNAME1= <>
##$TPNAME2= <>
##$TPNAME3= <>
##$TPNAME4= <>
##$TPNAME5= <>
##$TPNAME6= <>
##$TPNAME7= <>
##$TPOAL= (0..7)
0.5 0.5 0.5 0.5 0.5 0.5 0.5 0.5 
##$TPOFFS= (0..7)
0 0 0 0 0 0 0 0 
##$TUNHIN= 0
##$TUNHOUT= 0
##$TUNXOUT= 0
##$USERA1= <user>
##$USERA2= <user>
##$USERA3= <user>
##$USERA4= <user>
##$USERA5= <user>
##$V9= 5
##$VALIST= <valist>
##$VCLIST= <CCCCCCCCCCCCCCC>
##$VD= 0
##$VDLIST= <DDDDDDDDDDDDDDD>
##$VPLIST= <PPPPPPPPPPPPPPP>
##$VTLIST= <TTTTTTTTTTTTTTT>
##$WBST= 1024
##$WBSW= 4
##$XGAIN= (0..3)
0 0 0 0 
##$XL= 0
##$YL= 0
##$YMAX_a= 218111
##$YMIN_a= -212217
##$ZGOPTNS= <>
##$ZL1= 120
##$ZL2= 120
##$ZL3= 120
##$ZL4= 120
##$ABSF1= 10
##$ABSF2= 0
##$ABSG= 5
##$ABSL= 3
##$ALPHA= 0
##$AQORDER= 0
##$ASSFAC= 0
##$ASSFACI= 0
##$ASSFACX= 0
##$ASSWID= 0
##$AUNMP= <proc_1d>
##$AZFE= 0.1
##$AZFW= 0.1
##$BCFW= 1
##$BC_mod= 2
##$BYTORDP= 1
##$COROFFS= 0
##$CY= 11.3945322036743
##$DATMOD= 1
##$DC= 2
##$DFILT= <>
##$DTYPP= 0
##$F1P= 18.9103706918063
##$F2P= -1.10871071338519
##$FCOR= 0.5
##$FTSIZE= 0
##$FT_mod= 4
##$GAMMA= 1
##$GB= 0.15
##$INTBC= 1
##$INTSCL= 1
##$ISEN= 128
##$LB= 0.24
##$LEV0= 0
##$LPBIN= 0
##$MAXI= 10000
##$MC2= 0
##$MEAN= 0
##$ME_mod= 0
##$MI= 1.114404
##$NCOEF= 0
##$NC_proc= 0
##$NLEV= 6
##$NOISF1= 3.799351
##$NOISF2= 2.8
##$NSP= 1
##$NTH_PI= 0
##$NZP= 0
##$OFFSET= 15.70392
##$PC= 1
##$PHC0= -8858.069
##$PHC1= 23.00007
##$PH_mod= 1
##$PKNL= yes
##$PPARMOD= 0
##$PSCAL= 0
##$PSIGN= 0
##$REVERSE= no
##$SF= 200.130013532006
##$SI= 16384
##$SIGF1= 3
##$SIGF2= 2
##$SINO= 400
##$SIOLD= 16384
##$SREGLST= <1H.CDCl3>
##$SSB= 0
##$STSI= 0
##$STSR= 0
##$SW_p= 3612.71676300578
##$SYMM= 0
##$S_DEV= 0
##$TDeff= 0
##$TDoff= 0
##$TI= <>
##$TILT= no
##$TM1= 0
##$TM2= 0
##$TOPLEV= 0
##$USERP1= <user>
##$USERP2= <user>
##$USERP3= <user>
##$USERP4= <user>
##$USERP5= <user>
##$WDW= 1
##$XDIM= 8192
##$YMAX_p= 0
##$YMIN_p= 0
$$ End of Bruker specific parameters
$$ ---------------------------------
##NTUPLES= NMR FID
##VAR_NAME=  TIME,          FID/REAL,        FID/IMAG
##SYMBOL=    X,             R,               I
##VAR_TYPE=  INDEPENDENT,   DEPENDENT,       DEPENDENT
##VAR_FORM=  AFFN,          ASDF,            ASDF
##VAR_DIM=   8192,          8192,            8192
##UNITS=     SECONDS,       ARBITRARY UNITS, ARBITRARY UNITS
##FACTOR=    0.0002004,     1,               1
##FIRST=     0,             0,               0
##LAST=      1.6414764,     0,               0
##MIN=       0,             -212217,         0
##MAX=       1.6414764,     218111,          0
$$ Real data points
##PAGE= N=1
##DATA TABLE= (X++(R..R)), XYDATA
0@%%%%%%Qj6J6j6K4l2M0n0N8p2Q8j06J28j51J77k08K41k76L17l64M16m75N40o09
30c22O87p75Q69r73J089j214J349j501J669j850K049k269K510k779L080l414L791
47A996m217M704n269N931o716P670q861J0393j2448J5366j9882K7883m6362J69055
61A39243P8868k05146Q329K0860m032p0274R16L4272N4380L012m4005q4432q859
74g6868P1047M6631q1154r0340K7264R7478J6226m7001k413O7552M7145j3975
86F1592o4346p3775l1660N2408O9524p961n7787J0771O8587m19q9319m7244N8806
99e0823Q2171K6439o669j673J0953K9340K9975k4662p1512k3481N3454K2374p5234
112F52p5151K5043O7223R764l5856j9370K53k278k506r931k8141k721O4899O4609
$$ y = [0, 0, 0, 0, 0, 0, 0, 8, -8, 8, -8, 16, -16, 24, -26, 32, -40, 48, -58, 70, -81, 96, -112, 129, -147, 170, -194, 222, -253, 287, -322, 365, -410, 459, -514, 575, -639, 710, -791, 878, -972, 1077, -1192, 1318, -1461, 1619, -1795, 1996, -2221, 2483, -2786, 3145, -3571, 4099, -4762, 5631, -6817, 8549, -11333, 16550, -29812, 139243, 218111, 12965, 21294, 42154, 38122, -32152, -31236, 3036, 57416, 60428, 16423, -68009, -76868, -5821, 40810, -40344, -130684, -103420, -5942, 10284, -36717, -39130, 28422, 75567, 61592, -2754, -76529, -108189, -55781, 13743, 5782, -52005, -41234, 27353, 26934, -62385, -109629, -50823, 31348, 57787, 51118, 49445, 60398, 89738, 119713, 95051, 23539, 58, 53512, 75886, 652, -74499, -49456, 17767, 27531, -8325, -27695, -27442, -29720, -32226, -42157, -70298, -73019, -8120, 56489]
126E6489k3854o7204K918O1292J2693n0642l2213J6180K2253K886j1162k9789
138d0153k8402K0775N3364M088m5037K688P6137M7625l5535l9305K0412L4093
150G0750p156k9070k2824j2317J0732L4615L537n4436l9307L4326M0496l5528
162f182o4378j924M1011J0246j9244j30K1541K3729K2358M998l5659l9705K0653
175b2686N2096m596n2736p600N0681K2288l7898l6734N208K1719J8441J4920n049
188A8054k1308O849M0335P928m4675j9298M7501L8438l5410n4333l407K6561P996
201A5231r627j3513j9104o834K1170J1299l6954l3963L5036O0769j406m4581o020
214b8497L5549J4203j8047j0576Q680J2627J6665P017l1603m6063P262N2678J1923
$$ y = [56489, 32635, -34569, -31651, 29641, 42334, -8308, -40521, -24341, -2088, 798, -10364, -40153, -68555, -47780, 5584, 9672, -35365, -32677, 43460, 91085, 55550, 16245, 36657, 70750, 63594, 34524, 11700, -617, 10115, 44730, 48267, -6169, -45476, -11150, 29346, -6182, -70560, -72484, -31473, -21227, -40471, -40601, -19060, 4669, 27027, 32025, -3634, -43339, -22686, 29410, 24814, -27922, -35522, 15159, 37447, -451, -37185, -31977, -10258, 8183, 23103, 18054, -3254, 3595, 43930, 51858, 7183, -12115, 35386, 73824, 38414, -15919, -19326, 7235, 15231, 5604, -7909, -27013, -33847, -12677, -1378, -38332, -72295, -37259, 23510, 22104, -22477, -28497, 7052, 21255, 3208, -7368, 1312, 13939, 30604, 37621, 6018, -40045, -32783, 19895, 31818]
227C1818m5653k2065L7066K8412k1666k8644L876J7718J2887R288p194k4989j74
240i320L9165J9063l9168l3230K8786L6792k5571n4331j2645K6265J9634M351
252b09j444r178m551K1479J8226k7162l7779J6014M7890O77m2826j0224L6490
265G403K3750j4084j7300k981L032J0570J0400j8663l7204J056M6396J9783l5327
278c169k4112K9311L0847j3488k4583K860J5660N958p32j1993k6128r765K8353
291i81K0556k8767l2515K2451M3672l664l6725r271J9880J0406l126k168o399
304f651p824J3738K2574r867k9602Q008M1634P098l7932k0162K1886J7284j2672
317G512j6548n462m068M564J8395K306k3751n929L5695K5142k4642k9605J0717
$$ y = [31818, -13835, -35900, 1166, 29578, 7912, -20732, -16856, 862, 13749, 23037, 15843, -9146, -9320, 29845, 48908, 9740, -23490, 5296, 42088, 16517, -37814, -50459, -24194, -4560, -209, -1653, -10831, -15382, 6097, 24323, -2839, -40618, -24604, 23286, 23963, -18863, -29087, 7403, 31153, 17069, -231, -3212, -180, 10390, 20790, 2127, -35077, -34021, 12375, 32158, -3169, -27281, 2030, 32877, 19389, -5194, -2334, 13326, 19284, 18552, 6559, -19569, -29334, -981, 19575, -9192, -41707, -19256, 24416, 20752, -15973, -25244, -5364, 5042, 1916, -252, -6651, -14475, -737, 21837, 11970, -17632, -9624, 32010, 39108, 1176, -18986, 2900, 20184, 7512, -9036, -14498, -18566, -14002, 4393, 6699, -17052, -22981, 12714, 37856, 13214, -16391, -5674]
330e674K0247j3329k3962q8J4195J0481J1540O606j5861j4571J8949K5546j8791
343A5288m0259n6L1350O236k4547r199J5788J2034J792J732n593j3901N169K0896
357A6730m661l2962n452L5798J7945k8782k7461J1618K2158L594l757R5k687J525
371C701J5236J393k9527k1669K2340K6993j5052k8132J1236L1493L773j8959p002
384d176O628M391M484k253k3945k4255J3454L5752K318k7138k05L2721J0723k5773
398B726j7495R332J2620K298K99o389j3866K092K3069K815k8425r896L2435K4802
412C6417k3494l3556P80J6855K549n614j167k839m29J1954O787j7521j3882K5218
426B058L2705j1078l5530m642K3391N470j7568p687P538Q643P313K851j5287k1145
$$ y = [-5674, 14573, 1244, -22718, -22806, -8611, 1870, 13410, 20016, 4155, -10416, 8533, 34079, 15288, -24971, -25027, 6323, 12559, -11988, -21187, -5399, 6635, 8427, 10159, 4566, -9335, -4166, 16730, 12069, -20893, -26345, 9453, 27398, -1384, -28845, -17227, 4931, 8525, 4768, 4863, 2176, 3701, 18937, 20330, -9197, -30866, -8526, 18467, 3415, -24717, -13481, 18012, 21785, 2826, -4176, 2452, 6843, 11327, 9074, -14871, -39126, -25672, 10080, 12398, -14740, -14945, 17776, 28499, 2726, -14769, -5437, 7183, 9481, 9780, 3391, -10475, -8383, 14686, 17501, -10924, -20820, 11615, 36417, 12923, -20633, -19853, -2998, -449, -6063, -7230, -10069, -10498, 1456, 8243, -9278, -23160, 2058, 34763, 23685, -11845, -16487, 6904, 12374, -5194, -12881, -5343, 3300, 10613, 13464, -1823, -22968]
440b2968R478L2282N686k7793j0975K2321R750k3012j7761J3160J9779N843l122
453A2668q332j3974j06K1142P453k4631j9069J9205K1151j6207k6567O368K5726
466D827R215n754l068l825n429M682N138j3829j4672J5940K8427o903l1994m926
480b2171K6083J3329j2521r476K649R34m60N821q86j0020O079K4645L930k6569
494A367j4765J9448J4917j4222j6335O234R668l908o287l643p798j285J7895J2599
508A3885j7639k2874Q456K1083l359j5695O170J8278J119j1559l717J209Q87J0053
522F297J3662o491k1341r30K0584L163j9415m464K0493J1756j0955j1564j971
535a176j629M84J0809N204j2761q412J1276M929k0891j5161J7164K2614n273j7834
$$ y = [-22968, -13490, 18792, 24478, -3315, -14290, 8031, 17781, -5231, -22992, -9832, 9947, 15790, 12668, 4336, -9638, -9744, 11398, 18851, -5780, -24849, -5644, 15507, -700, -27267, -20899, 4827, 14042, 8288, 5220, 1395, -4034, 648, 5786, -8043, -22715, -6775, 21652, 14749, -17245, -22171, 3912, 17241, 4720, -4756, -2107, -1173, -1633, 4188, 3302, -6718, -639, 24006, 27936, 1367, -13398, 6050, 20967, 6745, -9590, -3356, 6312, 2404, -3883, -7526, -15324, -16609, 1286, 13885, -3754, -26628, -18172, 2911, -448, -16143, -9973, 8305, 9424, -2135, -5852, -4643, -3756, 6297, 19959, 13468, -7873, -8803, 11781, 14944, -4471, -8935, 11558, 23314, 12359, 795, -1176, -2805, -2321, 8488, 13692, 931, -7481, 3795, 8724, -12167, -27328, -10164, 12450, 7177, -10657]
549a0657m131L715R21M952P927l771q063P590J1823j2352k1381P273K7732P871
563A9449j4352m570R416L74q789k712P50j398N969J2331n977k3575m590K5937
577H263J7004j2300j2132P581N128j3164j3082R0L682M276R929L381j4341j0509
591a6194J3949J4929j2437j8858O397J6572n368j8065m648R685R736R302P868
604A2868m599j2699J903J2501n404j6798M545K3883O310j8076j0235J0507J0294
617A5000m88j594k467q110k101Q780J88j6763o081J8822J3225j6668k0026K479
631a5804R533l899n672N460O640J720M071J498j2792j1492J2512J8726p616k0411
645a7526J130J8787O209p073J600J0558K639k424k478r186j2811K196J7181L602
$$ y = [-10657, -14788, -11073, -10152, -5200, 2727, -1044, -9107, -1517, 10306, -2046, -23427, -16154, 11578, 19449, 5097, 527, 9943, 10317, 1528, -1184, -434, -1832, 4137, 16468, 10491, -13084, -17674, 8263, 25267, 12967, 835, 8416, 13544, 380, -12702, -12612, -8930, -4654, 5275, 8656, -5685, -16194, -2245, 12684, 247, -18611, -12214, 4358, -1010, -19075, -23723, -14038, -4302, 5000, 12868, 8269, -4430, -2527, 9974, 4570, -12228, -7683, 16200, 22510, 4434, -5801, 4706, 15000, 14512, 12918, 10451, 2341, 240, 9020, 9208, -7555, -13636, 5186, 18411, 1743, -18283, -15804, -6271, -10170, -15842, -10382, -3742, -2022, 2049, 3547, -9245, -20737, -8225, 10501, 2885, -17526, -16396, 2391, 8600, 1527, 3127, 13685, 16324, 13900, 11422, 2236, -10575, -8379, 8802, 12404]
659A2404j3357q75J9569P124j7146j3021O165O696m731o753m663q292j893J3143
673e630J0537p752p355J1766J0548j3659j8016M516J4505J656o378J325L243m39
687a133L655N460o260j1239O544J5693l322j8761k614J5395P313p099j392O177
701H417N1m277J17l56o757K694J4517M751j5969j0558J0578P651j2499j2519K955
716a1204N837k032l66L377k879l172Q724J0195q150j3125M456J1640m664j3409
730a4772L708J4814N549l640m02n72m551J500P859l646j4244J29J6821N683j2891
745A345m747J1950P743p313o600J518q50l775J664m86r964l755J3547Q624j3526
760d625j3638P101J3742l701r872J503O674J096J150L259k640m812P047J0795
$$ y = [12404, -953, -1828, 17741, 24865, 7719, -5302, 863, 7559, 2828, -3925, -8588, -16880, -18773, -5630, 4907, -2845, -10200, 1566, 12114, -1545, -19561, -15045, -540, 1116, -5262, -3937, -694, -1133, 2522, 7982, 1722, -9517, -2973, 12720, 9398, -9363, -11977, 3418, 10731, 3632, 2240, 8417, 8468, 4191, 4308, 3952, -2805, -111, 14406, 19157, 3188, -7370, 3208, 10859, -1640, -14159, -11204, -5367, -7399, -7765, -4388, -7267, -10439, -1715, 8480, 330, -12795, -8339, 3301, -1363, -14772, -11064, 3750, 9299, 5659, 5257, 4685, 134, 1634, 9493, 5847, -8397, -8268, 8553, 14236, 1345, -3402, 8548, 16291, 8978, 2378, 3896, 3046, -729, 935, 449, -9515, -13270, 277, 8901, -4625, -18263, -11162, 2580, -1121, -10993, -9490, -2816, -1720, -570, 2689, 49, -4763, 2284, 13079]
774A3079n807j3857L271J5917m36j6176n534J0925O074m389k715j444l644K533
788b203R307K53j2480k074J4342N861j3738r162J0296R369n911q139J375J924
802i80n61J361j0q202m640J1834J1651q987j3903N108J3753j678j0158R82P648
817C218P59k998P33k033m485M912R772m281j4407O83J4502K485j3258m784J0392
832A210P653l128k655k3l642j144N910J768r097l579J1334N683j2506j0321P709
847d828J0948m421q080L28J774j471J415L917l511l908R229J2556m752j3884Q10
862c878J0377r38r693Q16P951J114l717o91j091m189K482J0334p29j3482n314
877a0648J0298M478r464m433R202P917l325k781j03l645l602M818N220n429m747
$$ y = [13079, 7272, -6585, -3314, 12603, 12167, -4009, -9543, 1382, 7456, 3067, 352, -1092, -4736, -2203, 7104, 7357, -5123, -7197, 7145, 13006, -732, -9894, 402, 9771, 3860, -4279, -2904, -980, -1541, -180, -190, -8392, -13032, -1198, 10453, 1466, -12437, -7329, 6424, 4746, -5412, -4430, 3218, 3977, 979, 1712, -321, -4806, 106, 9878, 5597, -8810, -8127, 6375, 8860, -4398, -9182, 1210, 8863, 5735, 3080, 3057, -585, -1729, 4181, 5949, -3148, -6727, 4607, 10290, -2216, -12537, -4828, 6120, 1699, -6381, -6053, -4279, -5750, -4335, -418, -3929, -7837, 1392, 13948, 9196, -4688, -3878, 6499, 5561, -4132, -3316, 4635, 5749, 2032, 1341, 250, -3939, -1457, 8877, 8148, -5334, -10648, -350, 4128, -5336, -9769, -567, 7350, 4025, 1244, 1141, -2504, -6106, -1288, 3932, -1497, -6244]
892f244R060P160r278j1379N613J1673n89o154m8J438l068J53N858j017p157L005
908i74R207l537j3468j485J0387L145o298p88O965J164m023o1j93n831l21J0012
924C901M419r814o356Q986P794n770n574M638L759m690l875J477k035k777N721
939a96O488n017q443N333J0061m049j1758K77Q339R59m147N3K321j760Q61O028
955E350o77r307l29J0367K102r678k559J0032M018q996n977L263K658k18K351
970B400K64p369m657Q008O446o840o020P969Q533o521j0464J471O940J134N51
985A845M056k44m589J408L184o859r445N983J3541n5j2713m412O923J370l016
1000c023K422N528o95k555K14l542q388J535J3861O648q766o524N633J770r130
$$ y = [-6244, 2816, 9976, 698, -10681, -5068, 6605, 6016, -138, -186, 1252, -1816, -1663, 4195, 3178, -3979, -974, 8233, 4696, -8772, -10257, 130, 3275, -3023, -3811, 3154, 4318, 295, 234, 41, -5790, -6111, 3901, 8320, -1494, -7850, 1136, 8930, 3160, -2414, 2224, 5983, 1293, -2582, -1105, -3140, -5917, -196, 6292, 1275, -7168, -1835, 8226, 4177, -7581, -7304, 1035, 1994, -2153, -2100, 221, -1539, -678, 5350, 4673, -4634, -4963, 5404, 7506, -2172, -4731, 5301, 9319, 323, -5654, -2391, 267, 49, 2400, 2664, -4705, -9362, -1354, 5092, -1748, -7768, 201, 8734, 2213, -8251, -6780, 160, 1294, 1845, 5901, 5657, 1068, 2476, 5660, -1199, -10644, -4661, 8880, 8825, -3888, -8300, -1377, -7, -3023, -601, 4927, 4232, 1677, 1891, -1651, -10039, -8504, 5357, 12005, 3239, -3285, 2348, 4118, -5012]
1015e012o305O239O787J821P24n2p772o155O666R336j998n115N655N124q085j2293
1031a0435K249R944L600j098J012l527q359k346N353k71m423O193J2369J49j1622
1046a212n001O391L765k598K161N216j943n888o99q89n421j02J0822N812j0247
1061A67j0795K789L965l452j738P060N864j835r24J999l544n199N360Q754j908
1076F563p364J367O099m229q546J491P702J195k804N94r80n824o23Q222L439o103
1092A99j561P917J753q888m419N929L062n162k301J970k281k950K497L388m982
1107e829m364P167P320m113o698L808P816j258l053K134K707k882L36L893j261
1122E723o926O10N263k749r234N3R341K274o563k486M271N20q32L618K526m008
$$ y = [-5012, -11317, -5078, 1709, 3530, 4254, 4202, -3570, -9725, -3059, 6277, 4279, -836, 4819, 9943, 1858, -10435, -8186, 1758, 5358, 4260, 5272, 1745, -6614, -8960, -3607, -3878, -8301, -2108, 10261, 10410, -1212, -6213, 178, 3943, 1345, 3506, 8722, 6779, 891, 192, -697, -6118, -6220, 4602, 10414, 167, -10628, -7839, -3874, -7326, -9064, -2004, 3860, 2025, 1101, 3100, -444, -5643, -283, 8471, 6563, -801, 566, 6665, 2436, -6110, -4619, 3083, 4278, 1474, 2068, 1088, -4736, -5359, 2863, 6302, 199, -1362, 6555, 8308, -580, -4999, 930, 3992, -1170, -3471, -1501, -3782, -6732, -4235, -847, -5829, -10193, -3026, 4294, 181, -6517, -2709, 5107, 3849, 796, 2930, 5637, 2755, 3091, 6984, 5723, -1203, -593, 4670, 1921, -7313, -7260, 2081, 4355, -2208, -4694, -423, 97, -735, 2883, 5409, 1401]
1138A401k585N453J518q440m729Q258O012n497n983K072K170m979l309K277P81
1153e580q9M606N266n274p193O082J0538j273o405J239N924k682o990j56L667
1168A680M29J213L912j651q206j759O251L06q172m9J0518M289o560m437K585J195
1184A544j662J170J514n031m348L480K148o444l405Q641P315n581p958J531M338
1199b748j520j151M551L742P90L801M806l890p787J666O933k287q371J08N361
1214D004r34n561j07M624L08j577Q86k078o970k121P673L078n314r20Q997M254
1230H242o310m815K103P37l976k85K402j999k828L905M818l489m213N451P574
1245G317m150o990K249N408p90j657L409J839l122m26L133j912p614m41O375J35
$$ y = [1401, -1184, 4269, 5787, -2653, -7382, 876, 6888, 1391, -4592, -2520, -350, -5329, -8638, -6361, -5580, -5669, -1063, 4203, -1071, -8264, -2182, 8356, 7083, 678, 1917, 7841, 5159, -1831, -1987, 1680, 2109, 3322, 7234, 5583, -2623, -4382, 1869, 2175, -5997, -6046, 4472, 8761, 2201, -2236, 349, 1544, -118, 1052, 2566, -2465, -6813, -3333, -1185, -7629, -11034, -2393, 4922, -659, -8617, -7086, -2748, -4268, -5419, -868, 2874, 3664, 7465, 12271, 8381, 594, 2260, 9193, 6906, -1465, -1357, 4004, 3070, -2491, -2598, 2026, 2334, 757, 1643, -435, -7405, -9526, -1853, 1225, -4089, -5009, 3988, 8242, 1932, -2883, -780, -43, -4019, -4304, -1902, -3901, -6729, -2824, 1994, -1495, -5708, -257, 7317, 3167, -3823, -1574, 3834, 3044, 1387, 4796, 6635, 3513, 3087, 6220, 4308, -3306, -3747, 2628, 2763]
1261B763p138j96O492J272n581o17L170j55k153K386J437n370j958O042M946m496
1277H44m421L971K992n716m768K023K326k550P96M274P60k324L204N556k543o055
1293a631K587O398j825o221K6M548J27j992K369J442m063k918K624j111o980j106
1309g726O391K543n248k201O122L023m070j165K505r39k238K626K349m073l629
1324e730M885N747k901n538L576M057l559m307K440L449q33J79L654j065m945
1339h91P21N434j860p071L37O854J101o640j434L319M41k878J769J665k737k375
1355d245L979J376m914j416P794M507n256m497L100K489l428k052K729P78j996
1370a052K235J957m018n029L681O065k290m874K491M942k420n739O39M201M66
$$ y = [2763, -4375, -4571, 1921, 3193, -2388, -3005, 165, 10, -2143, 243, 1680, -3690, -5648, 394, 5340, 844, -3577, 394, 3386, -2330, -7098, -5075, -2749, -5299, -4503, -229, 531, -1793, 1411, 6967, 4424, -1631, 956, 7354, 5529, -692, -666, 3882, 4009, 2017, 4386, 5828, 1765, -1153, 1471, 360, -6620, -7726, -1335, 1208, -4040, -6241, -119, 2904, -1166, -2331, 174, -765, -3003, -377, 1972, -2101, -5730, -845, 4902, 2001, -3537, 39, 4096, 537, -3770, -1330, 2119, 1286, 1465, 5119, 4054, -891, -170, 5264, 3404, -3667, -3330, 3524, 4625, -2015, -3449, -130, 311, -2567, -798, 867, -1870, -4245, -266, 1110, -3804, -5220, 2574, 7081, 1825, -2672, 428, 2917, -511, -2563, 166, 944, -1052, 1183, 3140, -878, -5907, -2226, 3839, 1549, -3325, -834, 4108, 1688, -4051, -3412, 789, 1255]
1385A255K57J969p81m780l56N400J23n607q5O474M36o813k646M538J893j661R91
1402F07K198j948l151J601O33m319j628O786N178m343m885K633L410k654k050
1417a932K780J704l097n07K265j552l663L705N927j297o114Q17L680k363n340
1432d987P63M712M57j380K173J32m031j324M493K329m618j284M478O41m619j960
1448d025N000K343k871k05K151j241l489K365L383k012l249K746L641l643n052
1463d158J820L538j777k453L206R83l259q80L713M75m011M22M097q27n345o3N514
1480I95J772k258J064K455j322k657J902K171l766k462L124K040n051l069M694
1495c68L473k097k206K803P05l780j567K276o12k215K545M587k211n420J109N258
$$ y = [1255, 1512, 3481, 2700, -2080, -2436, 2964, 3087, -2520, -2605, 3869, 4305, -2508, -5154, -616, 1277, -384, 607, 2805, 857, -2294, -693, -60, -4379, -6007, 779, 5957, 1614, -3271, -638, 2772, 118, -1932, 848, 2552, -545, -1052, 1213, -339, -4002, -297, 5630, 4333, -1781, -964, 2716, 353, -4987, -4224, 488, 945, -435, 1738, 1870, -2161, -3485, 1008, 3337, -1281, -2565, 1913, 2554, -2065, -4025, 975, 3318, 447, 242, 2393, 1152, -2337, 28, 3411, 1399, -1850, 896, 4537, 894, -4158, -2338, 1200, -577, -3030, 176, 1159, -2100, -2980, 733, 1208, -2803, -2381, 1716, 889, -4456, -4519, 995, 2767, 509, 1573, 4028, 2706, 49, 1951, 4122, 356, -2106, 1018, 3058, -1993, -5062, -368, 3105, 1008, -1198, 1605, 2310, -1470, -3037, -761, -1373, -3588, -1043, 3544, 1333, -4087, -2978, 2280]
1511B280j59k730J484K858j939m351j7J429j281Q23M580R51m990k039M350J862
1527C111m209n19M483J855m159k862N76p68j339L710L444j751k686J651K199l909
1543a173l163M535M945k396m370k16J132j894P39M165R09k463O83K670k852o290
1559e039R4O084K47l392o41L181o78l038J458L217Rm6K502p73n719k513M728L523
1577C204k888k051L965J414l571k468K279J506j557J136J650k849m081K002L435
1592A126j752k891L293M409j873m561Q86K721m41r85K211L6m043q72K824K97l194
1609b809J115N341L72m932r18K852N68k903l37J867j166j719J637J418k467q90
1625b971M179L353l518l287J877J756k798j088K996J858j756l47K291r18k155
$$ y = [2280, 2121, -609, 875, 3733, 1794, -2557, -2574, -1145, -2426, -1603, 2977, 3928, -1062, -3101, 1249, 3111, -1098, -1617, 2866, 4721, 562, -2300, -1724, -2492, -3831, -121, 3323, 1572, -1114, 537, 2736, -1173, -4336, 199, 5144, 2748, -1622, -1838, -706, -2600, -1861, 2304, 3213, 750, 1433, 4103, 1251, -5039, -4945, 1139, 1386, -2006, -2647, 534, -144, -3182, -1724, 1493, 1502, 1456, 3958, 3185, -2534, -5047, -319, 3204, 316, -1735, 2230, 3644, 73, -2395, -116, 1390, -167, 969, 2619, -230, -4311, -2309, 1126, -626, -3517, -224, 4185, 2312, -2249, -1363, 1358, 917, -68, 2143, 2179, -1864, -2736, 88, 385, -2809, -1694, 3647, 4019, -913, -1831, 1021, 1589, -1314, -1651, 216, -950, -2669, -1032, 386, -2081, -2971, 1208, 4561, 1043, -2244, -367, 1389, -1409, -2497, 499, 2357, 601, 254, 2545, 1627, -528]
1640e28J239L710j537m552M67K741p12l525J292L017q29k149J408M55k846j046
1656c395L296J434l896p27L175J363l766j060L532J789k244K74J917r93k002J709
1672D06L528k047k450J660K688k383l085K077K441j248k029J132Q43k314o23K338
1688I34m70l141Q12L313j1l915l12L202O96k443K54J965j300j808J198J151k071
1705a946q24L228J764l460j828L258K435k517j792J722J830j706k26J652q8j746
1721b44J634K644j647l117P88K913j768l659P40K969o46j989P38J678j366k23
1737e55K324l22l665o23L050k11l423r14L673J267k364k92K362k34j566O93Q37
1754C7j551r25K294L020k772j683L693L022j525k674J722J329j668j725M93j10
$$ y = [-528, 711, 4421, 2884, -1668, -1201, 1540, 828, -2697, -1405, 1612, 783, -1366, 42, 497, -2349, -3395, -99, 1335, -2561, -3288, -113, 1250, -2516, -3576, -44, 1745, -499, -225, 1692, 699, -1303, 406, 3934, 1887, -563, 1097, 3785, 1402, -1683, 394, 2835, 1587, -442, 690, 1533, -781, -1404, 934, 464, -2677, -1865, 1448, 1437, -2478, -2790, 412, 1108, -1335, -1081, 884, -416, -2224, -1026, 125, -1946, -2770, 458, 2222, -1238, -3066, 192, 2627, 110, -1682, 40, 1870, 164, -62, 1590, 1502, -244, 1390, 4034, 2387, -730, 58, 2971, 1203, -2456, -1716, 1253, 607, -1382, -644, 1034, -332, -555, 1769, 1447, -2218, -2841, 209, -2, -3425, -4339, -666, 601, -1763, -2055, 307, 73, -1493, -800, 37, -1514, -2439, -145, 2875, 103, -1580, 2113, 5135, 3610, 936, 2658, 3987, 2319, 594, 1087, 977]
1770I77k462O03J982r25k670J146K989j447l389L77K915m6k074J37J392p79q73
1787b147J864O56k451k39L075J532k925j275L329J491k942j224J795L16j665k26
1803a036K119j88j041K475K420j717k971Q82J559k411l064Q98K189j601o84J525
1819f46K018j358j44J504k1l189l04K389j009l110J081L720N80j512P89J712j629
1836H71k320M69J296j712j130K254J369j993j014K564J894j811r50K402N80k552
1852B17k1J708j49k145L71K033p04l404M66J995q22j555J573J924j203j739Q89
1869e66N11k330j219K736J420j780r09K887R82j643m99K207L56k307k35J022j263
1886f30j764J841K784r18j933K085K091k092k356P42J908r36j898M09K44j394
$$ y = [977, -1485, -882, 1100, 175, -2495, -1349, 1640, 193, -3196, -2819, 96, 50, -2024, -1887, -495, -1274, -2147, -283, 373, -2078, -2317, 758, 2290, -635, -1910, 1419, 2910, -32, -1256, 539, 855, -810, -1036, 1083, 895, -146, 2329, 4749, 3032, 61, 943, 2502, 91, -2973, -2075, 114, -1487, -2171, -646, 1372, 14, -130, 1374, 1353, -1836, -2140, 249, -760, -3870, -2789, 931, 1511, -1, 788, 2500, 871, -1449, -980, 316, -1396, -2526, -272, 1097, -896, -1910, 654, 2548, 737, -213, 2189, 2769, 217, 196, 1904, 1755, -390, -19, 2014, 1310, -2094, -1628, 367, -455, -2010, -437, 1487, 284, -1455, -566, -55, -2385, -3604, -868, 552, -1228, -2137, 750, 1732, 89, -410, 1797, 2153, -154, -389, 633, -630, -2394, -553, 2231, 1313, -620, 1465, 3556, 1464, -892, -150, 1758, 822, -1076, -667, -423, -1817]
1902a817m8K075M42k000P07K620m99l246p71K589J96k042R3K151j95o51J111J519
1920B234j207j369K133M85k846k081K944J153j715j023K178O88k056n28J247J50
1936C87j563O20J451j243j997J462K932r70k289N33K347j073k192J090J768p07
1952E56L3J703m74k834r12J976Q2j849L5L004O76k760j052J688Q99j526N76J116
1970I37j462j256O70J466j060l14K925J630k389k413J76P63j279l46J921J668
1986A637j474k69P69p88j940J211L003j70k728k36J739r60j618J664K125l62j228
2003C75L08p8k462m60K610J480j773n25J535m5k501l69K066J455n40J78R39k045
2021A48k284R6J593k55j256J240J894j427k216J688J330k77l87J233K44j958q70
$$ y = [-1817, -1865, 210, 652, -1348, -641, 1979, 1480, -1766, -2537, 52, 248, -1794, -1701, 450, 255, -396, 715, 2234, 1027, -342, 1791, 2276, -570, -2651, 293, 1446, -269, -1292, 886, 1574, -482, -1010, 237, 387, -1176, -556, 895, -348, -2345, -883, 2049, 1079, -1210, -677, 1670, 597, -1595, -505, 1263, 556, 589, 2292, 1818, -1016, -1928, 48, 130, -1719, -1684, 1320, 1996, -764, -1816, -128, 771, -755, -179, 937, -525, -1781, -1111, 355, -705, -1019, 1906, 3536, 1147, -1266, -1090, -327, -1606, -1952, -31, 1637, 163, -106, 663, -125, -2065, -854, 2149, 1979, -749, -985, 754, -206, -1824, -160, 1965, 1603, 375, 683, 605, -1857, -2317, 293, 1773, 0, -525, 1010, 965, -1536, -1905, 161, 1616, 1076, 1254, 2193, 148, -2136, -2040, -447, -702, -1958, -718, 1176, -251, -2467, -779, 551, 274, -113, 1120, 1364, -594, -1464]
2038a464J717R74r14O55K694j13k634j103R59n16j771N64J659j158j672J149P62
2055b12r15p74K123J198j379j683J382J299j425j67J106M83j826m19J136j44j395
2072a612P62K723q06j993O30J547o06j718K51J666n31r19J652Q64j290l5J499
2089B084N79k736k031J594j21k189k26K194Q76o23k42J392k96p40J575Q48j319
2106F19j834J331J024j313j264J272K524j462j625J07L13r55m90J746O9j146J2
2123a072J419n21j437M41L098P84j699K7J457q01j814J47Q59q49j237J046R2k087
2141b147l10J821J745j099o72J362O62j732j300J002N93n53P27J323m06j818P69
2158c3J697r63j775Q73J138j569j763M71J732j17k21J634R30j262l80J441l78
$$ y = [-1464, 253, 1227, 313, 968, 3662, 3549, 915, -188, 771, 255, -1516, -952, 707, -451, -2123, -974, -212, -1127, -1901, 222, 1420, 41, -1642, -260, 1039, -386, -553, 553, 1036, -790, -1209, -73, -217, -1612, -850, 1873, 1067, -926, -296, 1251, 645, -1073, -822, 844, 313, -606, 1046, 1910, 620, 585, 2084, 2663, -73, -2104, -510, -631, -2820, -3046, -852, 24, -599, -841, 551, 255, -485, 1090, 1938, 619, -1215, 116, 1140, -173, -1437, -165, 2359, 897, -728, -621, -308, -1263, -1753, -7, 62, -1084, -1072, 347, -174, -1611, -1170, 1928, 2712, 1013, 1040, 2497, 1696, -118, 29, 888, 39, -1198, -152, -60, -2147, -2457, -636, 1109, 10, -662, 700, 1362, -370, -1670, -668, -75, -628, 99, 1422, 1016, -802, -33, 1664, 701, -1074, -201, 937, -632, -2395, -1924, -192, -309, -530, 1104, 2034, 772, 392, 1833, 1455]
2175A455j668q3J989k63k366n52J204j93j455N19J429k76p68Q71N17q77q60J389
2193A2J770j451q34J106J354j325o66J379K81q45j018P46o99j923j59J164j77
2210a285j034O00K001j18o47Q10J483n33j001P14O31j493q15J133P49j605n55
2227i65J581M41j647k76Q98J91j392M61J422k61r77O81J685j014j350J080J192
2244A750r09j278J96N90j328q34J058M8j055j08J375N63j521J31J927Q94j343
2261A56j43J614l72j348P23N84k99j167Q11M34j147j318R06J083j684p14J382
2278d99R43p42k88J050Q33q72RJ289k58j414P7J505j201j937M33J478o11j780
2296a985L75R29l51n77M11J021l55k93J182L05j421j1K155N17j375n60J569r8
$$ y = [1455, -213, -296, 1693, 1430, -936, -1488, -284, -477, -1932, -1413, 16, -260, -1028, -157, 360, -517, -1377, 12, 1782, 331, -503, 603, 1957, 632, -34, 1345, 1626, 781, -237, 509, -190, -2113, -2272, -1108, -1285, -2319, -1719, 282, 164, -483, 327, 1810, 1277, 276, 990, 1621, 128, -687, 446, 1195, -410, -965, 616, 1057, -590, -866, 32, 223, -1169, -708, 714, 453, -524, 157, 1842, 828, -522, 558, 1750, 841, -437, -241, 349, -979, -1813, -755, -707, -1762, -1870, -495, 68, -1453, -1322, 605, 1499, 156, 13, 1627, 1255, -93, 630, 1214, 915, -252, 559, 993, -154, -1472, -566, 517, -1167, -1881, -499, 444, -298, -586, 464, 1297, 425, 434, 1723, 1465, 51, 128, 1633, 432, -1505, -1072, 406, -205, -1985, -1610, -681, -1032, -1609, -1198, -177, -532, -825, 357, 662, -759, -770, 1385, 1902, 527, -33, 1536, 1438]
2314A438j422m87Q68k85p62M27P42o11q35J209J284m98j375J270J211j267j419
2331e12N72M25q77o39Q92k98r16m5J188k05j661Q22J095L20j977O8J859K50n52
2350a91R76J347r0q89R82k70j781p77R97Q91j678r10J387P59j527j34J422N63
2368A077j205l8P69p09j137J057R70m18j163J035P19q47j642L13J115k73p18J157
2386F2K27n98r80P95M60r12O0J642O73j420J9J393j58p54K77N36j056j465M91
2405g08M34n81k1J599J159p69j390P23M22j340m97R19N77j247J74J219j63j256
2423g46L17J502j084r42j70O70l08j232J080Q51j61l82Q99K62q10K83J145N31
2441A705r69n39P23L86j223o64J183L77r88J23M15m86j058P70J025l03j733N62
$$ y = [1438, 16, -471, 397, 112, -650, -223, 519, -92, -927, 282, 1566, 1068, -307, 963, 2174, 907, -512, 60, 485, -392, -1031, -139, -437, -1353, -1398, -210, -415, -2076, -1254, -159, 161, -1816, -1748, 111, 361, -191, 785, 2132, 2042, 1153, 2135, 1865, 84, -693, 304, 1195, -483, -1393, -6, 753, -774, -908, 514, 1077, -128, -166, 603, -106, -1243, -186, 784, 366, -797, 238, 957, 110, -1532, -1219, -104, -377, -1095, 62, 289, -309, -1289, -494, -34, -946, -886, 756, 1429, 9, 28, 1421, 1263, 509, 786, 1322, 266, -1199, -708, -274, -855, -876, 723, 1882, 1113, -277, 446, 868, -472, -969, -50, 527, -720, -546, 673, 510, -746, -429, 1073, -11, -953, -1123, -453, -761, -1993, -913, -62, -223, -605, 294, 556, -254, 29, 1174, 1705, 736, 197, 920, 1306, 83, -581, 602, 979, -9, 114, 529, 43, -1015, -245, 780, 477, -1256, -694]
2459f94R68r25j604J258J622n16o51P99R6p94k56J185%j186j62J365K3j483K5
2478i30J542J61l62L4P97p03j049N43Q57q52l03R60K10j564r37J391J216p88k64
2497d1Q25o6j061n54M38k11k84Q55J028p00j188Q03R22j31j062P11P76p61j683
2516a384J61O00J11K54Q62N44j172r00J209k30q51o4J623L07r89l19N70L0o75
2535c13O41M30J39j030Q9M13j112j4R25R73j016q52O59L65j086m88J066Q02m83
2554A08j62O34n96j086N06R58n22m64N30P49m63o59M72J105o19m13J66M96j062
2573c22p70R85O43l20k44O52K7j043o36J026J90n31k16R05j81r54M42Q04j45o31
2593c19O25P93j137r21R47N80p63k78J071M6p15m54P49O38j173L16N43J91j435
$$ y = [-694, 274, -651, -2255, -997, 625, 109, -542, 257, 353, -441, -697, 488, 488, -698, -860, 505, 528, -955, -930, 612, 773, 411, 445, 1242, 539, -510, 33, 890, 38, -265, 695, 905, -659, -1596, -205, 1011, 223, -41, 784, 718, -343, -897, -459, -670, -954, -99, 929, 229, -959, -156, 766, 635, -427, 284, 1060, 299, -1384, -1223, -623, -512, -258, 604, 1148, -24, -924, 285, 55, -796, -860, 763, 1070, 81, -238, 332, 362, -313, 328, 758, 897, -133, -44, 369, -743, -757, 168, 1141, 125, -727, -68, 297, -789, -1277, -211, 591, 108, -54, 580, -16, -1102, -596, 362, -160, -624, -94, 655, 192, -467, 5, 1110, 491, 78, 244, 740, -322, -1092, -107, 536, 216, -28, 624, 651, -392, -1028, -2, 188, -343, -559, 346, 165, -789, -347, 457, 312, -319, 306, 1099, -38, -959, -12, 568, -195, -473, 598, 644, -71, -525, 224, 862, -311, 5, 548, 739, -696]
2612f96m3R07l15q01J58J409o30j209R82O23n92l34Q86N05r98l96N18P99p97k80
2632c04J040J69j002P9J24L89j393O07P80j48r05K52Q09l30o28K90L71l55l94
2651e49N85L11q82j26J058L47j073l56Q32N21r44j40J012k64n21n7R17r00m53
2670f82N58Q55p33o33N42Q74p13n82Q21M50m48p28O05K4m90k83R49j55m56O4J224
2691A063m92j006L16P72n81p87L27L82J06o98M90M07m53k46M47L80r07n67R04
2710a43J86k95p86R20N14r31L03J010O3o88k94Q48l95m76Q7Q41n75o91M67Q03
2730G68o14m97L40O86o91n26N72L30o08l98M50%l34m17J217j96o06Q7J349m22
2750D90q22K60O22l89n50M62M65l64l25M45M47p13m48M91L25r47j41O32K24o12
$$ y = [-696, -739, 168, -147, -948, -790, 619, -11, -1220, -238, 385, -207, -541, 345, 850, -148, -544, -26, 773, -24, -304, 736, 905, -97, -18, 106, 495, -898, -291, 489, 341, -564, -312, 497, 167, -461, -171, 200, -155, -549, 36, 347, -535, -661, 397, 744, -329, -685, 147, 668, -276, -416, 596, 332, -189, -246, 671, -229, -682, -124, 731, -2, -635, -93, 781, 68, -514, 307, 757, 309, -419, 186, 210, -280, -563, 386, 231, -225, -161, 1063, 571, -435, -119, 653, 72, -715, -388, -6, 100, -598, -108, 299, -154, -400, 47, 427, -480, -1047, -143, 43, -252, -1038, -118, 396, -535, -232, 778, 841, 153, -141, 707, 312, -164, -77, 764, 189, -502, -35, 768, 154, -343, -3, 683, -8, -534, 38, 368, -240, -638, -188, -188, -522, -939, 278, 82, -524, -437, 912, 490, -332, -72, 550, 161, -389, 73, 538, 174, -151, 294, 741, 28, -420, 71, 396, -551, -692, -60, 164, -448]
2770d48K17L73O4l28j01R94l57p18K66O48p17m83P51kj93p26N48Q52n05m58M08
2791H5O02n27o55P96J74q14o4L87K6n15R3P78j14j043K67J049m27p18K88P07k46
2812A29p52N49M59m02J10L07L69j038L0Q46J87q73l27R39k32n50j92O15N6o52
2832d22N32N19m65k70RL78m84m66N60J140q32k41J73N90l50n10K19K44n62j68
2852d06N34j84o48N91M31l06o36N55P50m37o15L91L69j76n36K43L78k87k49M77
2872B39K87m46l68N22L3n93K69O48j00p72P2N80l37k95L35N16n09m10K19M55n27
2893a82l70L83P3Jn84J66K71L5m01P55J41l77N10J92j29p02L22P03k37l97l6K66
2915D03pm80j23N83m81k20K16L25o24m27J047M0l50l28Q69j84n40k1M67L7k57
$$ y = [-448, -231, 142, 206, -122, -223, 771, 414, -304, -38, 610, -107, -590, 161, 159, -34, -760, -212, 640, 135, -323, 85, 687, 160, -495, 301, 475, -339, -403, -16, 10, -505, -412, 366, 252, -791, -524, 525, 98, -620, -332, 375, 129, -623, -74, 385, -17, 93, 400, 769, -269, -239, 607, 794, -79, -406, 533, 301, -249, -441, 174, 230, -422, 110, 629, 164, -106, -97, 281, -203, -669, -109, 1031, 199, -42, 131, 721, 371, -139, 80, 324, -238, -406, 128, -56, -704, -113, 318, 12, -624, -69, 681, 244, -371, 20, 389, 213, -323, -80, 298, 11, -238, 239, 526, 80, -288, 234, 267, -326, -57, 591, 491, -281, -209, 371, 34, -261, 74, 590, 81, -329, -110, 345, -182, -552, -169, -96, -95, -679, -513, -242, -207, -608, 147, 288, -89, 421, 613, 484, -218, 104, 807, 570, 173, 137, 403, 396, -84, -207, 376, -105, -325, -109, 216, -408, -835, 212, 252, -98, -426, 443, 259, -281, -302, 165, 202, -55]
2936e5j29N63j81o12P4M51o3l58L80M10o78k2k45P45k77J72J64R8m7r23Q13j71
2958A09n5r4L28L46p13k71L71N3n66M74P79o91n54K88J01m8l05L96P27o94k11
2979b30j18K01l79k5N07M25p96K0O41n10l48j9J221j70m20L43M17p62l29P07N11
3000H87m91m86M07L08m61k91K35R2p9l37J0L55m66l14P42L7p4p8O7k74n06J48
3022e69R72l24k06K18L22m10l25K53K80k61K3K41L20p21J30J43N22q41L04M65
3042E36l90l23k95N18L1o06M17O7M7n55K49L94m02k25N09M58m43l29K07J39k8
3063b4j32J11O55n76j42q3O01n41j12R04n12n58J49P26j70m90L15L1m1l53J60
3084h2M82l82j61M07K94p19Q1K82p5m42K71K49K55l43k47K77L0n40K24J89N9l31
$$ y = [-55, -184, 379, 198, -414, -340, 111, 48, -310, 70, 480, -198, -220, -465, 280, 3, 175, 339, 437, 390, -533, 280, 109, 54, -40, 288, 634, -79, -350, 21, 74, -492, -18, 761, 70, -484, -196, -95, -143, -448, -52, 675, -19, -230, -348, -147, -526, -551, -44, 381, -415, -395, 246, -264, -612, -631, 590, 420, 0, 343, 760, -2, -331, 376, 887, 396, -90, 317, 625, 164, -127, 108, 200, 121, -216, -206, 149, -317, -631, 111, 148, 74, -4, 63, -211, -717, -569, 403, 79, -127, 91, 413, 3, -322, -69, 211, -50, -27, 214, 534, -187, -57, 86, 608, -233, 71, 536, 146, -177, -472, 46, 77, -529, -112, -45, 2, -553, -304, 90, -312, -537, -28, 430, -13, -342, -135, 4, -24, -156, -45, 610, 34, -108, -191, 410, -131, -243, 661, 149, -409, -260, 466, 296, -194, 121, 152, 111, -242, -82, 400, 18, -143, 264, 558, -161, -80, 202, 127, -315, -44, 205, 460, 117, -130, 147, 177, -363, -139, 50, 109, -222]
3106b22o8P05l32l69M59K15l71m35N98K78o47j83L70K74m70R5K82k36l41K02M70
3127B74j81k06j77L65j27k17R3M69k78m04R01m01m32r0N16O3j6k49J13K44l05
3148d5j12M66J48o31J06M7J27l11N15P7l53j57J82L19n79kK2N48l54j76q4M71
3170B24l39m04J62M10m17m9L32K58n30K52J72p1k79M32O17o67l09L39N05k97n88
3191b47M94M5l66j47rL90j88k39L53j95j71K1J39K3p4J87J44j92j50j30O88m6
3213C30n95pO00n09m1J01L03p2n21L80R5k08k19L44K06m53j1N49q5j37J66L4J65
3236D15n53q5M55l64m03M23K83k31r8R5K89j26l92L53ol23J03K83J39m67K03j06
3258a13L81k63R9J07Q8m43j35M10q6n33K04L94j55O0K24pj50R3PK17k11m31L28
$$ y = [-222, -290, 415, 83, -286, 173, 388, 17, -418, 180, 458, -189, -372, -2, 272, -198, -103, 179, -57, -398, -196, 274, 93, -113, -290, 75, -52, -269, -176, 293, 15, -389, 512, 111, -321, -411, 105, 168, 152, -97, 16, 260, -45, -157, 309, 457, -174, -68, -21, 106, -205, 310, 387, 34, -123, 59, 378, -201, -203, -181, 367, 13, -163, -247, 224, -115, -519, -357, 53, -364, -413, -81, 177, -353, -101, 71, 0, -279, 153, 770, 103, -206, 133, 638, 341, -247, 247, 292, -74, -221, -230, 160, -28, -267, 86, -109, -280, -259, -120, -97, -171, 16, 160, -32, -182, -312, 376, 330, -265, -272, 328, -181, -222, -121, 182, 110, -411, -31, 64, -144, -363, -19, 187, -266, -277, 272, 187, 50, 216, 250, 415, -138, -223, 232, -132, -535, -112, 171, -60, -158, -63, 226, 100, -292, 61, 55, -268, -165, 118, 257, -210, -7, -113, 268, 5, 104, 211, 299, -144, -279, 131, 45, -488, -284, 110, -45, 15, 239, 232, 82, 175, 182, 399, 188, -243, 85]
3281H5R1l10m5K62q9j24J37M18k26m82K65K92k67l04L2M90m47j98O12j67P9k14
3303a10O7J12j84j13L47K04j55k12k03M37l55J13M09j39m13K58K14p0j27K00k03
3324G7r1N8k50N42l74j5K89J79p32K19R2L01o58J88K63k0L5LJ78J57m80L4K93
3347B88K5o15L7M83q7l63J33L78m33j74M36Om0j29J51L12p62K02J17J06r1N5J67
3370B02J03j40j84L53k35k73J69J77k71j65J35oL0K34J19J96k47n74L70J05nk09
3392a16K45J14j49k20J34j35J77M21k99p3j19K26J9o8l23K52l2Pj83J45n8Q9r5
3415d1Q6p1j89j37J35P2M26m61M04k06j02J63J63j17p4k26K37K11k02j60K27R1
3437B29l54J25j06pJ22n8J85l90K46j33K51j58M2j56P9O4Q4K4K27k72m7J91j65
$$ y = [85, 176, -134, -179, 83, -6, -130, 7, 425, 199, -283, -18, 274, 7, -297, -265, 225, -222, -420, 192, 25, 104, -110, -43, 69, -115, -228, 119, 323, 168, -44, -247, 190, -165, -52, 357, 218, -195, 63, 277, 207, 80, 280, 77, -14, 44, -206, 336, -38, -53, 236, 415, -317, -98, -6, 295, -363, -175, 88, 68, 103, 106, 284, 441, -39, -5, 288, 313, -302, -265, 218, 131, -232, -99, 279, -154, -328, 108, 114, 74, -55, 96, 408, -354, -152, -35, 71, -20, 35, 202, 305, 165, -19, 334, 99, -174, -5, 172, -99, -264, -129, -135, -105, 129, 248, 444, 197, -377, -7, 98, 93, -116, 129, 243, 94, -126, 8, -127, 50, 471, 172, 99, -20, 206, 225, 157, -166, 86, 54, 61, -122, 23, -35, 54, -41, 45, -26, -215, -352, -217, -145, 281, -180, 224, 18, -84, 79, 242, 125, 51, -175, 62, 273, 71, -89, 138, 229, -125, 0, -106, -113, 9, -49, 136, -254, -8, -141, 110, -48, -6, -162, -83, -19, 65, 89, 316, 44, -3, 188, 23]
3460B3k61L01K62l57k3N4P6K00m90P9L74P7k70P4R9n80K46J71p0J03K7J70k61
3483B4j85J31NJ90k28K81k13k04J83k04M52l14J59K6J07j3j60q9L67j21m34M40
3505B00q0n86K65M56j90j93M8K89r8k7j97j08K28P2J1J82j21j44j14l8o9M30k50
3528c4L46m12Q3J28J25k25q1r7L1K55m08M45j41m02M04K70R6l74q6M15m33k17
3550c12N59j41n8l19N86o7k63j23L31j37qQ2n36M7J99J16K62J78j44k87K84k60
3572a1l69N52J26m16L62k12j93j12j81N85j52J78j91K44k15l4J73N6k26J68k16
3593h4PJ58j74L9J57R4k23J02o5o1j50K25Lk28O9J25J52j58R9k60j07M73p4m6
3617G3N2m09J04O46j97m43M38Rl61K4O3K7j09k2M64m86J57j18K2R5m9k70L84j59
$$ y = [23, -238, 63, 325, -32, -55, -1, 75, 275, -215, -136, 238, 315, 45, 119, 218, -362, -116, 55, -15, 88, 115, 285, 24, -161, -30, -25, 165, -63, 218, 5, -199, -16, -220, 232, -82, 77, 103, 210, 197, 37, -52, 315, 194, -240, 200, 120, -466, -201, 255, 65, -128, -80, 209, 111, 84, -113, -221, 7, 79, 90, 272, 151, 7, -107, -145, -214, 216, -34, 312, -100, -17, 111, 236, 11, -70, -167, -136, 119, -289, 156, 15, -387, 17, 287, 383, 9, -77, 338, -95, -312, 247, 106, 48, -271, 315, 248, -15, -138, 193, 56, 48, 130, -406, -359, -160, -44, 218, 396, 252, -35, 249, -11, -380, 172, 298, -118, 244, 32, -161, -273, -454, 131, -21, 157, -34, 210, -5, -39, 134, 190, -36, 132, -84, -77, 81, -93, -54, 103, 197, -26, 76, 11, -50, -200, 25, 28, -200, -131, -6, 146, -12, 87, -173, -280, 193, 119, 73, 125, -284, -180, 466, 269, -174, 264, 273, -88, -64, -1, 26, -83, -105, 359, -127, 30, -88, -66, 29, -20, -290, 94, -65]
3641f5l9k07lJ65p1K36M7j86j7M44l56j06M2K1J0o4L9M36k85M5N4o1Oj8k56K76
3667H7L00m95oM13k67j12m2L28l42j50L05n4j75J20N33m51J24l00J43J75l34O5
3689a35L31r2p5J84j75m7l68K4N62Pj33j27L24m93K86J38n3R6m54K77l0L03o25
3712b75J56K01j91p5M95j17l09K8K62j60J69n36M05j22K84k51M7Nj56L76N2j64
3734A24n65O00R4j55j07M68j89K6k71j84J67PO8J08m1l30K28N5j10J62m21K6K05
3757c5J55j69j07R7j40K76k30q8J41k25L67l0L05j99j25M6j34K05M4m6J21j55
3779G4l99L35L2K63n17J54n1J92K81k57J47K51m87k8P9K30l18M8Q5R3m84L09j
3802C1J61j78N6Q5o4nl5J22k38L49j87J20k44p0K45k00J19k2j41K66j49N2k83
$$ y = [-65, -104, -311, -314, -149, -220, 16, 63, -123, -140, 304, -52, -158, -116, -95, -85, -149, -110, 326, 41, 86, 140, 79, 85, 67, -189, 87, 387, -108, -114, 299, 32, -80, -122, 206, -136, -286, 19, -35, -210, -90, 443, -8, 116, -184, -41, 134, -200, -135, 196, 104, 29, 213, 38, -9, -377, -353, 209, 216, 83, -44, 280, -213, 73, 211, 158, 254, -200, 77, 47, 350, -275, -119, 82, -109, -184, 311, 194, -115, -87, 175, 15, 184, -352, 53, -69, 215, -36, 11, 16, -140, 236, 288, 124, -441, 159, 253, 98, -9, 459, 270, 296, 25, -159, 8, 15, 83, 191, 150, -180, 48, 103, -7, 155, -266, -240, -35, 120, -49, -156, -59, -199, 77, -153, -241, -100, -325, 42, 12, 317, 118, -7, 39, -95, 110, 154, 108, 229, 74, -325, 10, 42, 305, -212, -58, -109, 83, 364, 107, 254, 505, 18, -10, 69, 299, -19, 29, 114, 207, -277, 32, 31, 192, 14, 70, 155, 91, 86, 51, 173, -65, 284, 97, 217, -27, -97, 148, -52, 67, 45, -96, 170, 21, 73, -210]
3825b10K59l27M27p4j6n1J41N1K36n66J91k3K0O1j4j39k20K97k84L23R1l69K12
3848A6O8j4k45M5J05j27K16O3k33K26j04l40L86n1K9%K84k77L7j69lK33l90N66
3872C21l60k40M62p0j36j14K10k63L68m36R2J63j30N4J15R8j80K41k27p7QQ0J83
3895A62m54M37O3l96K95j79j52K13j7k6k19L41l21Q5J23M4q8K9J46k62J11r3Q4
3918g4L04k13J65j74J15l33K89l4J76o6q4m8o2k04k3O43l23k28J56NK30k43j08
3941a34N6m8J02J22k5j65o5L52l85J65M2k03J72j22Q2K75l99L03k36K25j99L10
3963B25p4J27l61J48k6L3k03J14L81j43l77J51K7k00L93Nl67L01M1j3l8j26J93
3986B11j10j77M27k11j86L08k20l9n6k20K01j39J98j62L86m01M2M16n14K62L76
$$ y = [-210, 49, -278, 149, 75, 59, 8, 149, 200, 436, -130, 61, 38, 58, 119, 105, -34, -254, 43, -241, 82, 173, -196, 16, 84, 70, -175, -130, -25, -152, 64, 127, -106, 120, 16, -324, 62, 11, 40, 40, 324, 47, 84, -85, -88, 145, -245, 321, -39, -279, 183, 113, -23, -137, 73, -190, 178, -258, -166, -3, -133, -79, 36, 134, -46, 195, -32, -109, -101, -21, 162, -292, 145, 208, -188, 107, -72, -224, -11, -28, -54, -273, 68, -253, -168, -45, -1, -89, -60, 86, -176, -65, -158, -74, 230, 17, 182, 8, 123, -210, 79, 45, 221, 155, 71, 23, -39, -243, -266, 377, 54, -174, -18, -13, 217, -26, -134, -78, -126, -24, 98, 73, -92, -157, 195, -190, -25, 17, -186, -14, -136, -54, 221, -178, 125, -111, 114, -85, 225, 151, 278, -83, 65, 39, 72, -131, -17, 364, 221, -156, -5, 22, -178, 215, 220, -147, 154, 195, 182, 144, 18, 211, 101, -76, 351, 140, -46, 262, 42, 3, -53, -273, -72, -211, -13, -175, 211, -190, -148, 268, -246, 16, 392]
4007C92k92j5n2m3M18m49J46m7o2R3k68L62Mn6l13J10j00P5L3k3qO0O4j56K76
4032A49j88j20J57Q6l32K92J09j22r9M47m51K27J18k63k53N00j97l0J94j14L3
4053A43k63K1R6m6P5J13%k14J75k46K09j22j58J42J13m3K61q8l63k0M31l68N2
4076a00q0P6j79N2M34n14K17O3J4N7q4J47j60R6k25K71k26K41j8J7J30l74k6L54
4100A83j99j1J72j51lp6K54n43K50pJ80k28j27J51l3M18l59M3J4L59j75r8lJ72
4124A83j53J03k5j56j93j46L90j09o7K69o5j30r6k4J89L1P7q3Q6K86m77m6r1K51
4148Dj18J8J6J16k6k17M04j74J59l22M27l63j27L28J7j96J68K9p2l2L1oJ57k19
4172Bj70K61m1L9J17R9l82k76K66J26n6J55k0l53M34j61o4j17K47K5j68n5n4L03
$$ y = [392, 100, 85, 33, -10, 408, -41, 105, 58, -4, 89, -179, 183, 187, 131, -182, -72, -172, -97, -64, -87, -95, -35, 29, -127, 149, -39, -159, -2, 84, -248, 44, 153, 31, -68, 379, -72, 155, 273, 10, -243, 257, 60, 30, 224, 110, 143, -120, -99, -3, -49, 26, 139, 139, -75, 100, -146, 63, -59, -217, -75, 38, -5, 256, 168, -195, -215, 216, -152, -100, -180, -104, -283, -231, 203, -311, -94, -31, -17, 40, -44, 103, -57, 39, -186, 85, -141, 100, 82, 99, 229, -145, -171, 183, -16, -27, 145, -6, -9, -85, 169, -374, -124, -131, 49, -179, -306, -155, -188, 230, -129, -86, -72, 287, 112, 14, 11, 183, 30, 133, 108, -48, -241, -387, 3, -106, -173, 96, 31, -99, -195, -219, -30, 1, 78, -5, 81, 367, -110, -156, -247, 4, -114, -96, -80, 36, 10, -207, 197, 23, 182, -140, 287, -76, -203, 125, 142, -54, 114, 143, 71, 39, 70, 64, 221, 2, -168, 93, 52, 91, 208, 307, -75, -351, -85, 41, -15, 140, 120, -233, 201, 40, -24, -141, 106, 131, -37, -92, -146, 157]
4196A57j64m6j45J00m0L20j26j64k43L97k41K03M9J5l68K07r8L68l60K37N0k78
4218a70J18K18R7m30J01OJ15j06k67O09m05n3K79N2k54j63J64J18J1k38K05J11
4240A18j96J71j7m6k5n0M81m89n8lqj88K36J12j95j40M60n5k20J99l77J87J92
4263H9j82K38j74MQ6l86K38K17l82J1L74k37K44l74N48j55k12Q9j01K1l9O2K2
4286Aj36j45J43K16J28k9J53m79K57k57j7L13k05k33K63M0j31K02r9K3P6l4J74
4309B24l45O9j39K82j06J72l60p2L57Q5j52kj32j04K18J78k98K51l06L13m58J30
4331a95J61K5J32l42K18l63j05L94K62q0j49J87l08l6L37k36j39J89K67j01j1
4352A07j00P8k9j20J04j71P2J9J51j96J01J12k88J28l5J77J20l77K97J4Q6o3k57
$$ y = [157, -7, -53, -198, -98, -138, 182, 56, -108, -351, 46, -195, 8, 57, 72, -296, -89, -187, 181, -179, 58, 108, -170, -52, 166, 263, -167, -66, -60, 55, -51, -318, 291, -114, -167, 112, 164, -90, -253, -89, 29, 40, -198, 7, 118, -78, 93, 76, 30, 5, -45, 436, -53, -111, -114, -122, -310, -74, 38, -157, -297, 163, 108, -112, 87, -290, -103, 89, -93, 145, -29, -25, 61, -325, -87, 130, -252, -241, 133, -104, 140, -234, 314, 159, -53, 36, -65, -44, -83, -21, 1, -135, -280, -137, 79, 207, 178, 331, -148, 109, -148, -165, 148, -57, -290, -27, 13, -118, 84, -15, 8, 84, 50, 224, -121, -52, -191, 91, -15, 157, -203, -275, 82, 167, 15, 13, -119, -223, -5, 173, -125, 126, -180, 133, -325, -195, -34, -9, 123, -219, -1, -364, -469, -75, 187, 107, -42, 145, -163, -199, 138, -98, -237, -48, 219, 118, 107, 7, 85, 56, -64, 40, -131, -59, -40, 111, -85, 16, 128, -160, -32, -67, 110, 230, -147, 150, 164, 250, 187, -70]
4375g0L15nJ37n29p3j32J46O2M84r6k38j03K74K6l25n7J90Op4K93q5m8j59L2j21
4400a50K25r0L32k85Q0k53j4R8J48Rj1j00J75l21l0K08n8j11M4K4j37q7L73m4
4424B5j1j81j01L75j60Q8k18o1M96k55k21rM84j32j36j5J50K91l64P5Q7j58Q2
4447A31J9l64K43r3j08K13j83K74j55r9J27q5R8o7l2j27K44l30L5M31mj35k08
4470a75J61p6l0R7J70j74j17K66j95p6J44O6p8l65J98L80j21k22K4J1K90k18k55
4493b95K2K84n8P5K60l76J09j84L70J56k45L1j92K17j77K5j14K0q1K95n6m9K02
4516B39p7j10k45k1L21p1p0j61J78J14m05N22m12M57n1j77j44K22Q9j05L72n60
4538i5L93j82K51l75n7L37n6l4k5p9k98K05j10M74n24K46K6L01k19m11L67l08
$$ y = [-70, 245, 240, 377, -152, -225, -357, -211, -149, 335, 239, 1, -102, 172, 198, -127, -184, 6, 12, -62, 231, 146, 98, -61, -29, -150, 75, -15, 317, 32, 112, -141, -155, -57, 91, 100, 89, -11, 164, -157, -187, 21, -37, -148, -104, -80, -217, -304, 69, 25, 14, -167, -268, 107, -53, 35, -183, -244, 252, -3, -224, -233, 251, 119, -17, -32, 118, 409, 45, 120, 207, 49, 131, 150, -214, 29, -64, -172, 41, -142, 132, -23, -122, 5, -80, 18, -49, -81, -208, 36, -294, -259, 172, 168, 33, -175, -14, -90, -120, -23, 147, -27, -144, 122, -73, -149, -5, 61, -17, -382, -184, 196, 75, -147, -123, -112, 178, -40, -295, -273, 11, -47, 28, 288, -88, 21, -163, 207, 363, 118, 149, -43, 174, -3, 22, -92, -72, -153, 142, 86, 37, 239, 162, 52, -193, -214, 107, 36, -34, -195, -17, 97, -308, 214, -198, 259, 208, 31, -113, 109, 198, 93, 465, -95, 298, 116, 367, -8, -65, 272, 216, 182, 157, 78, -220, -15, -125, 349, -175, 71, 97, 398, 179, -232, 135, -173]
4560a73L61q1k13K59k14k95L64Pn3j4j47J68R6l65N19l80P8L78j35L6j04l0J33
4583A95k83Jl3o2Qj52M03l5j7j94K95R4l51j9K38J09n05J89L08k66j71K87J04
4606A43m24J43j13L48J56l25o3No2q1M66k85J63l67K90Q7l38J22J5J52N3k79L74
4629A80j81j5j77J02m4p6L18q6j90L94J45p4m21j69O94k59p6l08M43k99l12K24
4651a87l5Q3Q8K99J27L8l79J47m78L60j49j31L92p5m29M79n5Mj30RK17n79K21
4674a63O8N7J56j63r3L23J61l00J80j32n06N45M3j29j61j6J34K4m10L02n2L06
4696A74Q9n6j66j26k10L89J34l15p2K6J24R8l76L67j66L10J57l40j22r1K0M95
4718C43l29q4J98l22K53k01K84j82j28j0J74j42J15k0K41j78k88L16k4j68K07
$$ y = [-173, 188, 107, -106, 153, -61, -356, 8, 15, -38, -52, -199, -31, 65, -300, 219, -161, -83, 295, 160, 196, 92, 62, 195, -88, -87, -120, -182, -174, -326, 77, 42, 25, -169, 126, 220, -131, -150, 88, 197, -308, -119, 189, -77, -248, 39, 143, -281, -138, -251, 97, 253, -72, -135, -130, -192, -273, 193, -92, 71, -296, -6, 81, -257, -135, -120, 32, 85, -194, 180, -1, -16, -193, -91, -135, -211, 107, 21, -169, 225, 370, 296, -125, -294, 400, 141, 65, -243, 200, -99, -411, -187, -222, -139, -51, 248, 375, 413, 34, 181, -297, 63, -86, -217, 175, 100, -329, 150, 95, 99, -31, -22, 195, -384, -163, -95, -38, 118, -45, -138, 185, 346, 46, 226, 94, -412, 133, 176, 47, -114, -130, 4, 28, -382, -80, -132, 174, 263, 207, 41, -85, -295, 94, 228, -87, -159, -133, -9, 89, -287, 80, -86, 224, 381, 41, -81, -172, -152, 343, 14, -70, 128, -194, 59, -142, 142, -40, -168, -178, -4, -146, -31, -51, 190, 12, -276, 40, 16, -152, 55]
4739E5q2N3J11j91k23K64k18l6K93j72K45m9P9Q8l09K73L4l02r7L85l5k72J9k0
4763a07K94j56k03J53J20k45K11K24l58J18n0J83O2k50k20L00%m07L09L66n15
4784a71K12j23N31l82l68M39j47M1k50L87N8k07j21K01J51l47j52J12K10j97j66
4805b89J46O2J6o8L19k04m7L4p1K25m65r4K94M53l88J46P1J83k98J74J56k40j49
4828c4J29J28l82M4M68k45q4k3K47m4l42J7J75j11L43l44J72o0p0J3K57k87O3
4851C0P9M4j64o8M95n33K45l48J05K39r7j51j01K99L9j22L06k70m6k1J73m56L33
4874A0p3J99L98o12J6K94m04mj22N29n73J02K80j34L9PK4J78n82K62K83k56K69
4897A30k07r1mj08K37j30J52J33M9o8J63k73j16L67j6l91K13r2L42k67J82o3m31
$$ y = [55, -27, 26, 137, -54, -277, -13, -231, -267, 26, -146, 99, 50, 129, 217, -92, 181, 215, -87, -184, 201, 166, -106, -87, -107, 187, 31, -172, -19, 101, -144, 67, 291, -67, 51, 1, 184, 246, -4, -224, 76, 76, -331, -22, 344, -171, 41, -82, 449, 67, -301, 138, -9, 32, -218, 169, 227, 20, -101, 100, 251, -96, -248, -136, 74, -123, -289, -143, -81, -65, -133, 186, -18, -65, -31, -102, 123, -342, -436, -142, 311, -77, 69, 140, 323, 25, 199, 355, 115, -34, 95, 223, -159, -115, 353, 108, 24, 1, 248, 204, -138, -121, 54, -57, 286, -58, 114, 54, -16, -3, 254, -33, 30, 109, 153, -11, -79, 416, -117, 128, -220, -115, 124, 27, -124, -225, 74, 113, -9, 297, 27, -19, -40, 133, -323, 10, -63, 136, 534, -78, -62, 232, -172, -176, -298, 231, -342, -240, 40, -94, -55, -48, -24, 154, -428, -166, 117, -139, 130, -77, -168, -172, -280, -43, -173, -21, 112, 161, 93, 256, -17, -133, 234, 218, -173, 40, -52, 290, 23, 205, 142, -289]
4920b89Q5J79j37j06K83p2q3j68L31J10n3l08K57L15m85j66N07n51J40J38J15
4941D2K5j36K07j28j55k48M29K88l22J6k14K22j68J59j30K07kj56k9J95J66o57
4963c89N48l71R9K7M20l82P6j9nK27k90L7L4o5j47J81K26m74M56j73p4K16k63
4986a05n4K16N6l27L55O5J2k36l15K52n2N0J54K4j71Qp4L64j22k92M25jk09N8
5010H1K43k34j57L09O5k40L7O6r6l0k97J10L71l82Q7R6n0Kj15N3q3J48Q6K77k48
5035I9K54l40o1J99k70J75k13K37O9j56J38k48j12K44J90j53j05J5K41j18o8L65
5057C82l96j02PK60l7Lj98K72l32J92J47J08l97J22j24j07J83j17O0K14m15J94
5079h1Q9k19J65p1L16l43K57n6j02K33m36L02L26j60k57j51M02l98J87L4K18l33
$$ y = [-289, -204, -25, -162, -268, 15, -57, -140, -308, 23, 133, 80, -228, 29, 344, -141, -307, 200, -351, -211, -73, 42, 67, -69, 138, 10, -145, -393, 36, 324, 2, 18, -196, 26, -142, 17, -113, 94, 92, -64, -93, 102, 268, -389, 159, -212, -113, -86, 334, -48, 28, 9, 4, 231, -59, -22, 12, -53, -200, -19, 207, -267, 189, 16, -58, 158, -105, -159, 57, 113, -214, 141, 206, 218, -18, -333, -81, -133, -83, 71, 95, -76, -68, -142, 222, 100, -192, 233, 232, 23, 81, 324, 90, -67, 242, 307, 67, 104, 170, 74, 44, -253, -143, 228, -154, -67, 29, -21, -19, -134, -81, -164, -16, 70, 347, 99, 353, 13, -48, 151, -119, 56, -157, 80, 149, -7, 131, -117, -229, 15, 205, 52, -53, -38, 203, 85, 17, 382, -14, -116, -109, 151, 114, 117, -81, 191, -141, 51, 198, 306, -91, 31, -93, -200, -17, -134, -74, 140, -275, -81, 8, -211, -46, -117, 199, -144, 113, 57, -45, 188, -248, 54, 380, 220, -37, -188, 214, -184, 3, 37, 255, -78]
5101g8r8K47p3j70J36J32p1J96k75K68j96j26K07j5p3jJ22Q9j27k70K89j68J51
5124I6k89K03L9r4Q2j3o2J1j45L36k10m09K24M49l47j19L40L2k65j2K86j57m8
5147g2l1J9K85j62m6l91M17p0j62K73J18r2j07J31k43R6Q9N5l38r7O40j15j88
5170IM0J96n18J73q5K32K30p29L28l4L45m14K92j95K70o4J06lk11J09O5K78k02
5193B18j45o7J43k70M0N2M3N7k51l3M26j91j53k9J56K6j44M22l69R5L71l98L3
5216C2j12J09pK52l05J06j94J19P9K05q8j20j08R3l1j96M2L1N6J32m64J67L39
5239A37j55O4K86l89P3j92M00ll7k44m7J70l67M62k8K71o87kJ65J34jl0q0oRr4
5265a91L34l15O2O7l0J1J54J16j37L6j21J75j81n0J16j21J23N0j06K55k02Q5j63
$$ y = [-78, -176, 71, -2, -172, -36, 96, 25, 221, -54, 214, 18, -108, 99, 84, 11, 10, 132, 221, 94, -176, 113, -55, 96, -193, 10, 49, -45, 37, 24, -38, -27, -172, 164, -46, -455, -231, 218, -129, -248, 92, 124, -141, -153, 133, -24, -72, -103, -84, 201, 39, -7, -398, 19, -51, -213, 60, 178, 86, -21, 110, -133, -37, 52, 107, -231, -328, 312, 197, 9, 49, 245, -273, -100, -185, 47, 277, -452, -124, -158, 187, -227, 65, -130, 140, 76, 182, 179, -32, 77, 142, 420, 218, 73, 6, 149, -121, -81, -29, 14, 71, -180, -213, 213, 22, -131, -160, -4, 22, -122, 300, -69, 26, 397, -1, 32, -80, 29, 22, 274, -31, 75, -119, 0, 79, 284, 196, 76, -32, 61, 30, -166, -124, -93, -37, 95, -369, -202, 137, -18, 46, 332, -57, 16, -176, 224, 221, 184, -60, -107, 63, -304, 158, 130, 401, -286, -288, -123, 11, 10, -20, -100, -106, -97, -191, 143, -172, -110, -43, -73, -62, 92, 208, 71, 107, -14, 161, -20, -70, 46, -75, 48, 98, -8, 247, 45, 130, -33]
5288c3P2j09mK37j56p7N6J78o2n01L17N67l85l41K17p4K6K00q4J1j20K3o7j8l3
5313a60K30JP2j25q1M54l75J99k62k6J61k55J01R7j8l38M92n5p3k89o1M1J88L36
5337B54j41k37J94k96K61j87O1jK65j68q9J67j24q5J32o5K97k25l64M66k95K72
5359I2j55j18J85qj29K38j72L8M0j37KjJ60J12J82l54J68J76p0m30K22k2j2n62
5383e55M54K22k7j00n8J26j72k86K31L92j22l34J18J98q0j79L3L21k42N72l87
5404A25m9k71N1J93r6j19K49l12J76J67j5j28k30j0L9J74J0k8Q7k68J10p5L68
5427A48j5k23n3P8p2o7J49j75L68J2j92R1M8j30j10J85J73m24J32OJ14k31K88
5450A00k8j77K01J31k32M1j80n6Q2k40J35L26K6m74K90K20l86J72R4j6o5K74j47
$$ y = [-33, 39, -70, -74, 163, 7, -70, -14, 164, 102, -399, -82, 485, 100, -241, -24, -98, -72, 128, 44, 55, -65, -42, -109, -127, -160, 70, 71, 143, 18, -63, 391, 16, 215, -47, -73, 88, -167, -66, 31, 13, -325, 167, 112, 39, -250, -311, -270, -82, 254, 113, -124, 70, -226, 35, -152, -91, -92, 173, 5, -84, 83, -41, -126, 6, -59, 238, 13, -351, 115, -180, 92, -63, -181, 4, -4, -133, 105, -67, -29, 11, -126, -124, -125, 35, 147, 329, -25, 143, 319, 249, -181, 41, 19, 7, -555, -101, 121, 94, -6, -64, 62, -110, -396, -165, 227, 105, -229, -111, 87, 7, -172, -139, 182, -60, 512, 125, 76, -195, -144, 49, -47, -166, 83, -229, -53, 114, 99, -29, -259, -269, -230, -56, -46, -74, 13, -255, -145, -220, 148, 133, -90, -143, -65, -137, -204, -55, -230, 138, 150, -42, 49, 97, -33, -143, 42, 215, -209, -77, -71, 43, -188, 100, 72, -105, 96, 227, -5, 36, -144, -200, -118, -358, -223, 103, 129, -345, -55, 165, -221, -49, 45, 29, -36, 238, 91]
5473I1P0l4m02N89q5j49p6k23J25j43M2Q1J10n8M5J77j93Ml56N37j82j96J52L86
5497C12l71kM8K30pk72K91O8j58o61L69L42j31m03L24J62k32K86J18l75J95Q1
5519B14r9p7m21N00k2Q3l15K50N3j39p4K93k58j22J65m02M38k44J61M04m82J14
5541B0j09K23j6j57k6L52l78j02L31j54n8q8J20J07j6j59J50K08m6n19M86o1O2
5564A70r0k3M2P6k09Q0j36q7K70m9L1k61K14K18j15q9m2o5K02k08L81j48l34K41
5588F9K62m95K39j74p6L83j63J00l8j9k61o8L47J68j84j28L05n91K58N0k0J37
5610A01J55l95K77j80J67p9m99M24J1j1j10LL16J86J7p19L21l3P3p6J97j40j25
5633a19J0L75l38J05J71j40L6j66p4L87k53j31LK00j42l05L31J86j54Q3k57J49
$$ y = [91, 161, 127, -275, 314, 229, 80, 4, -219, -94, -237, -195, -114, -4, -62, -17, 160, -33, -29, -385, 152, -30, -226, -74, 312, -59, -61, -13, 217, 210, -62, 229, 297, 139, -522, -153, 189, 58, -345, -21, 141, -91, 195, 313, -62, 133, 214, 115, 38, -383, 117, 95, 178, -137, 113, 166, 27, -47, 246, -12, -134, 31, -371, 67, -177, -16, 388, -94, 20, -89, 134, 118, -39, -65, 287, -91, -193, 138, -16, -74, -162, -42, 65, 49, -110, 40, 248, 202, -317, 169, 108, 170, 80, 57, 99, 175, -34, 46, -90, -177, 93, 44, 75, -186, 28, 246, 131, 42, 0, -65, 137, -71, 310, 162, -172, 69, 331, -164, 75, -99, -175, 208, 45, 145, 107, 88, -173, -241, 106, 274, 90, -38, 267, -324, -66, -16, -36, 101, 256, -139, 138, -42, 125, 46, -453, -29, -18, -29, -139, -136, 180, 366, 383, -336, -15, -48, 25, -51, 146, 6, -119, -109, 266, -72, 33, 204, 64, 100, -66, -140, 247, -6, -137, -134, 66, -76, -381, -50, 136, -18, 65, -192, -43]
5655d3K55j24m7j11n0P3J49J30k94r8L28J23l74J62K6j79M3J35j07J17j81J7J0
5678d0J16j64L23l44q1l0K80M7k29L67j97L48n45J00K01j29Q8l6j50p7K48j93
5700i7M37n19L7J07l3j3J22m3J60m29K42K92j72j15P3j33J13J41K0k68L20j85
5722E7j45j33M72l92K13J06Kl70M45j31j32j10m8J79j93N6m9N7J71K1RJl4j62
5746a10L41J26m79L72l41K82m28K16N1j6K7J34R6k54k48j69L46j09J33K7k22m1
5768b66J19J90Lm43O6K07P3J47O3Q8n46K27K55j52m1n3j91L10J96k84n6jj63K76
5792B4n8P2n2L7J30k06j52K94Pn26M57Q0k01K07k93J58L5L6j15J05j60P4j19J34
5816c2J93m1j00K5k41J93Q0n43P46j44K3m7j63k52J39k2J2j70K59K19k49j88L42
$$ y = [-43, 212, 88, 41, -70, -120, -47, 102, 232, -62, -160, 168, 291, -83, 79, 105, -74, -31, 104, -3, 114, -67, -50, -40, 76, -88, 235, -109, -190, -220, 60, 107, -122, 245, 48, 396, -149, -49, 152, 23, 111, 75, -75, -152, 96, -97, 340, -179, -142, -35, -68, -81, 41, -2, 158, -271, -29, 263, 91, -24, 49, -84, 29, 170, 190, -78, 242, 57, -88, -221, 251, -141, 72, 178, 180, -190, 255, 124, -8, -118, -166, 13, -180, -124, -173, -116, 55, 76, 85, 86, 52, -110, 231, 357, -122, 250, -91, 191, -237, -21, 30, 14, 41, 175, 271, 17, -231, -400, -54, -163, -30, -3, -225, -266, -147, 43, 46, -397, -331, -124, -51, 96, 159, 247, -299, -72, 183, 31, -10, -63, -254, 56, 252, -32, -88, -89, -252, 24, -34, 38, -14, 23, 153, -53, -205, 89, 96, -430, 27, 107, -94, 113, -180, -22, 13, 49, -66, 39, -121, -47, -166, -32, 161, 120, 20, 45, -196, -3, 77, -466, 280, 136, 159, 112, -51, -303, -164, -186, -174, -344, -85, 134, -115, -303, 39]
5839C9K39m41L13j73kJ54n24K13J12N2j38Q3j52n2J38N02j73r1j96j22J32J4J18
5862D5L5J27l75K3L55m07o6J26J96oq6K51J95k58j16nj02k14K03L93m66J05j47
5885a94L65p9o7n9L35m67O6J78M6M5o3Mq3o9R9K46l33J26r5J95R7l69k60O40k57
5910D7P2M3P4j11n55K88L33l15M65j98j43j27L9j97L73n5l27L04J21j33j77L06
5932A27K55m02j3L15j13l88n7M03J2o1K12k68j40j88p0M89j58k11j42L88O4m2
5954A2L4%j07j21L77j11Q6n31M98k74J41L0K38k10K03n10K94k03P6J56r1M9K7
5977F3M0K16K2k26j21L82n17m3J49K46m53J81J05j17J58j03L42l7l76p8M53m95
5999b09M53k82J06J53m27P8o3J07P4k21J41J5n2q5K12j08Q5m6K24j57oK84k91
$$ y = [39, 278, -163, 150, -23, -25, 129, -395, -182, -70, -18, -156, -73, -225, -277, -139, 363, 190, 99, -97, -219, -87, -73, 45, 80, 207, -168, -145, 210, -197, -263, -137, 59, 53, -33, 218, 413, 155, 39, 34, -68, -282, -79, 314, -152, -47, -194, 171, 92, 25, -34, 301, -166, -100, 78, 124, 169, 106, 110, 27, -42, 57, 303, -30, 96, 1, 196, 293, -76, -336, 304, 47, 119, 162, 236, 125, -430, -142, 191, -124, 341, 143, 0, -127, -88, -285, 88, 33, -294, 10, 131, -2, -179, 127, 382, -20, -33, 282, 169, -219, -276, 127, 139, 78, 290, 22, -118, -306, -376, 113, -45, -256, -398, -10, 54, 12, 46, 46, -61, -182, 195, 84, 170, -361, 137, -137, 4, 34, 272, 62, 265, -245, 49, -154, -78, 78, -13, 36, 63, 103, 319, 341, 115, -6, 376, -141, -184, -35, 211, -242, -61, 44, -73, 85, -18, 324, 287, -89, -167, 286, -209, 244, -38, 68, 221, -206, -128, -191, -84, -10, -231, -90, -75, -127, -212, 0, -108, -23, -69, 155, -2, -8, 276, -15]
6022a5L4m2L39j95L6l8j92O6J04J59j8j76o3q9J69p7j23k01L29om07J86K94qj3
6047E3J2j23j85K63r4j26K62k54J48J5p5R5j71L01q1j51K52J6k80K61k1l01K94
6070A10J05J22m55k9j92M68r5j28K75j13l41M11L27n67K7J0M08l04k03L41J5k92
6092a00O4M9k73M24j77J89j51O8k4J05K4l24r0K57M0J28j43M3J29k58J00l55M01
6115A26n10N14j52J95l26r0K68j92kQ6J28m5J5M7Q1o0Q1m86N7K06O1j3P0n13N13
6140E9L9J56m73K09lN2K04j46J72m10k2P9K17k58M2N06k03k88r2K96k65O5P6N0
6164F2P6l30L5J31P9k88L08k07K81k93R1K19m62J97K88j19j37j19L21n29L27R2
6186B3L97m95M9K07j52K07l70J76j73O6j80O42m69J53q0K87k20k29J46L32l33
$$ y = [-15, 19, -23, 316, 121, 157, 119, -73, -7, 97, 256, 238, 62, -1, -90, 79, 2, -121, -322, 7, 1, -406, -220, 74, 66, 53, 65, -58, -243, 20, -74, -200, 62, -192, -44, -29, -104, -9, -180, 121, 40, -111, 141, 157, -123, 138, 117, -184, 110, 215, 337, -118, -147, -339, 129, 34, -94, 181, 68, -273, 138, 465, -102, -75, -65, 343, 39, -164, 177, 192, -100, -36, 13, -260, 164, -13, 176, 25, 93, 69, 174, 198, -126, -216, 41, 81, 209, 66, 109, 238, -20, 80, -275, 126, -384, 130, -22, 173, -153, -243, 25, -167, -169, -83, 45, 0, 15, 62, 143, 83, 164, -322, -265, -59, 2, -11, 59, -454, 59, 98, 254, -219, -10, -13, 39, 243, 97, 269, -141, -163, -84, 133, -125, -83, 423, 220, -68, -160, 136, -129, -64, 12, 62, 138, -192, -157, -26, 53, -235, 73, -134, 147, -146, -55, 164, -298, -101, 187, 68, -69, -188, 133, -396, -69, 23, 420, -75, -26, 181, 29, 236, -134, 42, -131, -65, -245, 397, -72, 81, 1, 288, 68, -161, -15, 317, -16]
6207a6m4p9N1J96k04J35j90j88J31K69j25J63k13K95q4l21L62k66J37J71r0J87
6229B77l50J75k06K70n8k87j19K13K2J29l0o8j05Q4k58M83l57k9O3M43j80k36
6251a24L36j62q5j23J74%k12on4N62m60j8K76K2j48m6K29r1k72J24K40L5nk45
6275e3K41j4m41K69J0k59L04o0N3K10l63J2J70p4J08L1k28j39P5L68l30j03J06
6298a07P3j49j12J20L39j10j00OL72k19j54J9K0J3K3j03J57j45k85L49L5q4J3
6321b9j40j7J76l22L80J63l8j20M10l0m27J85k66o2L40l07K56k58K88r2J42l56
6343a24J96n3j03K8k92O65l03k5k75L90j46j96l8K46j27o3J24j11K02k87J69k4
6365a47NJ45J53l5j40K27j89o5J3J33l04K61k37K29J22m67L11k41M24m34NJ72
$$ y = [-16, -60, -139, -88, 108, -96, 39, -151, -339, -208, 61, -64, 99, -114, 181, 97, -224, 138, -128, 9, 180, 90, 277, -73, 102, -104, 166, 108, -179, -298, -85, -63, 66, 36, -32, -137, -53, -311, 172, -185, -214, -151, 292, 112, -124, 212, 50, -35, -158, 16, 16, -196, -202, -256, 306, -154, -172, 104, 126, -22, -68, 161, 70, -202, -78, 162, 197, 192, -53, 188, 174, -267, 2, 12, -247, 57, -3, 50, 260, -103, -91, 79, 5, 113, 144, -84, -223, -148, 220, -110, -213, -107, -34, -183, -295, -175, 164, 54, -46, -40, 332, 113, -41, -22, -2, 11, 34, -69, 88, -57, -342, 7, 42, -42, -29, -169, -186, -10, -332, 48, 211, 173, 53, 463, 433, 6, 191, -75, -137, 203, -104, 152, -106, 182, 90, 232, -124, 72, 19, -84, -56, -348, 317, 14, -11, -286, 104, -42, -238, -276, -30, -157, -220, -96, -207, -5, -292, -123, -147, -142, 3, 156, 121, -19, 208, 19, -46, -33, 100, -204, 57, -180, 49, 171, -296, 15, -226, 198, -236, -231, -59]
6387e9R6R5j38j27R2k0j20L05j95j2K2L69k92K23j52K37l26k25L40j8n8k0m0K36
6411B13j81l99N29mk70K6M6L81o10M16L21m93l7J7J69r2P0J29P7J84o42P7J77
6434A04j55l13N62j09j00k08j7O87m57k86L46j73K24j62K11R6k09j10j58M51l39
6455a15l6J82J57j49K35k55j20JJ36L4n4kk1J29j47j36J70J85l74qL6L51j78o38
6479f17P92j6O6o07O00j86J76k69J64k19M23j41k3m05L00J62Q6j56k42r7L40j70
6501c9M8J32l37J79j55K46p1k32N22K3k43J4P3M8n82N22J54k61N8m0j90L41k11
6524aJ89k40K38R1k95J65j05J2J08k59K64k55k47L63K69l91NL16k40J74j04J41
6546A98m6k30J19j0j49L5J7K92J6k01n8L08k28m95N81k06j90K27J98p9j49p3N7
$$ y = [-59, 37, 132, -6, -133, -41, -61, -181, 124, -71, -83, -61, 308, 16, 239, 87, 324, -2, -227, 113, 95, 37, 17, -23, 213, 32, -367, 162, 158, -112, -86, -40, 341, -269, 147, 468, -25, -62, -45, 124, 32, 102, 231, 308, 492, -150, -73, 104, -51, -364, 198, 89, -11, -219, -236, 451, -6, -292, 54, -119, 105, -57, 154, 250, 41, -69, -227, 224, -115, -151, 31, 188, 39, 274, 19, -101, -100, 36, 70, 16, 14, -7, 122, -25, -161, 9, 194, -180, -188, -152, 199, 21, -617, 175, 159, 225, -382, 218, 32, 208, -61, 103, -116, 307, 166, 143, -262, 38, 200, 286, 130, -112, -209, 131, -39, 9, 141, -196, -17, -172, 74, 3, -229, 293, 316, 73, 87, 160, 208, -374, 148, 302, 41, 99, 59, -131, 210, -1, 188, -52, 186, 277, -18, 147, 42, 54, 162, -97, 167, -88, -335, 28, 297, -94, -89, 227, -13, 161, 57, 198, 152, -78, 41, 31, -118, -83, -66, 226, 242, 41, -17, 291, 63, -432, 149, -57, -247, -20, 178, 99, -50, -123, -66]
6569f6J22m88K90K63J7k63L54j6l56nK69M5l91N3K31K18m42oJ76J14j16P8K02
6592B83k52K95l37j4nq3K28k33k0K1M2K82k07j15L34J17l58j13L21l32N7L36j10
6615A37l51J66l47N06j50N2k85M17ql28K07K6k38p1J88J46K9m03K20K31k29q0
6637a65K28l79M03j83M0j18K35J8P6j53k28L76m16J73K08k56J43l5L05j42qj85
6659f3K2P5K44j28m16J00K06p1p9L3O1J87q6j16o7O0J55J47k03P7o0j87M76n34
6683a67J86M1j01R8j23j3j08j64N48k35k4j93K7M53l39jJ99K28k73l3j5p1j28
6706b08O3J05J0m3j03N10k88k24M61j00n11J11N03k76M0L0j79L96m75l8K37P2
6728I3K33n57L97j64k27K66P6j90j38M51m28n8K26o2R6n23K52K43q6l6Q7J68m4
$$ y = [-66, 56, -432, -142, 121, 138, -125, 229, 213, -143, -148, 121, 166, -225, -172, 59, 277, -165, -171, 5, 119, 3, 81, 283, 31, 326, -11, -25, -30, -113, 115, -118, -138, -117, -75, 207, 0, -115, 219, 336, -22, -135, 186, -146, -89, 247, 137, -214, -48, -395, 111, -39, 13, -272, 145, 137, -191, 16, 42, -196, -267, -79, 67, 96, -307, -87, 144, -85, -165, 63, -316, 87, -96, -56, -174, 61, 79, 155, 2, -226, 150, -266, -93, 115, -141, 2, -33, 272, 130, 122, -63, -41, 34, 278, 150, -266, -166, 40, -31, -110, -77, -16, 171, 85, -31, -98, -38, 117, 264, 61, 138, 78, -109, 367, -167, 19, 60, -41, 57, -66, -79, -187, -351, 197, -38, -62, -255, -228, 225, -114, -115, 84, 312, 39, 6, -9, -80, -208, -145, -40, -30, -73, -176, 334, 46, -178, 283, 183, -328, -217, 286, 10, 50, 80, -99, 297, -178, -216, 21, 93, 326, -231, 166, 2, -225, 41, 117, -73, -211, 240, -188, -246, -20, -82, 14, -509, -257, -14, -100, -136, -49, 119, 75]
6751G5k54R3J6M6l41J86R3K03N6l28K90k81j10J05K12j45o2K46j67mK13k73N08
6774C77l38r7j45L17Jk98M13m95K20K75r5k2j37K0K57j80l67J37K52J67m28L71
6796B05l59J59j97M57L2m95J91L03j20o6m9K64n03l0N0J75Mm41L81J00r3q9K36
6819A15j31q7j62M56k38J78O3k69J38J68k68j26K11j47K41j26J72M4qJ77m26p9
6841a04P9%M0j68L64p5j24j67k0N2n9r3%N99n00k49M38J77k56j49M18m6n02J16
6865b29M30j2l00J32K62l24j34m0N95l56LK10K6l29JK78j95j74R0J28p5m4j42
6888a99L52n2k63K7J80r1k96O95l56k79J10L02J01k13k71K42R4k53PM20j55j8
6910H4p0J15n0j39J80J51l96J54j62J35J89M8j41L58k96j16J76m2nm61L56k5P9
$$ y = [75, -179, -86, -70, -24, -365, -179, -86, 117, 173, -155, 135, -146, -256, -151, 61, -84, -146, 100, -67, -71, 142, -131, 377, 39, -58, -203, 114, 115, -183, 230, -265, -45, 230, 135, 113, -24, -4, 253, 73, -294, -157, 95, 262, -166, 205, -154, 5, -192, 265, 297, -198, -7, 296, 176, 110, 61, 325, -178, -208, -158, 17, 21, -420, -39, 61, -32, -121, 115, -16, -103, -265, 191, -47, 131, 194, -75, 63, 231, -37, -163, 48, -99, 142, 16, 188, 232, 224, 401, -25, -104, -25, -25, 15, -153, 211, 136, 12, -155, -175, -123, -182, -275, -275, 324, -176, -425, 13, 190, -66, -215, 203, 157, -345, -229, 201, 189, -111, 21, 283, -41, -175, -215, 380, 24, 27, 237, 263, -66, -65, 213, 18, -156, -66, 62, -13, -57, -199, 153, 101, -162, -135, 45, -46, -342, 353, -3, -282, -172, 130, 231, 18, -253, -11, 83, -170, -163, 257, 102, 84, 14, 129, 79, -60, 120, 271, -125, 29, -133, 2, 191, 239, 98, 456, 160, 44, 220, 178, 173, -288, 68, 43, 122]
6933A22m34K07K58k6l7j84k98L68J54J66l60J13j63J32j89J98J8J3J48l86K19
6954C9j1m56K24L70j61K33j70p5J48q9m8Q8j55j67J95L74k79j82p9K23k61P8J86
6977B5OM1o9RP4n1j21n3M1j82K68mMK19j42j38L9j00J92j86K0K30k6j69m0K48
7003A35Pq9j84K44J2K4j06l11Q9K72j75p5J66lJ47n36O75L4l48K12p6k2j5j26
7027d9J67l2k17K44jl70J45j13M59j92M6K86m91r0J82NK68k61m37M09J33j86O8
7050b7J29p3J29J4l9q6J10j60j28P6J04j37J95j45J66J05m1l99R2L35j78j70j56
7073b84J29J74O5l40K87k99K11p7N36l99j78o4J62L82m14j33M93j54l21L81j74
7094a7k24K96j6N5j64m1J17l0n0M0M02k79j79J21l3j45J00k73O24l42j8K84l18
$$ y = [122, -312, -105, 153, 127, 90, -94, -392, -24, 130, 296, -64, 49, -114, 18, -171, 27, 45, 58, 206, -180, 39, 28, -428, -204, 166, 5, 238, 68, -7, 141, 52, 4, 92, -63, -230, -35, 339, 60, -122, -201, 22, -239, -161, 25, 31, 72, 3, 12, 86, 35, -86, -139, -98, -280, -12, -16, -12, 207, 65, -73, -34, -134, 58, -128, -108, 122, 96, -73, -113, 135, 142, 53, -131, 113, 125, 149, 43, -268, -179, 93, -82, -157, 9, 6, 153, -383, 292, 326, -22, 190, 114, 92, 77, -49, 118, 86, -131, 113, 112, -258, -113, -226, 233, 41, 87, 373, -118, -208, -26, -21, 247, -14, -451, -42, 91, -95, -27, 102, 29, 158, 172, 133, 47, 157, -3, -131, -55, 49, -88, 107, -38, 128, 233, 192, -207, -115, 220, 42, -128, -284, -155, 19, 84, -256, 31, -268, -57, -134, 402, 3, -175, -239, -77, 305, -109, -242, 251, 97, -224, 157, -17, -241, 55, 39, 94, -70, -111, 6, -24, -74, -34, 368, 89, -90, 31, -2, -147, -47, -320, 304, -38, -56, 228, -90]
7117i0O8m34M72Rm5l38N99n35N2K86k0M9p9j57J0J94k95L28r9%q6j09L43J3j13
7142B3mR1j64K20k26J73k47Q8K62m11p9R8L71J48k26O0M30n57l80L40J62N8k15
7165A5j32O9M69k79r2r0j37L24k39K29j28LL1j54O9n6L57j52k50M0J62k72J07
7188a06j12L35j22j7J61J8l42K21r9K47k02j7K21k42N0l08M37q1k8o7r1M10k41
7211B5j67P3K99j88J03k45k06J27K6k3J71j84L82j55j20O8J90J86n46Q5O7l1J57
7234I4m39K98J27j94OM01l13O7k97K40o4k41K78mn4j7J13M7q2K06j00lk27k59
7258d17M87j46q0J06J63K0k89k67P51j51m45L48RL7l02K02K9j09m1m1K29j55j95
7281b57L21Q2k51j2J09Oq4N2j82J29j05M3J54j03j27J32K78l3k67K85n5l4K7k4
$$ y = [-90, -22, -456, 16, 25, -20, -358, 241, -294, -242, 44, 24, 73, -6, -163, -153, 41, -254, 74, -25, -25, -111, -220, 123, 136, 23, 19, 110, -54, 166, -60, 113, -134, -46, 216, -195, -274, -176, 195, 343, 117, 177, 607, 50, -330, 10, 172, 230, 15, -117, -48, 421, 142, 50, -40, -177, 147, -92, 137, 9, 12, 43, -111, -42, -98, 259, 107, -143, -103, 59, -213, -106, -218, 117, -5, -22, 139, 157, -185, 36, -63, 184, -18, -35, 186, -56, -6, -314, 123, 42, 14, -53, -144, 266, 25, -142, -69, 230, 42, 145, -100, -306, -179, -153, -176, -5, -189, 193, 38, -82, -14, 176, 362, -184, -99, -32, -63, 94, -345, -47, 80, -114, -108, 293, -20, 47, -250, -10, -74, -315, -37, -41, -95, -112, 1, 48, -34, 172, 72, 69, -158, -417, 70, -76, -156, -50, 113, 133, -156, -423, 328, 177, -268, 80, 89, 126, -176, 26, 55, -54, -95, -136, 93, -62, -257, 64, 146, -105, -117, -8, -2, -86, -34, -216, -87, -192, -149, 5, -98, -225, -93, 185, 152, -115, 170, 115, 81, 108, 84]
7305H4k03J1j69O81l33r6j60M20l16R9m60L59j23p4J71L70n9l50J49O5j71L28
7327B23j94j8k21L29J62L3l10l88K95O7p9M7j32L52k3k27K14n8k93K65j45K36
7349A35k71k2M48r6p5k55L38k58m7j16L52q1m7J91p6k70l3J24M65l71k12M24j68
7372G9J25l27J42o6J02p2J8J97l19N1pj46P8K10r1O1l06L05k59M31l20J31L7m60
7396d06J18L70O8m16K38M12k61l04K5K27K9q5l8J24q3k4j94K24L5k10J05J93k5
7419A22m85L89o6J51r0Q1j46o3n0K11J11j18k36K67n0j49K60M3l3n68K74N65m93
7442g3k69K62K65o17M98j39J34j97P5MO3o1p6P0K71m12M0K57p0N2J41j08k19j51
7466b60J59J14j5R0k59j09L51j66L03J09n52L28l8K86j84Mk78K05q4K77j48P9
$$ y = [84, -119, -108, -277, 404, 71, -25, -185, 235, -81, 18, -442, -83, -206, -280, -109, 261, 202, -148, 1, 66, -105, 223, 29, 11, -210, 119, 281, 314, 4, -384, -89, -22, -101, -54, -186, 166, 143, -84, 130, 72, -221, 44, -101, 135, -136, -158, 290, 194, 119, -136, 202, -56, -103, -219, 133, 52, 5, 196, 120, -150, -183, -59, 406, 35, -177, 247, 79, 204, -123, 19, -47, 55, -17, 1, 198, -121, -70, -77, -223, -145, 65, -26, 35, -271, 34, -225, 206, -114, 17, 54, -406, -288, 82, 150, -266, -28, 384, 123, -181, -156, 71, 100, 15, -23, 101, 18, -6, -200, 24, 59, -151, -46, 147, 122, -363, 26, -40, 111, 21, 102, -44, -107, -157, 54, 165, 47, -189, 78, 28, -121, 139, 182, 149, -419, -145, 420, -73, -342, -80, 185, -432, 66, -73, 61, -136, -61, -57, 6, -55, -131, -61, 210, -202, -162, 95, 25, 77, 218, 110, -109, -260, -101, 13, -2, 88, -171, -280, 71, -95, 208, 317, -235, 93, 55, 341, 157, 161, -117, 88, 4, 281, 133, 212]
7488B12j83k80J55K22m6L6q4rl01P2L89l69L60l15j1J62k38M62q7l76J94J02j84
7511a17J78M38n34L54q1k21o0O6J11j02LkM5k04o2L47K0k09J1j44J23J96k31K6
7535d9k56J32J60r3q4L10j0l72N03j99J35o2k80K19J26r0M16l71m6l63J39J29
7557fm0j26J17K19q1Q4j52L12o02M14l1k52O1k4J93j97m8RJ98j35p1k00N25J52
7581C19o75M69j43j20K52Qk85J36N5l6L03l59J16J68l78o9K81O5j41L40k25J54
7603B35j92l93M28M5n49L77J10P5k87J50R9K48l65J6J05m02J27L29k12n2j2J45
7625B5%j31N3PK26l53L23k83K82k48k08L17r8l1M31N2m73p6J72k13K90J2J47o4
7649A59k92j91N17k4J13l26j08K70k32K33m21N01k75Q6J03m34L5N98n8k12L01
$$ y = [212, 29, -251, -96, 126, 80, 116, 32, 23, -278, -206, 183, -186, 174, -141, -152, 10, -228, 234, 147, -229, -35, 67, -117, 61, 499, -35, 319, 238, 17, -43, 23, 134, 32, 35, 33, 78, -126, -188, 159, 179, -30, -19, -163, -40, 156, -75, -49, -305, -173, -13, -106, -190, 120, 110, -262, 241, 42, 177, 115, -165, 54, 180, 90, 506, 135, 89, -274, -135, -6, -46, -172, -55, 164, 83, 167, 15, 327, -275, 139, 108, -144, -83, -107, 86, -111, -159, -150, 48, -87, -158, -358, 167, 319, -356, 113, -30, -150, 102, 110, -175, -39, 16, -20, 283, -76, 40, 208, -170, -239, 42, 107, -34, 306, 81, 235, 43, -350, 78, 123, -426, -49, 61, 136, -151, -1, 98, 346, -19, -3, 102, -300, -173, 156, -56, -108, -120, 25, 25, -106, -53, -46, 180, -173, 150, -133, 149, -99, -307, 10, -88, -119, 312, 364, -109, -185, -13, -226, 64, 76, 223, 159, -133, -324, 193, 169, 282, -44, -152, 118, -114, 119, -302, 199, -76, 10, 113, -321, -286, 312, 254, 42, 343]
7670C43m12J3J69q1J5K4k5k61L38k36K92m59L60l82J31M63k95J92j01j44R5k3
7692A6k52J65K92k9k24K01j32j16R7K62K78m35j60K19J03l80J64q2J56j08j98
7713a63L40r6k11j56L82J8k98N9K89J4j18L31l78L8j37n7J35j68M66n33L18l0
7735D5RJ40l69J0N6J36K16r1k10K8J39n5k61K00o5K27j19k4j63L82l33K54j6k24
7759h8K71J73m21q9K83q9k8j32J21K62k79N8j78Q4%k32N82l25q0j89N87k64m00
7782c73L12K61l03j97M18L76l62j57K11j36j46J23L27m47K93n8K19m86o5K72R4
7803A76j4k66P5L0j85Q2%K51j46k49K06N3K72m08J8J94p5jQ7P9o19M04j59K1J21
7828e3K74J88k75l97J10L90j00q8J41Q8m00K70Q8j19j6j59J78j62N7l70Q8K95
$$ y = [343, -69, -56, 113, 32, 47, 71, 46, -215, 123, -113, 179, -280, 80, -302, -171, 292, -3, 189, 88, -56, 39, 16, -236, -71, 221, 192, -32, 169, 37, -79, 18, 280, 558, 123, -37, 182, 285, -95, 69, -13, 143, 35, -163, 177, 81, -130, -286, 96, 114, -184, -125, 164, 178, 60, 391, 13, 51, -86, -143, -8, -176, 290, -243, 75, 45, 54, 194, -175, -165, -109, 27, 243, 152, -58, -30, 109, 54, -207, -7, -72, 155, 36, 12, -151, 231, -102, 152, 136, -88, 183, 356, -65, -154, 129, 40, 12, -120, 1, 263, -16, 42, -136, -52, -52, -284, 298, -27, -107, -296, 291, 27, -373, -61, 200, -103, -300, 118, 494, 132, -25, 186, 50, -96, 27, 354, -93, 200, 142, 361, -125, -190, 82, 176, 162, -104, -29, 1, -184, -102, -102, 149, 3, -246, -40, 13, 285, -123, -105, 89, 14, 13, 100, 179, -440, -36, -195, -174, -53, 221, 409, 134, -263, -153, 237, 137, 49, 190, 278, -122, 148, 236, 117, 101, -58, 120, -42, 15, -355, -267, 28]
7850B8q6m4L18k07j01K01J64J16o21N6J6k64K79K26J28l05M7j24L31k47J19K6
7872E6j04j57K69J62j53k11j54J78J31l0m60O95j35k90J86jJ38j71m0lM3R1j58
7895a18K91On25N23O8m18J75K36j02j75j2j6P6q1j07OM6N3K30K22k07l78L01Q1
7919A75J37k91k79O01l65j78J14J69N6j14o3K5j60l5L8K34j9j60L82m06q5L32
7941A08J01j15j20P0k3j39j10K53n7j99P5J35j30m4L03J24k29P7K27m6k94j3J06
7964F0J37l55J30nL32m9l85L01O3j17k3r6J92p9m71N44j42K4R6j57J32M0j76K22
7988B18k20p1j96L99J21l36qJ2p3L43l01J8R2n2j27M48m67NK41l7o5J56m8J67
8012B19j67j33L61n8N7k67q9j11R7JM37l38q0k14M71k07p4J62M6p9m94N50j3j31
$$ y = [28, -58, -102, 216, 9, -92, 109, 273, 389, -232, -176, -160, -424, -145, 81, 209, -96, -49, -173, 158, -89, 30, 56, -48, -205, 64, 226, 73, -138, -292, -114, 17, -13, -473, 222, 87, -203, -17, -18, 120, -51, -91, -94, -51, 40, -118, 173, 179, -346, 177, 245, -173, 2, 238, 136, -39, -51, -67, 9, -72, -179, -173, -127, -74, 156, 378, 171, -207, 94, 175, 312, 21, -258, 343, -22, -200, -86, 83, 139, 25, -38, -13, -173, -208, -170, 64, 45, -115, 267, -139, -224, 108, 209, 94, -26, 44, 21, -118, -228, 25, -32, -231, -156, -21, -151, -195, 108, 232, 3, 80, 307, 261, -33, -46, 60, 197, -158, -28, -33, 299, 250, -135, 166, 229, 112, 89, -7, 185, 106, -365, 179, 37, 61, 157, 0, 132, 172, -4, 218, -2, -73, -269, 130, 251, -85, -93, -81, -154, 189, -112, -94, -2, -54, -181, 267, -200, -195, 46, 9, -56, 100, 52, 219, 52, -81, 280, 222, 279, 12, -77, -188, -91, -90, 347, 9, -71, -285, 186, -21, -95, 67, 113, 34, -460, 90, 77, -54]
8036e4j13L05J02k78l80M21K93j55m5lj18k6k11K22k16L87kl5J96k69j6j27j3
8059a35L52l75J00L96l88K40K7j87k54L88l09j6j31K55M03k38n5rn09J31K78M0
8081DN6r8p4J30p8l38M28K03k35J1n2K42m01J39KO8J37k10M8j03J79p5J02K16
8105C01j29K9K30m42k95N10j11r8k26N06q9n47K28j3J28PJ48J2n4R2j99K14k10
8128hK9r1J45O0k14P7JK71p1j11q8p7j77M98j05k04j91J49J76j84P8j50N06l01
8152A8j13J15J80j33L3j79R5m92K86Q7L34l17n0K62O2m48P51n34j58K50k67L48
8174A30j2k49M26j59l72O7J29r1m0p0L53k19K05j27J64J16j68
$$ y = [-54, -167, 138, 240, -38, -418, 3, 296, 141, 96, 93, -25, -51, -262, -40, -256, 131, 129, 94, 290, 21, 5, -122, -135, 217, -158, -58, 338, -50, 190, 217, 30, -224, 164, -145, -161, -292, -37, 366, 128, 73, 64, -445, -314, -36, 4, 60, -38, -112, 18, -60, -398, 30, 233, -2, 9, -43, 199, -202, -63, -61, 7, 144, -66, -18, -121, 58, -17, 85, 301, 172, 201, 431, -11, -306, 204, 93, -5, -231, 275, 186, -361, -133, -146, -18, -11, 137, 149, 95, 187, -12, 202, -8, 21, -70, 75, 135, -79, -2, -1, 270, 199, 88, 0, -77, -254, 244, 139, -65, -256, -107, 69, -115, -37, -187, 319, 18, -95, 20, 200, 67, 100, -79, 16, -476, -190, -103, 231, -86, -136, 126, 188, -260, 491, -43, -201, 49, -218, 130, 118, -131, 295, 136, -236, -169, -40, -131, -171, -241, 112, -107, 98, -29, 135, 251, 83]
8191H3
$$ Imaginary data points
##PAGE= N=2
##DATA TABLE= (X++(I..I)), XYDATA
0@%%%%%%%%%Qj6J6j6K2l0L2m0M8n3O1p2Q8j02J17j35J52j72J98k24K51k83L18
32A68l58M03m50N00n55O16o83P58q41R32j031J140j265J404j559J736j937K173
50A151k452K784l191L701m364N267o577Q657j2477K1807q5590j40933J24821J41088
64E3692M8234l6284J2595L9502K0165l3676n7348n1577K0057P1984J5245j03794
76a205r4316L3392Q7096n178o2205N696P7952L8555l7437o3517l8766J0991O2410
89A3468M9025l4419o9425N134N8265j3754r0819l4586O5176N7124k4664n0268
101f9743j2536K2136L8628L4330m633l1885J4847P1770K5584o5155m6812N8891
113C5422Q2933p64n5086k7887j390j5573k6239k5737k5525K433N4858M5377l2750
$$ y = [0, 0, 0, 0, 0, 0, 0, 0, 0, 0, 8, -8, 8, -8, 14, -16, 16, -24, 24, -29, 32, -40, 48, -54, 63, -72, 80, -92, 106, -118, 133, -150, 168, -190, 213, -237, 263, -292, 324, -359, 399, -442, 490, -541, 599, -666, 738, -821, 915, -1022, 1151, -1301, 1483, -1708, 1993, -2371, 2896, -3681, 4976, -7501, 14306, -71284, -212217, -87396, 53692, 101926, 65642, 78237, 117739, 137904, 104228, 46880, -4697, 15360, 87344, 102589, -1205, -95521, -62129, 24967, 19789, -42416, -36720, 41232, 79787, 42350, -21167, -59933, -48942, 13468, 62493, 28074, -41351, -36217, 22048, 8294, -82525, -117111, -51935, 5189, -19475, -69743, -82279, -60143, -21515, 12815, 8182, -23703, -8856, 62914, 88498, 23343, -23469, 35422, 118355, 117591, 62505, 34618, 33228, 17655, -8584, -34321, -59846, -57413, -2555, 42822, 10072]
126A0072n4902K4093P1318N481o2628l1492K7147K5079o975j6663j6089q349K3371
139a0537L3632k1310o5454j2678N4516K1970n1572l2650M4318N5123J885k0832
151c589j202J5172K4580L0845J152m0054j6416M8603L8504m5642o9655k398L6354
164A6254o707l7440o829K5837J9783O199q407l2699k6137K5976M4578j3328n0748
177d3668M598O0501K1276m3588l2895J5381K1725k299j3883j9339k0018J1675
189d0534M1335J2263l1958m957N2197K9678m4554m8037J9836N0204J6771j0025
201D2219p643o486l434Q271o159m4046l2586L2306M7389j7682n1804j265M1515
214E95R961k8428j3695J4109J4419Q693K336j9580j9490K7079N3255P08n6857
$$ y = [10072, -44830, -20737, 50581, 56062, -6566, -38058, -10911, 14168, 7193, -9470, -25559, -33908, -10537, 23095, 1785, -63669, -76347, -21831, 139, -51433, -84083, -39765, 15358, 17243, -3589, -4791, 10381, 34961, 65806, 66958, 26904, 10488, 59091, 97595, 51953, -17702, -20100, 16254, 9547, -27893, -34722, -8885, 10898, 17097, 8690, -24009, -50146, -24170, 20408, 7080, -43668, -39070, 21431, 42707, -881, -33776, -18395, 3330, 1031, -12852, -32191, -52209, -40534, 801, 13064, -18894, -23851, 28346, 58024, 13470, -34567, -14731, 35473, 52244, 42219, 34576, 28090, 24656, 32927, 26768, -17278, -49864, -17558, 29831, 12149, -39655, -40920, 595, 10556, -17872, -31567, -17458, -3039, 5654, 7990, -11590, -31080, -4001, 49254, 49962, -6895]
227f895k6195L3386J9221l2833k9350J6351K9043R751k694j1374j8587M146L3741
240A7711J1879l5902k0183M0512L9823k6771m8373L328L8134J3837j4499j5461
252D035j0280l172J4704R621k7084l0857J9616M1891r115m5769k449M6600K5033
265C2774j9687j8252N336P926K441l617k1732k7142J2267M7705J4360l7598k0376
278b5595L3065K5944k5285l2072O657K1340N505m818m220q610N251K9290J3284
291C9736l3113l1599K2795L6990j4657m2226m132K8564R566j4459j1206n651m878
304b4270J1594J8423o830j9668J6122M0341j87m3166j7957K7067J6945j8258j6982
317a6826N646J0630R954J3086k200k4263p158K6103J1548l3797k9988J8239K7255
$$ y = [-6895, -33090, 296, 19517, -13316, -42666, -26315, 2728, 12479, 9785, -1589, -20176, -16030, 17711, 29590, -6312, -26495, 14017, 53840, 27069, -21304, -17976, 20158, 33995, 19496, 4035, -6245, -9417, 5287, 14908, -12176, -43033, -23417, 18474, 9359, -36410, -38859, 7741, 32774, 13087, -5165, 171, 8097, 10538, 6921, -14811, -41953, -29686, 18019, 32379, -5219, -25595, 7470, 33414, 8129, -23943, -17286, 4054, 9559, 4741, 521, -8089, -2838, 26452, 39736, 6623, -24976, -2181, 34809, 20152, -22074, -26206, 2358, 11924, -2535, -13741, -19392, -24270, -12676, 5747, -1083, -20751, -4629, 35712, 35525, -7641, -25598, 1469, 18414, 156, -16826, -11180, -550, 9404, 22490, 20290, -3973, -11131, 14972, 26520, -7277, -37265, -19026, 8229]
330H229r488k0481Q685K1412P044j759l516j5031r465J8673K1070j9810l4676
343b9113P647L5759K561k8849o851K2932J4391m486m419n267r993K624J3522q235
357B223k9248Q07L6573J4784l1529k1495K2378K6501l401j4932m880j625l30Q157
371C983p52k2222r801K8751K6464j8195k7943J3423L0823k581k5372n015J3103
384D666O094k920p108j7916j2455K0091L2830l251l0388p96K9867L246l2375j8365
398b8780J5405J4727k862n702k409l455R352K2546K917k4580o326K9665J5243
411C5741l2004l2073J1516K7517L322j0558l196j181k665M652J962j5606q489
424b1062K4643K4867j8223l6199K187K9360N413j9836n991J4680J0989J280l389
$$ y = [8229, -1259, -21740, -13055, 8357, 15401, 13642, 10126, -4905, -14370, 4303, 25373, 5563, -29113, -21466, 14293, 16854, -11995, -18846, 4086, 18477, 13991, 9572, 4305, -5688, -3064, 10458, 2223, -27025, -26218, 10355, 25139, -6390, -27885, -5507, 20994, 17593, 2661, -2219, -3844, -4174, 3983, 3231, -18991, -28792, -41, 26423, 8228, -19715, -6292, 24531, 21950, -3422, -8437, 4666, 10760, 7840, 732, -17184, -29639, -9548, 23282, 20031, -10357, -11153, 18714, 21960, -10415, -28780, -13375, 1352, -1510, -7212, -9621, -13076, -3724, 18822, 21739, -2841, -9167, 20498, 35741, 3737, -28336, -16820, 10697, 14019, 3461, 265, -916, -3581, 1071, 3033, -12573, -21062, 3581, 28448, 10225, -25974, -23787, 5573, 10986, -8850, -14841, -161, 10828, 12108, 8719]
437H719j2043j2781J2777K6210l955l4026j0523K3941J1138k0566j0652K2409
449F48K2071k338j2973j0053p406M788J8491M061k3168j3468K2089J9838j9471
462C109k5637J1048K7666K222j6689p288j37j424M193N321q520q994J6058K2107
476B3035j2259l1286J167L0935R361k0122j4535M043K951k143K883R60n491P067
490c434J9320m59k5296r693K4512J6770j5820j5165J1982J5087l861p847m24j574
504D098N27J0769L456k1844k0958J1616K2205m943j8194M453J6103m322j7101
517a4135m000O807M364O796P880q521j7489L177K1893K494j9281l203K1161R703
531A7646j5767j1699N474P000K913Q235K364j2400q373J1660O615j5461q015K0327
$$ y = [8719, -3324, -16105, -3328, 22882, 18927, -15099, -25622, -1681, 9457, -11109, -21761, 648, 22719, 20381, 7408, -2645, -10051, -5263, 13228, 17289, -5879, -19347, 2742, 22580, 3109, -22528, -11480, 16186, 18408, 1719, -5569, -5706, -7130, -2937, 2384, -6136, -15130, 928, 23035, 10776, -20510, -19343, 11592, 20953, 831, -13704, -9661, -6710, -8853, -5970, -5010, -10501, -3434, 15886, 15427, -9869, -19562, 4950, 21720, 5900, -9265, 2717, 17804, 13943, 6096, 5672, 4098, 4625, 15394, 18850, -2994, -23952, -12336, 9869, 4926, -13268, -8815, 7288, 2966, -14135, -18135, -11328, -6964, -168, 7712, -809, -18298, -15121, 6772, 9266, -10015, -13218, 7943, 17646, 1879, -9820, -4346, 2654, 5567, 13802, 16166, 3766, -4607, 7053, 13668, -1793, -9808, 10519]
545A0519J9496j3726k3967l208Q776K225K79K930n279r105M728Q234j1074j6418
559b5590J1469K6551J813k0722o770J1284K558q783j424N703J865L277O449o076
573A604j7071L093K7705J3083j8454j6797P650O364j1527q571Q923J1937N369
586A3308M652n85j3179q767J2740J0714j5598j9581P818J7249p170j8089Q61J5831
600B04P780n34k430j0480j3930K172J1806k286j2708O911K2298J759k1289q149
614a8876J6435J2356l610m288M54k122J481R784K011j2114j984J8439R062j9336
628G692j8748Q326J4656k697p490L464M621m570m151l721j0864p075J3512J4452
642G407j0087k0359M416K1664L825j1873j356Q428m19q045m393l820m455Q996
$$ y = [10519, 30015, 16289, -7678, -10886, -2110, 115, 394, 3324, -1955, -11060, -6332, 1902, -9172, -25590, -14121, 12430, 14243, -6479, -13249, -1965, 593, -8190, -9614, -3911, -2046, 1231, 7680, 1604, -15467, -12374, 15331, 28414, 9960, -6837, 813, 7177, -4350, -12921, -3998, 7939, 13308, 17960, 17375, 4196, -4571, 8169, 18883, 3285, -16296, -8478, 8771, 1601, -16488, -15627, 204, 7984, 7450, 5020, -5460, -19390, -17218, -5412, -7698, -20406, -13495, 8803, 10562, -10727, -18876, -2441, 9915, 6305, 2017, 2471, 349, 1830, 11614, 13625, 1511, -473, 17966, 27028, 7692, -11056, -2730, 11926, 9229, 1739, 5203, 9824, 5254, 1103, -2618, -13482, -20557, -7045, 7407, -2680, -23039, -18623, 3041, 6866, -5007, -6363, 2065, 1646, -6399, -10792, -14612, -19067, -10071]
656a0071J8453M040j2851k82J7974M772j8959j0988J0928J0586o220p454r21q6
670a079L323J2299O426j1368j1552O807M824j6059j6262Q467J7414k6q945N00
684e231M833l32K92J904n427q451O471J3832n148j8114L33J7851N732j0921n243
699g619N660N55n270J335M313j270M868J2863K151j5580q190J3007R679j1163
713E339j0577P396R658k443l776J058l157n120M115M229j0811j3495N069J2951
727D36l877j1904N613J6223J843r555l727K29k457R17O263k974j0704K747J7029
742F102L688j3937l849J2949P697r484o414N057L295j594K313K131n140o00J1705
757A3919N459j5231j3776Q584J2016p383j3833Q98P229j56l254Q00j944l093N817
$$ y = [-10071, 8382, 12422, -429, -711, 17263, 22035, 3076, -7912, 3016, 13602, 7382, -72, -993, -1079, 2244, 14543, 20969, 9601, -1951, 4856, 9680, -6379, -22641, -14174, 3240, 3214, -5731, -5231, -398, -730, -438, 1466, -3961, -12412, -5941, 7891, 2743, -15371, -15038, 2813, 8545, -2376, -7619, -1959, -1404, -6674, -5339, -1026, -2296, 2572, 15435, 17586, 2006, -6184, 6823, 16502, 5339, -5238, 2158, 11816, 9373, 5597, 6655, 3498, -1622, 2493, 6722, -4089, -17584, -12515, 436, -3441, -15345, -9732, 6491, 8334, -1221, -4948, -4719, -7176, -6259, 4, -2970, -13674, -10927, 6102, 9790, -4147, -7996, 4953, 12650, 3166, -3248, 1809, 5104, 3510, 5823, 7954, 2814, 2214, 13919, 19378, 4147, -9629, -1045, 10971, 3588, -10245, -9347, -2118, -2274, -5528, -4728, -6672, -9765, -3948]
772c948Q825n697j1733N869J5839j071j5595j612J3934O222p654n558l48n61K202
787h86O224j241j1026q28J3888M260j4295o896J3153J0278p425r244M179N302
801E443j283n93k16o275k417J0023P102j2116j3310N771J4033l039j1420J210
815g087R345Mn201J99P04j322L980P370m997j2609K129J4512M05j4386l865J2485
831A666P056o748n811J284m42j23N742K935o426j876J0995N002j2122q563J0283
846B852J0216p108j0865P64L650j516l97K380k407l738O593P711q157j3959K446
861a1535J2861L27q438K236J0344R99n201j400J346j611K536O700k836j3235k598
876i505J2132N083j0093m060J0228N580o580o383Q89n69j706M680M886m600n054
$$ y = [-3948, 4877, -820, -12553, -6684, 9155, 8084, -7511, -9123, 4811, 11033, 3379, -2179, -2527, -3088, -886, 5338, 4097, -6929, -7757, 6131, 10391, -3904, -10800, 2353, 12631, 5206, -4038, 141, 5443, 4160, 3567, 3351, -2924, -5341, 4682, 11784, -332, -13642, -7871, 6162, 3123, -8297, -7087, 2258, 2262, -2939, -2740, -2036, -3358, 622, 7992, 2995, -9614, -7485, 7027, 7432, -6954, -10819, 1666, 8722, 1974, -3837, -2553, -2995, -3118, 2624, 5559, -867, -2743, 8252, 13254, 1132, -7431, 2852, 13068, 5960, -4905, -4141, -491, -2007, -2404, -24, -2431, -6169, 424, 8135, -22, -13981, -11535, 1326, 1653, -6785, -4549, 5795, 6794, 1593, 193, 1539, -72, 2464, 9164, 6328, -6907, -9505, 2627, 7710, -2383, -6443, 3785, 9365, 2785, -3598, -2709, -3278, -4984, -304, 4582, -18, -5072]
891e072P065N531r694r407P718J2282k266r178n72L215j659O94N256l00o240J975
907f52P722l979j1441J027J2779K899q345k082O220m17o579j869J965k596P76
922d572Q797K273j0386n217J0126P850p036o976N004M352m765l905L343J413j137
937h36M099M965n397q289M919R187n508j1756J628J0129R14o882k59L580j371
952h77n21L569j546p832R23R943K001r341j656R888L607r339m759O155M965j270
968C910k68l46n478k792Q043N024q157p056O684O699q714j0009M794R659J030
983C023k006J869m23n036M76L617l857n094P911J2162l478j4008l308R335L013
998D196m113N51L483k452m971l11p57l330M738J2934L482j1924p561N978L229
$$ y = [-5072, 1993, 7524, -2170, -11577, -3859, 8423, 6157, -3021, -3593, -378, -2037, -1343, 3913, 3613, -2627, -652, 7070, 3091, -8350, -7323, 5456, 8355, 10, -2072, 4148, 3731, -2848, -4717, -2752, -5348, -4572, 4225, 6498, -3888, -9105, 1021, 8871, 1835, -5141, -137, 4215, -550, -4455, -1112, 301, -836, 3263, 8228, 2831, -5458, -539, 8648, 3140, -8616, -6988, 3141, 4055, -2827, -3086, 494, -877, -1398, 2171, 625, -7207, -6284, 3659, 5660, -3681, -5337, 4551, 8158, -1181, -5940, 215, 5180, 3910, 3642, 3296, -2182, -4974, 3069, 8093, -64, -7120, -436, 6263, -2451, -12460, -7666, 1993, 3023, 1017, 2886, 2463, -2573, -2097, 1520, -2337, -7431, 480, 12642, 9164, -4844, -8152, 1183, 4196, 83, 634, 4117, 1665, -3306, -3617, -4374, -7704, -2966, 9968, 13450, 1526, -6035, -57, 3172]
1013C172p253l623Q668P040k545m489k340o012k847P932Q895l545o740L374M907
1028D594p334q083O919J3391J936n324l016k897o055l45O424J676m079K602P298
1043G707l966j3694l786R624N963k146L34M729j994n025J243L666n50J410Q971
1058A2486J492j2060j0198M164O346k940l188N014L299n736m332P60j319k886
1072i098N607Q871k394q136K149P086k161p022L582Q826l02o380k194mm191N16
1088e245P823K471o866j680P257J838p460k684Q365M405m482k317K787j39l398
1103F75J635J985n265n166M524N050o874q226L971P439k166m711K347M074o59
1118a367J11M451M17m674J075O422j718p840J334R402m0r278l368M507R64k219
$$ y = [3172, -4081, -7704, 964, 8004, 5459, 970, -1370, -7382, -10229, -2297, 6598, 3053, -3687, -313, 4594, -2740, -10823, -3904, 9487, 11423, 6099, 3083, 186, -5869, -6214, 210, 1886, -2193, 409, 7707, 3741, -9953, -13739, -4115, 1848, -298, 36, 4765, 2771, -2254, -1011, 2655, 2105, 3515, 12486, 13978, 1918, -8280, -4116, 2230, -710, -3898, 1116, 4415, -1321, -5653, -4893, -6212, -9098, -3491, 5380, 2986, -5150, -3001, 4085, 1924, -5098, -1516, 7310, 7008, 628, -1566, -1570, -5761, -5245, 2578, 5049, -1817, -3497, 3760, 5598, -1862, -4546, 3819, 8224, 3742, 1425, 4212, 4073, 675, 2310, 4295, -970, -6136, -1612, 3438, -3436, -11662, -7691, -252, -2418, -7129, -4782, -708, -1367, -1256, 3195, 3612, -1062, 13, 6435, 4717, -3123, -1789, 7613, 7573, -1705, -5073, -566, 398, -1821]
1134a821J074K340m352j518N489K642n967j200R272O532o425o943L234K582m643
1149B96m130K901J606j930J085R64o382o321N437R297k844q082J327P211j534
1164a099m815K307P440J359k64J025k344p524k18O991M58o872O00R363K255q928
1180b66m812M937L749j159M22K066k829k615L738L304m768l403O963L346q998
1195c25j0442J864M871j679k765L453L225j213M01K361l885n725M547R028j68
1210C548o579K550P774J016n471N97M926j156m423j487k011m838J8P660K952n838
1226g62j127O995K456p874m897L936L213l005m10L608r57l059K071K948l961n552
1242f377L829N081n945p432K707P247n3k129K647K838j981r79L639o64m850J384
$$ y = [-1821, -747, 1593, -2759, -4277, 1212, 3854, -2113, -3313, 5959, 12491, 6066, -877, 2357, 4939, 296, -3834, -933, 673, -1257, -172, 792, -5590, -11911, -6474, 2823, -21, -8103, -6776, 435, -1099, -5914, -3607, 3833, 5192, 4928, 5953, 3609, -3915, -4133, 2858, 3316, -3556, -2956, 6407, 8662, -266, -5078, -141, 3608, 2449, 2871, 4937, 2108, -507, 3231, 6535, 1767, -1636, 5327, 8673, -325, -10767, -8903, -4032, -5711, -8476, -5023, -1798, -3011, -2610, -249, -4134, -9859, -5312, 3716, 3548, -3031, -481, 7293, 8309, 2838, 3435, 8361, 7205, 2782, 1295, -716, -5554, -5536, 2124, 5076, -762, -1889, 5106, 7562, -312, -5209, -1273, 1940, -1065, -1475, 2133, 1176, -1883, 188, 3136, -825, -6377, -2548, 2533, -3412, -10844, -8137, -890, -943, -3072, -425, 2413, 432, -547, 3092, 2428, -2422, -1038]
1258a038P381K44o175n03N809N8o827j562L446P0k811J212J756k982j091O933
1274C920L803n112n256M273L144o062m505L700L288k426j091K877n91m131P39
1289c430L370l618n942L374O442o36n643K481P316J440j713J446J602l424k951
1304A14K970M10n480L75O413J905o467k848N386J252n479k399K913L13k307J785
1320a144K493l596k697N049N409m390o299K687M333l487m342K720M358o27j577
1335a110K327r92l806J303N480p30n559K035P188L95o619j596M788K40l024O1
1351C81J671k803k563L014J411m109r46O536L271p145m714L853L855k398j844
1366b530L380J736k332Q15J282l080l836M023N708l080o070K061M731k651n329
$$ y = [-1038, 6343, 6587, 412, -91, 5718, 5776, -1051, -2613, 833, 903, -1908, -696, 1060, -1922, -3013, 3920, 7723, 2611, -2645, 1628, 4772, -1290, -5795, -2095, 1193, -1233, -2324, 553, -38, -4169, -3430, -60, -3678, -9620, -6246, 196, -440, -6083, -3602, 3714, 5154, 3441, 4887, 6489, 3065, 114, 3084, 3494, -1986, -1611, 4802, 6707, 240, -2608, 2778, 4030, -1449, -3848, -935, -622, -2929, -1144, 1349, -2247, -4944, 105, 5514, 1124, -5175, -2488, 1845, -1642, -5984, -3264, 1094, 467, -1110, 1217, 225, -3581, -2278, 3202, 2472, -3087, -1052, 6136, 6531, -88, -1684, 3104, 3344, 320, 381, 2052, -751, -3314, -300, 1111, -2998, -3944, 2592, 5863, -1282, -5996, -2143, 1712, -686, -2530, 850, 2586, 254, 1069, 2351, -729, -4565, -542, 5166, 2086, -3984, -1923, 2808, 157, -5172]
1381e172J623N702L64j978Q65j455l302N01N664K09n081k19O123K97o776j714
1397d349O142K395l047l16J265j955l290J407K056k607r87O238L798o359n506
1412e115K895M155k828k089K946J965k986j425K943k20j895K615N147k909o285
1427c086L65M638j684m376K317N176j12l035M28N17l308q72M046J989m549k130
1443c676M138J334m651j234N479J937l631j444K420q23k498K269L863k004l879
1458b400K788L446l177m262K875M426j741j947J653J557l631q35K699M77m566
1473b638o52L583p28n116P08O274J481l913p76K775j240k631J907K845k383k128
1489b632L455K611l715k361N326L479l069l431J754N56m220j304L101R40k145
$$ y = [-5172, -3549, 2153, 2517, 539, 1404, -51, -3353, -2852, 2812, 3021, -2060, -2279, 3844, 4141, -2635, -4349, 1793, 4188, 1141, 825, 2090, 135, -3155, -1748, 308, -2299, -3286, 2952, 6750, 391, -5115, -2220, 1935, -893, -2982, -36, 1929, -1057, -2482, 461, 241, -1654, 961, 6108, 3199, -3086, -2721, 1917, 233, -4143, -1826, 3350, 3238, 203, 631, 1148, -2160, -3032, 1014, 3003, -1546, -3676, 462, 1796, -2855, -4089, 1390, 3327, -304, -1748, 672, -151, -2649, -380, 3483, 1479, -2400, 388, 3834, 657, -3605, -730, 3696, 1955, 8, 1661, 3218, -413, -1248, 1451, 1928, -2638, -3290, 293, -435, -5551, -4843, 1431, 2912, -1001, -1777, 998, -242, -2873, -966, 1879, -504, -2632, 823, 3434, -281, -2642, 2684, 6163, 3094, -337, 1417, 1973, -2247, -3551, -450, 490, -1655]
1504a655J743L612k500n367J842N765m20l852Q7K400k257l727J184L195p5J45
1520A20K926l67n039j356M705J621l679q25M270J108m821k781K472J377m87K852
1536B096K660l121l800J425J987k669k713M109M436l813m868P32L025R9Q08L450
1552C843M08l119l47J158j998m679J856O436j3m626j377L524j74k789R97K857
1568A957n17k019N87q91m298o19N864L746l126k251K824K216m271j630L160J541
1584B273j060o87R37k524k602K206L837j478l046K665L639k913m728J051M133
1599A703p48j697J346k7l011o28L751R33k597J128M234o92n388j307M115O66k819
1616a038l37K614j055j853J636J952k089j340L289J719m402l721K379K467k308
$$ y = [-1655, 88, 3700, 1200, -4167, -2325, 3440, 3020, -832, -745, 1655, -602, -4329, -3145, 50, -25, 120, 3046, 2679, -2360, -3716, 989, 2610, -1069, -1894, 2376, 3484, -1337, -4118, -1646, -269, -756, 2096, 4756, 1635, -2165, -740, 1247, -1422, -4135, -26, 4410, 597, -4271, -3539, -514, -415, 393, 3843, 4251, 1132, 785, 1943, -55, -4734, -2878, 3558, 3545, -1081, -2458, 1066, 892, -1897, -900, 1957, 1440, -579, 8, -883, -5181, -5800, 64, 3810, 684, -1567, 1257, 3473, -798, -2428, 732, 2273, 1213, 526, 1463, -1061, -3663, -1457, 2380, 902, -2144, 521, 4160, 1247, -3481, -2430, 1703, 955, -742, 604, 577, -2434, -3062, 689, 1622, -975, 153, 4387, 3695, -1693, -3000, 1115, 1781, -1038, -1375, 1239, 184, -1669, -33, 1919, -170, -1510, 1779, 3498, -904, -4625, -2246, 221, -2087]
1631b087j277L227K087k269p17J694J22k436J555L171j584m242J161L852k72k720
1647g35J305L207j190k838J280R59k048j444L108J134l501j512K624J079l640
1662b212j173L429J247l055q34J869n80j878J694K877j688k314J840K912j969
1677A65k841K814L232j267k198J217J414k357r01K763m3k708R8L486p24l699l76
1694a925L405R73l069n34K275o08k101R85J857j778q74K224J258l540k469L232
1710f89K245l108k502K470J781j661m21J708L08j196J060K557j407l212J329K944
1726B206j267k959J501L383m25k477R39J571j405q88J641l74l107j46L119O84
1742A996l296j62L854J043l575j109K100n95k611j11R46j671j369K621K171k453
$$ y = [-2087, -3364, -137, 1950, -319, -1036, 658, 780, -1656, -101, 3070, 1486, -2756, -1595, 2257, 1985, -735, 570, 3777, 2587, -251, 1029, 1988, -60, -1504, 1604, 2738, -763, -2275, 349, 1428, -2212, -3385, 44, 1291, -1764, -2598, -729, -1309, -3187, -1493, 1384, -304, -2618, -778, 2134, 165, -2676, 138, 3370, 2103, -95, 1122, 2536, 179, -722, 2041, 1998, -710, -612, 2874, 2150, -1549, -1925, 1480, 2453, -616, -1150, 1125, 517, -1584, -599, 1258, -520, -1394, 830, 2088, -1452, -3921, -689, 1556, -1552, -4054, -1584, 197, -1464, -1885, -177, 131, -1065, -5, 2552, 1145, -2067, -738, 2206, 939, -2020, -519, 2864, 2439, -38, 901, 2472, 1067, 179, 1820, 1446, -1661, -1807, 1312, 1996, -1300, -1462, 2392, 3435, -140, -1249, 851, 256, -2355, -2466, -1520, -3191, -4560, -1939, 232, -2221]
1758b221j794L801K767k601k584J872K495j213j294J560J286j076L16K538q61
1773B991k599R05K766j724l732O82K823m01l377J64K000r72q94R25J120j758n34
1790a615K384R49k953j496K970J001l144j891K308J232j773P1K487K85q66J542
1806A491J725k167l142J449K302j939k088K318L147q69j651J666J431k212j440
1821B1R32o26k911k82K708L3k436J335L648O59k754R0J135j482k271P60J599j224
1839a066j200K010J296j853j574K212J521k019j128J308J219k033J4K215J89j915
1855h04J164K315q05k747Q93K410k92j376R76J081j665k392O11P04j949n15K741
1872C50J210k473o63K266Q97k268r84J815K67k363k9J124j50j130J927K210q53
$$ y = [-2221, -4015, -214, 2553, -48, -2632, -760, 1735, 522, -772, 788, 2074, 998, 1314, 3852, 2991, 392, 1297, 4063, 2339, -1393, -711, 2112, 1711, -1666, -1502, 498, -474, -1368, -443, 677, -1081, -1615, 769, 1718, -1235, -2731, 239, 1240, -1904, -3795, -1487, -255, -2028, -1957, 530, 815, -51, 1491, 3216, 1049, -2093, -644, 1658, -281, -2369, -51, 3096, 2227, 576, 2242, 3673, 1461, 21, 953, 327, -2584, -2866, -158, -125, -2561, -1226, 2422, 3081, 327, 417, 1552, 70, -2201, -1441, 158, -1066, -2266, -256, 1040, -813, -2387, -175, 1346, -673, -1801, -493, 726, -1307, -1293, 922, 1111, -804, 360, 2675, 1870, -877, 16, 2426, 2134, 758, 1734, 2815, 1150, -1242, -631, 73, -1876, -2391, 350, 1560, -913, -1576, 690, 1587, -681, -1665, 150, 417, -1946, -1975, -851, -1001, -2131, -204, 2006, 1153]
1889A153j764J076J926k227k187J454J947r54j306R16J164q16m5K325r2k395l35
1906a60J767q11l259o9K567j1k244Q43J827n6r15O03R03j329p39J342M79k379
1924a641j029L536J837j640j417J408Q36j598j172J421K01j229k17J630j115j751
1940a940J167K820j530k431N38J949o33j902J006K004j10n57P48m30k507q0K337
1957D49R91j681j09K655K11l306p67K004L65j271m2R00j122j207J294J871r35
1974C00n92J856Q04k801k452J258J948n07k46K062N17j955j139J008q54j213J357
1991f49K542o54l229p1J904M08j378J646J893p81k074q0J63j022MK391J558k377
2009A94j324J167M32k015j08K679J546j643l17K03j088j862J303K364m82j234
$$ y = [1153, -611, 465, 2391, 164, -2023, -569, 1378, 424, -882, 34, 1198, 382, 337, 2662, 2570, 175, -160, 1607, 796, -2463, -2532, 35, 24, -2220, -1377, 450, 394, -521, 82, 985, -344, -1083, 259, 738, -1641, -2670, 866, 2703, 1063, -354, 1054, 1890, 292, -880, 541, 742, -487, -704, 926, -189, -1940, -773, 2047, 517, -1914, -1376, 573, -60, -1962, -956, 1048, 938, 381, 1129, 699, -1808, -1888, 449, 1440, -241, -350, 2305, 2516, -790, -1557, 447, 812, -459, -501, 399, -723, -1930, -636, 1235, 300, -292, 1564, 2368, -433, -2885, -1627, 321, -186, -432, 1630, 2147, 192, -947, 61, -793, -2006, -649, 1893, 1239, -1990, -2061, -157, 251, -1127, 519, 2412, 1631, -443, -523, -360, -1382, -1378, 1013, 2571, 194, -1130, 37, 469, -1546, -1654, 1025, 2571, 928, 611, 814, -274, -2136, -833, 1531, 1049, -185]
2025a85R36R94j736k027J246J484p99j584O03k13j619l22K357J941j327Q65J678
2042B292n92k583m08K053N97j132N97J236m68j748N13J082j259j226J863O17k049
2059f15j737J428J433r80q32J718M23j724N7J427pj258P36J838q30k563K38J390
2077A42p88j844N76K160l02m48O94J566q81J0J286k24k575p86J822J085k062O9
2095e00K098N69j715j205R32l79j095L99R07j181j440J650J856o63j044K021J830
2112C040j127k321O24O21r43m65J359l32j877m39J377n41j411J035K731j1k059
2129g39l48J644J01j707P05J730n40r87J356L16j588k08K055J020k149j943J122
2146a60o0j773r96J753J193l31O23J085l46j248J023J108o96j839K14J338j660
$$ y = [-185, 751, 1745, 9, -2018, -772, 712, -87, -1671, -1068, -1281, -2900, -3222, -865, 1076, -251, 614, 2292, 1700, -883, -1291, 762, 1359, 227, 824, 2060, 1592, -156, 357, 1439, 180, -1046, 817, 1434, -615, -2352, -924, 509, -471, -1303, 415, 838, -886, -829, 598, 591, -667, 69, 1907, 1077, -1486, -1248, 142, -646, -2490, -1914, 246, -56, -504, 190, 1756, 875, 885, 2171, 1947, -628, -1414, 408, 1493, -569, -500, 1598, 2167, 452, -753, 179, -200, -1295, -896, 11, -1170, -2610, -960, 896, 233, -811, 1210, 3040, 1913, -408, 216, 837, -106, -571, 788, 456, -1421, -1860, -483, -1024, -2435, -1400, 1331, 1320, -739, -1087, 557, 658, -1049, -344, 1386, 846, -141, 1215, 1531, -57, -265, 1790, 2810, 661, -1282, -160, -220, -1993, -2989, -1236, -43, -374, 249, 1334, 988, -260, 763, 1871, 1175, -664, -450, 888, -772]
2163g72j802J068J671k9r19P68Q92j348q68J032O54j409P47J967K7j743n51K083
2181A468J18j357K39J025n57j773J16O00j412n79J222R34j120j120J707J450p33
2198B28l04J912O86j351p48Q97k98j501m0J231k18j272K73J479j047j714N30J110
2216a47n39j412J208P42n90m11J700J075j347j29J359N18k066m39N59K72j680
2233a327J36J341k79j286Q05J351j61j234J152J280r59q45L78J246r77o05P82
2250G98K46p75q26R57j66j682n30J528J65j464j23J173M93p35L12J585K3p03Q27
2269A103N51j035j263J109J048j477j095P71J004j329r03R72N29l93k56J014J47
2286D97j222J012J278r3j654J171J256n40j895K85J106n02j675O2J031j293o24
$$ y = [-772, -2574, -1506, 165, 136, -783, -15, 877, -471, -1339, -307, 347, -1062, -315, 1652, 1679, -64, -615, 1468, 1586, 229, 468, 1493, 936, -837, -721, -121, -1533, -2112, -890, 44, -1076, -2196, -489, 961, 228, -76, 1836, 2522, 1171, 423, 1320, 1022, -479, -519, 712, 494, -778, -505, 974, -73, -1787, -1257, -147, -686, -2098, -890, -148, -738, -1149, 551, 1626, 279, 150, 1509, 2027, -39, -478, 81, 353, -1327, -1191, 150, -129, -1415, -610, 741, 580, -654, 498, 1778, 819, -26, 352, 1598, 621, 16, 798, 1044, 269, -557, 400, 234, -1448, -1978, -450, -285, -1749, -1872, -699, -206, -941, -629, 956, 979, 276, 1103, 1654, 619, -644, 465, 1513, 36, -1059, -288, 716, -613, -1516, -544, -15, -408, -664, 350, 497, -725, 287, 1565, 1472, -182, 989, 2245, 1705, -190, 95, 1201, 699, -976, -914, 117, -1176, -1800]
2303a800P82M97j258l03K236P91j478l80J252P65j384k00J289K2j113K14N89p73
2321b52q17J299P62p15j365J507Q44j358r63J373J108o61j23J094J8j095k48N56
2339I64j78j825l14J501o33k151K69J374L55q80L93J682j038l67O54K60q48k1
2357h03J338J126j344m27J418K99j316o07J265k47j303j56P10l38q99O74J613
2374A003l13n21L59O47o96j167P62J271m35p49N45Q7j825l46P22J03p68N9J508
2393B46K36j181k63J108N46j147K64N76n26j085R12J164l55m9Q69R26j633j406
2411g98L41Q79j115l29Q95Q21n01r2J512m6j436N17Q26o60j586J59Q69j78j286
$$ y = [-1800, -1018, -521, -1779, -2082, 154, 945, -533, -913, 339, 1104, -280, -480, 809, 831, -282, -68, 521, -252, -1069, 230, 992, 277, -1088, 419, 1263, -95, -1058, 315, 1423, 762, 639, 1733, 1751, 656, 408, 964, 786, -1039, -1353, 148, -485, -2636, -2367, -993, -638, -1518, -1125, 557, -481, -848, -194, 66, -782, -803, 535, 1661, 317, -110, 1308, 1607, 291, -316, 949, 702, -601, -757, -47, -385, -1284, -610, 1003, 690, 169, 528, 1175, 479, -688, 74, 1345, 910, 161, 706, 793, -1032, -1378, -656, -553, -1321, -1262, 246, 482, -699, -962, 146, 692, -455, -191, 385, -141, -1226, -314, 850, 495, 446, 1315, 2241, 608, -798, -457, 422, -693, -1022, -127, 694, 193, 101, 1613, 1567, 131, 648, 1474, 814, -772, -613, 256, 78, -1208]
$$ [...]
8191B5
##END NTUPLES=NMR FID
##END=
