##TITLE=1H_CA-8047-3-2
 CDCl3, 8 sc, 
 14.1.2019
##JCAMPDX= 6.0         $$ Bruker NMR JCAMP-DX V2.0
##DATA TYPE= NMR FID
##DATA CLASS= NTUPLES
##ORIGIN= UXNMR, Bruker Analytische Messtechnik GmbH
##OWNER= root
$$ XWIN-NMR		Version 3.5
$$ Mon Jan 14 16:34:56 2019 Russian Standard Time (UT+4h)  she@DPX200
##.OBSERVE FREQUENCY= 200.1313
##.OBSERVE NUCLEUS= ^1H
##.DELAY= (6, 6)
##.ACQUISITION MODE= SIMULTANEOUS
##.ACQUISITION SCHEME= undefined
##.AVERAGES= 8
##.DIGITISER RES= 18
##SPECTROMETER/DATA SYSTEM= spect
##.PULSE SEQUENCE= zg30
##.SOLVENT NAME= CDCl3
##.SHIFT REFERENCE= (INTERNAL, CDCl3, 0, 15.7039)
##AUDIT TRAIL= $$ (NUMBER, WHEN, WHO, WHERE, WHAT)
$$ ##TITLE= Audit trail, XWIN-NMR		Version 3.5
$$ ##JCAMPDX= 5.01
$$ ##ORIGIN= Bruker BioSpin GmbH
$$ ##OWNER= she
$$ F:/spectra/data/she/nmr/H-F/1/audita.txt
$$ ##AUDIT TRAIL=  $$ (NUMBER, WHEN, WHO, WHERE, WHAT)
(   1,<2019-01-14 16:33:35.37 +0400>,<she>,<DPX200>,
      <created by zg, POWCHK disabled, PULCHK disabled
       configuration hash MD5:
       00 E9 B6 7A A2 85 ED C7 34 08 36 98 17 FE 4E 26
       data hash MD5: 16K
       B8 E2 55 1D 8D 55 A3 B6 5E 15 2D 2A E4 9B 3C 83>)
$$ ##END=
$$ 
$$ hash MD5
$$ A9 7F D0 5C 48 DA 70 F8 F4 E7 92 9B BE 3E 9F 0D
##$RELAX= 
##$RELAX= 
##$RELAX= 
##$RELAX= 
##$RELAX= 
##$RELAX= 
$$ Bruker specific parameters
$$ --------------------------
##$DU= <F:/spectra>
##$EXPNO= 1
##$NAME= <H-F>
##$PROCNO= 1
##$TYPE= <nmr>
##$USER= <she>
##$AMP= (0..31)
100 100 100 100 100 100 100 100 100 100 100 100 100 100 100 100 100 100 
100 100 100 100 100 100 100 100 100 100 100 100 100 100 
##$AQSEQ= 0
##$AQ_mod= 1
##$AUNM= <au_zg>
##$AUTOPOS= <>
##$BF1= 200.13
##$BF2= 200.13
##$BF3= 200.13
##$BF4= 200.13
##$BF5= 200.13
##$BF6= 200.13
##$BF7= 200.13
##$BF8= 200.13
##$BYTORDA= 1
##$CFDGTYP= 0
##$CFRGTYP= 5
##$CHEMSTR= <none>
##$CNST= (0..31)
1 1 145 1 1 1 1 1 1 1 1 1 1 1 1 1 1 1 1 1 1 1 1 1 1 1 1 1 1 1 1 1 
##$CPDPRG= <>
##$CPDPRG1= <>
##$CPDPRG2= <>
##$CPDPRG3= <>
##$CPDPRG4= <mlev>
##$CPDPRG5= <mlev>
##$CPDPRG6= <mlev>
##$CPDPRG7= <mlev>
##$CPDPRG8= <mlev>
##$CPDPRGB= <>
##$CPDPRGT= <>
##$D= (0..31)
0 1.2 0 0 0 0 0 0 0 0 0 0.03 0 0 0 0 0 0 0 0 0 0 0 0 0 0 0 0 0 0 0 0 
##$DATE= 1547469214
##$DBL= (0..7)
120 120 120 120 120 120 120 120 
##$DBP= (0..7)
150 150 150 150 150 150 150 150 
##$DBP07= 0
##$DBPNAM0= <>
##$DBPNAM1= <>
##$DBPNAM2= <>
##$DBPNAM3= <>
##$DBPNAM4= <>
##$DBPNAM5= <>
##$DBPNAM6= <>
##$DBPNAM7= <>
##$DBPOAL= (0..7)
0.5 0.5 0.5 0.5 0.5 0.5 0.5 0.5 
##$DBPOFFS= (0..7)
0 0 0 0 0 0 0 0 
##$DE= 6
##$DECBNUC= <off>
##$DECIM= 24
##$DECNUC= <off>
##$DECSTAT= 4
##$DIGMOD= 1
##$DIGTYP= 9
##$DL= (0..7)
0 120 120 120 120 120 120 120 
##$DP= (0..7)
150 150 150 150 150 150 150 150 
##$DP07= 0
##$DPNAME0= <>
##$DPNAME1= <>
##$DPNAME2= <>
##$DPNAME3= <>
##$DPNAME4= <>
##$DPNAME5= <>
##$DPNAME6= <>
##$DPNAME7= <>
##$DPOAL= (0..7)
0.5 0.5 0.5 0.5 0.5 0.5 0.5 0.5 
##$DPOFFS= (0..7)
0 0 0 0 0 0 0 0 
##$DQDMODE= 0
##$DR= 18
##$DS= 0
##$DSLIST= <SSSSSSSSSSSSSSS>
##$DSPFIRM= 0
$$ [...]
##$SUBNAM2= <"">
##$SUBNAM3= <"">
##$SUBNAM4= <"">
##$SUBNAM5= <"">
##$SUBNAM6= <"">
##$SUBNAM7= <"">
##$SUBNAM8= <"">
##$SUBNAM9= <"">
##$SW= 24.933730806125
##$SWIBOX= (0..15)
0 0 2 0 0 0 0 0 0 0 0 0 0 0 0 0 
##$SW_h= 4990.01996007984
##$TD= 16384
##$TD0= 1
##$TE= 0
##$TE2= 300
##$TE3= 300
##$TEG= 300
##$TL= (0..7)
0 120 120 120 120 120 120 120 
##$TP= (0..7)
150 150 150 150 150 150 150 150 
##$TP07= 0
##$TPNAME0= <>
##$TPNAME1= <>
##$TPNAME2= <>
##$TPNAME3= <>
##$TPNAME4= <>
##$TPNAME5= <>
##$TPNAME6= <>
##$TPNAME7= <>
##$TPOAL= (0..7)
0.5 0.5 0.5 0.5 0.5 0.5 0.5 0.5 
##$TPOFFS= (0..7)
0 0 0 0 0 0 0 0 
##$TUNHIN= 0
##$TUNHOUT= 0
##$TUNXOUT= 0
##$USERA1= <user>
##$USERA2= <user>
##$USERA3= <user>
##$USERA4= <user>
##$USERA5= <user>
##$V9= 5
##$VALIST= <valist>
##$VCLIST= <CCCCCCCCCCCCCCC>
##$VD= 0
##$VDLIST= <DDDDDDDDDDDDDDD>
##$VPLIST= <PPPPPPPPPPPPPPP>
##$VTLIST= <TTTTTTTTTTTTTTT>
##$WBST= 1024
##$WBSW= 4
##$XGAIN= (0..3)
0 0 0 0 
##$XL= 0
##$YL= 0
##$YMAX_a= 15296
##$YMIN_a= -16796
##$ZGOPTNS= <>
##$ZL1= 120
##$ZL2= 120
##$ZL3= 120
##$ZL4= 120
##$ABSF1= 10
##$ABSF2= 0
##$ABSG= 5
##$ABSL= 3
##$ALPHA= 0
##$AQORDER= 0
##$ASSFAC= 0
##$ASSFACI= 0
##$ASSFACX= 0
##$ASSWID= 0
##$AUNMP= <proc_1d>
##$AZFE= 0.1
##$AZFW= 0.1
##$BCFW= 1
##$BC_mod= 2
##$BYTORDP= 1
##$COROFFS= 0
##$CY= 11.3945322036743
##$DATMOD= 1
##$DC= 2
##$DFILT= <>
##$DTYPP= 0
##$F1P= 18.9103706918063
##$F2P= -1.10871071338519
##$FCOR= 0.5
##$FTSIZE= 0
##$FT_mod= 4
##$GAMMA= 1
##$GB= 0.15
##$INTBC= 1
##$INTSCL= 1
##$ISEN= 128
##$LB= 0.24
##$LEV0= 0
##$LPBIN= 0
##$MAXI= 10000
##$MC2= 0
##$MEAN= 0
##$ME_mod= 0
##$MI= 1.114404
##$NCOEF= 0
##$NC_proc= 0
##$NLEV= 6
##$NOISF1= 3.799351
##$NOISF2= 2.8
##$NSP= 1
##$NTH_PI= 0
##$NZP= 0
##$OFFSET= 15.70392
##$PC= 1
##$PHC0= -8952.162
##$PHC1= 14.00006
##$PH_mod= 1
##$PKNL= yes
##$PPARMOD= 0
##$PSCAL= 0
##$PSIGN= 0
##$REVERSE= no
##$SF= 200.130013532006
##$SI= 16384
##$SIGF1= 3
##$SIGF2= 2
##$SINO= 400
##$SIOLD= 16384
##$SREGLST= <1H.CDCl3>
##$SSB= 0
##$STSI= 0
##$STSR= 0
##$SW_p= 3612.71676300578
##$SYMM= 0
##$S_DEV= 0
##$TDeff= 0
##$TDoff= 0
##$TI= <>
##$TILT= no
##$TM1= 0
##$TM2= 0
##$TOPLEV= 0
##$USERP1= <user>
##$USERP2= <user>
##$USERP3= <user>
##$USERP4= <user>
##$USERP5= <user>
##$WDW= 1
##$XDIM= 8192
##$YMAX_p= 0
##$YMIN_p= 0
$$ End of Bruker specific parameters
$$ ---------------------------------
##NTUPLES= NMR FID
##VAR_NAME=  TIME,          FID/REAL,        FID/IMAG
##SYMBOL=    X,             R,               I
##VAR_TYPE=  INDEPENDENT,   DEPENDENT,       DEPENDENT
##VAR_FORM=  AFFN,          ASDF,            ASDF
##VAR_DIM=   8192,          8192,            8192
##UNITS=     SECONDS,       ARBITRARY UNITS, ARBITRARY UNITS
##FACTOR=    0.0002004,     1,               1
##FIRST=     0,             0,               0
##LAST=      1.6414764,     0,               0
##MIN=       0,             -16796,          0
##MAX=       1.6414764,     15296,           0
$$ Real data points
##PAGE= N=1
##DATA TABLE= (X++(R..R)), XYDATA
0@%%%%%%%%%%%%%%%%%%%%%%%Qj6J6j6J6j6J6j6J8k6L2l2L2l8M6m8N0n8O4p1P9
44D0q7R7j06J20j35J50j69J93k22K57l06L70m62O14q93J591o431j1417J4355J4155
64A1714l995j4338j063J1478N955q691r275K509R541K469n823l958L916L947l441
79I45o312O39O547L153l620l709O19J889j91o06J9o69l76K755L251j951n854j407
97d878N295M114k762m330J161M397K25m340k097L285L145k485m370J496O083Q93
113D832p096m804N321P377k318q175p45P788L806n504n290K483M693q14l493Q25
129a114L997N36l934k506K300L071r76l233J29L872J732l236l520O04K088k81
145d71m79K408J740l133l911J696M324q74m653K81N985K600m822m798J830M160
$$ y = [0, 0, 0, 0, 0, 0, 0, 0, 0, 0, 0, 0, 0, 0, 0, 0, 0, 0, 0, 0, 0, 0, 0, 0, 8, -8, 8, -8, 8, -8, 8, -8, 10, -16, 16, -16, 16, -22, 24, -24, 26, -32, 32, -39, 40, -47, 50, -56, 64, -71, 79, -90, 103, -119, 138, -168, 202, -260, 354, -539, 1052, -5379, -16796, -2441, 11714, 7719, -6619, -7682, 3796, 9751, 1060, -8215, -5706, 3835, 6304, 481, -3477, 439, 4386, 945, -5367, -4728, 1819, 4972, 1352, -2357, -1738, 151, -40, -646, -627, -1296, -1672, 1083, 4334, 2383, -3471, -4878, 417, 4531, 1769, -2561, -1400, 2997, 3222, -1118, -3215, 70, 3215, 730, -3640, -2144, 3939, 4832, -2264, -7068, -1747, 5630, 3312, -4863, -5608, 2180, 5986, 482, -4808, -2325, 2368, 1554, -1939, -1114, 2883, 3419, -515, -3021, -721, 2350, 1374, -1859, -1730, 2142, 3874, 638, -2882, -2278, -190, -471, -950, 1458, 3198, 65, -3846, -2150, 2174, 1300, -3353, -3072, 2913, 5513, 691, -4107, -2277, 1883]
161A883n42l387Q69N004J268n700n039L153O613n22p077j715P717N333o377r225
177g744J556R207K508o606l771M991M929l295o308J05N736K867l217l522J554
192a010L959Q3m235k656K497L931L75k478j530K44N30N75N25j007k104M74L716
209A889J544l780l657K221M305p95m316j37M605J952l788l351K392M087j026m855
225b710q94N308L968l644o149N95O010J386n645l073N065N100l213o255M72N415
241A736Q07m753j721M651L923k526n028p32L601K237j571j904J199K432k38k577
257d64j231J026O49l42J021J974p88l464j059K850J417k820j741L477L608k501
273A612n086J8M504J465l631k189L551M291j625n646j755M521L976k330m411J032
$$ y = [1883, 1341, -2046, -1177, 3827, 5095, -605, -5644, -2491, 4122, 3600, -3477, -5192, 2525, 7858, 1481, -7744, -6188, 3019, 5527, -1079, -4850, 141, 5070, 1775, -4533, -4428, 1308, 4175, 958, -2564, -1010, 2949, 3032, -1203, -3859, -1362, 2569, 2944, 466, -1064, -820, -290, 285, 810, -197, -2301, -1827, 1889, 3433, -347, -4004, -1783, 2522, 1727, -2589, -2726, 1879, 3831, 43, -3308, -916, 3171, 2145, -2710, -3604, 1704, 5672, 2028, -4121, -3526, 2484, 3870, -1775, -4848, 217, 5317, 2104, -4151, -3679, 1736, 2543, -2210, -3931, 720, 4643, 2117, -2911, -3643, -42, 2195, 624, -1280, -81, 2351, 2113, -464, -1695, -669, -20, -362, 659, 2633, 1845, -1619, -2678, 172, 1589, -1231, -2972, 505, 4113, 1612, -3474, -3456, 1048, 2513, -1118, -3307, 244, 4535, 2910, -2736, -4491, 30, 4006, 1676, -2735, -1703]
289a703M861N46m997k761L466L469j904l186J261L170o36l416p93K469J526j169
305B03j285N79J147J8p87m01J61J61M8N48Q49j92j494n27J593J071j939k120J763
324f04L396o46l906o66L609J247l903k641L496M485j406m901q21L998K057l156
340c62l243K107M721M84m321k536K793K920k066l379J838M791q7n137k252L665
356f4K850k682l257J971M169n9l965k113J773K109l63j260M94J670J66j807j325
373a693P91J288q3m13Q79Q28j063j481N60J142r89j370J744K925j005m189j039
390c168L664K300k830l224J700M148L36l933k461K233L283n05l069m29L106J677
406B828k569k740J494L073m83k952j94K760R91k150j458J112R30r26o18J110P44
$$ y = [-1703, 3158, 3704, -1293, -4054, -588, 2881, 977, -2209, -948, 2222, 1586, -1830, -2623, -154, 1372, 203, -1082, -503, 644, 662, -125, -526, -365, -204, -156, 392, 1241, 1049, -445, -972, 621, 1692, -247, -2367, -604, 2792, 2146, -1760, -2426, 1183, 2430, -1473, -4114, -618, 3867, 2461, -2440, -3261, 737, 2794, -362, -3605, -1498, 3223, 3707, -614, -3150, -357, 2563, 497, -2882, -1044, 3747, 3660, -1477, -3729, -64, 2786, 104, -3153, -1182, 2987, 2928, -1037, -3150, -1377, 732, 369, -891, -397, 1273, 1439, -368, -1693, -902, 386, 303, -110, 769, 1597, 534, -947, -387, 755, -234, -1604, 140, 3065, 2060, -2129, -3168, 496, 2796, -34, -3258, -1558, 2590, 2926, -1007, -3468, -1235, 2048, 1543, -1526, -1955, 1151, 2828, 259, -2481, -987, 2086, 1603, -1349, -1543, 1217, 2208, 58, -1400, -288, 642, -284, -902, 208, 952]
423I52j110r84R25J192q24j877JK240J490j279k046L73K013j9k348n01K851J827
441B876k305k572J614K801j436l771L51M414J746l486l122J619K971p26l049k34
457b309L201J942k162k911N86K730J02k705n92L262K296k402l423O30K950K51
473A446k215k97K173Q39j717j328O35O42o38l52J078J001o41j437l55Q16N16n45
491c79l57R04R73p28j477L49J657j75k063j44K868J475k666k760J569L178n03
508A721l234n85K931J659k080k347Q40K246p2k283p74K095J868j254k450K43K420
525I44M80k201j060J946J723j115j515P11J083j057j326J159J973n15k118j50
541a038J901M60k034j453J461K321j14k170q83J510J102j479j714J300K792l3
$$ y = [952, -158, -1142, -217, 975, 151, -1726, -1725, 515, 2005, 726, -1320, -947, 1066, 1047, -1301, -1802, 1049, 2876, 571, -2001, -387, 2414, 978, -2793, -2442, 1972, 3718, 232, -2890, -1271, 1700, 974, -2075, -2309, 892, 2834, 672, -2239, -1653, 1077, 1179, -1526, -2118, 1144, 3440, 1038, -2385, -1755, 1195, 1446, -769, -1066, 1107, 1946, 229, -1099, -464, 178, -460, -812, 266, 1267, 626, -811, -1166, -350, 166, -379, -736, 168, 1141, 413, -1064, -715, 942, 767, -1296, -1440, 1428, 2903, 237, -2523, -954, 2224, 1721, -1513, -2098, 833, 2492, 412, -1935, -1095, 1151, 1079, -1204, -1978, 117, 1985, 731, -1719, -1476, 944, 1424, -777, -1837, 109, 1832, 717, -798, -87, 996, -61, -1387, -228, 1745, 1230, -888, -1038, 863, 1323, -711, -2164, -703, 1618, 1504, -666, -1549, -39, 1063, -416, -2130, -830, 1962, 1929]
557A929k778r82K222J302j978j711J738K502o05k310l26J482J74j440k52J656
573F23J053j196j681K18J475J29j567o71J714J741j006k285MJ965L84j688l84
590a172J976J024j703j502J138J546q10j627M87J832K24j603q43R02Q57o84j019
607i77M46J319Oj484n90J405J069j370j654J054K321j81k362m58K193R20k013
624c56j410J674J965q86k018K68J903K31k017j159J486J932m04j996m98J533Q40
641A088j452j415J139J945l55j789l9J564mj763l44J974J195j299j342P72J103
658I78p22j326L89J598L88j229q50P36Q27p98j432L79K026O95j832j550J158J686
676A121q06j907M84K284L93j968r15J456R81j203j122J072J619l33j614m26J132
$$ y = [1929, -849, -1831, 391, 1693, -285, -1996, -258, 2244, 1639, -671, -997, 485, 659, -781, -1033, 623, 1676, 480, -1201, -983, 492, 621, -946, -1617, 97, 1838, 832, -1453, -1449, 516, 900, -788, -1172, 804, 1828, 125, -1377, -239, 1307, 497, -1130, -643, 1189, 1413, -190, -1033, -131, 726, 42, -977, -531, 788, 794, -690, -1280, 125, 1194, -176, -1830, -776, 1545, 1364, -998, -1456, 737, 1657, -356, -1766, -92, 1873, 987, -1031, -763, 1140, 1371, -646, -1805, -319, 1613, 1209, -787, -1285, 248, 1088, -364, -1779, -640, 1305, 950, -839, -878, 686, 682, -1081, -1425, 549, 1744, 445, -897, -125, 978, 256, -1070, -681, 917, 1305, 76, -774, -38, 789, -9, -1441, -1062, 964, 1659, -173, -1723, -565, 1121, 315, -1592, -1108, 1176, 1569, -399, -1314, 142, 1123, -80, -1202, -130, 1489, 1156, -458, -884, 248]
693B48O64q66r39N97J270j47j434m07J205N95j272r13J288J450r39j774M76J875
711I77J0j844m22J735R68j275j172Q97J335n02j522j38J494Q06j116j317N96J550
729A060j42j855o27J676J252j166j440P97J440o20j673K36J785L73j396n17J196
746C79O97j105j080O68J374N7j079m12Q29N21r65j070O63J565oj600n41J413P41
765A049j513j263J232J838m80j744l7J449K07j381m69J331J024p15j127K36R97
782F34m4j062l66J103R60p08j304J89J231k6j431k84J569P99j415j241J048J436
800A088p44j626L34J774L65j445q01J006J004n32j111J43J171L90r89p76P19R86
818I56n22j290J18J402K61j348n88J182P49j110j045Q48J229m96j204K86J276
$$ y = [248, 912, 46, -893, -296, 974, 827, -607, -1014, 191, 786, -486, -1399, -111, 1339, 400, -1374, -898, 977, 987, -857, -1279, 456, 1424, 149, -1023, -126, 1209, 707, -815, -953, 541, 1347, 231, -1086, -490, 1060, 918, -937, -1564, 112, 1364, 198, -1242, -445, 995, 375, -1298, -1062, 723, 1096, -300, -817, 379, 1076, -29, -1109, -441, 933, 990, -89, -501, 328, 849, -116, -1186, -523, 1042, 1036, -564, -1105, 308, 1049, -464, -1727, -495, 1343, 863, -881, -918, 531, 738, -643, -1112, 219, 1243, 528, -599, -363, 634, 590, -472, -838, 265, 1225, 517, -787, -598, 633, 607, -824, -1108, 461, 1260, -155, -1396, -348, 1088, 344, -1282, -948, 826, 1191, -254, -1055, -49, 955, 423, -688, -545, 626, 1016, 27, -749, -30, 956, 434, -856, -738, 664, 925, -423, -1011, 171, 920, -190, -1235, -387, 842, 346, -858, -572, 704]
835G04M1j290n01J077R68n16j069J37J144K67j184q49R25J268m47j418Q3J402
853G42J40j576o75J380J105r33j171N89J115l71j207L9J178M45q03n44N86O76
871G15m47r30J20J136M50r72q25P05J004n92j357K30J517K40j420o35J187P69
889H95j088j050P68J320k21j236j76J011M88p56p29M96R75or45l12Q50N50p72
908F2q52O38J078l89j239J00J237J05j310m67J184P56r36r46O43J064l18j124
926g14q9J065N62p32q12M34J051j5j142m43J034Q45p24j042M76J102k91j265p2
945g72J202L23j023m99Q45N79p36p91M59Q65j06p53p8P28L23o37o25M30R32l4
965F32r62k31R90N39r89r58P63J227l92j312K7J233K15j221n73R67Q29o00r19
$$ y = [704, 745, -545, -1046, 31, 999, 483, -586, -449, 695, 962, -222, -1071, -146, 1122, 675, -743, -660, 742, 882, -694, -1369, 11, 1116, 183, -988, -399, 716, 345, -862, -823, 355, 800, -3, -547, 39, 715, 268, -662, -542, 594, 1044, 72, -753, -48, 956, 364, -993, -763, 754, 994, -426, -1061, 126, 895, -193, -1243, -475, 845, 624, -612, -788, 223, 711, -45, -774, -278, 697, 691, -254, -566, 284, 834, 62, -790, -152, 926, 537, -702, -602, 635, 740, -570, -1037, 147, 903, -33, -979, -336, 728, 410, -714, -803, 262, 824, 92, -720, -286, 765, 750, -392, -835, 199, 1044, 320, -722, -246, 856, 565, -700, -772, 430, 753, -270, -769, 76, 655, -81, -872, -413, 452, 346, -407, -485, 243, 566, -71, -696, -266, 666, 632, -330, -561, 429, 968, -21, -979, -216, 1011, 619, -693, -666, 567, 782, -439, -1012, -45, 784, 184, -735]
984g35K60Q85O5q16m06O80P35l00q25K9Q95K19q83m76Q35P42o56q94M67R37l40
1005D18j066O2J046J74r75m09P82N49n86p37K94Q27O3p46l43O51O65m18q90J52
1025d87J039K38r88m91Q82P36p40r53N02J012k34j037j6R47J91q84m56O56O15
1044E32l93p03J27P18J91o68m93N28P54k15q41PR18K64q95n02P98O91o04q16M26
1065a76Q36k74q82K8P96J36p21l36N76M82m00o48J19P22J97o66m67N94P64l44
1085C36r60Q4J065K76r91n40Q72P86o79r40L69R60j05q98j54P46L14n79n28L07
1105b59N71q2n40j45N35L22m50n13L56O96j55p51J7Q48J61q37l38P58N41o31o74
1126e70M68P31l12q00K1P40K08o04m81M07N80j55o81j38O85M63n56o78L79Q49
$$ y = [-735, -475, 410, 475, -341, -747, -67, 668, 368, -457, -428, 467, 686, -197, -673, 162, 904, 248, -646, -179, 758, 418, -648, -586, 460, 634, -341, -750, 32, 581, -5, -742, -448, 379, 442, -304, -647, 4, 669, 251, -639, -487, 552, 790, -198, -689, 193, 929, 189, -764, -262, 750, 516, -521, -537, 410, 601, -283, -739, -83, 532, 139, -564, -437, 281, 472, -196, -689, -161, 593, 378, -463, -456, 462, 726, -169, -671, 127, 818, 214, -602, -176, 660, 386, -496, -468, 328, 464, -257, -593, -17, 465, 65, -583, -464, 258, 455, -211, -678, -84, 680, 336, -624, -540, 525, 801, -190, -730, 142, 928, 249, -691, -322, 638, 533, -365, -519, 227, 541, -38, -566, -259, 312, 230, -310, -455, 80, 402, -48, -561, -205, 491, 336, -415, -398, 450, 611, -226, -564, 194, 735, 104, -570, -102, 629, 317, -483, -462, 278, 486, -118, -599, -192, 388, 233, -448, -586, 99, 562, 6, -672, -293, 556]
1146E56j32q89n3R26L27q34m90O58O07m68o53K78O41r3o31j46M97K73l97l95K11
1167b07M84l0n67k07N53M38m33n94L64P24j80q08J8Q26K11p41l21O60M31n58n68
1188e05L73O39j60o61q4N32K88m85m94K45O62K1p16k94O57N57n31p41L59R08o5
1209E05q88j59Q08L65o29m67M69N26k99n01Q3M33M8l84j77K89K38k26l73R3M64
1230B18M5n05k33N08L87m76n09M18P10k56p58O7P74J26p23k78O28M81m35n98J55
1251b54N70K9m98k49M08M30k82o19J5O44J90o02l55N80N58m65p20K62P69j9o55
1272b63o2O01K04n17l38L69M00k06l44P9L33Rl86k28K87L69j66m52L8N08M5o01
1294c21k26N82M50m73n38L81O27k26p04O2O99K05n74l42M20M32k36n09nN30J93
$$ y = [556, 424, -465, -518, 408, 735, -99, -589, 69, 676, 208, -445, -167, 474, 381, -250, -396, 101, 374, -23, -418, -207, 277, 247, -320, -527, 26, 464, 31, -563, -199, 525, 345, -463, -445, 381, 592, -149, -470, 190, 621, 63, -505, -132, 507, 347, -314, -398, 134, 422, -63, -557, -312, 350, 371, -345, -639, 18, 575, 44, -697, -338, 570, 505, -383, -542, 266, 631, 2, -465, 4, 530, 231, -270, -187, 246, 294, -90, -267, 22, 260, 34, -339, -246, 218, 263, -242, -475, 33, 420, -56, -565, -147, 563, 307, -451, -384, 390, 516, -207, -485, 143, 624, 189, -409, -254, 316, 345, -153, -402, 6, 436, 154, -465, -450, 194, 384, -218, -573, 7, 565, 100, -620, -358, 411, 392, -263, -325, 276, 480, -37, -375, -6, 394, 188, -156, -77, 256, 265, -121, -349, -62, 307, 141, -311, -273, 235, 280, -321, -547, 35, 485, 12, -526, -145, 482, 256, -448, -386, 313, 518, -56, -398, 22, 454, 218, -291, -296, 234, 427]
1315D27m53m17K85N45j16o49j04O46K77o13m30N02N74l18n74J48N80l1m79o1M73
1336B12J65l30k50K16K52j39k79L9L36J12l54l12K33L79j77m87Q6O14R8o56l33
1357e75N51M46m20n05L69O34j53o48j12N34K72l50l02K62L79p9m82j93L90L36
1377C54k72m05J83N13j09o44j31O09K87m78l23M05M08l35m85J74M85J9l55o1L11
1398A50J26k56k32J55L08Ll17r6K96J70l41l57K77M88j72n87M0O00R5o10k82N57
1420A5M53m06n37K36N70J3m99j63L65L27k20m02N1M36J47m01k88K91L41k16m58
1441c45J32N09On21j44M35J64l85k21L83L25k49l45J15L07o1k65KL50J84k40l47
1463b11N8L49M5l46j44L94L11l66n16J80N03o0n07j2N77J44n44l74L72M19j70
$$ y = [427, -26, -443, -158, 387, 271, -378, -482, 164, 441, -172, -602, -100, 474, 156, -418, -270, 310, 279, -200, -261, 212, 377, 47, -203, 13, 265, 126, -153, -114, 222, 334, -20, -332, -99, 280, 103, -384, -298, 316, 414, -242, -575, -24, 422, 2, -503, -134, 500, 347, -301, -413, 121, 393, 43, -259, 3, 382, 303, -179, -372, 18, 354, 82, -323, -140, 373, 264, -380, -511, 98, 385, -93, -416, -11, 397, 62, -423, -249, 236, 255, -100, -161, 150, 276, 20, -212, -57, 251, 254, -63, -159, 137, 307, -34, -391, -114, 374, 202, -385, -345, 255, 350, -260, -542, 15, 468, 62, -475, -239, 331, 344, -155, -318, 47, 374, 154, -248, -197, 239, 386, -15, -303, -12, 329, 113, -345, -213, 296, 302, -219, -363, 72, 236, -149, -370, 13, 338, 89, -256, -141, 166, 105, -160, -158, 192, 376, 136, -211, -153, 196, 241, -105, -249, 145, 456, 90, -426, -246, 257, 197, -310, -322, 255, 399, -145, -519, -147, 272, 102]
1484A02l63Q6L86P8l44k52K03L27k8k91j3L31J04m16k90L41M07k33m41J29M63
1505B86o0m94r5M42J62l05k02K56K38j87k86J02L01O6k70j38J99K65j06l23k0
1526a69L69J12l77k36L62L27l08m40K04M53j16n16n0N08K37l75l28J96L05o6k87
1547a95k0K88K02j77k89P6K63Ok96m6L85J94l57l26J99L10j78k96J74L70j02l92
1569b07m2L02N7k64j02K97K63j52l58n9K78J86j75k06J77L32q6m10r0L87J83l53
1591d2k16L54L07l08m72J12M49K8l48j21L00J63k29k38R3K51L9k01r1K16J79j88
1613C7k72J02L55L7l47j19L25J80k85k24K18K23j91k69J23L11p9k90l6K58J13
1634A70k24j88J15K79K6k30j16J83J72j74k35J58L64k6l95q7L42J54l63k48L13
$$ y = [102, -261, -175, 211, 289, -55, -307, -104, 223, 195, -96, -109, 222, 326, -90, -380, -39, 368, 135, -306, -177, 286, 226, -268, -363, 79, 241, -64, -266, -10, 228, 41, -245, -143, 158, 224, -46, -184, 15, 280, 174, -149, -169, 200, 312, -65, -301, 61, 388, 80, -360, -156, 297, 181, -335, -385, 123, 360, -15, -343, -147, 158, 92, -195, -215, 73, 275, 98, -191, -115, 148, 154, -142, -188, 197, 391, 34, -292, -93, 217, 39, -257, -83, 287, 185, -207, -249, 53, 110, -154, -256, 41, 304, 152, -206, -265, 13, 199, 24, -182, -5, 327, 241, -169, -259, 128, 311, -42, -258, 96, 403, 95, -377, -265, 184, 212, -136, -257, 43, 206, -23, -261, -168, 83, 122, -79, -170, 46, 225, 37, -235, -133, 222, 259, -88, -207, 118, 298, 13, -211, 7, 230, 39, -230, -107, 204, 125, -165, -201, 57, 170, -54, -242, -127, 152, 178, -52, -168, 15, 187, 13, -222, -64, 300, 274, -121, -208, 134, 288, -75, -323, -10]
1655a0L66j54l80j5K56K7k38n5K09J95j23k32j7J64Q1j55j03K06K64j38l16rK79
1678A02L9k34j2L04J03l28k11K07K06j72k04J45K76k6l11j37J72J88o1j72K9K21
1700A24M9k40j75K09K48j17k72R2L36rl72j27L25J92k42k19J72K15j08k45K4J94
1722E4N7j79j12J24J63l2k03l9K04J18j87j82J53K46m9k48M2K41l1k78k1K82J29
1745B52k31j72J67J52j44k08N1K27P6j55j38O3J35p2j91K6K83J36k49k09J45K32
1767A76j36k47J08L33M2l12j26J84J00j57j24J66J91p1k13n9J09P3p8r7Q7J98
1789A47l5k28r9J72J35j31j18J85K03j44k70P3K40Mk24j0K32Q9k07j65J07J52
1811A08l8j44j4J37R4j48j60P0K05Jk21n7K19J32j84j76J34K18r3k39N2K38K2
$$ y = [-10, 356, 202, -178, -193, 63, 90, -148, -203, 6, 201, 78, -154, -171, -7, 74, -81, -184, 22, 286, 148, -168, -177, 102, 141, -93, -105, 199, 302, -26, -237, -30, 176, 4, -200, -55, 221, 195, -116, -253, -81, 107, 46, -126, -97, 124, 173, -67, -242, -33, 215, 98, -174, -82, 254, 245, -127, -254, 71, 263, 21, -198, -26, 189, 81, -164, -140, 54, 111, -68, -180, -56, 107, 75, -128, -167, 37, 155, -32, -214, -61, 185, 136, -112, -70, 171, 140, -138, -159, 123, 252, 21, -151, 16, 168, 24, -184, -133, 94, 170, 15, -123, -60, 75, 3, -188, -162, 121, 257, 8, -201, -56, 176, 40, -207, -99, 234, 276, -36, -162, 22, 122, -35, -159, 7, 198, 127, -86, -145, -36, 37, -41, -138, -51, 147, 112, -116, -215, -43, 92, -39, -157, 28, 231, 87, -183, -110, 130, 134, -90, -100, 132, 221, 14, -151, -44, 108, 70, -74, -88, 49, 143, -5, -165, -95, 110, 111, -110, -167, 52, 184, 0, -176, -42, 176, 83, -156, -104, 134, 156]
1834A56j98o7J66Q9j48j37P1J44K7j37o6Q3P8q0j69O1K08K1j52q9J67Q0j74j45
1858b11J85K25p3k17L5J61l6j66k1J82J32j09j45J6R8lj48l6J44J59q7j99k3J65
1882B8L0j75l9K17J33j77j78J05J60p4j39N7J94K5j71r6R0O8m8q7N3J11J4j32
1906c1j16Q7J23n3j36M2J82J3j94q1J82J12j54j16J30J61o8j77M2J54J8j30o0
1929g0R6R7n9j04j6R7N2j19j02Q2J57n6j45J1J60qj88m9J63J36r6j27P1J22p2
1954C3j37J9J38M6p5n9L9N3n4r3jJ49P3j06j17M7R6p0j40M5K05L2j66o8J23O3
1980G5j29q3J15J77m5j34k9J00K0p8n8P6J11j1j29m1P2N5q8q0R3J34n9j71pJ47
2006C3K5j23l6J32P4r5r8N8R2k5q4J1P9M9p7p1K9Q8Jj07m0R8Q4j09q9O9J15n2
$$ y = [156, -42, -109, 57, 146, -2, -139, -68, 76, 103, -34, -100, -17, 61, -19, -188, -127, 81, 102, -50, -139, 28, 108, -66, -211, -26, 199, 126, -91, -56, 105, 69, -97, -118, 64, 196, 87, -58, -42, 56, 53, -95, -131, 13, 172, 85, -114, -137, 28, 58, -117, -156, 61, 194, 17, -161, -56, 104, 30, -109, -52, 142, 167, -4, -100, -10, 58, 10, -77, -24, 87, 101, -31, -147, -60, 63, 10, -126, -84, 98, 111, -83, -164, 18, 130, -24, -140, -10, 151, 83, -94, -52, 102, 120, -10, -70, 26, 123, 64, -40, -56, 41, 93, -26, -128, -46, 111, 55, -90, -79, 81, 73, -115, -164, -1, 135, 39, -88, -17, 105, 33, -104, -85, 53, 99, 24, -35, 4, 57, 3, -90, -91, 58, 131, 25, -92, -45, 51, -19, -159, -114, 91, 123, -43, -111, 12, 75, -54, -137, -22, 155, 110, -24, -53, 47, 67, -11, -69, 7, 118, 107, -22, -63, 9, 64, -24, -104, -11, 123, 64, -107, -114, 33, 58, -65, -101, 31, 105, 10, -88, -30, 62, 37, -47, -36, 43, 92, 15, -56, -27, 61, 62, -45, -85, 13, 97, -12, -101, -32, 83, 31]
2034C1j45K7J41J7j10m9J12O8r1j04O7R7Qp6kN9K1n7q6L0J08L4r2m1P0N4j12j12
2062a33P2J45j9j15%R7j0j23l6J29P9n6n9J6M8j6o5k0P6P6k5q1j1P0j2r3k9J32
2090C7P6q0j13M1R4m0j16L4J39J7j00o7P6M7n9m1M0Q5nn4n3M4O7l0p2RR3K9j01
2119cp0Q1P3q6p7N7R6m0j03K2Q2J6p2n6P7M4l2n5K4N1J6o0m3N0O5j8o8nR2Jj06
2150d7l7Q3O8n5o6N5P7o3q9%R4L0m7k9M3L1m5n1KP8L0j8n1J2M4k2q0mJ04L9p7
2181Im4O0K0o6p7P2P7j0o7kL5J6n4k3M9L8km7j3L9J6l5m4M6P7k7p6qO0L4p9k1
2213d7O5M8o5m0J7N9j5o7NO0J7k1n4L5L4lm4k0O2K3j5p0L6P2k6o9j4O0K5n0l1
2244c3N0L9o0l7J0N3j1l7NL0K5m5l5NN1J8m1rK3L6l7n1K7O2ll9j4N5ln6l6N7M0
$$ y = [31, -114, -87, 54, 71, -39, -88, 24, 92, 1, -103, -36, 61, 69, -7, -9, 50, 71, 14, -72, -42, 66, 100, 8, -33, 37, 91, -21, -133, -61, 84, 65, -50, -50, 47, 37, -86, -122, 7, 86, 30, -29, -13, 35, 19, -46, -66, 10, 86, 61, -20, -31, 39, 27, -66, -95, 37, 113, 33, -80, -39, 55, 15, -101, -67, 72, 89, -11, -78, -2, 45, -14, -55, -15, 70, 65, 11, -42, 2, 69, 39, -33, -24, 69, 98, -3, -73, 8, 81, -5, -82, -25, 71, 31, -72, -50, 32, 48, -24, -80, -3, 41, 9, -46, -22, 29, 45, -15, -58, -8, 57, 39, -29, -34, 58, 59, -47, -84, -1, 67, 12, -54, 1, 78, 15, -74, -74, 20, 50, 3, -26, 17, 48, 3, -48, -46, 32, 62, 44, -7, 5, 49, 27, -53, -57, 47, 86, 9, -35, 25, 45, -21, -98, -26, 51, 41, -26, -28, 7, 23, -31, -54, -5, 33, 31, -16, -29, 10, 26, -9, -53, -7, 70, 43, -33, -41, 19, 53, -26, -47, 18, 66, 1, -39, -22, 37, 22, -45, -40, 20, 37, 16, -38, -3, 31, 28, -16, -36, 26, 49, 34, -36, 0, 72, 46, -23, -37, 23, 48, -2, -33, 17, 56, -4, -41, -31, 22, 11, -26, -21, 9, 34, -11, -46, -41, 10, 28, -13, -22, 1, 37, 0, -51, -24, 38, 35, -4, -18, 37, 34, -22, -58, -1, 39]
2277C9k6l6J5L4j4m8mK8M2Mm1%K7J6m5k2L9M8l3l9J1M5j2o2OO1Ol2l0K0K6l1k6
2310c4K3K6Pm1j8L3K2j5l1kL2L1m2j2K5L6l0m1J9L8Om1pM0J9l8l7K5L5k0k6LL5
2343B0nj1k9J7K5Lk8LL4J9l7l5K6L3j9k1J1K7Lm9j8M3K3n4LK4J3j2l5j7L4QJ2
2376A1j8kJ1J1k5j3K7J9j7k4K4K0k0m2K9K3K3l1MOqopJ4MJ6j1k1QRj1k7K3K4M
2411B7k1j1K4Kj0k6K7J4ok4nK3Pl6OK4Mqj8nJ5kkj1MJ3Jl6J4K7pj8j1L0J4j2k5
2448a8J1J8Nl1PK3%k2J4J4mrj7QJ1Lpjj0K5j0jj8OJ6j3kK3Ok4j1KMJ1k2J4J9q
2486A2rj5J4Rrj4OJ3j5Rk0KK1j9LKJ0Oj8j3K3J3mj5RJ0okj1K0mJ1lk6J3J0kj0
2524ALKloPO%kj0J5Kj1MokQqmJ6j0Jj6RNpMj1RM%knLmNj8KJ0PlRQqj0J7Oj0%o
$$ y = [39, 13, -23, -8, 26, 12, -36, -40, -12, 30, 34, -7, -7, 20, 36, -9, -31, 8, 56, 23, -16, -5, 40, 28, -34, -28, 33, 39, 7, -23, -3, 23, -8, -34, -11, 15, 22, -19, -37, -4, 18, 3, -28, -30, 2, 33, -9, -21, 4, 40, 10, -31, -12, 26, 32, -9, -16, 24, 43, 5, -32, -7, 28, 8, -18, -15, 20, 15, 4, -25, -8, 17, 20, -8, -5, 29, 48, 11, -24, 2, 35, 16, -5, 6, 33, 36, -13, -31, 12, 35, -19, -16, 8, 21, 9, -26, -43, -9, -1, 11, -7, -9, 2, 13, -12, -25, 2, 21, 4, -20, 4, 24, 4, -38, -9, 14, 37, 6, 10, 16, 8, 2, -5, 9, 13, 29, 18, -3, 5, 14, 3, -24, -1, 23, 27, 6, -5, 19, 21, 11, -15, 12, 26, 20, -4, -9, 14, 21, -15, -9, 15, 19, 11, -7, -12, 3, 1, -1, -12, -8, 5, 6, -30, -16, 11, 4, -14, -25, 5, 19, 7, -18, -7, 11, 16, -15, -8, 15, 15, -7, 7, 21, 17, 8, -9, -1, 10, 13, 6, 5, -5, 20, 10, 9, -9, -3, 13, 0, -2, 21, 27, 3, -8, -6, -2, 9, -13, 1, 20, 12, 3, -12, 2, 11, 2, -12, -6, 7, -8, 1, -19, -17, 4, -15, -12, -10, 0, 6, -12, -25, -2, 11, 7, -8, 1, 11, 5, 3, -8, 12, 8, 19, 16, -10, 3, 13, 11, 1, 4, 6, 3, -3, 4, 10, 10, 8, -2, 13, 15, 4, 8, 2, 0, 8, 0, -4, 12, 2, 3, -13, -4, 1, -6, -2, -13, -4, 0, 0, -2, -7, -4, -8, -3, -21, -19, -9, -2, -5, 4, 12, 4, -6, 11, 17, 7, 7, 1]
2573ARLqnOLQj0oQlQqj6J9J2rj1RoPjk2K6%j7QnRkrQLoj1%ON%lmjJ5j2j3J3Jr
2621a0NJ3j2M%lJ7rlo%J8qkJpJ6j3j%mJ6%k3J2J8j0J0j0J0Nk2nK1pj3Oj1J7j4
2661dpRLRKk2K0qj7J7j8J1J0jj8kJ3lnkPK1k8J1LJ3j9nJ1PRj3nJ5pj4oQJ3jlj4
2703a0J2J1Qk8PJ6jrqK3j4qPkJ1j2qj1L1prLPLnj3j1QJ7j2j5MK2j6j8RJ4J1k1
2742a4j0J0K5rk4K3J3pk4K0K5j7p%J4Pk1qRJ0Lnk4J4J9j2l7K3J8Nl3J4K4mj4j7
2778a1J7MRk1kjJ6k0rJ5Omj2kJ1Rnk6J9L0j9k1mK7kj5OJ2J4j9j6OJ1J3j9LQJ9
2816B7prmQjrrJ7J4k4plK8nk5%K3J1l0j0K1Kj9pJ8J8j4j7kJ0K5j6j7LJ7Pk9JN
2855iJ6rk4OJ4Qj8KK4J1m2PJ2J0rMnJ4lonJ1Ppqj1K8Jj6m4M9K1j3m2K3K5j4j9
$$ y = [1, 10, 13, 5, 0, 6, 9, 17, 7, 1, 9, 6, 14, 6, -10, 9, 21, 12, 1, 10, 4, 11, 10, -12, 14, 14, -3, 5, 0, 9, 7, -2, 6, 9, 3, -8, -8, -2, 3, 3, 0, -4, -5, 10, -2, -15, -2, -1, -10, -5, 8, -4, 0, 0, -3, 14, 5, 2, -4, -4, 14, 6, 4, 5, -2, 14, 1, 0, 0, -4, 12, 12, -11, 1, 19, 9, 19, 9, 19, 24, 2, -3, 18, 11, -2, 4, -7, 10, -4, -11, -2, 1, 10, 12, -10, 10, 2, -15, 2, -16, -5, 5, 4, -14, -16, -3, -6, -11, -13, -6, 15, -13, -2, 1, 14, -5, -10, 1, 8, 17, 4, -1, 14, 7, -7, -13, -5, 8, 7, 4, -10, 2, 13, 21, -7, 0, 16, 15, 6, -2, 21, 7, -1, 6, 4, 15, 3, -5, -16, 15, 8, -1, 2, 9, 12, 7, -6, -17, -9, 8, -4, -19, -15, 7, -9, -27, -18, -4, 7, -14, -24, -14, 11, 2, -22, 1, 14, 7, -17, 3, 28, 11, 4, 4, 18, 25, 4, -4, 5, 15, 18, 13, -11, 3, 22, 10, -27, -4, 14, 19, -14, 0, 24, 20, 6, -11, 6, 10, 19, -2, -4, -5, 11, -9, -18, -3, 3, -1, -13, -15, -4, 5, 0, -26, -7, 23, 4, -17, -21, 6, 4, -11, -5, 7, 21, 2, -14, -8, 3, 16, -3, 0, 8, 27, 20, 11, 7, 15, 14, 5, -4, 13, 27, 3, -4, -7, 21, 16, -9, -9, 14, 25, -5, -15, 6, 8, -11, -18, 0, 18, 4, -13, -15, -5, 20, 4, -13, -10, 7, 14, -15, -14, -9, 7, -2, -26, -20, -6, 2, -16, -14, 10, 21, -21, -14, -2, 8, -1, 3, -2, 12, 9, 3, -2, 9, 16, 9, 1, -10, 18, 19, 3, -41, 8, 29, 16, -26, -3, 22, 8, -11]
2893a1KK7%k5mJ7jj0poL3Lj7njRjk6PK1Pk2j5L9Ll4j3QM8k0k0KK4mj7%J8J5j3
2932A1j9J8jJ5j6orJ5Kj9OK3nj8k2L3K9l0l3L2K3k4j0mL0lj7l0K7J1Kj9oJ7J5
2967A8j5k0OK3Jl7JK3K0l2j1K2J5j8k5J6K8j6k0RK3pnj6J8J4Jj7rK1J3j1k7J8
3001DJ8j1l1QJ6J0k5j1J3L1j8k3J3K2mk9jK3LLk7QJ9Rk1rNK5j7k8J5K7rj9k0M2
3037A1Nm1j0J8L0j9j6J6J0Lj5RNJ0pjpJ3Oj2j5L2Lj4j9kM0j0k6j6M6%k5j8K6K
3073A2rl4K8K5j1mk1J3J9k2j8J7PJ7k0j9K3K4k9j6OK6J0m6qL4J4l1nJJ8Ll6K0
3107a2J0J5j0qJ1J8nj8JRQj1%LL9k2l6J1L3k0k2mL2mk0j6K1J2k1j8K1Rqj5PlK4
3144A1Nk8KJ2J5k8j7L6J4k1k6J4K2kk9nL9j4pk3J0K6Mk0JJ9Oj5j0OJ7Jk6jL0Q
$$ y = [-11, -9, 18, 18, -7, -11, 6, 5, -5, -12, -18, 15, 18, 1, -4, -5, 4, 3, -23, -16, 5, 12, -10, -25, 14, 17, -17, -30, -22, 26, 6, -14, -12, 12, 8, -9, -9, 9, 24, 11, -8, 10, 9, 24, 8, 2, -7, 8, 10, -9, -3, 20, 15, -3, -25, 8, 37, 7, -26, 6, 29, 5, -5, -9, 21, 18, 1, -29, -2, 9, 11, -8, -14, 3, 18, 3, -17, -11, 12, 13, -24, -23, 0, 20, -12, -23, -1, 14, -4, -29, -13, 15, -1, -21, -12, 11, 4, -1, -17, 1, 15, 16, -1, -10, 11, 24, 13, -14, 4, 22, 11, -20, -12, 4, 14, -11, -22, -9, 22, 4, -19, -6, 16, 12, -17, -18, 5, 8, 11, -16, -8, 11, 20, -1, -10, -5, 20, 3, -25, -10, 17, 8, -11, -31, 11, 16, -25, -35, -17, 13, -6, -22, -6, 4, 7, -8, 1, 6, 16, 9, 8, 1, 14, 20, 8, -7, 25, 28, 14, -5, -7, 33, 23, -3, -19, 27, 27, 2, -16, 10, 12, 3, -31, -3, 22, 11, 7, -14, -1, 18, -4, -22, -5, 2, 19, -1, -20, 3, 27, -2, -18, -12, 14, 24, -22, -30, 4, 18, -13, -18, -17, 1, 4, -32, -12, -2, 13, 3, -5, 6, 24, 19, 1, 2, 11, 19, 8, 8, 11, 50, 28, -8, 3, 36, 16, -6, -10, 22, 18, -2, -18, 3, 15, -6, -24, -3, 6, -2, -17, -10, -13, 11, 16, -12, -10, 2, 17, -11, -28, 8, 22, 1, -25, -11, 11, 9, -20, -25, 14, 0, -7, -30, -20, 6, 10, -10, -9, 10, 16, 1, -9, -3, 14, 15, -11, -12, 18, 26]
3180B6k5j9K4K5l6mlN2k2l7OK7Kj6k2J5J7k6KKPoMj1LK4jl0jL3Nk0j2J7L1k1m5
3217c5K4K7qj7%K4Nj8j2J0J8Nl4LJ0K0j7k3K1J8J1l5%K7Nk2j6K5K5l1l6K1L2j9
3251Hj1mJ8J3k6k4K7Rlk1j0K0J2Kl9NM5ol4JK2K5l8k2L0K4k2j3LJ5Jk5MK1Rj7
3287aj3PJ0K0l1j0K3K0j7j8LK8mk5KJ9Joj0J4K1j5k9mL2k1j4jJ8J1nqj0%Njj1
3324b0NK6j1k7RK2Rl2j0L5J4l3j7J3K9rj7lK9Nk4qMJ6Lj9OJ5Rj7k7K2L1k0k1J2
3360aJ3oj3j3M4J1k8j2OL0l9nOK0lok2lJ6pjj0J1K2j8k3J2M3j6l1NL3%k4j3K9
3396GOk7OJ1K1j3k6%PJ4moPORk7qK6J6l0j0J1L7k4k0RM0ll3j7L7%k3j0J9Nnj3
3434eJjJ4k0rQPJ7l3kJ2K4k9j5JL8ok0PK7Mk3%RJ6j5rJ4J8j4nj1J1Pml0OL0%j7
$$ y = [26, 1, -18, 6, 31, -5, -9, -12, 40, 18, -19, -13, 14, 16, 0, -22, -7, 10, -16, -14, -12, -5, -11, -7, -18, -15, 9, 8, -22, -23, 10, 15, -5, -17, 0, 31, 10, -35, -11, 16, 8, -9, -9, 15, 20, 2, -10, 0, 18, 23, -11, -8, 2, 22, 5, -18, 3, 21, 32, -3, -3, 24, 29, 7, -9, 16, 41, 10, -26, -5, 27, 8, -3, -7, 11, 24, -2, -26, 1, 10, 7, -14, -24, -4, 8, 10, -29, -24, 21, 15, -19, -18, 4, 29, -9, -31, -1, 23, 1, -12, -9, 6, 7, -18, -14, 7, 16, -1, -14, -7, 3, 23, -8, -18, 5, 25, 8, -10, -7, 21, 17, -8, -6, 13, 14, 8, -2, 12, 33, 18, -11, -15, 17, -4, -18, -19, -1, 10, 5, -3, -13, -13, -8, -9, -20, -15, 11, 0, -27, -18, 4, 13, -19, -29, 6, 20, -13, -30, -17, 12, 3, -14, -17, 12, 17, -7, -15, -11, 5, 8, -11, -5, 10, 19, 2, -25, -3, 28, 8, -13, -1, 12, 6, -7, -20, 24, 35, 7, -5, 1, 31, -8, -13, -7, 13, 10, 4, -18, -21, -5, -12, -13, -23, -12, 10, -8, -31, -19, 24, 8, -23, -18, 15, 15, -9, -22, 7, 13, -14, -8, 3, 24, 11, -15, -15, -8, 6, 2, -4, 3, 9, 18, -9, -17, 9, 25, -5, -15, -4, 33, 9, -11, -2, 38, 35, 2, -15, 22, 22, -1, -11, 8, 13, 8, -5, -4, -5, 9, -11, -20, -12, -5, 12, -21, -23, -11, 13, -16, -31, -30, 8, 2, -18, -11, 16, 20, -3, -3, 6, 22, 7, -2, 12, 30, 16, 11, 0, 11, 18, 14, -16, -10, 20, 20, 3]
3474Cj8K1J5k4j0J9J5qj8J3J2kk5QJ3Mlj7j5K1Mj7jjL0l0j4mK1J7l5pL7Nk6nJ7
3511eK7k2k2J3K0Lk4JJ1K4j9r%J7j0pkPJ9lm1OK9j3k0JL8Lj5k3jL6oj1kK7jk1
3549EqJ0J4rllKOj7j3PK6nk7%J3ok4nL3J6k0j8J0K3j0j0LJ0J3j7KRlMorL2Mj7
3589A2k2QK6ml1NJ6J1k1j7J8Oj7KJ8J7k5j2JK3j6J1k6QK1j0pj8J2J6j3JjK4j3
3624Ck9mL4Nl0mK4Oj5lJK2Jj6j5K4qJMPRMj9k0K7J9j3j7J2MPm4J7K8Jl9JK7Mj8
3664bk1K8OPj3k1J6M%j5LK5j2J1l0MJ8j2j1MK5ok4j3K9oj0m%L3j4j0mJ8j0pJ5
3701ARNpppJ9Qjj7J0Oj0j5kK3rLpNJ1k3lJ2J7j9njMJ4j8nJK1Lj6j3K6nj4kLJ4
3743Ij5rj4L4kj6J2Ppk0PnJ2Lj0OJ7oq%j0M2rj5j0J6J9l1oK3knj1nK3oj8pJ9J7
$$ y = [3, -15, 6, 21, -3, -13, 6, 21, 13, -5, 8, 20, 18, -7, 1, 14, 18, 15, -2, -17, 4, 8, -9, -10, -11, 19, -11, -25, -29, -8, 9, -26, -33, 4, 9, -17, -22, -5, 22, 0, -22, -9, 11, 14, -10, -9, 2, 26, 7, -2, -2, 15, 5, -2, -4, 3, 22, 19, -22, -16, 13, 0, -20, -19, 19, 22, 7, -16, -17, 19, 13, 2, 0, 27, 26, 5, -3, 7, 21, 12, 9, 6, 8, 14, -3, -16, -9, 17, 12, -15, -15, -2, -8, -32, -37, -4, 12, -8, -26, -16, 7, -3, -13, -10, 0, 13, -4, -2, 7, 4, 8, 2, -7, 25, 29, 12, -10, -2, 24, 20, -11, -6, 10, 21, 0, -17, 1, 7, -10, -8, 10, 27, 2, -10, -9, 14, -2, 9, -17, -9, 12, 2, -5, -23, -11, 5, -8, -7, -8, 16, 3, -26, -30, 4, 9, -21, -25, -1, 5, -10, -13, -12, 10, 11, -5, -20, 4, -4, -3, 1, 8, 17, 21, 2, -18, 9, 28, 15, -2, 10, 14, 21, -23, -6, 22, 23, -16, -15, 12, 16, -2, -23, 5, 11, 18, 5, -16, 0, 4, 4, -11, -8, 17, 5, 16, -14, -10, 8, -4, -15, -11, 14, 8, -16, -29, 0, -6, -16, -20, -20, 13, -1, -11, -15, 3, -7, -14, 1, 10, 15, 8, 1, -6, 13, 21, 20, 3, 13, 19, 9, -6, -8, 15, 6, 9, 2, 7, 18, -5, -8, 4, 21, 2, -3, -4, 0, 14, -4, -9, -8, 13, 16, 0, -13, 13, 8, -6, -8, -5, 9, -6, -15, -29, 5, 3, -13, -1, 6, -1, -21, -14, -19, -7, -4, -14, -8, 9, 3, -5, -5, -15, 27, 18, 3, -7, 9, 28, -3, -9, 14, 12, 7, -4, -9, 14, 8, -10, -17, 2, 19]
3783A9j4oQpNLj3K5kk8pPJ5Kl4%K7Rk5NJ2J2qk3J3J2nl7J0K0PkpPJ3j2plMJ8L
3824A6j5oJ8%k1jM1j5j2qJ2Jmj4jK0Nk5RJRk6ORONj1j8J6J1qk3J7J4%k6JK1Jk1
3864a6OPJ4k1j5K8ljonQJ0k0j6J5J6Nj5NMJ5lj0QJ0kj0j4J1J7k0lJ2J9j8j7PK
3902DkrKJ1oKj5JNQrj2RJ8jk9RL3j2k3J2J3Qk8J1NJ3j1qjJ1qLk0K3oOrjNJ1j0
3944CpJ5J4rk4K0Poj9K1Qnqk0K5Kj2nJ0Lkj6mMOJj7JJ1rmj3J7J8pk1J3MLk2MR
3986a1L2qj6JJ0mrRJJj3NlKJ1rmK4Kj0omK4j2j2RJ6Nk6NJMj6J6PrJ2k1pKjJ4k3
4029a1J1j0J9j5j0OJ5j7j5K8J2j2j7J5J8j6j4RNJ0poMK0lj4j2J1J6jj4mJ0J1j9
4064CKJ4j1j6KK9Jk2j3LK3loJQj1kJ2k0PNooJ4jj8m%K1Jk0KJ5Pl4mJ5J4plnJ9
$$ y = [19, 5, -1, 7, 0, 5, 8, -5, 20, 18, -10, -17, -10, 5, 7, -27, -27, 0, 9, -16, -11, 1, 13, 5, -18, -5, 7, 2, -35, -25, -5, 2, 0, -7, 0, 13, 1, -6, -9, -5, 13, 16, 1, -5, 13, 13, -8, -9, 32, 17, 5, -3, 9, 10, 6, -8, -9, 11, 16, -9, 0, 1, 10, -16, -10, -1, 5, 10, -1, -19, -3, 8, 0, -23, -6, 8, 8, -18, -17, 4, 5, -16, -10, -3, 11, -10, -25, 3, 0, -1, -7, -12, -4, 6, -14, -30, -15, 1, 6, -9, -4, 0, 15, 12, 2, 10, 20, 18, 8, -6, 5, 22, 2, -1, 11, 30, 12, -5, 2, 4, 2, -7, -5, 6, 0, 2, -13, -12, -7, 1, -8, -20, -11, 7, 6, -23, -14, 19, 7, -16, -4, 9, 17, -11, 0, 5, 18, 7, -1, -2, 9, 1, 4, -16, 7, 1, 7, -2, -3, 2, 13, 3, -4, 11, 25, 16, -8, 12, 19, 13, -6, 15, 23, 18, 10, -10, 15, 17, 5, 0, 10, 13, 11, -5, -9, -5, 1, 2, -15, -14, -3, -12, -16, -29, -12, 6, -1, -22, -9, -5, -2, -24, -20, -11, 21, 13, -3, -2, 8, 4, -5, 4, 5, 6, -7, -2, -5, -3, 8, -1, -5, 19, 21, 11, 5, 1, 25, 13, 1, 10, 26, 31, 5, 10, 11, 15, -1, 15, 22, 13, 25, 4, -3, -1, -2, 12, -11, 0, -10, 9, -6, -16, -10, 5, -12, -27, 1, 13, 1, -16, -1, 17, 1, -13, -4, 1, 11, 4, -2, 2, 22, 19, 5, -7, 4, 20, 19, 5, 1, 11, 22, 3, 5, 19, 8, -8, -6, 23, 24, 2, -11, -8, 15, 12, 6, 7, 15, 4, 2, 14, -6, 1, 6, 0, -6, 8, 7, -11, -15, -15, 6, 7, -13, -11, 4, 11, -23, -27, -12, 2, -5, -8, -13, 6]
4106Fj2OpJ2OrjORoj2%J0%Pj5KJ6j1j2MJ4J0j5omK2j7LlJ6j3rOjlkJ2mj0J4rn
4149eJ1J0k5j1OK7j7nkOJ5k0j2J6J1j7J2pMJ1r%JLKpRJm%j6K5JNj3jJ9pl2J1J1
4190GQj4J0krRj3MJ2%j1mOJ0j1nnJ8J9k2k3J4J1qk5K3PKk0kJ9omnJ8%k3RQOmJ1
4232A5j1PNoj0KJ4lorJ7l%j5J3J3j5jlRMk4J2oJ5pmmJNPk%Mj2Mj4NJ0j0j0J3R
4275Ij0k4K1lOmMNq%Pj0QjRj0J0J4k0j9J6K4Qj9k2J9loj1K1J6j6j5NJ4pj5PJ3
4314A3Mj2rLJjMjJ0lKj1oJ1lj0MK4j2j7j5J3Rj1J3nRpj2J1PJjnKMPk8J4J8qJk
4357FrJ4nj1RoJ7j4J3qJ0m%%qMqMjl%pkJ2Pj1NnOjj4RJ8lk9%QJ2j4OJ0qj4OLJ
4403eJ0qJ4mPqloKQJ9k0KkjjJ3J4nj7NjPj7KJQJnJJ1k1J6j4PrmJ1knJ2j7qJ8J1
$$ y = [6, -6, 0, -7, 5, 11, 2, 1, 7, 16, 10, -2, -2, 8, 8, 15, 0, 2, 18, 7, -5, -1, 13, 23, 8, 2, -2, 20, 3, 6, 3, 19, 6, -3, 3, 2, -1, -3, 9, 5, -5, 9, 0, -5, 6, 16, -9, -20, -14, 13, -4, -9, -11, -5, 10, -10, -22, -6, 5, -12, 0, -7, -3, 8, -1, -1, 0, 3, 5, -2, 7, 8, 4, 4, -12, 13, 14, 19, 6, 5, 24, 17, -15, -4, 7, 15, 1, 11, 9, 0, 9, -4, 0, 12, 12, 1, -3, 3, 13, 2, -3, -8, 10, 29, 7, -16, -2, 9, 1, -24, -1, 6, 8, -12, -14, 5, -1, -5, -10, 8, 8, -15, -6, 2, 8, 4, 15, 4, 11, 16, 10, 0, 2, 16, 13, 7, -2, 15, 12, 12, -3, 10, 23, 8, 7, 4, 13, 17, -7, 5, -1, 14, 7, 3, -1, 0, 5, 12, 10, 10, 14, 2, 6, -8, -3, 7, -3, -13, 0, 9, -1, -25, -4, -7, -1, -5, -1, 4, -4, -4, 3, -7, 1, 0, 9, -1, 9, 23, 3, -16, 0, 24, 32, 13, -9, 10, 7, 1, -10, 11, 27, 11, -4, 1, 15, 8, -7, 0, 13, 17, 5, -4, -1, 0, -1, 3, 2, 12, 9, 11, 0, -6, 5, 2, -8, -4, 20, 8, -9, -24, -11, -2, -13, 0, -5, 4, -3, -15, -4, 3, 4, 3, -2, 0, 4, 11, -17, -3, 15, 7, 8, 6, -3, 11, 6, -5, 4, -2, 15, 1, 14, 6, 16, 12, 12, 12, 4, 8, 0, 4, 3, 0, 0, -7, -9, 3, 10, -1, 4, -1, 5, 4, -10, -1, 17, 14, -15, -15, -7, 5, -9, -3, 7, -1, -15, -9, -6, -5, 5, -3, 11, 7, 14, 6, 3, -3, -1, 7, 26, 6, 8, 6, 5, 4, 17, 31, 26, 9, 14, 13, 20, 3, 5, 6, 14, 15, 10, 11, 22, 1, 17, 3, 10, 1, -3, 8, 6, 1, 13, -4, -12, 6, 17]
4448A7pj4J3mKj5kJ2J1j0k3J6J8k0nMnJ8ojNjJkpNRnpJ6J2pqkOkkJPj3kK0j8Q
4492A3j3OKPj2JmkjKokPJKMlMomJ1Nlj4jNJ5j1%Pj1%mRnJ1Qk0JK0j7plRJ1oNL
4540A4MjnMJ6j7%Rjj3MlJkMnj0NM%Oj4N%j0JQNj2lNOj3lJJ2npJjkJ8nlJ3j4Pr
4588eJJ1rOmJ1Kj4NOPj9LJ1qlrK0mJpQOlRk5K%J1omM%oJpJ5qmmJ1Llm%Rlk1J1
4637flJ1oNLqJ8j3j1JK2j9J4j0NpJ1j4J5J2k5KJ3Pj5KJ1Rqj1nlJ0kPj8J0mQj2
4677dlJ9j9JLKjk2J1J9j0pJRqRj2J5j5NLKjNrj1K0PmomJ1Nlj1J0J3j4kO%KoqJ4
4722A2JJkjOjjKonNpJKmmrJ3J0j5pJ5Qmk3%J0Kj2%J9%oMqnNpJ7j9J0J3j2JMqj
4769fMJ0lj1OJ6jj7qJ3J0JMrkKj1qJ8LmOj1JPmmjNj2jlKRppMJ4j3OQKj4QqJ1j0
$$ y = [17, 10, -4, 9, 5, 7, -8, -10, 2, 13, 3, -20, -4, 14, -6, -11, -7, -12, 6, 0, -1, 4, 3, 4, 2, -5, 0, 9, 4, -3, 13, 25, 18, 10, 8, 14, 12, 10, 11, 18, 5, 3, 23, 5, 13, 0, 6, 8, 15, 3, 4, 0, -2, -3, -1, -7, -9, -2, -1, 1, 5, 2, 6, 0, -4, 7, 12, 9, -5, -6, -1, 14, 3, 3, 10, -1, -1, -5, 4, -1, 10, 18, -2, -1, 19, 2, -5, -8, 1, 12, 6, 11, 14, 18, 17, 12, 16, 32, 15, 15, 24, 23, 10, 14, 11, 12, 10, 14, 9, -1, 4, 8, 8, 14, 0, 5, 5, -5, -4, 4, 9, -3, -6, -1, 5, -8, -11, -10, 2, -3, -10, -9, -10, -12, 6, 1, -2, 11, -3, 4, -5, -4, 7, -2, 4, 0, 11, 13, -1, 4, 10, 17, -2, 1, 12, 4, 1, -8, 12, 8, 9, 2, 10, 16, 13, 22, -3, -1, -1, 10, 4, 0, 4, 4, -2, -1, -8, 7, -1, -5, -9, 2, 5, 2, -2, -2, 7, 4, -17, -6, -9, 2, -4, 1, 4, -4, 14, 1, -10, -9, 13, -6, 8, -2, 3, -4, 7, -7, 8, 20, -5, -3, 10, 17, 2, 4, 15, 24, 16, 5, 0, -3, 7, 5, 12, -6, 4, 0, 8, -4, -7, 12, -7, -6, -3, -1, -2, -24, -13, 6, -4, -11, -10, -1, -9, 0, -12, 3, -12, -7, -4, -2, -3, 2, -7, -18, 2, 9, 5, -1, -5, 6, 11, 8, -3, 7, 20, 6, 4, 10, 10, 12, 6, -2, 12, 13, 14, 12, 11, 17, 16, 15, 17, 11, 6, 11, 4, 5, 7, 3, -1, -10, 3, 13, -2, -9, 6, 14, 10, -13, -13, -3, -1, -13, -13, 6, 6, 0, 4, -4, -9, -4, -11, 6, -13, -3, 10, -2, -1, 3, -5, -6, -2, 8, 5, -6, 0, 16, 15, -2, -10, 3, 13, 14, 18, 9, 7, 9, -2, -10, 8, 11, 7, 13, 2, 3, 10, 6, 2, 1, 6, -6, -7, -10, -8, 1, -6, -13, -9, 5, -8, -2, 6, 8, -6, 2, -6, 5, -5]
4816eLNm%jlJ5j1NkoJ2qK0pJj0k%pPOPj0JJrJ8rKNpJKMooK%j2J1Oj4NJMj1%Lo
4866inMMlrKJ0konJ4j4KJ2jkJ0mlQKJ3j5J2j8K5k3ROPk1lJ3rJ2j3jMlPj2J0J4
4909A9j1jj1J0Jq%Rmj4J4j7J8J0j7ljPjj0J0okJj6J2RljJ2%MjqkK%LrJ9olmJ7
4953A8kpnLRj5J2j0%KMnqJ3noOnJ0j0mJ1mjlJQrj6J7MoKLj3LmJ6qKjnLNklL%R
5002Gj1J7qMj%oJ8onjqJ2rLoJ7J1k0jRmqLOqRjj3QmLOj8Kk%NK%Qj3%oJ9j1okJ5
5051FpKKj2J0rRpRjoPJ1j4%NmM%LnJ1k%mmNMlJMoJQj9RJlq%J1mj1QJ3qJqrJ2j
5102BlRnLj0Rj5J3LmlJLJpNmJ1Lj1OlJ1oNNlQj5Oj4OOJmJJ1j0PoljojKJPlkj4
5152gJ2OjljkmKj2lJ3%jJ0j5j2J0MnNKlJNnPMJn%jNRQk1J3nJ4k3J1pJ7j5oK0p
$$ y = [-5, -2, 3, -1, -1, -2, -5, 10, -1, 4, 2, -4, 8, 0, 20, 13, 14, 4, 2, 2, -5, 2, 8, 15, 5, 6, 7, -2, 16, 7, 9, 14, 7, 8, 10, 14, 8, 2, 4, 4, -8, 3, 9, -5, 0, 1, 5, -6, -6, -3, -9, -14, -10, -6, -9, -18, -16, -6, -8, -14, -19, -5, -19, -17, -5, -6, -8, 2, -2, -5, 3, 5, 18, 3, 15, -3, 22, -1, 8, 14, 21, 0, -3, 10, 1, 13, 0, -1, 3, 0, 7, -5, 5, 19, 8, 7, -4, 6, 7, -1, -1, 8, 4, -10, 4, -13, 5, 15, -2, -5, -6, 1, 0, -10, 0, -6, -8, -7, -23, -11, -2, -5, -6, 6, 6, 10, 9, 1, -1, 1, 1, 4, -5, 14, 8, 5, 1, 18, 16, 9, 4, 7, 16, 1, 13, 3, 3, 5, 9, 4, -4, 9, 4, -2, 4, -1, 9, -1, -5, 6, 2, 1, -2, -1, 7, -2, -18, -1, 3, -3, -1, 2, -11, -8, -12, 4, -4, -2, -3, -8, -5, 0, -2, -5, -2, -2, 7, -4, 13, 5, 9, 8, 8, 2, 20, 14, 9, 8, 0, 12, 3, 6, 0, 17, 28, 8, 7, 16, 12, 4, 7, 13, 5, 14, 13, 0, 8, 4, 7, 13, -5, -3, -5, -5, 0, 2, 2, 10, -3, -3, -9, 10, -1, -7, -9, 6, -1, 1, 3, -9, 1, -8, 1, -6, 3, 2, -4, 3, 14, 0, 0, 5, 1, 5, 5, 8, 3, 14, 12, 12, 8, 4, 9, 13, 10, 11, 15, 9, 10, 18, -1, 8, 9, 6, -2, -2, 9, 5, -6, 2, 15, 7, 8, 0, -9, 3, 2, -1, 8, 3, 6, -4, 5, -10, 3, 6, 2, -1, 0, 3, 4, -3, 2, -2, 9, 12, 1, 7, 4, 15, 9, 14, 19, 16, 24, 9, 15, 1, 7, 13, 14, 10, 11, 22, 12, 19, 13, 10, 9, 3, 2, 4, 5, 12, 9, 7, -7, 5, 11, 10, 7, 6, 4, 0, 2, -10, -13, 0, 0, -1, 9, -6, -18, -8, -4, -9, -4, -2, -5, -4, 1, -4, 3, 7, 8, 3, 3, 2, 7, 16, 24, 3, 16, 11, 25, 2, 13, 6, 23, 8, 2, 22, 15]
5198A5j3LRj1nJ8lmJrj%J7pnNj2PnnJ4Lj3J1j4NPKj3Qj0KKqNnjJ7lj3J9j2J5j3
5242@J0rJ1O%nnNMLpJpOlj2J6lNpKpkQolJ5j4Mj0NLj1jJJ6j7J4j7KMj1J8LMj6
5288gnQJ0j2mlROPj6MlMJ2rMOjrJ0nMJ1lj0%lMkJ8mj5QlQk2NQjLnMmnQj3JjlQ
5338Bj2RpKMoNLkJ1mj3KKMLj4J7njnkJ2Kj1Rl%RLj0nPQkmj4QKkJj7MJ8J1j1jo
5386AlKPnKnJ0j5lqK3j2jlO%J0k3QJ2mJp%RpP%qPMJ0j3KJ2krPkmOMkj2KPkPj8
5435bJQNjqNj5PJ6rLrLj2K5j6nJ0kplQqmOLj4J1%Oj3mJ3j7J6%Nj1J1njJoJ5Jn
5481BPrJ1KKj5J3Nj6K0j5j7J3Mj4J4pQrNJ0j8mK0lkmnPrOoP%mPOk1J3klqQj0j
5526a2J0QpKrJ0mmkL%L%kQJ2j0oNnJ1MloRrnJ5j4j%MLJp%%LlKpMmMLqj0NJ2lj4
$$ y = [15, 2, 5, 14, 3, -2, 16, 13, 9, 10, 1, 0, 0, 17, 10, 5, 10, -2, 5, 0, -5, 9, 12, -1, 10, -4, 1, 8, 10, -3, 5, -5, -3, -1, -9, -4, -9, -10, 7, 4, -9, 10, -2, 13, 0, 10, 1, 12, 18, 18, 13, 8, 13, 17, 20, 13, 14, 7, 13, 10, -2, 14, 11, 16, 9, 11, 4, 2, 10, 4, 1, 16, 2, 6, -4, 1, 4, -7, -8, -7, 9, -8, 6, -11, -9, -5, -16, 2, 5, 9, -7, -12, -4, 6, -6, -10, -13, -4, 2, 9, -7, -3, -6, -2, 10, 1, 5, 11, 10, 1, 11, 6, 10, 21, 18, 8, 8, 5, 9, 7, 25, 21, 6, 14, 11, 19, -3, 2, 10, 9, 12, 7, 11, 7, 2, 10, -3, -2, -3, -6, 2, -10, -1, -8, -6, -2, -8, -3, 0, -2, 9, 5, -8, -6, -4, 0, 3, -11, 6, 1, 0, -5, -7, 5, 7, -4, 5, 2, 2, 11, 14, 4, -1, 6, 14, 12, 8, -6, 2, 4, 2, 3, -14, -10, 8, 19, 8, 7, 1, -2, 0, 7, 2, 4, -1, 9, -6, -9, -17, 6, -6, -7, -10, -4, -4, 6, -17, -9, 3, -1, 0, -7, -7, 2, -5, 2, 2, -6, 1, 5, 15, 2, 4, 16, 14, 5, 12, 10, 6, 12, 16, 14, 2, 4, 11, 9, 16, -2, -1, 7, 12, 11, 3, 8, -7, 0, 16, 7, 10, 1, 4, -8, 17, 1, -4, 6, 4, -3, -6, 2, -6, -10, -4, -1, -15, -4, -4, 2, -11, -15, -2, -19, -3, -3, 2, -9, 2, -3, -4, -3, -9, 6, 7, 2, 9, 0, 11, 13, 15, 0, 13, 18, 2, 22, 7, -10, 3, 7, -7, 7, 0, 8, -1, 4, 14, -4, -8, 12, 9, 7, 3, -2, 5, -4, 2, -4, 3, 3, -1, 6, 12, -9, 4, 2, -1, -9, -1, -11, -12, -2, 6, -1, 1, -8, 2, -2, -6, -8, -5, -5, -2, -2, -4, 4, 16, 6, 0, 5, 0, 11, 15, 12, 6, 15, 6, 1, 16, 2, 1, 1, 5, 8, 9, 2, 2, 2, 5, 2, 4, -3, 1, -3, 1, 4, -4, -14, -9, 3, 0, -14]
5577a4J0J0j3oQPK%k0RKmLNoPjlj0J1NMj5J3KNj6J1K%Mj2LNoRqLlPj5JPPj7Qk
5624a%KnnPJ2j3kqOKOj2NOJKj2jKJ0l%Nk%j7K9j9J1j2KJ7j1l%%nJ6mJ2roJ4nm
5670HJKj4J4Nj1lR%pl%LMlqPPqmMrJJlMqLJJ2rmOoMJ3j7KPmoJ1Pqj1J6rOQlj1
5721cPNjKj2RmJ3j%ookmJ3%nLOpjlJOjj5MNqJ3mnOj2J0pPKj9J2lRlpQkJ0j1Pr
5771cMJJ0nqkMMN%jRkpkjMNjJrqJ9qpJ6oORk4Qnk%OpLj1JRjk0J5kkj2J7nOrJ4
5822FqKPjmqMLKojK0k3QK1j6J0k0RQoLlMloJ6Lj2%KK%k%kMk0J9j8J8mj1jJRJn
5870BmMooKJ1j4Mj5J3mJ0rJ2LoK1j9koJ4OkqLoNmK2j4lJJ0Ojj4KQpQLkj5jJ0L
5916A5j1PJpLRj0%oQMj7%%OqMmkLlPpJ6j0mmRKoKkQKmKMjKj5K6JqmJOjokJllJ5
$$ y = [-14, -4, 6, -7, -13, -5, 2, 4, 4, -16, -7, -5, -9, -6, -1, -7, 0, -1, -4, -14, -3, 2, 6, -9, 4, 6, 11, -5, 6, 8, 8, 12, 0, 3, 8, 2, 11, 3, 6, 3, 10, -5, -4, 3, 10, -7, 1, -1, -1, 1, -4, -9, -2, 10, -3, -5, -13, -7, -5, 1, -11, -6, 0, 1, 3, -9, -10, -8, 2, -1, -1, 4, 2, 2, -15, 14, -5, 6, -6, -4, 13, 2, -1, -1, -1, -6, 10, 6, 18, 9, 3, 17, 12, 8, 9, 11, -3, 11, 16, 5, 2, 11, 11, 4, 1, 1, 4, 8, 5, -3, 4, 11, 3, -1, 3, -6, -5, -4, -7, -3, -11, -8, -7, 5, -4, -8, -2, -8, -4, 9, -8, -6, 1, -3, -9, 2, 9, 1, -10, 6, -3, 3, 11, 8, -3, 4, 9, 8, 10, -2, 7, 3, 16, 15, 15, 9, 3, 1, -3, 10, 10, 5, 8, 14, 7, 6, 3, 4, 10, 9, -6, -2, 3, -5, 8, 4, -1, 5, -7, 3, -4, 3, 5, -14, -2, -5, 4, 1, -6, 2, 0, 10, -1, 6, -3, 1, 2, 12, 7, -1, -3, 1, 5, 10, 10, 9, 18, 16, 9, 7, 6, 10, 15, 14, 15, 6, -2, 17, 9, 2, 18, 12, 18, 27, 3, 11, 6, 4, 4, 10, 3, 6, -5, -4, 5, 4, -16, -1, -3, -5, -17, 0, -5, 1, -8, 6, -2, 0, 7, 6, 2, -6, -2, 1, 3, -3, -4, 16, -7, 1, 22, 6, 16, -4, 5, 13, 7, 10, 7, 11, 8, 2, 18, 21, 9, 9, 11, 13, 13, 11, 11, 9, 13, -7, 12, -6, 12, 8, -3, -4, -3, 6, 7, 2, -2, 2, -4, -10, -8, 3, -11, -7, -22, -9, -13, -3, -12, 0, 3, -3, 18, -1, -3, -9, 5, 11, 9, 1, 4, -2, 3, -1, 21, 7, 4, 5, 15, 21, 20, 6, 8, 16, 9, 17, 20, 18, 3, 2, 12, 15, 4, 11, 12, 5, 8, 17, 7, 7, 1, 9, 13, -4, -4, -4, 2, -6, -2, -6, -8, -5, -8, -1, -8, 8, -2, -6, -10, -1, 1, -5, -3, -5, 3, 5, 1, 3, 7, 6, 8, -7, 19, 20, 12, 8, 9, 15, 14, 8, 6, 7, 4, 1, 16]
5969A6j3kROk2NK0j2%qJ1KKj7J9rqpJ7pmpJ0lrj0OMNJ1j5J1Jj8K2j4kJ6j1jOn
6011eLrJ7J0pRk0J4j3m%J0%KL%qlLKJj9NPMj3OONlnQpJ1kj3%J1nmKmj6K2nkLn
6059hrJ1Kjj0J0j1JJJ6lmjJ0KJnJ3Jj9J1Mk%j4J3J1j5NJj0JRj6%kRQj2j%J0j5
6102hQJ4opKJ2k1Pj5J0knkK0rJMmmMKPj0%J2j7MmNnKJ3kknLJ0nJJNoLNj2jOPj6
6151@KLlOoLk%mnRjj2Qj%lMMrMmJl%PpLJ5kj1jMJ2j7%PKnmMkQj2KR%Kj1J2qK2
6203B0j3oJ1j4k%J2J2qpKLpKj1QOKj3PPj7QlKJ3j3qLpJPj1J6Npk%%Npj1PJ0j2
6248a0MJ1%p%J4rOmpK2j3lPNKr%lMlLmpJ7%j1j0OOj1nJ6j1NkNj7NJ5j%j2OoKN
6295Aj4JPnLNoRJnMQJLj1KJ5j2jMLmj0J0jOjlOpLKoJLMj4jJ1rmjKQpmJkj2J6j
$$ y = [16, 3, 1, 10, 16, -6, -1, 19, 7, 7, -1, 10, 12, 14, -3, 16, 7, -1, -8, 9, 2, -2, -9, 1, -2, -11, -21, -15, -11, -6, 5, -10, 1, 2, -16, 6, -8, -10, 6, -5, -6, 0, -5, -2, -11, 6, 16, 9, 18, -2, 12, -1, -5, -5, 5, 5, 7, 10, 10, 2, -1, 2, 4, 5, -14, -9, -2, 2, -11, -5, 1, 6, 3, -2, 6, -1, 10, 8, -5, -5, 6, 1, -3, -1, -5, -21, 1, -4, -6, -3, -8, -17, -6, -4, -5, -15, -5, -16, -15, -14, 2, -1, -5, -6, 4, 6, 7, 2, 15, 16, -3, 8, 12, 10, 10, -4, 9, 20, 5, 10, 11, 1, 2, 11, -5, -5, -7, 2, 10, -2, -3, -3, 7, -8, 0, 14, 8, 1, 3, 15, -6, 1, -14, -4, -6, -11, -13, 7, -2, -1, 3, -1, -5, -1, 1, 8, -2, -2, 10, -7, -3, -7, -2, -7, -5, 8, 6, 4, -1, 2, 12, 7, 8, 9, 14, 8, 11, 16, 4, 3, 9, 16, 0, 2, 5, 2, 8, 2, 5, 3, 3, -1, -6, 3, 2, -10, -2, -3, -3, -6, -2, 2, -7, -3, -7, -6, -9, -9, -2, -9, -6, 9, 7, -4, -5, -1, 11, -6, -6, 1, 3, -2, -6, -2, -4, 4, -8, -6, 3, 3, 5, -6, 6, -2, 20, 7, 1, 12, -2, -4, -4, 8, 20, 12, 5, 7, 10, 3, 5, -6, 2, 8, 10, -3, 4, 11, -6, 2, -1, 1, 14, 1, -7, -4, -11, -10, -3, -14, 2, 7, 0, -2, -2, -2, 3, -4, -15, -8, 2, -10, -6, 5, 5, -2, -2, 12, 3, 9, 5, -2, 20, 7, 4, 11, 16, 18, 9, 9, 6, 10, 7, 10, 6, -1, 16, 16, 5, -5, 1, 7, -4, -9, 7, -4, 1, -1, 4, -13, -8, 7, 6, 6, -6, 0, -6, -4, 1, -13, -12, -5, -10, -7, -2, -8, 1, 2, -3, 1, 9, 10, 13, 2, 4, 19, 7, 6, 10, 13, 9, -1, 9, 8, 14, 13, 10, 16, 9, 12, 14, 8, 9, 12, 16, 2, 1, 12, 3, -1, -2, 0, 8, 1, -3, -2, -4, -16, 0, -1]
6346aPj0oJJRLj4kkMQmpJ5NjrlJ9rj8QRLrj0L2j8mKnJ7j7J9krNLJ0j9l%MmPJ1
6393A6j1j0RonJ3pLrnJ1l%mJ0Kj6J4mJoJ4rrJ5k1J3%K%LpJ4j0J1mpJmNLjlN%p
6439cK4j1lKJrnJ5lj4MJ0Jj6Qoj1%J8mLmrMPk1J8qPoKqJ6%j0pJ6%pRqOLKpOjJ
6487BkPqMkJqN%JPj0NJMKMPk2J2J2j4Oj0NMj1kJ4pQj5MJj0Lj6PkPpM%nPjJ0pl
6536hrJ0PJkNJjJj7J8qJJ0Jmj0nNkkNPm%PJmkRmj0J2MmJj2J3rPpqjKMQkk0JJ4
6586@pl%%N%J1j2rOJ7j6lNKLlQ%J6k2J1j2Pj7J9koJ5oNqPkJkKj0nJ0QlojJmkJ
6634aPjj1NQj0LokRr%J5j9rJ2m%LkmJ0kLnRQqNmlj5K6rnJ2knMkk%J0nlKRPj5r
6684eJ6lpJ0rkK%J4j1okJJ4k0lRlnJnJJ5j4J8j1KQj9JJ2nOkPj4NMkJ1n%j2%J6
$$ y = [-1, 6, -4, -10, -9, -8, 1, 4, -10, -12, -14, -10, -2, -6, -13, 2, 7, 6, -3, -6, 13, 4, -14, -6, 3, 6, -3, -13, 19, 1, -3, -1, -6, 11, -6, 13, 11, 2, 7, 10, 20, 1, -2, -2, 2, -2, 5, 16, 5, -5, 4, -2, -7, 6, -1, 2, -7, -12, -1, -4, -4, -8, 2, 4, -12, 2, -2, -1, -7, 7, -2, -11, 4, -17, -4, -4, -2, -2, 1, -6, 8, -2, 9, 5, -2, -1, -5, 0, 3, 2, -1, 4, 4, -3, 21, 10, 7, 9, 10, 1, -4, 11, 8, -6, -2, 8, 9, -7, 1, -5, -16, -16, 2, -2, 1, -3, -12, -8, -1, -22, -4, -12, -5, -11, -9, -17, -1, -1, -11, -18, -2, -2, -9, 0, -8, -2, 1, 3, -4, 2, 1, 2, 0, 7, -1, 3, 1, 2, -6, -1, -1, 0, 7, -3, 2, 3, 7, 9, 13, 20, -2, 10, 22, 8, 14, 4, 9, 13, 2, 0, 14, 7, 15, 0, 4, 5, -5, -2, -18, -11, -13, -6, -13, -9, -9, -14, -7, -8, 2, -5, -8, -17, -7, 0, 1, -1, 4, 5, 4, 5, -12, 6, -2, -1, 9, 10, 6, -4, -9, -4, -6, -8, -3, 4, 0, 0, 7, 8, 4, 2, 11, 7, -3, 9, 13, 9, 10, -2, 11, 2, 9, 2, -6, -7, -5, -1, 7, 5, -15, -14, 0, -7, -10, -10, -10, -5, -5, 6, -6, -15, -9, 8, -8, -11, -6, -4, -1, -4, 4, 4, 20, -2, 9, -3, 4, -13, 6, 4, -2, 13, 7, 12, 4, 11, 9, 10, 8, 10, 0, -5, 5, 13, 10, 4, 3, 4, 0, -2, -1, 6, 5, -6, -1, 7, -3, 0, -6, -8, 1, -8, -8, 7, -12, -21, -9, -13, -13, -10, -12, -16, -6, -8, -5, -10, -1, 7, -1, 4, 0, -3, -18, 8, -1, -6, 6, 4, -1, 3, 1, -1, -1, 9, 4, 1, 3, 12, 19, 4, -5, 11, 8, 1, 11, 2, 0, 2, 2, 16, 5, -1, -3, -2, 12, -8, -11, -2, -5, -10, -9, -14, -13, 2, -12, 6, -5, -3, 5, -14, -13, -1, -6, 0, -2, 5, -9, -4, 0, -2, 9, 4, 4, -8, -8, 8]
6729HoOKoLmJnJ9j7J1nk3K1Pk0J4J4j6pJ2rlLoJ4pkOjrPqjkjlOlnJ4lj0NOqj1
6776b2J1J2lPj8K9pj3kQKPj2jJ5j7K2j1mj0NJ0oNMnmJ1pLnrPPrnO%Mj3KPj0Rj4
6821a4J5jkJ2j8OmRj2M%JoNJ0j4kJ1Nlj0JkJ1LmmJ2Nj1NQj5J1j0PnMMrj0lQj%
6866cKJ0j7RPpOj3RmnQkj0J8j2MNpj0J0jnKqKJ2rLQmJ1j3oRKlj0J7K%pJ2Pn%J1
6913B5k4J2%lrOrK1rJj1Rj3LkLkLKnmmK4k6QKmPOj1QOj3JQnj5K2Kk7J6j2J8j5
6957a0LjKLkK1j6Mj2J0rQ%J0qQpMMj1KJ9k0KJRj7R%Omj5QjmJqJ5j0JJ4j4%oPj
7003enJJ2koKKLQn%qJ2j2Pj1J0lPj0QLj4J9qJJ8k6MJJjo%nLJ3lqJ4%Kj0qJ2jj5
7050iJ1qnlKJjnOPlrKJ2JrJnkJ0NNj7NJ0qQrMNJpJ7onpJ9k3J9jMj1nQmKrJ6j1
$$ y = [8, 2, 8, 10, 4, 7, 3, 4, -1, 18, 1, 12, 7, -16, 5, 12, -8, 6, 20, 4, -3, 9, 0, -3, 0, -6, 8, 1, -1, 5, 4, -5, 2, -6, -7, -9, -10, -13, -7, -10, -15, -1, -4, -14, -9, -3, -11, -22, -11, 1, -2, 5, -13, 16, 9, -4, -6, 2, 4, 11, -1, -2, 13, -4, 18, 7, 3, -7, -2, 8, 2, 7, 11, 6, 2, 13, 6, 9, 4, -5, 2, 9, 0, -5, 1, 1, 5, -8, -6, 1, -9, 0, -14, 1, 0, -2, 10, -8, -2, -6, 3, -9, -5, -5, -4, -10, -5, 5, -9, -11, 0, 5, 2, -8, -7, -9, 2, 5, 1, -3, 9, 14, 3, 8, 16, 1, 12, 2, 9, 4, 8, 12, 3, -7, -10, -2, -3, -3, -1, 9, -8, 1, 8, 1, 7, -6, 3, -1, -6, 2, 0, -10, 8, -4, 0, 5, -2, -12, -2, -3, -8, -6, -14, -12, 0, -9, -6, 2, -2, 9, -4, -10, -1, 1, -2, -12, 5, 7, 7, 0, 12, 19, 14, 14, 25, 1, 13, 13, 10, 1, 7, -2, 19, 10, 11, 0, 9, -4, -1, -3, 0, -2, 1, 3, -2, -6, -10, 14, -12, -4, -2, -6, 1, 7, -4, 4, 10, -3, -2, 6, 1, -14, 8, 10, -17, -1, -13, 5, -10, -7, -8, -6, -3, -5, 16, 0, 4, -8, 2, -7, 1, 1, 11, 3, 11, 4, 8, 12, 1, 3, 22, 2, 4, 5, 14, -3, 6, 6, 12, 8, -7, 1, 0, -4, -3, -11, 4, -6, -5, 9, -5, -5, -11, -4, -5, -10, -9, 3, 1, -5, -3, -1, 2, 10, 5, 5, -3, 9, -3, 4, -7, 3, 0, 7, -3, 5, 8, -6, 13, 5, 6, 24, -2, 2, 3, 4, 3, -3, -3, -8, -5, 8, 5, -3, 11, 11, 13, 3, -5, 7, 6, -9, 2, -6, -11, -14, -12, -11, -12, -17, -11, -4, -7, -16, -14, -2, -1, -10, -9, -14, -16, -6, -1, 4, -13, -8, 2, -6, 2, -7, -3, 2, 3, -4, 13, 7, 2, -5, 14, -9, 10, 9, 13, 2, -3, 5, 1, 3, -6, 10, -1]
7099aLlK0j0q%MmKrJ7j6O%j5J9j3J6lk3QmK1pnMnKKj1MjQMj4LkJ4rjNoOMj0NN
7146Bj7J7KklPJ0j4klKj0K4j6PpMLj4PRlj5jKJ8qoj5RQoK1j7JlPkrJ2Pj6LmRR
7192Gl2K5ljrQjnMQOQj6%J2nKkojORpKJJKmPpmqJ3J0j3j9J6qmj2J9%jpjOoMOj8
7242a8J7lJolQJjmPPmLjjJ0nmqJ7nkj1rJ8rJ1JPj5MKlrJ2rOjmJ4pkrJ7j7J8pq
7290dKJj2J5j3Pj2J0mllJ0omMK1qJoJ2j4jrJ8NkjKLnJ4j7QKqmQjJ0mrJ9j9oK4
7335B1j4nPrNJ0qnmPLlkoLqLKkMMj1rNJ4rKkMj1PMmNKpKJ1j8NJ2mLoJ5j1lKKj
7385BJ2lj5jJ6oRnj0PpnJ6j5J1lJ7j1mj0NKj0RKJqRj4LkOKkoKlPkMkmK%mNmOn
7434fNNnMLj4QOJPk%j9RJ0qrJ8mj8OJ0Mj3J1JlomkLQ%ql%LnJLj3Q%Mj1kJ2rJ3
$$ y = [-1, 2, -1, 19, 9, 1, 1, 5, 1, 3, -6, 11, -5, 1, 1, -14, 5, -8, 8, 5, -18, -10, -14, 7, 0, -5, -1, -6, -4, -2, -13, -9, -10, -2, 2, -12, -9, -11, 3, -6, -7, -2, -8, -2, 2, -8, -3, 2, -15, 2, 4, 2, -1, 6, 16, 2, 0, -3, -1, -11, 13, -3, 4, -3, 1, 4, -10, -3, 6, 3, -12, -13, -11, 7, -1, -7, -22, -13, -5, -11, 10, -7, -6, -9, -2, -4, -13, -1, 6, -10, -7, -11, -2, 7, -25, 0, -3, -4, -13, -5, -6, -11, -7, 1, 7, 15, -1, -1, 11, 6, 8, 6, 0, -1, 5, 14, 7, 9, 10, 11, 13, 9, 16, 9, 5, -3, 10, 20, 7, -12, 4, -4, -8, -20, -1, -1, -2, -9, -10, -4, -10, -6, 0, -18, -1, -4, -3, -9, -12, -4, -3, -4, -8, -1, 6, 2, 5, 4, 3, 13, 8, 4, -4, 13, 8, 6, -5, -14, 4, -5, 6, 7, 14, -1, 3, 5, 2, -7, 5, -4, 2, 1, -3, 11, 4, 2, -7, 10, -7, 11, 4, -4, -2, -1, -13, 2, -11, -4, -16, -6, -10, -13, -16, -6, -12, -16, -12, 9, 1, 2, -4, 8, -6, -7, -16, 2, 7, 5, 4, 6, 9, 4, 18, 1, 9, 11, 3, -1, 7, 6, 16, 12, 3, 22, 3, -3, 21, 7, 2, 9, 0, 5, 15, 7, 2, -2, 5, 8, 5, 3, -3, 0, -8, -5, -3, -5, -1, 3, -8, -17, -12, 2, -7, -5, -7, -3, -14, -7, -3, -7, -2, 0, -7, -5, 6, -12, -7, 5, 1, 4, -2, 13, 2, -1, 1, 3, 2, 14, 11, -4, -5, 11, 5, 14, 9, -1, 6, -1, -6, 10, -5, 6, 3, 20, 9, 5, -5, 0, 2, -8, 1, 3, 4, -4, 5, -9, -6, -8, -2, 0, -2, -8, -6, -9, -2, -4, 0, -2, -6, -4, -4, -8, -3, -7, -1, -6, -1, 4, -1, 3, 6, -8, 0, 6, 7, 14, 12, 12, -7, 2, 12, 4, -5, 13, 9, -9, -3, 7, 11, -2, 9, 10, 7, 1, -3, -5, -2, 6, 6, -2, -5, -5, -2, -7, -6, -3, -16, -8, -8, -4, -15, -17, -5, -14, -1]
7483aj1MOkpKNnJ5nO%jqlK0qNj1RlLjJ0j2j2J2np%J3Oj3%J1pnqJ0P%jqPj8OmM
7531eN%Pj2pLPQj0Pn%lqJ3nLJPpkLRplJ4j9J4jomJKOjJojJ2kMj5MJ1oqoJ7nJj2
7582fJRlmjkLJ0JpopOjQnOppMjOpRKJrJPlKrPJ3j6J4J2j8lPJ3orMMmjJLkKjj1
7635@NJMJ0k4J4jj3Nj0J7qOj6JLj1PNkmJ4j1JJ3j0j2ORj2Qj1J2KKqJ2Kj2kJ2J
7677E%oNJj5J0J4j0JJNpJ3%qlpJnRKPooKqkJkQQj4kJOOj0%qMNJ0k3NJ1LK%oLJ
7728Br%LJLJ2j1KNNkj3MNKpLJ3j8NnMk%J5j0KlnlljMmrQJ1j0j2J1oJ7j9J0nOk
7775flJ2qLKnQOj0%lJJ5rkNlnLJ%Qj5J2Kj0OoPMjKpNNoJ1j0MploNknJ0lRkppK
7827cnqRMj3J0Qj0mMJnJ2mPoPoPmrQjLlJ5j6JoJ1lj0P%lQKJ1rpPnPJnnOkQoKm
$$ y = [-1, -12, -8, -2, -4, -11, -9, -4, -9, 6, 1, 7, 7, 6, -2, -5, 15, 7, 12, 1, 10, 7, 10, 9, 19, 7, -5, 7, 2, -5, -5, 8, 14, 1, 1, 12, 5, 0, -8, 2, 9, 9, 8, 0, 7, -11, -5, -9, -5, 0, 0, 7, -5, -12, -9, -2, 6, -4, 3, -2, -2, -5, -13, 0, -5, -2, -1, 6, -1, -3, 0, 9, 2, -1, 13, -6, 8, 7, 1, -3, -2, 0, 6, 5, 6, 0, -1, 11, 9, 13, -2, 2, 13, 7, -1, -7, 10, 5, 6, -6, -5, 4, 1, -3, -4, -6, -3, 7, 8, 1, -5, -12, -6, -7, 1, -4, 2, -5, -12, -8, -9, -3, -10, -1, 1, 2, -7, -6, 1, -2, 0, -9, -2, 11, -5, 9, 21, 3, 0, 7, 20, 14, 5, 9, 13, 9, 8, 9, 12, 10, 12, 11, 0, 5, 6, 10, 20, -4, 10, 9, -4, 1, -9, 8, 0, 6, -10, -9, -6, -17, -10, -5, -7, -11, 3, -8, -7, 6, -4, -16, -10, -1, -13, -5, -16, -4, -2, 0, -8, 4, 6, -6, -8, 4, 5, 5, -1, 4, 5, -10, 0, 14, 4, 5, 6, 11, 4, 17, 17, 9, 6, -1, 0, -5, 4, 6, 13, 7, 1, 3, -5, -7, -6, -8, 0, 8, -6, -8, -7, -1, 5, -5, -5, -13, -9, -4, 6, -17, -12, -1, 2, 4, 4, -2, 1, 2, -7, -7, -4, -3, 0, 12, 1, 3, 8, 13, 11, -2, 2, 7, 9, 2, 5, 18, 0, 5, 0, 4, 2, 2, 17, 7, 9, 6, 1, -2, -5, -6, -2, -6, -15, -7, 4, -6, -18, -7, -13, 4, -15, -5, -10, -4, -6, -9, 3, -5, -2, 0, -5, 3, 9, -1, -1, -4, -3, 12, 3, 1, 6, 3, -2, 1, 2, 2, 10, -5, 7, 9, -1, 5, -1, 6, 10, 9, 11, 4, 9, 14, 8, 19, 9, 13, 6, 3, -3, 2, 0, -5, 5, 2, 11, 9, 2, -5, -3, -8, -16, -7, -3, -16, -6, 2, -8, -12, -8, -7, -12, 0, -4, 3, -3, 4, -2, 5, 1, -8, 0, -1, 2, -1, 14, -2, -1, -7, 4, 1, -9, -2, -2, -5, 3, 5, 16, 7, 0, 7, 2, 9, 10, 5, 0, 6, 4, 12, 6, 8, 4]
7879DljLj4OLKj0Nk%oNjoRkmkLkRjJJjmJ7j6J1lJ2j9JJ1MqONpQoJ%j1OPomj0J2
7930CpK0k2J6nmkqJ0NpJ4oqlL%rJ6j3Pj2Q%j6J6%MMj7RMqqJ2KjJ0jJ1j0Nj8NJ
7975@MJ2j5lJ0oNJrJ1j3J2l%pnJJ2j9%J3nOj2J5NnqLj0LRjk0J2JJ1r%MlpKJ0n
8020crJQJ0j3rJ1NmjNlkNJ6j1mrK0NrnnJlJ2qOoNjj5PONoM%qlPnlPKpmoJ2oJn
8072a2J1j3J4kj4KJ0oJ5pMj3PnMNJoJ3j4JKLmOR%rJJ3rJ1j3%pOnJ1j4JJ0qKlo
8117h%J5j3M%pNmKOMj6QnJJNpLrJ0JJ0j5R%jNjjqJ4j7QmRj0KROrLqJ8lmpRj2K
8167@%J6nj1qQMj1RNkrmJ6j1MolnJ8jooJ
$$ y = [4, 1, 0, 3, -11, -5, -2, 0, -10, -5, -7, -7, -13, -8, -9, -15, -6, -8, -12, -14, -11, -13, -4, -5, -4, -3, -4, -8, 9, -7, 4, 1, 13, -6, -5, 6, 10, 2, 8, 13, 6, 14, 8, 9, 9, -2, 4, 11, 5, 1, -9, 3, -4, 16, -6, 10, 5, 1, -1, -9, 1, 6, -1, 13, 7, -1, -4, -1, -1, -10, 6, -7, 0, -12, -4, -4, -20, -4, -4, 0, 4, -13, -4, 0, -8, -16, -4, -2, -3, 7, 6, 17, 7, 12, -6, -1, 0, 4, 16, 1, -2, 8, 2, 7, 8, -1, 10, -3, 9, 6, 6, -1, -6, -5, 7, -12, -12, 1, -4, 2, -10, 5, 10, 5, -3, 0, -10, -7, 2, 1, -19, -7, -6, 5, -4, -4, 0, -3, -10, -8, 2, -3, -12, -11, -3, 7, -6, -15, -4, 1, -3, -4, 1, -2, -4, 1, 17, 6, 2, -7, 13, 18, 9, 4, -1, 0, -3, 9, 1, 7, 1, 6, 5, -10, -3, 3, 8, 2, 6, 6, -2, -5, 2, -3, -6, 1, 3, -4, -8, -14, -2, -8, -7, -12, -1, -14, 0, -2, -16, -14, -4, -10, 5, -2, 2, -11, -4, -9, -5, 0, 1, -5, 8, -6, -5, -3, 0, -4, 2, 11, 11, 2, 3, 16, 7, 18, 5, 5, -2, 4, -1, 10, -4, -3, 7, -1, 1, -2, -8, -8, 7, -6, -2, -2, -9, -4, -8, -6, 0, 4, -12, -4, -9, -8, -7, -2, -9, -6, -15, -5, -4, 6, -9, 0, 0, -1, 4, 3, 2, -6, 8, -9, -1, -5, 4, -6, -4, 5, 11, 2, 5, -3, 15, 12, 8, 1, 10, -2, 0, 0, 16, 11, 0, -8, 0, 4, -7, 2, 7, 5, -4, -8, 8, -3, 1, -5, -8, -13, 5, 4, -2, -8, -7]
8191g
$$ Imaginary data points
##PAGE= N=2
##DATA TABLE= (X++(I..I)), XYDATA
0@%%%%%%%%%%%%%%%%%%%Mj2J6j6J6j6J6j6K2l0L2l2L7m5M8n3O1o7P5q4R2j02J13
42E9j25J38j52J70j90K09k33K62k94L33l79M36n11O10p51R64j330K132o916N747
62A79J5117j0317j3837L56J3546L062r845q131O294R853P54p963l365M340L964
77D007l889m881K277O998J320n342m102J823K701k39j260J07pK2J722J566k890
94f7m834M24O077L101l936m346J919M376m32m376j121L974K783k780l663K099
110h02N168o05o902k908O447O285l935q028P23Q076K242o900m891L905N241j361
126A755l926Q50L650l20m127j516L292L073j410l016O93L575O82l860k920J926
142a599L134k4j073J186O71l215l077K431M223j160m375P26N367R28n821l981
$$ y = [0, 0, 0, 0, 0, 0, 0, 0, 0, 0, 0, 0, 0, 0, 0, 0, 0, 0, 0, 0, 4, -8, 8, -8, 8, -8, 8, -8, 14, -16, 16, -16, 21, -24, 24, -29, 32, -35, 40, -44, 48, -54, 59, -66, 72, -80, 90, -100, 109, -124, 138, -156, 177, -202, 234, -277, 333, -418, 546, -784, 1348, -5568, 179, 15296, 4979, -8858, -8502, 5044, 8106, -1739, -9870, -3576, 6277, 7031, -932, -4297, 43, 4007, 118, -4763, -2486, 4512, 5832, 490, -3612, -1789, 912, 673, -587, -480, -487, -465, 1257, 2823, -67, -4901, -4477, 1600, 4701, 765, -3581, -1662, 2714, 2282, -2094, -3215, 759, 3542, 762, -2901, -802, 4366, 3761, -3141, -6049, 398, 6683, 2748, -5280, -4557, 3519, 5761, -1139, -6030, -2125, 3116, 1755, -2171, -1321, 2329, 2009, -2118, -3634, -342, 2731, 1321, -1695, -1002, 2573, 3255, -605, -3525, -1599, 1535, 1511, 438, 1624, 2295, -920, -3997, -1566, 2657, 1497, -2878, -2152, 3215, 4143, -1678, -5659]
158e659L327M817p17l436Q66M090j36n671l181M748O213j672o795n10P408L239
174F931p565p607M140R690P86q026l467N571M160m383n759J834O363J636m488
189a84l359K295L743p78m166j263L749L704r30l437j260J299J166K97%q55j288
206a267Q83K928L06m101k823L011M110j473m322L39M493R72m357k746L125L837
222B915j643m367L15N340K416m710n290K154O327N89n788k189N457M035m382o013
238d834J705N943K98n021j183M717K664l931m823Q42M564J825k387k057J326K100
254A748q33k644n40J984J327l09L22R70j228k976j72L285J402k687j467L147K451
271C780l357m644J208M935R19m003j761L611L126k913n222nN430L179l299m210
$$ y = [-5659, -2332, 2485, 1768, -1668, -802, 3288, 3152, -2519, -5700, -952, 5261, 3589, -3206, -3716, 3692, 6931, -634, -8241, -4101, 5589, 6375, -1651, -5118, 453, 4613, 230, -5529, -3695, 2668, 4304, -184, -3543, -1248, 2495, 1717, -2449, -3712, 37, 3741, 2811, -626, -1886, -587, 579, 876, 876, 21, -1267, -384, 2544, 2850, -1251, -4074, -1063, 3047, 1574, -2748, -2409, 2084, 3056, -1301, -4047, -922, 2915, 1272, -3095, -2780, 2560, 4976, 266, -5024, -2870, 3457, 4046, -1742, -3931, 1526, 5561, 1179, -4834, -3129, 2814, 3112, -1909, -3092, 1625, 4289, 358, -4465, -3623, 941, 2766, 379, -1678, -352, 1748, 915, -1729, -2269, -285, 1042, 733, 1055, 2025, 797, -2179, -2351, 934, 2336, -351, -1818, 1329, 3780, 423, -4221, -3013, 1922, 2841, -1162, -2923, 688, 3814, 901, -4321, -4326, 1104, 4283, 984, -3226]
287c226J652M664l03n072j648M426L369k555l365J476L041j086l442j14L032J273
303B122j836j516P41J144l61j047k90N05L90J06K86L87m65j198j25J619Q78j712
321c72j453K035K813j284l786r2L727R22l729j839L841L545k667m999J19M461
337A242J495l564k598K775M094r26m783j695L586K966k217k946K133M110j123
352B549n216j161M523K756l016k974K396L678j241m399j251K916K351q80j655
367f24L39J292l80j914q14J384J532k25p41M45N13j094j205Q47J447n58j028J476
385F92K082j604l761j9M055J768l248k790K288L687q62m318j567L156L022j295
401A286l210QL063J021k926k253K134L022q62k965J93K933O31k515j314J629J294
$$ y = [-3226, -1574, 3090, 2787, -2285, -3933, 493, 3862, 1307, -2058, -582, 2459, 1373, -2069, -2183, 849, 2122, 286, -1230, -489, 655, 294, -753, -1043, -538, -148, -42, 244, 631, 166, -1032, -1157, 462, 1340, -372, -1825, 210, 3023, 1739, -2047, -2139, 1588, 2510, -1219, -3058, 783, 4328, 1661, -3338, -3219, 1242, 2737, -827, -3425, -650, 3444, 2518, -2265, -3960, -374, 2592, 375, -2571, -438, 3672, 2549, -2667, -3828, 695, 3451, 435, -2539, -143, 3535, 2294, -2105, -3356, -440, 1911, 1031, -624, -285, 1007, 627, -1287, -2101, -717, 815, 590, -151, 294, 807, -287, -1492, -645, 802, 244, -784, 692, 2774, 1170, -2591, -2610, 1445, 3213, -35, -2825, -537, 3150, 2288, -2030, -3597, -441, 2581, 1286, -1924, -1916, 1147, 2168, -758, -3011, -877, 2145, 1283, -1682, -1489, 1444, 2075, -440, -1754, -125, 1169]
418A169r00o96R99O06j187r11R24J017r68j558N05K167P23j904j953P32K037j44
436F58k069j00K736J184k672k267J945K699j475l153J116M280O66m165k657K496
452g78L104j099k953L08L155R98k889k664J261K871j30k618k64L043J374l030
468c11l043J538L406L2k456k05K189N34k025j178J163J090m69l64Q92N83j037
485C39j408L9J134N19o20m15O72N74r45j290M94J581j90j768J54K548P60k895
503g17k147K205L105r59l210L0L176J127k587k127J422K331m54k280l42K196J308
520B077j824k287O88K428J45k294p66K128J449j545j683Q29J301p80j048J258
536G6J713q57k086J37J998K90j955q86J880J943q57k426n57J758R96j481j329
$$ y = [1169, 269, -427, 572, 1178, -9, -920, 4, 1021, 53, -1505, -1000, 1167, 1890, -14, -1967, -1235, 802, 658, -1411, -1511, 1225, 2409, -263, -2530, -585, 2114, 639, -2514, -1398, 2882, 3548, -617, -3274, -778, 2326, 1227, -1726, -1418, 1737, 2735, -154, -2818, -1557, 1314, 1184, -1434, -1698, 1345, 2719, -311, -3354, -1816, 1590, 1622, -834, -1039, 1150, 1684, -341, -1519, -356, 734, 265, -99, 793, 1376, 339, -1069, -1030, 104, 623, 3, -412, 260, 834, -111, -1401, -907, 674, 484, -1284, -1130, 1418, 2178, -717, -2864, -659, 2446, 1487, -1723, -1693, 1483, 2610, 23, -2104, -682, 1649, 1195, -1085, -1427, 769, 2077, 253, -2034, -1346, 1082, 1227, -1067, -1833, 295, 1744, 199, -1484, -655, 646, -134, -1182, 76, 1789, 932, -1154, -1017, 981, 1271, -684, -1570, 310, 2253, 1396, -1030, -1587, 171, 1167, -314, -1643]
553a643J475K270p87k948n95K502J201k022j396J997K177j217k534N4J920L67
569H21j292r1J610O19j534j491O57J578mj494l54J676J150j541k168M15K159K70
587I86j769l35J835O66j936j299J453J598q85j513P39J783j34j747n81J263Q96
604A020p43q99N68J139k84j471l53J407P78j421j375J244K014o63k445j68K274
621F22O92k064j105J926J765j271k014N84J979j9j933o19J857J631r77k068j55
638a169J721O90j525j127J349J683p95j994N2J609j0j622q5J977Q04j696j338
655a476R73J251o65j105O60J557K6j462o89R43Q19p25j071O84J777J00k088j253
673a744J453J619r65j794O80K121j04k231p24J689R92j264r73J236J401p33j666
$$ y = [-1643, -168, 2102, 1315, -1633, -2228, 274, 1475, -547, -1943, 54, 2231, 1014, -1520, -1466, 454, 821, -471, -562, 1048, 1667, 133, -1358, -701, 877, 873, -621, -975, 701, 1851, 310, -1858, -1443, 716, 986, -783, -1118, 717, 1383, -553, -1852, -399, 1199, 314, -1199, -460, 1323, 1189, -558, -1139, 124, 1020, 277, -622, -54, 1085, 801, -670, -1023, 384, 1162, -259, -1634, -390, 1624, 961, -1484, -1652, 622, 1314, -750, -1855, 71, 1836, 565, -1449, -865, 1114, 1095, -838, -1457, 400, 2031, 1054, -1014, -1169, 552, 1242, -283, -1410, -61, 1622, 827, -1167, -1115, 494, 484, -1138, -1223, 754, 1558, -138, -1476, -503, 748, 83, -1022, -362, 1195, 1221, -241, -930, 13, 832, 107, -964, -280, 1497, 1597, -491, -1744, -291, 1328, 363, -1431, -751, 1370, 1266, -965, -1689, 0, 992, -272, -1245, -9, 1392, 659, -1007]
690a007p3J435N97r31p58P82J108m24j396j83J306M98j238p50J285J137j194j677
708a483O64J839k47j878j89J809P27j503j071J071J279o55j416K60J595N02j313
725ij081Q63J447l97j728k19J816R62j476j434Q99J396p42j583M57J762P9j626
743f14n02J258N86j147q33R75J333k72j242k76R36M71q51p27Q90J369l47j659
761f52l39J479N89j459r94J423J579r18j896J19J553J21j398k57J402P74j056
778G0j119M58J076j00r54q8J162O97r28j166M08J293j01j303r3J497N09j580j067
797a329J188J326r05j560N49J700K6j681o39J235R41p37j039L66J195J46j071
814b89n93Q92R15o14j118L44J385P5j402m62J220O61j162r35R78J133o97j247
$$ y = [-1007, -1080, 355, 952, 21, -737, 45, 1153, 729, -667, -850, 456, 954, -284, -1034, 251, 1388, 194, -1483, -819, 1020, 773, -1105, -1294, 515, 1242, -261, -1332, -261, 1018, 363, -1053, -793, 802, 1304, -9, -1090, -227, 1220, 823, -905, -1124, 692, 1654, 178, -1256, -357, 1039, 297, -1286, -829, 933, 1012, -614, -1116, 142, 728, -419, -1252, -277, 1056, 784, -458, -734, 202, 673, -178, -905, -15, 1354, 1007, -652, -991, 488, 1077, -382, -1376, 47, 1626, 708, -1188, -1069, 484, 605, -793, -1050, 352, 1126, 70, -1049, -591, 485, 385, -569, -657, 505, 1202, 274, -892, -484, 809, 708, -595, -688, 809, 1318, -262, -1329, -141, 1185, 280, -1280, -731, 969, 995, -686, -1325, -90, 851, 114, -925, -559, 636, 782, -289, -882, 10, 925, 311, -807, -463, 922, 997, -405, -867, 353, 1014, -148, -1083, -105, 1028, 331, -916]
832i16L58J201j65j297k54J235Q06q11j025L31J126O6j153n19J142J110o58j368
850g91K45J388Qj495l91J519R00j192j186O55J124n06j186K19J222K21j027n43
868h16O71N89n04p53L48J088J99j055o52Q45R40o46j153M66J472Mj519m82J284
887C26O86j155r29R31J201n26j335k0J097L26r03n79O53Q79k41r75j55R15M72
906F68p92o54P52R89n00j152K24J251j7j277k95J272N88j081q84P56R70n21j128
925h31J12J103L39r25p08N79R56k21j107j83J150P00q75r45O21J075l48j193J32
944e69J256K17j125m40R16M97q30p07O11Q42l05q55rO97J92o82m78N61Q15k21
964C83r47q4R89L98r94p12R40J134n48j289J91J281Q2j252l89J109P05q16r09
$$ y = [-916, -558, 643, 478, -819, -1073, 162, 968, 157, -868, -537, 589, 655, -498, -1017, 125, 1235, 577, -791, -546, 842, 850, -645, -1036, 483, 1383, 191, -995, -340, 784, 278, -908, -689, 533, 754, -273, -816, -145, 444, -60, -813, -465, 623, 822, -233, -885, -40, 900, 254, -899, -433, 1039, 1043, -476, -958, 326, 1012, -143, -1072, -141, 1060, 534, -801, -821, 276, 602, -301, -880, -227, 652, 411, -564, -719, 196, 668, -124, -778, -26, 963, 463, -689, -465, 786, 769, -508, -803, 469, 1057, -24, -908, -152, 818, 297, -831, -719, 384, 723, -202, -910, -331, 625, 404, -703, -886, 264, 964, 89, -856, -235, 840, 492, -701, -569, 687, 904, -221, -661, 255, 752, -78, -785, -174, 668, 363, -492, -501, 196, 388, -294, -772, -211, 604, 383, -564, -648, 341, 739, -255, -967, -27, 1107, 559, -730, -539, 742, 824, -428, -817, 292, 997, 181, -728]
983g28L73Q85j06q74k64P54N81n07q05J73Q66Q9q71l26R06O34p23p95N69R19l88
1004C62r92K19J092L7j009l06Q49M67p13o95M56P87j46q36j94O88M89n68p71L09
1024d75R97M9j009l48R41O52q14q09O43J019l56j031J28R83R0r15l50P87N19n52
1044A49o77K34O84J0p30l47N86O33l72p99R3R00J37r04l62Q76O35o92p24N20Q49
1065F99l39q54J66Q47N4p67k52O47L76m96o02K42O73L2p27l42O19O15m83q75K25
1086e42J039J21j045l79R52O95p79q46N45R67k21r30j7Q19K51o68m46M27N45k11
1106B77n78m5N03K24n21m40M09O02k58p38R8Q10N7q10k38Q27M74o78n94N58O98
1127F37l47p80J56P99J19p00l60M88N11k85o62rP06K85o66n94M62P68k56q75M7
$$ y = [-728, -355, 530, 424, -450, -714, 40, 621, 114, -691, -518, 348, 437, -434, -760, 146, 780, 57, -738, -169, 750, 362, -630, -411, 681, 718, -291, -597, 252, 719, 6, -689, -233, 554, 408, -428, -622, 66, 555, -13, -784, -475, 522, 571, -438, -786, 155, 807, -7, -816, -173, 846, 490, -541, -413, 570, 660, -255, -605, 182, 701, 149, -528, -294, 390, 400, -330, -677, -91, 542, 170, -629, -536, 364, 501, -403, -765, 111, 746, 54, -670, -150, 699, 360, -494, -328, 519, 573, -194, -446, 201, 577, 81, -521, -279, 394, 426, -301, -643, -24, 591, 108, -767, -542, 497, 618, -427, -806, 146, 841, 62, -784, -239, 728, 507, -423, -440, 379, 630, -38, -484, -57, 488, 277, -301, -346, 157, 381, -140, -580, -171, 431, 173, -565, -467, 343, 400, -410, -648, 179, 653, -25, -619, -61, 637, 290, -490, -334, 465, 584, -116, -476, 12, 523, 238, -424, -433, 273, 558, -108, -702, -240, 528, 272, -603, -556]
1148e56R36J77q64m10P68N90n44o14L59O93j95o39lN72J83m26l36K72M24j40n65
1169c18j17N92L09n28n32L86O51k59p70J04Q25J08p66k63P14M04o03m99N02O38
1189E78k71o53M2O12J90n31m12L67N84j23p20j87O77M29o26o59M35Q31k26r18
1209e81m1Q73K84p16m06N63N26l71m98J81M99ol92j00L14J96k44l17J50M01k4
1230B91n25j55N09K80n08m72M68N94l43p31J51P89M7p36j99P23L87n40n40L01
1250b09O15l1n35j45M78L39l82n42J41O25J05o37k94N76M34n49o63L62P66j33
1270C21p17j9O24J38n67k57M70L81k37l56J33L35l1l56j15L45L13k30m15Q0M55
1291B95j5n90j39O03L35n53n17M32N78l18o79J64P26R6o60k56N24L93l13m64J42
$$ y = [-556, 380, 557, -307, -717, 51, 641, 97, -517, -158, 535, 340, -299, -302, 270, 453, 27, -309, -37, 387, 247, -318, -435, 157, 466, -62, -594, -208, 443, 184, -586, -482, 343, 451, -315, -578, 136, 540, -63, -562, -60, 578, 307, -346, -304, 308, 498, -33, -445, -78, 506, 383, -337, -524, 153, 582, -44, -703, -268, 563, 337, -581, -622, 251, 535, -181, -587, -24, 502, 131, -367, -186, 313, 307, -85, -185, 129, 325, 81, -236, -86, 315, 291, -234, -389, 120, 400, -108, -580, -112, 482, 139, -592, -441, 348, 395, -341, -540, 183, 570, 30, -510, -209, 406, 375, -160, -305, 173, 512, 130, -412, -271, 354, 459, -178, -472, 104, 538, -11, -674, -312, 454, 321, -396, -415, 209, 347, -220, -477, -7, 374, 137, -219, -86, 249, 218, -138, -253, 92, 405, 175, -240, -160, 295, 280, -310, -449, 154, 489, -64, -581, -149, 429, 111, -568, -404, 322, 418, -242, -498, 26, 419, 106, -358, -216]
1312b16N40R3m72l11L66M90k24n98LO46J79o49l73N37N03m23o02K22N77q6n25
1333c23%M66J20l76k17L01K37j48k48J16L20M1l62k19L10L29j98m32J41N41l4
1354C65o87k20O17L87n07m73L89N78k76o75J9O21K07m06k63L03L48j72m41m1M68
1375A41L02l24l81K22M57j78o05qO44K22n48l42M18L52m00m51K55M93p2m18l2
1396b53L22R0k75j72K37K89p0k99m5L08J39l10k68L22M25k38n40Q5N92J4o30j99
1418d76N85L61n00m91K99N74j27n36q7M44K63l02l39J57M27N1l92k28L37L50k42
1439A28l92J90M75p2n64q6M80J63m32j83L66K64l38l44J53L17o6k57K6L15R4l09
1461g2k76J73L60K2l26p0L85K16m05m24K72N36j14n08K2N27M9n91k64M55M05k59
$$ y = [-216, 324, 417, -55, -366, 0, 490, 266, -332, -329, 317, 496, -153, -526, 11, 514, 91, -511, -289, 288, 202, -323, -323, 143, 263, -113, -330, -29, 208, 60, -188, -72, 248, 289, -73, -292, 18, 347, 149, -283, -142, 399, 365, -322, -542, 75, 462, -45, -518, -129, 449, 173, -502, -483, 138, 345, -61, -324, -21, 327, 155, -286, -327, 141, 443, 119, -262, -40, 417, 239, -366, -374, 270, 492, -56, -398, 20, 372, -28, -479, -224, 269, 197, -221, -253, 69, 159, -116, -288, -51, 238, 168, -131, -176, 132, 271, -39, -307, 15, 440, 202, -338, -253, 339, 353, -277, -476, 109, 470, -30, -521, -222, 352, 225, -311, -398, 46, 309, 7, -332, -175, 252, 303, -89, -317, 20, 370, 128, -264, -74, 401, 329, -235, -321, 159, 322, -110, -293, 73, 337, -1, -345, -192, 125, 59, -198, -172, 143, 237, -72, -348, -175, 185, 207, -119, -189, 196, 412, 7, -417, -145, 391, 277, -231, -209, 318, 367, -224, -488, -33, 372, 113]
1483A13m15J30L61k6l73j51K91K97r1l03J3L22N2l84j63L98L45k54m22J69M36
1504C45j14m67j7M68J17l99j97K82K08k49k64J32L14j0k88j30K53K17j50l14Q6
1525a77L50P4l54j65L68K82l39l78K62M48j65m90K3N22J36m77k98K79L13j33k97
1546b16K2K99J06k55k52J29K80rk63OL55J10l74k66K72L42j64k97J75L29j42l99
1568b12mL42O2k69j01K91J67k59l39M6L27J39k13j76J58K59j35l83J8M16J53l38
1590e1j81L40K67l59l94K11M79l3m02q0L15J24k79k33J70K45k1k18p4J90J33k09
1612f0k17J46L31k4l54n4L40J65l01k00K54K45k01k64J73K83j06l12J7K72O2k63
1634f8j53J84K30p3k62r7K15J47j68k02J84L19r8l85n1L85J25l49j67L74L19k62
$$ y = [113, -302, -172, 189, 163, -210, -361, -70, 227, 136, -167, -154, 168, 220, -164, -327, 71, 416, 162, -260, -91, 345, 231, -236, -253, 215, 332, -67, -264, 18, 226, -23, -287, -155, 159, 149, -139, -269, -16, 201, 51, -263, -177, 173, 247, -107, -272, 96, 378, 39, -339, -77, 371, 206, -284, -261, 261, 397, -80, -378, -99, 214, 81, -216, -194, 105, 211, -44, -296, -167, 113, 104, -159, -153, 202, 312, -62, -328, -56, 286, 122, -175, 0, 329, 187, -212, -216, 126, 188, -81, -182, 109, 276, 17, -322, -276, 51, 190, -23, -199, -41, 218, 83, -300, -282, 134, 287, -51, -232, 108, 375, 16, -378, -167, 312, 279, -123, -203, 112, 236, -43, -276, -106, 139, 118, -100, -174, 16, 149, -60, -277, -131, 200, 176, -178, -232, 108, 273, -28, -228, 26, 271, 70, -194, -21, 262, 156, -156, -139, 133, 195, -68, -221, -37, 193, 120, -142, -239, -24, 123, -45, -247, -63, 256, 158, -227, -278, 107, 232, -117, -284, 90, 409, 147]
1656A47m01N1L34L9k35n1K29J15j89k34L1J85P6j57q5J89J61j89k95M8L29O0k50
1679i2MK65M1l13j74K70K21j59k01J59K34r0l21p3K41J59j11j81M8J77jk49j25
1702b71K34K25j61k42J04L11p1l59m8L77J58k71j92J92K23j21k38N0K29K4j99
1723d6q3J47J56r8k07mJ86P2j89j46J79K16j12k52M5K64l4k66K9L00P7k59j39
1746a64J72J63j41j74J11K23mj98j31R8J25o5j61O5K32L7k70j92J78K47j41k32
1768b22J29L14l2l28r6K28J40j57r3J79J58j06k41mJ60P7q9o0O9J25p7k18n0K03
1792IJ13j35j24J62J35j60k45J02K77ok23pK31L5k11j15J43J77o8j48J3J41L8
1815A34j45j23R7J59k4k08m2K01R7k04j68J80J99j21k26Q0K37nk20l2J89P1j53
$$ y = [147, -254, -203, 131, 170, -65, -116, 113, 228, 39, -195, -164, 21, 97, -60, -145, 44, 205, 16, -279, -231, 98, 158, -92, -88, 177, 218, -95, -269, 1, 222, 63, -138, 21, 255, 165, -156, -229, 12, 171, 60, -121, -73, 104, 103, -146, -271, -37, 188, 27, -215, -111, 200, 129, -230, -278, 99, 257, -14, -206, -14, 209, 88, -150, -100, 129, 153, -46, -129, 18, 174, 76, -131, -135, 51, 123, -66, -212, -33, 183, 71, -181, -136, 128, 94, -172, -143, 157, 234, -25, -164, 8, 171, 30, -144, -33, 190, 186, -12, -143, -45, 80, 15, -146, -81, 151, 188, -82, -274, -96, 151, 10, -222, -93, 221, 189, -139, -235, -7, 133, -24, -117, 62, 220, 114, -127, -131, 29, 106, 17, -43, 26, 151, 74, -144, -194, 9, 122, -13, -137, 25, 160, 0, -245, -143, 134, 128, -95, -102, 129, 164, -47, -162, -19, 158, 90, -58, -45, 96, 134, -11, -134, -37, 122, 98, -110, -152, 49, 146, -58, -226, -46, 153, 32, -194, -114, 123, 118, -102, -134, 55, 126, -27]
1838b7r2J04J61j8j45n9R6O7q0j16O6J84%k13p1J66P3j75j08J96J86j33k18N0
1862a06J75k0j70L3K10N9j45j38M3J29k4r3rJ50R4j32j93K5J71J6j52j8J76P7
1886A58k11j75J31J84o6j71R6J79j6k06l8J27Q3m9p5O3R8k7j24n7J06J18p9j38
1910h9N2J72l9k12m0J89Q2j38j31J33J56j18j48N0J63j5j43l3J32Q2o9r6J8J17
1934G5J6j12p9R8J40o8j65J5J57nj83m0J91R5j34j34P9J09p8j20O5J50M1j28o0
1959g5N9N5n1n9M3J27L7j12j18O6J05n5j25P2J69pj95o4J37N2j16p5J43J27q2
1984E8j73PJ18M1q3k4Q3R5n7j26l4J23N7p7q0J10R8q5j71J6J50M2j43l9J35M3
2010H4j33r2Q2J22n6p5OJ02J1q0n8O5Q5or3k5R8O7q9q0O3J11o4j43L5J53oj29
$$ y = [-27, -119, -15, 146, 128, -17, -76, 20, 87, 7, -109, -43, 141, 141, -72, -143, 23, 96, -79, -187, 9, 195, 62, -156, -106, 69, 49, -121, -88, 122, 181, 36, -102, -59, 70, 46, -47, -56, 94, 188, 56, -137, -112, 59, 75, -77, -95, 81, 158, -53, -228, -97, 87, 21, -150, -54, 125, 109, -97, -135, -8, 75, 26, -49, 14, 112, 85, -39, -96, 10, 128, 49, -89, -37, 135, 96, -116, -156, 33, 115, -23, -154, -21, 135, 17, -131, -81, 82, 67, -76, -109, 23, 105, 36, -60, -42, 75, 91, -21, -100, -2, 138, 70, -95, -80, 77, 72, -111, -151, 40, 135, 1, -133, -54, 55, -23, -143, -78, 72, 113, -15, -75, -16, 39, -12, -71, -28, 99, 136, 24, -94, -28, 77, 22, -103, -31, 138, 131, -64, -128, 9, 61, -55, -130, 13, 140, 58, -115, -108, 10, 51, -32, -56, 27, 122, 65, -61, -95, 28, 85, 8, -72, 38, 136, 51, -120, -104, 46, 88, -55, -94, 41, 84, -49, -141, -59, 63, 7, -68, -62, 40, 51, -29, -87, -22, 63, 57, -36, -61, 37, 104, 15, -65, -2, 109, 45, -98, -63, 90, 84, -45]
2038d5m3J15N2j04r8Q7Q6kq2j1O5J0p3l2N5J04Jj11l1P1N5r6p5Q3J35k9j50%Q2
2067A9Nj21J5J14N9q6r2M2M9k0m6OJ02M5n5q9QP2Jo7pJ16N2j11j03P9P9k7j11
2096g2M3J26j0j23n5O8P1n7l6K0P0%r2k2M8O5k5o3QQ7K2j13l3Q8O3n9r2O2J00
2125H9n5r3JJ08jr1l6P4N7n5n3K3N1Qn9k8M2P9l0n5J4O0Or8k7J01O7o6p4M2P1
2156G2m9r4K3J02J7p2l2K9L0m6m7K9O2N0p1n0K1M0j7o9L7R5J3q8m1N1N3o6o7P7
2186hQ7l3q5nM4J8n9rN1L6j8o7KM8J9m5j4N6N2m4o3J1N9K0q2jO6L4n2o9M5O0k5
2219B9o3J8N0J9n5k9J8M6mo8NK8M9n2m1L9M6k5o2J0P1J4n8k7N6L7o1n1L9N3lm7
2251a9kL5jl0m2L4M8Ql9j9K0L6m2m4N3N2Lo2j9O4oo9jP6L3l0n6J3L0jn7J1M7J0
$$ y = [-45, -88, 27, 79, -25, -123, -36, 50, 48, -34, -45, 20, 30, -43, -75, -20, 84, 85, -26, -57, 14, 69, -27, -102, -19, 116, 87, -63, -63, 19, 24, -97, -82, 32, 91, 5, -87, -45, 4, -16, -62, -56, 46, 91, 36, -53, -45, 27, 28, -39, -46, 70, 122, 11, -92, -13, 66, 39, -72, -29, 97, 87, -36, -91, -23, 48, -9, -45, -25, 45, 45, -47, -69, -21, 44, 19, -44, -36, 51, 73, -40, -73, 15, 78, 19, -73, -11, 89, 34, -59, -58, 50, 49, -42, -78, -4, 53, -2, -55, -32, 19, 27, -32, -60, -18, 61, 31, -24, -10, 50, 56, -42, -69, 32, 99, 33, -41, 1, 72, 23, -71, -48, 54, 71, -1, -33, -4, 26, -20, -67, -38, 24, 74, 3, -47, -26, 14, -3, -72, -35, 60, 73, -15, -56, -5, 48, -18, -85, -8, 79, 46, -39, -44, 0, 18, -41, -50, 1, 37, 19, -48, -46, 2, 21, -24, -38, 18, 70, 26, -37, -26, 33, 53, -29, -30, 36, 70, 18, -51, -6, 54, 29, -34, -16, 34, 53, -2, -31, -13, 33, 29, -39, -34, -6, 43, -9, -50, -11, 35, 10, -52, -42, 29, 43, -15, -42, 14, 51, -10, -61, -22, 31, 28, -19, -21, 14, 13, -17, -59, -25, 23, 31, -8, -27, -7, 29, -13, -57, -4, 48, 51, -11, -30, 34, 28, -41, -42, 34, 67, 37, -19, -6, 24, 23, -34, -23, 24, 34]
2285C4k4l4oL3Qm4j0N3K5l4l8ON5j8m8PO9Mn3l0M2J8k1k9K6L0Jm9oK7K0j2k8J4
2319a2J8K2l7k2L5L0k4m4K1M5mm9J3M1J2m9k5M9J5k5j9J5L2k0k1j8K0K3rk4mL1
2351A6Kl8j9L4K5pm7L1K7rm3kM2K2l1j2LK4j7l7K5K0Pok0lJ8mj2kL5Ql3j3J2K3
2387A9k0k3K0L1ml1jJ6Nk5lK8J0nj4oKJ1j2j4JL2Kl2j6L9kj3j9K0J1k0j5J2J8
2422BLk3pK4J3k2j0J3J7ljj8J2Pmk4K1NQj3j3J8J1j5j3JK8kk3mK6oj7O%K2rj5
2460eK1%pLqnK2j9k4OQK0j1j8K1%j0k6K5Rj1nnJ3Oj6%RjJ7lJrK0qk5K2KJk0OQ
2502DQj5jJ1PJj8JJ0Lk2J0J7llLj3J2mmlRoj0MkQLj6JOKpk1L0qLqRkKJnJMPj5
2549ikMJ1mnMJLlmkPRj6N%K3k5j4L5qnLmJ3j3Kj1lK2j0O%oj4KJoJ5nj9PJ0Mj1
$$ y = [34, 10, -24, -30, 3, 11, -33, -43, 10, 35, 1, -37, -31, 24, 6, -42, -35, 34, 38, -15, -45, -3, 15, -6, -35, -9, 21, 22, -27, -33, -6, 14, 2, -26, -12, 6, 28, -9, -31, 4, 34, 10, -34, -13, 32, 28, -21, -8, 33, 45, -4, -29, 20, 35, 10, -9, 6, 38, 18, -3, -21, -1, 22, 13, -11, -15, 16, 18, -20, -39, -5, 20, 13, -34, -3, 24, 15, -28, -30, 12, 34, 3, -9, -6, 18, 1, -36, -11, 9, 16, 10, -10, -13, 5, 1, -11, -13, 22, 30, -3, -16, -4, 19, -1, -24, -4, 27, 23, -8, -9, 7, 12, -13, -16, 12, 22, 17, 3, -3, -1, 10, -2, -16, -15, 17, 19, -13, -29, 10, 8, -5, -24, -4, 7, -13, -28, -16, 2, 5, -18, -25, -1, 12, -10, -20, -7, 10, 7, 6, -12, 0, 7, 3, -21, 0, 5, 13, 0, -13, 5, 16, 1, -12, -11, 17, 15, -8, -12, 14, 8, -9, -3, -3, 19, 10, -5, 16, 16, 9, 12, 4, -1, 21, 2, -22, -16, -8, 12, 1, -17, 4, 4, -6, -32, -7, 2, -9, -14, -19, -6, 0, -16, -16, -7, -8, 9, 6, 7, -2, 18, 10, -15, 7, 9, 10, -10, -4, 4, 12, -3, -4, 7, 14, 15, -3, -2, 8, 11, -11, -1, 16, 13, 10, 13, 0, 12, 8, 4, 1, 10, 4, -6, -2, -4, 4, 7, -9, -8, -2, 0, -7, -28, 2, -6, -3, -11, -2, -4, -2, -1, -6, -5, -1, 6, -9, -11, -7, 4, 0, -5, -1, 0, 3, 0, -4, -6, 1, 10, -6, -1, -1, 22, -3, -17, 18, 10, 5, 8, 4, 17, 4, 6, -5, -8, 14, 4, 10, 10, 4, -10, -8, -7, -13, 2, -3, -22, -15, -5, -1, -12]
2594a2j1K2Jnj7J0QlJMRo%j1J1j2J2oN%j5J5lnJ7kk3kL2j0jJj%kj1J4%K1k4j1
2635a0K1Jj0Rj4kJ0kmj7K1oj0LJ5j3nlJ0Pj5lQQ%j3%J6jpKL%L%rJ1KnrJ0J7pj5
2679cj8L5lrj3J6N%j9J8Rj6Rj0KJ0j7LOLmlrJ8plj0MK0j3nrJ9Mk1j3K2Oj3j3J3
2720iJ7j0lmQpQppK9lk2lJ2J2%l6J9K2Jj8j0L5j5pj6J4J6j7jj0L0rjj2NJ7pj9
2759hJ5Rk%k9K8Jj1j1NK2lm1PJ3Pj9LJ4J7k5rJ0J9j9poK2J3j8rJ0J4Ok1rJ2J6
2797A6Jl5NL7Kl6LK5kll5K5K6j7j5KJ1J0k7LNNKqj1K4J4k5k0J2K4k1j7OJ8Pk3
2834a2nJ6J0rj5J1K2j2j6%K6j0Lk9J5QPk2j7K5K2j8j5J2K6j8l3J8K5nl0mL6J0
2868B2j1k1J1J3lqrJ1J8jl1J3MQl4OJ2J9j7j6J1J2j1j9JK9jl4RQJ4lk5J8Plqj1
$$ y = [-12, -23, -1, 0, -5, -22, -12, -4, -7, -6, -2, 7, 1, 1, -10, 1, -11, 1, -5, 0, 0, -15, 0, -3, -8, 9, 7, -16, -18, 14, 4, 3, 4, 3, 3, 1, -10, 4, 4, 25, 1, -10, 11, 12, 2, 11, -3, -5, 5, 3, -1, -18, 3, -3, -13, -10, 5, -8, -13, -16, -6, 1, -14, -17, -9, -1, -1, -14, -14, 2, 1, -6, -4, -1, -1, 2, 2, -7, 4, 6, 1, -8, 2, 19, 12, -3, -21, 14, 11, 2, -11, 5, 10, 10, -9, 9, 18, 2, 11, 1, 3, 13, -4, -1, 5, 8, 4, 1, -8, 10, 3, 0, -10, -6, 14, 1, -4, -13, 6, 10, -11, -24, -2, 4, -9, -22, -9, 8, -2, -5, -9, -1, -8, 0, -7, -14, 15, 12, -10, -13, -1, 11, 11, -25, -6, 16, 17, -1, -11, 24, 9, 2, -14, 0, 16, -1, -2, -12, 18, 9, 8, -4, 1, 18, 11, -8, 7, 16, 14, 14, -15, 13, 14, 3, -8, -3, 19, 16, -25, -18, -5, 2, -17, -14, 0, 17, -8, -17, -7, 12, -7, -14, -20, 2, 15, -3, -12, -2, 12, 18, -3, -12, 0, 16, 17, -18, -13, 24, 26, -10, -7, 18, 16, 13, -22, 3, 29, 12, -3, -1, 10, 20, -7, -4, 1, 6, 8, 0, -11, 13, 27, 2, -18, -6, 18, -3, -20, -14, 4, 11, -12, -17, -1, 9, 0, -15, -4, 18, 6, -10, -10, 16, 6, 9, -20, -5, 3, 10, -12, -29, -4, 18, 0, -15, -3, 23, 5, -28, -10, 15, 10, -20, -24, 12, 22, 11, -10, 1, 14, 11, 3, -6, 5, 23, 22, -9, 4, 8, 16, -18, -12, 0, 19, 2, -14, -3, 9, -2, -21, -20, 9, 8, -26, -17, -9, 5, 2, -23, -5, 2, -1, -9, -20]
2906b0K1J1Jk5%K4jk1j1L7%j7j8K0L4qm3J3RRj9j5K9J2k4olK9Nj9rQK0%l4MK5
2943A8Lk4k0J4K8k6kjK8j8l0OK7mj7LOJ6j5j8J9J4Kqj3J7J8k2j9J0K9J2m1j8L9
2978A3J6k8j8L1Mnj8rL2qj6KJ2lj1LnJ2Qpk6J8K6Jm1lL3Pm6J0K0K1m3j7K8K1k2
3015hl1J0K9Pj8j8J3K2j3orK9J3j6nJK7pl0QK7%k1j4K5J5l4j1J3K4qk9J2PRnk0
3052a2QJ8Rk8j5L6l%l7K0L6k2k1j4M3lk4rK4Ql0OjJ7mk1POJ7j4k3K1MJ7k3j6K2
3089aJ6k0j9K1K0Jl3OJ7Qk2rK4J6k1k2PL0k7jpK0J2j6qj1J5K8k0k5K3J9k5j8J2
3124a0L2j5k9NK9Lk5j4J2L1j9j9KJ4Jk4qK4K2ql7K1J0J3l2KK4L2j6m5K4M3l0k6
3158a3RL9om0KJ0J2rj4MJ4qj1lJ1J9jk5k1L8Rj4k6K6J9k0k6J8K0Kl4PK3oj9k5
$$ y = [-20, 1, 12, 13, -12, -12, 12, 11, -10, -21, 16, 16, -1, -19, 1, 35, 27, -16, -3, 6, 15, -4, -19, 10, 22, -2, -8, -11, 18, 23, 4, -5, 3, 23, 23, -11, -7, 18, 21, -3, -23, -9, 19, -7, -9, -10, 18, 0, -30, -24, 3, -1, -18, -15, -9, 7, -8, -26, -7, 7, 9, 1, -12, 5, 23, 1, -18, -8, 21, 33, -8, -26, 13, 29, 1, -17, 14, 18, 13, -5, -14, 18, 10, -6, -4, 8, 5, -6, -3, -8, 4, 12, 5, -21, -3, 23, 24, -17, -20, 13, 20, -26, -16, 4, 25, -18, -35, -7, 14, -8, -39, -29, 0, 7, -11, -29, -16, 6, -7, -13, -22, 7, 20, 4, -1, 0, 27, 20, -10, -2, 25, 25, 4, -10, 15, 30, -4, -15, -2, 22, 14, -15, -3, 4, 13, 8, -12, -4, 14, 23, -5, -20, 16, 13, 13, -24, -4, 32, 10, -11, -25, 18, 15, -9, -18, 6, 14, -16, -10, -11, 6, 2, -19, -12, -6, 11, -3, -26, -5, -1, 16, -7, -23, -1, 15, -5, -24, -3, 17, 18, -15, -9, 8, 16, -6, -15, 9, 25, 4, -18, -11, 19, -8, -9, -16, 4, 16, 0, -8, -19, -4, 24, 4, -21, 2, 21, -4, -22, -10, 22, 7, -22, -17, 12, 15, -10, -24, -12, 19, 0, -19, -17, -3, -2, -26, -34, -10, 12, 4, -33, -12, -2, 11, -21, -19, 5, 37, 21, -24, 0, 43, 13, -13, -4, 35, 29, -11, -9, 1, 13, 4, -10, -6, 8, 0, -11, -14, -3, 16, 15, -10, -31, 7, 16, 2, -24, 2, 21, 1, -25, -7, 13, 15, -19, -12, 11, 5, -14, -39]
3194c9L4Lkk7J4OJ7j9rNK1pj2rK8J7l4k2K8L1k2j7J3K9ql0J4J3Ok9kRPJqoNlj
3233eoKJ1%k5LK7Nk9j3L4J3j6l7K8K2pj3k1L0Qj9oNK6qj6j9J4J1j0j8J3K5mk8
3269b3nL6J4l1j2L2J7k1rjL4j6k6J5J4Nj7k1J8NMj8j8J1K4rj9J0J6Rl4j4K8Mk2
3304b0k1L5L1l5j6K4J4j4j0OmJ8j3j0nJ4J6j8j4J7J4j4k4J2K0Kk6NOK7j8k4L0
3337EJ9k5j0J4K4Jk4nJ1Nj1j1j3L3Kk3j0J7J0qk2JL3mk9nN0ql4j4K7Qj2j7J6J7
3373HNj9j9K0J5Kk6kJ3J7j9k0K0J7j5j6pL6ol5K1J2PorRPJ3k9MK8qJj2qJ1lj3
3411foJ5J4j6l3L0J2k0k1J7K9pm2KL0Lj2k1K0K4mj8j0K0J4pk1OJ9%k7%K1J7j7
3446Ek9K2K2k2j2jM6j6k1oK1Ql0J3RJ6mk5OOJ3rk7J7J4rj5j6K0J9k8j1J8K3k0
$$ y = [-39, -5, -2, -4, -31, -17, -11, 6, -13, -22, -17, 4, -3, -15, -24, 4, 21, -13, -35, -7, 24, 2, -15, -2, 27, 19, -11, 3, 16, 22, -7, -9, 0, 7, 8, 0, -6, -1, -4, -5, -11, -9, 2, 2, -23, -20, 7, 12, -17, -30, 4, 17, 1, -36, -8, 14, 7, -6, -27, 3, 11, -8, -14, -9, 17, 9, -7, -26, -12, -1, -11, -29, -16, 9, 5, -23, -28, 8, 22, -9, -21, 11, 28, 7, -2, -3, 31, 15, -11, 4, 18, 23, 6, -15, 3, 8, 12, -6, -24, -13, 11, 2, -17, -7, 9, 18, -16, -30, -2, 2, -20, -41, -6, 25, -10, -26, -2, 12, -2, -12, -6, -10, 8, -5, -15, -20, -6, 10, -8, -22, -5, 9, -5, -29, -17, 3, 5, -21, -16, -10, 17, -1, -25, 5, 24, -1, -11, 3, 27, 28, 4, -1, 10, 15, 4, -7, -20, 13, 15, -8, -18, -1, 9, 1, -21, -20, 13, 9, -20, -25, 25, 17, -17, -31, -4, 4, -8, -25, -9, 8, 13, -6, -25, -5, 10, 12, -14, -16, -3, 14, -5, -25, -5, 12, -3, -19, -26, 10, 4, -31, -10, 2, 9, 3, -6, 3, 10, 23, -6, -2, 26, 18, 19, 7, -1, 10, 7, -6, -12, 3, 17, 1, -32, -2, 10, -10, -31, -14, 15, 8, -34, -32, -2, 1, -11, -32, -12, 12, 8, -10, -20, 0, 14, 7, -14, -8, 11, 11, -16, -16, 5, 22, 5, -24, -2, 20, -2, -14, -15, 31, 15, -6, -12, 9, 17, -13, 0, 9, 25, 21, -4, 2, 8, 21, 12, -15, 2, 16, 7, -8, -24, -4, 15, -13, -24, -6, 17, -3]
3481ck2QK1rk2J6RRk4oPPJ1Jj8J4K1j8k8QK2K0l3j5L4kk0oRK5qj4pK7j0k2PJ1
3519@J1mqrK1Lk0JNK1j5j3QK0jl0qL3Nj2k7K2Nj3k1KL2j5j3jK5Kj6Lj6K7jJj5
3558a1MJ5Pk1j6L1Pl1oL3Jk0j8K9J7j0k5NK0Mj5kj3J8mMnNJ9j4k9K5K8j7l5J4
3594fJ7J1l0j5J5K2k8rJ3J0Jk8J7J1Nk1nJ3Lkkj6K6Noj6K2Qj3j2lL1qk2j1L6N
3631A8k0rJ3K%jkJ2%nj3j0J3J4j1j1K3mj1j2K0J0j1k2LL2j5j4qJ7J0k8nJ3J1j
3667bj4j3K4qlkJRJ7j6j0J2J2rj2K6J4j8l0J0K2J0l1J0ONj9%JOMjOJKlj7jK2P
3707A8k6qJ0J2pJjK1j0k4kJ6Pk6J0J0Rj9j3QlRqjJ6Jkk0J2J2Ok1%K2J3j9j5MK2
3746A4j1j3PK7j2l2J4RJ3j1nK%Lj3mJ4J5j5Jj3J7Lj6oJ5K5j8l4K3J3j3rmK8Mk3
$$ y = [-3, -25, -17, 4, -5, -27, -11, -2, 7, -17, -23, -16, -9, 2, 3, -15, -1, 20, 2, -26, -18, 4, 24, -9, -24, 10, 8, -12, -18, -9, 16, 8, -6, -13, 14, 4, -18, -11, 0, 11, 7, -1, -10, 11, 14, -6, -5, 0, 21, 6, -7, 1, 21, 20, -10, -18, 15, 20, 8, -19, 3, 8, -5, -26, -24, 8, -7, -20, -21, 4, 6, -10, -7, -23, 4, 3, 4, -11, -7, 8, 15, -6, -22, 9, 16, -15, -21, 12, 13, -7, -25, 4, 21, 11, -14, -9, 11, 15, 0, -2, -15, 3, -1, 3, -2, 3, 22, 8, -21, 4, 32, 15, -20, -6, 11, 22, -8, -23, -8, 14, -14, -23, -10, 0, 1, -27, -10, 1, 6, -15, -20, -7, -4, -6, -8, -24, 2, 7, 1, -15, 7, 15, 2, -10, -13, 18, 10, -12, -23, 13, 18, -2, -11, 2, 4, 4, 3, 1, 13, 13, 8, -5, -15, -2, 12, 1, -10, 13, 9, -2, -14, 6, 16, 5, -17, -14, 18, 3, -11, -19, -2, 8, -20, -25, -12, -1, -2, -16, -29, -5, -13, -16, -18, -17, -8, 9, -7, -17, -5, 7, -2, -14, 12, 26, 8, -22, -12, 10, 20, -11, -1, 5, 10, -9, -9, -8, -2, 2, 1, 7, 8, 10, 7, -10, -11, 11, 18, -8, -16, -6, 6, -1, 0, -1, 20, 10, -14, -16, 0, 7, -19, -9, 1, 10, -9, -22, -14, -17, -8, -16, -17, -1, 0, -2, -22, -10, 2, 8, -13, -13, 9, 22, 3, -12, -8, 14, 3, -10, -3, 24, 12, -20, -6, 3, 16, 5, 0, 2, 2, 5, -8, -12, 2, 17, 2, 3, -10, 7, 10, -6, -12, 3, 28, 10, -24, -1, 12, -1, -10, -14, 14, 18, -5]
3783ej4J4%nmmlJ6j3nMJ3Rk7J0K8Kj6k3K0J7j5mkK1kk9J4J5onqJ1RQl1mK4qKj0
3824fKJ3j5j9J7J2J5l0mJ3Qlj9J1K5k3j2J4k%kj1J3Lkk0%J5Qj3j5J6LJ3j0mK2
3861A3mj0oJ8Mj6pQK2kk3J3qmnNOJ5Kk4k4J4K8j7j8J7K4ol8MJ5J0j6%J4Jj4lJ3
3900AonRkJ4j2k2rJ6LJ8qlnLLj8jK6pj9J8K2ok0j0J7J5Kj8K7k1Roj2K2j8J8j4
3939APoJ3j3j5K0rKj5J1J5mj4kMOj0oL0mj9kJ8j0Rj7j7K9J2kj6rJ0Mj7LJ2Oj8
3978a3LKJ4Rl9K0J5lnjNonmL1Jj4kj0J0J4j3kj3K3jqk0kJ4j3jJ6lJk4JK7j0kn
4019a3J3J3j8mJJJ8j9QLKqj8J0K1Kj6j3K1OpnlJ6j2mLJ2nj3J4Qklj2QOJ0kj2j1
4060dJ7kqJ%Jj8PK3j6lqNJ6lj2oj1PLMQlknJMJ7j6j5OJ8Rj0prR%j5L1Mj6ljQn
$$ y = [-5, -19, -5, -5, -10, -14, -18, -21, -5, -18, -23, -19, -6, 3, -24, -14, 14, 16, 0, -23, -3, 14, -1, -5, -7, 14, 12, -17, -3, 12, 6, 1, -7, 4, 13, 21, -10, -14, 10, 2, 4, -6, -4, 9, -6, -25, -8, 4, 19, -11, -15, -2, 6, 3, -16, -5, 20, -3, -15, -1, -3, -3, -5, -16, -3, 0, -2, -22, -22, -7, 1, -12, -27, -11, -8, 5, -5, -9, 13, 9, -1, -7, 11, 15, -1, -8, 0, 22, 20, -3, 10, 2, -2, -7, -2, 4, 19, 21, -3, -27, -13, 15, -2, -20, -3, 21, 15, -23, -19, -4, 6, -10, -10, 4, 5, -9, -12, 1, -5, -10, -1, -3, 11, -1, -23, -32, -16, -13, 5, -3, -6, -11, -8, -5, -23, -24, 2, -5, -24, -6, 16, 10, -10, -20, -3, 12, 14, -4, 23, 2, 11, 5, -7, 15, -3, 15, 1, 8, 2, 15, 2, -13, 7, -2, 0, -15, -4, 11, 7, -7, -9, -5, 1, -9, -15, 15, 11, -8, -10, 8, -2, 7, -10, -27, 2, 14, 12, -4, -13, -3, 1, -16, -13, -1, 5, -13, -10, -8, 6, 15, -24, -4, 11, 8, 3, 2, 7, 1, -4, -8, 23, 24, 10, 8, -2, 8, 22, 9, 7, -6, 17, 16, 8, -12, -14, 0, -13, -14, 2, -1, 0, -24, -23, 4, -6, -8, -13, 0, 13, -5, -9, -8, -7, 11, -8, 0, 3, 5, -3, -21, -11, 10, 12, -4, -17, 4, 10, 3, -2, -5, 11, -1, -5, -2, 10, 5, -8, 6, 14, 12, 9, -3, 5, 11, 21, 19, 7, -4, 13, 11, 3, 4, 4, 5, -13, -6, 17, 1, -2, -10, -5, 11, 8, -4, -10, -21, -14, -11, -7, 1, -2, -4, -9, -8, -4, 13, -3, -18, -12, 6, 15, 5, -2, -11, -2, -2, -17, 14, 18, 2, -1, -2, 6, 1]
4106A%KJ5qj3%oJ0JJ1lNMj7mmJ9jj9J1%Nj3k8K2PNk0RJ0j3OJO%Mj3jJOloJ1%p
4151gqLK2Lk5JJ5Jj4j2L7mrj0%J8k1oJJ4OJ6j8QNooj6K5Jnj5%J9j0j6J3LQk1o
4192a6K0qqpJ7RnprlNLj5QK1Kj2j0J8JLk0J0J8j6kj0K7lj7lJ7J3j6j1KNJ1qMp
4233ARlpqJ7K0k8JNPpk0NK7j7j8J6O%j2%J2j2%j5J9jJ0j4oPQr%kLJ3j9J6LQk8
4275a3MPJ8pmnRnk2K4p%mMPMj0JKnQJ5j1j0J1%j2qJ8Opj0%NrqOQKj3kLJ0qJ3j2
4321gNrLNk2K4Oj0LNKk0KJ2J6j9nPJ5mj2PQmk0J9Rj6J3qj3K2oJ3k4QOMj9RRlj1
4364@j1QJ2nj8J8oJ4j9oJ2rj1QKj1Qj3J3ROlj7QK0j2j7QJ4K1k3LM%j1Q%PMk8O
4405gNjjmJ0MkLj5%J5prJ2OKj5jQj0Qj1POkkoPqJK%nKkQ%Mjj7QJ0k4RROJk0OJ2
$$ y = [1, 1, 3, 18, 10, -3, -3, -9, 1, 2, 13, 10, 15, 19, 2, -2, -6, 13, 12, -7, 4, 4, 9, -4, -32, -10, -3, 2, -18, -9, 1, -12, -6, -5, 1, 1, 5, -8, -9, -8, -2, -5, -11, 0, 0, -7, -15, -12, 10, 13, -12, -11, 4, 5, -9, -21, 16, 12, 3, -7, -7, 11, -10, -16, -15, -1, 5, 21, 3, 11, 16, 10, 4, -12, 13, 14, 9, -6, -6, 13, 3, -13, 0, 3, 11, -10, -16, 4, -4, -12, -19, -2, 7, 2, -5, -14, -17, -12, -9, -24, -16, 5, 7, -5, -15, 3, 4, 7, -13, -3, 15, -1, -3, -13, 14, 11, -6, -9, 8, 21, 5, -6, -4, 1, 12, 4, 8, 1, 10, 7, 0, -8, 9, 29, 1, 2, 7, 14, 7, -13, -8, 19, 2, -16, 0, 6, 6, -6, -6, 6, -6, -6, -21, -2, -3, 7, -7, -13, -6, 2, -7, -7, -9, -6, 7, -12, 4, 7, 15, -13, -9, -2, 16, 9, 5, 0, 9, 4, -18, 6, -1, -1, -5, -1, 6, 10, 0, 1, 3, -2, 6, 21, 10, 0, 11, 11, -1, -9, 9, 15, 8, -2, -2, 3, -6, -14, -8, 0, 2, -11, -13, -10, 0, -8, 5, -7, -2, -11, -8, -3, -25, -1, 5, -5, -2, 3, 5, -15, -13, -1, 15, -4, -9, -2, 13, 9, -3, 4, 12, 8, -12, 7, 16, 0, 13, 5, -8, 14, 8, 21, -3, 5, 11, 15, -4, 5, 14, 11, 0, -11, -3, 9, 4, -14, 4, -2, 12, -7, -13, -1, -10, -21, -13, -11, -22, -14, -27, -14, -5, 1, -2, -19, -11, 9, -3, -20, -12, 2, 23, 0, 3, 7, 7, -4, 4, 4, 11, 15, -13, -7, -2, -3, -4, -8, 2, 6, 4, 7, -8, -8, 7, 0, -9, 3, 9, 11, -4, -5, 3, -7, 1, -10, -3, 3, 1, -1, -7, 0, -8, -7, -5, -5, -10, -8, -10, -2, -2, 2, 1, -16, -8, 2, -22, -13, -4, 2, 3, -17, -11, 1]
4455AJ9j2pJ3Jkj7PJ9j6kMJPrkmPJ1qrJ3nqj6J1J0Lj2%lQj8LJ4j2RjJ2j2o%Mn
4499iL%pQoOj1QNNj1nMJ5pp%KJ7j8J7KNj9PlmJ7oNj4J3Mj1kNlJ2k8J9J0j2j5J4
4543EJ1k0l%J1LkolJ1Jj0Pl%Nrj7J0PqkJ4qkj5K0J4j3kNJ0Jj0lLnJ3qnJPlkJm
4589cMpKR%j4%%J5j1kP%pmJ4Pj5MlpKKkrJ0MklLoLnrK2nj1NqK8k0RNrMJjJ6rM
4639H%onJ0Jj6J5nrPoO%%qK3rj6MkJ0rKJ2mpnJ1nkMllNMlj3J3JmqjJ2j2kMoJ5
4687bj1MJ1kj4LJ0LkNjNj0jJ2j4QJ2k5Qj1J3J2k1OPJj4J3noJ6j5RpjJ%qJ0pjP
4730boKPj1kLJ6pj%opQJ8j7MpOoNlJ9j0rQmPkqJ6Mj1kjoLJ3Mj4J2jj3OoJ3rjJ
4778Cj%j2kOPk2QKJKNrOMqkJ7nJj1MlMjJ0j7LJ1kJo%j0J4J2j6mMJ0Rj1KjjJ0m
$$ y = [1, 20, 8, 1, 14, 15, 13, -4, 3, 22, 6, 4, 8, 9, 16, 7, 5, 1, 8, 19, 11, 2, 15, 10, 2, -14, -3, 7, 10, -2, -2, -5, 3, -15, -12, 2, -10, -1, -2, 10, -2, -8, -8, -4, -9, -6, -6, -13, -5, -11, -5, -16, -8, -3, 2, -9, -14, -10, 5, -2, -9, -9, -7, 10, -8, 9, 11, 16, -3, 4, 1, -3, 14, 8, 13, -1, 12, 16, 5, 3, 8, 5, 17, -11, 8, 18, 6, -9, 5, 16, -4, -7, -7, 4, 7, 5, -1, -4, 7, 8, -2, 5, 2, 2, 7, -2, -19, -9, -2, -10, -12, 2, -6, -8, -23, -3, 11, -2, -4, 1, 11, 12, 2, -1, 2, -3, 10, 2, -3, -2, 5, 2, 0, 1, -3, 1, -6, -4, 5, 5, -9, -9, -9, 6, -5, -7, 0, 0, -7, -11, 3, 10, -5, -1, -4, -11, -9, -7, -9, -18, -8, -4, -6, -9, -6, -12, -9, -14, -23, -1, -6, -17, -12, -20, 8, -12, -3, 2, -7, -3, -2, -3, 13, 4, 8, 8, 2, -3, 7, 8, -8, 7, 2, -7, 0, -6, 0, 0, 0, -8, 15, 6, -10, -6, -8, 2, -7, -5, 7, 3, -4, -9, 2, -3, -5, -1, -4, -7, -2, 2, -1, -14, -1, 0, -4, -12, -13, -1, -13, -15, -11, -17, -2, -13, -9, 2, 0, -14, -11, -1, 2, 0, 5, 4, 9, -1, -2, 10, -4, 4, 16, -9, -1, -12, 1, 13, -8, -2, 5, 6, -8, 5, 0, -6, 10, -5, 4, -3, -4, -3, -3, -11, -1, -8, -9, -2, -8, -6, 1, -10, -12, -9, 7, 0, -1, -1, -7, -14, -6, 12, -5, -1, -8, -2, -8, -3, -6, 13, 3, -6, 2, -2, 5, 3, -5, 11, 15, 4, 2, 1, -5, -2, 11, 15, 1, 13, 12, -1, 5, -1, 12, 3, 2, 3, 2, 2, -10, -12, -6, 1, -21, -13, -11, -10, -8, -3, -12, -6, -2, -10, -12, 5, 0, 1, -10, -6, -9, -5, -6, 4, -13, -10, 1, -1, 0, -6, -6, -16, -2, 10, -6, -10, -6, 4, 13, 2, 4, 3, 2, 12, 8]
4825Hj7KNJ4j1loLkKOOorLKj6QKKJ1j7J3pNl%lkMNj7J1MOj7NK3j6j1LjJ0oJJ1
4871ENKk0J4pjQmQmQj9lJ0jLoj%LpQMMMj9NMj1N%jj7QOjPlrnj4J1J0Mj2K0m%j0
4920a3MmOLoKkJ0oNoj7K0NmQRk3R%j2J4j8J9mo%NJ3%lKJj6JJ3qnMJrjJ1kj7Nm
4967a6J3rJ8j1l%Kj0QoLJ3j3KljJ4j4J2lRoqNJJ2k0J0LmnjJ4lqJ0j4J6Qj2Nnn
5010boJ3j3oK5rj2RoL%KlnNjj4QpJ8ojjrkQJ4qLLnPmKj7QJ0qRlNjqJ2j3QJ5j7
5058@J1koOj4NJ0j5J5k4J1J2Kj9QkPprJ2%rNjKmllLpJ0mKJ2Mj3qKoK1k1K0pLj
5103bJKPom%Rj5PnjNNJlKjOlJj5J8j4kQ%Rj0J1j1KLj0J4nj0J4qk3K3j8NNJ1j8
5148a5K0j4jQqMQJ2j9PrKKLMkj1M%OnNkQrQmN%j1J1j2J0j3J9nnpJ1j3RPoLJoK
$$ y = [8, -9, -7, -2, 12, 1, -2, -8, -5, -7, -5, 1, 7, 1, -8, -5, -3, -19, -11, -9, -7, 4, -13, 0, -7, -2, -5, -5, -8, -10, -6, -1, -18, -7, -3, 3, -14, -9, 14, -2, -13, -10, -11, -1, -7, -6, 5, 10, 12, -8, 6, -1, -2, 6, 2, 10, 6, 14, -5, -8, 2, 1, 4, -2, -3, -3, 0, -7, 1, 5, 9, 13, -6, -1, 3, -8, -3, -3, -4, -21, -13, -7, -8, -1, -4, -13, -18, -32, -21, -11, -7, -19, 1, -3, -3, -13, -9, -13, -7, -4, -10, -8, -10, 0, -6, -1, -7, -24, -4, 1, -3, 5, 14, -9, 0, 0, -12, 2, -16, 3, -1, -7, -7, -2, 11, 11, 8, 10, 11, -5, -4, 9, 1, -4, 0, 1, -8, -9, 2, 0, -17, -12, -16, -3, -12, 6, -5, -8, -8, -6, -16, -8, -14, -11, 2, -11, -9, -12, -13, 1, -13, -1, -4, 5, -1, -9, -4, -3, 9, -11, -1, 2, -2, -7, -8, 6, 3, -5, 5, -9, 7, 15, 3, 8, 3, -2, -8, 5, -8, -14, 11, 2, -10, -1, -7, -4, -4, -2, -5, -10, -5, -6, -20, -12, -19, -1, -7, -8, -9, -18, -20, -12, 2, -6, -3, 0, -5, 2, -2, 0, -17, -9, 1, -7, 2, -1, 4, 3, -5, 7, -6, 2, 17, 0, 11, 9, 3, 9, -5, 0, 10, -5, 10, -14, -3, 9, 11, -8, 0, -2, 5, -2, -11, 1, 1, -8, -3, -4, -2, -6, -9, -12, -9, -16, -6, -10, -8, 4, 8, -5, -13, -11, -17, 4, -17, 3, -4, -1, -2, -1, 1, 8, 2, -2, -2, 7, -8, -1, -6, -7, -2, 3, 4, 1, 3, 2, 8, 5, 6, -9, 9, -5, -7, 1, 1, 10, 0, 11, 0, 2, 5, -5, 9, 4, -6, 8, 0, -23, 0, -18, -13, -8, 3, -15, 5, -9, -10, -2, -10, -6, 2, 14, -5, 2, -7, -5, -3, 0, 4, 2, -9, -5, -5, 1, -4, 1, -1, 7, -2, 6, 2, 7, 7, -4, 7, -5, 5, -8, 11, 6, 1, -6, 5, -8, 1, 8, 2, 5, 6, 0, 2]
5195Bj0J4mrJ0%ommjLkRjj2J2rPMj3KQnNjpQoJJJ1qJ3kmMJJKrJ1lJNnroJ0oJ7
5245A6j2rQN%oLKqMpJ4j3J1j1j3J7pN%qNKLj6MJ5j1rNkLQPj1%NnJoPlJ2pMl%O
5293EOKj0lQoKlJRMqrPJJlloPjojRPkqj4%QpJ0pMJMjj8K7j2kJJ3j2JPoRnMrJ4
5345A0j2PljMNj4%J3rJ3jj2O%j6K7qj0L%kJ4j8K7j0nQj2j0LQlmMrJ6j3j3PMj2
5387a8lJ4nj4K1lQqLJ3pjqJ6kPj3PrNpJ9j2Oml%jO%PlklomJ2qJPMj1pQNj4J1J1
5435A5k7J8Mjkj0NmpRmJ0rmKL%j0J4%kKJPkJ0j8MKpKMK%K%kKlNlJ3j2lkMkJJk
5485Fl%MqJ4mpkjKLQrqPpPqLmjRrNpJ0pNqMRj2PJ0mlj0PPjj7L3k2kJ2nJ3j0kO
5535A0lOpKNqj9K3m%j%m%MqJ1ookJ6%rnJ8j3ljLPmjLj8RlJ0j1PPmj6J0J8j1j2
$$ y = [2, -8, 6, 2, -7, 3, 3, -3, -7, -11, -12, -9, -11, -2, -3, -15, -3, -12, -5, -1, -14, -12, -4, -9, -4, -5, -12, -4, -10, -9, -8, 3, -5, 8, 6, 2, 6, 7, 8, 10, 1, 12, 9, 10, 15, 10, 1, -5, 5, -1, 16, 4, -5, 3, 8, 8, 2, 5, 7, -1, 3, -4, 10, -3, 8, -3, -16, 1, -6, -1, -1, -9, -4, -2, 1, -15, -11, 4, -7, -16, -11, -13, -10, -2, 5, -6, -6, -1, -6, -5, -11, -4, -7, 5, -2, 2, -1, -1, 5, 11, 13, 3, 0, 8, 2, 4, 1, 2, 11, 15, 7, -2, 5, 6, 7, 4, 1, -5, 2, 1, -5, -6, 3, 10, 8, 0, -14, -14, -6, -13, -3, -10, -6, -5, -1, -2, -20, 7, -5, -7, -6, 7, -5, -4, 3, -3, 6, 1, 5, -4, 10, -2, 5, 2, 1, 5, 10, -4, -4, 9, 0, 13, 12, 0, 6, 6, -10, 17, 9, -1, 2, 2, 0, 14, -4, 23, 13, 8, 16, 4, -6, -3, 5, 2, -2, 2, -7, 9, -4, -17, -10, -6, -18, -21, -7, -12, -26, -5, -8, 0, -8, -5, 8, 1, 0, -8, 8, 6, 13, 0, 7, -2, 3, -4, 15, 3, 9, 5, 2, 2, 1, 7, 7, 14, 11, 9, 6, 0, -4, 8, 0, 1, 8, 12, 1, -6, 2, 7, -7, 4, 15, -12, 6, 10, 9, 7, -3, 2, -2, -9, 0, -4, 6, -3, -7, -5, -2, -2, -12, 2, 2, 0, 2, 3, 10, 8, 18, 0, 4, 6, -1, 1, 5, 7, 7, 9, 9, 7, 9, 6, 11, 8, 21, 9, 6, 4, 8, 6, 7, 8, 6, 3, 3, 7, -1, 13, 9, 2, 0, -1, 1, 4, 12, 3, -5, 2, -5, 2, -6, -3, -7, -8, 1, -8, -3, -10, 0, -7, -2, -10, -6, 3, -9, -2, 8, 4, 1, -9, -2, 5, 4, -13, 20, -2, -4, 8, 3, 16, 6, 4, 10, 7, 13, 6, 8, 13, 5, -14, 9, 5, 5, 4, 4, 0, 0, 4, -4, 7, 1, -5, -7, 9, 9, 0, -5, 13, 0, -3, -4, -1, 6, 2, 1, 4, -14, -5, -8, 2, -9, -2, 5, 1, -15, -5, 13, 2, -10]
5581a0QJ1nPj2J2mkJJ4j2lnJ0moJJ2j4J4mpKloJ7j2mJQj0MKqJJ3j7QJ1j9NRnQ
5625Gl2K1J5j3K%lPjk0QJ0J0oj3RnNjKlRjmJJ%nPjPJlpJ3q%MLrpJmJ4rK%Mj9K
5675iJ0nPpMlmOMj1J0pkkMOj7J0jJKO%%JNj1JJ2Nj3OlRjmKJN%JrJ5j0j2J3mmO
5724A3oNLj1jJOj2OkJM%j4J0qNqMkPj2LOlj4J3jnNQoJ5mloMLmjrPQKJjmMMlPK
5776A7j0KLKk1%RkoJ2j4O%onPK%%l%lJlJQJj6J0OmnJ1j9J9okMpOOjrRPj1KLPp
5826AJ3j4Lkn%NQJj2K5kk1J4j%j1NLj3j4J6oNmJ0mpJ3jml%K%lkNJ4j6K%nmmMJ6
5873Gj7QRj7J8mmQoPJj5oJ3j2OlJ5Mj2OmJ1k1J6Pkj1mMj5J2LlLJj3Oj3mPJ0%q
5917a2J8j0MNnnOlPlpNJMnlRlNmLj1PJ8j5k%J0j4%J2NqJqJlJ0JmlkLooJ7pJ2k5
$$ y = [-10, -2, 9, 4, 11, -1, 11, 7, 5, 6, 20, 8, 5, 0, 10, 6, 0, 1, 13, -1, 13, 9, 2, 4, 1, -5, 12, 0, -4, -3, 5, -5, -1, 1, -7, -6, 7, -10, -2, 9, -10, -5, 4, -1, 7, -25, -4, 11, -2, 0, 0, -3, 4, 3, -17, -9, 1, 11, 5, -8, 1, -4, 1, 0, 2, -1, 8, 7, 3, 4, 5, 5, 0, 7, 6, 13, 14, 11, 4, 17, 9, 9, 13, 16, 7, 0, 1, -3, 11, 2, 4, 4, 8, -11, -9, 1, -4, 3, -4, 0, -3, -7, -1, 3, -8, 2, -5, -7, -9, -5, 1, -16, -6, -7, -6, -4, 2, 2, 2, 3, 8, -3, -2, 10, 15, 2, 8, 5, 14, 13, 9, 11, 12, 17, 17, 18, 9, 24, 14, 2, 15, 11, 7, 13, 7, 12, 15, 4, 3, 4, 10, -2, 4, 2, 3, 7, 7, -7, 3, -5, 0, -8, -4, -6, 1, -11, -8, -2, -5, -19, -6, -7, -12, -7, 1, -5, 10, 6, 3, -3, 1, 4, 0, -1, -10, -3, 5, 7, 8, 7, 3, 7, 11, 8, 15, 17, 7, 9, 12, 14, -7, -7, 2, 0, -6, 6, -8, -2, -2, -8, -13, -6, -4, -4, -4, -7, -7, -10, -9, -12, -11, -3, -2, -18, -8, -2, -6, -11, 0, -19, 0, -6, -8, -4, -11, -5, 1, 0, -9, 0, 7, -4, -2, 1, 8, 1, 14, 0, 3, 1, -4, -4, 1, 9, 10, -2, 23, 21, 0, 14, 13, 13, 2, 7, 10, -3, -17, -1, -7, -2, -6, 4, 0, -7, 6, 5, 1, -2, -2, 0, 0, -3, -5, 0, 14, -2, 0, 0, -5, -9, -13, -9, 7, -10, -2, 7, -10, 8, 4, 0, 8, 2, 9, 10, -5, -11, 2, -10, -4, -7, 8, 12, 0, 6, 2, 13, -8, 8, 15, 13, 2, -2, 2, -13, -1, 2, -1, 2, 3, -10, -4, -17, -21, -14, -4, -4, -12, 6, -4, 0, 5, 0, -5, 1, -2, 5, 2, -5, 0, 1, 5, 0, -3, 6, 3, 8, 4, 7, -4, 3, 21, 6, 4, 4, 14, 0, 0, 12, 17, 9, 10, 2, 3, 0, 10, 11, 7, 4, 2, 5, -1, -7, 10, 3, 15, -10]
5966a0J4Kj0LJnNj1On%oQJ1j2J2pLqlJNj2J7LNk1J3m%%RkjKkNrLkMJPnMj2KJ9
6014A8Jk5LP%nkJ1p%mJ2j1j0J8pj%jJ0okk%KjkJ2k3J0%J4j0MPj7QNj0jJ3j2Nj
6058@Oj6RnPJ1Rj9KjqMNJLqQJj0J0Jj3K5j3pKj2RKj5K2j4NrJ0j5NKlQQj7kQJ1
6103Gjk5J4jj0OQJmOPj5RKoMlNMLj9K3mj5J2%Mo%mLj8J5KRnjnRppkOoKJ8k2Rp
6152eJ8j8KlMqPrRMj7mJ3oQlJ3j5MPpQ%lj0QNpklJ1KomJ1%j2PJ4Ok0nJ0p%pK0
6199A0lpMpK%qoJ4nOmmKKkOmj1KJmJ4k2J0j0J0J3LRpLJljN%j1J5j1%nJ8k1RPr
6246AlLOj4JPRqljjQJ2j1j0QkL%rKMmL%J%k1QOn%mQonJ0Nkj2Q%LMj3J3oRPmnP
6298GProJ3rJnmK4j6LKJolj0J8j3oQlL%LoQJjKpPnjlOKqQj4J2j1j0RJ%%JlJlO
$$ y = [-10, 4, 6, -4, -1, 0, -5, 0, -11, -5, -10, -10, -16, -8, 3, -9, 3, -4, -1, -9, -12, -11, -6, -18, -1, 2, 7, -14, -1, -5, -5, -5, 4, 2, 1, 3, 1, 6, -3, 0, -2, 2, 3, 10, 5, 9, -3, -1, 18, 19, -6, -3, 4, 4, -1, -3, 8, 1, 1, -3, 9, -2, -12, 6, -1, -2, -2, -3, 7, 1, -1, -3, -3, -1, -2, -4, 8, -15, -5, -5, 9, -1, 3, 10, -7, 1, 6, -4, -5, 8, -4, 1, 0, 6, -10, -1, -6, 1, 12, 21, 2, 4, 3, -5, -1, 4, 5, 8, 0, 8, 9, -1, 9, 10, -3, 22, 9, 2, 4, -8, 1, 3, -12, 10, -4, 1, -8, 2, -13, -8, -6, -9, -1, 7, -10, -12, -4, 7, 6, -19, -5, -6, -16, -10, -2, -1, -5, 1, 8, -7, 2, 4, -2, 2, -1, 4, 8, 11, -8, 15, 11, -4, 8, 8, 12, 6, 6, 2, 5, -13, 2, 4, 13, 8, 7, 2, 11, 4, -3, -5, 1, -5, -3, 15, -7, 2, -5, 13, -5, -3, -6, -2, -10, -3, -12, -3, 1, -16, -20, -7, -13, -5, -8, 5, -10, -6, 1, -6, 2, 2, -1, -11, -3, 2, -5, -7, -10, 1, 3, -3, -7, 4, 4, -8, -1, 13, 19, -1, -6, 4, -3, -3, -10, 10, 7, 0, 4, -3, -1, -1, -9, -15, -1, -6, 0, -4, -8, -6, -4, -6, 0, -4, -15, -13, -12, -16, -2, -24, -14, -24, -14, -1, 2, 11, 4, 7, 8, 5, 4, 9, 9, -2, 13, 2, 2, -3, 15, -6, 3, 10, 1, -2, 1, 7, -7, -6, 1, 10, 2, -1, -2, -3, 5, 17, 6, -4, 4, 2, 5, 5, -4, -2, 2, -2, 1, 1, 2, 2, -19, -11, -5, -10, -10, -14, -6, -12, -17, -7, -2, -4, -16, -8, -8, -5, -1, -14, -1, -7, 2, 9, 5, 0, 7, 14, 5, -1, 12, 3, 4, -1, -5, 19, 3, 6, 8, 9, 3, 0, -10, 8, -5, -11, -3, -6, -3, -3, 0, -6, 2, 3, 2, 4, -3, 4, -1, -2, -5, 1, 3, -5, 3, -11, 1, -10, -20, -11, -10, -10, -10, -9, -12, -11, -14, -8]
6349h%%KPrJ3JlPmKJoKkJ6j3oQKrM%%%nmrJ7koLOpJrlJ1nJ1j6J7j2Mj6QJ2j0k
6398a1MJ5k3J3JnJ1j7QkNj4J7l%NpPnP%j7J6NqOqRnq%LPjKJorQkMrrJNnRrKJJ2
6449ApKPLj1j2J2Pj2oOL%mRp%kJ2j0J2onNMpOnmRQmpkPlj%J2KomLlLKmLNlj9J3
6501BrRpPqO%mNmKrmJ4Lj6jJ2jrknJ2LO%oNjj2J8LmNj4QkNj4J2lllJ7j1oPQ%q
6551CKQnj2NQmj4MKMpqJ0mmMPpLOlnpJ5rKoRJk1J9jJ0mlQmoOPj4kOJ5k3J2nJ3
6600A1nNLOj3j4ROrJ5j2JJ0llkKmpOmkNJj0Pklj5J1RmpPM%pNRj1LkQj5J1j0LP
6648@j1K3nj1JLJ6k2J7prPJ2jj2mOkpR%Ko%Pjl%oJ3j3J0oj0LMo%nJ2j5LNJQj8
6694a8pJ1PpJ7j1oPj1N%Qj3K4j5jKMjMLkkmK0qr%QPmj6J6MrJ6j7MlJ0lj5Qj1K
$$ y = [-8, -8, -8, -6, 1, -8, 5, 6, 3, 10, 6, 8, 9, 3, 5, 3, 19, 6, 0, 8, 10, 1, 5, 5, 5, 5, 0, -4, -13, 4, 2, -4, -1, 5, -2, -1, -10, -13, -2, -7, 4, -12, 5, -7, -3, -19, -11, 1, -9, -11, -7, 8, -15, -2, -1, -6, 5, -12, -4, -6, -1, -15, 2, -1, -1, 4, -3, 4, -1, 6, 6, -11, 5, 10, 2, 8, 0, 9, 4, -4, -4, -1, 6, 5, 7, 8, 2, -7, 1, -1, 3, -6, -15, -14, -9, -14, -5, -14, -12, -11, 1, -6, -4, 3, 6, -5, -17, -5, 2, -10, -16, -10, -7, -7, -11, -2, -9, -9, -11, 1, -9, 3, -3, -8, -3, 1, -6, 0, -5, -9, 0, 8, 4, -3, -5, 2, -1, -2, -2, 10, 12, 6, 2, 5, 2, 5, 7, 3, 6, 11, 8, -11, 2, -7, 2, -5, 2, -6, 0, 0, -4, 1, -3, -1, -10, -14, 0, 3, -13, -14, -2, -3, -12, -14, -19, -7, -4, 2, 2, -4, 1, 0, -12, 6, 9, 5, 10, -4, 4, 2, 7, -7, 5, 2, -1, -4, 13, 2, -4, 3, 11, 11, 3, 5, 13, 8, -4, 1, 9, 5, -9, -5, -3, 1, -6, -14, -4, -8, -12, -8, -1, -8, -5, 1, -2, -7, -14, 1, -8, -6, -12, -3, -2, -23, -4, -5, 5, 1, -2, 6, 2, -4, 2, 9, -5, -7, -1, 14, -9, 3, -2, 11, 6, 11, 14, 20, 7, -7, 2, 8, -1, 14, 2, 3, 13, 10, 7, 5, 7, 3, -4, 2, -2, -4, 1, 2, -8, -1, -3, -6, -21, -10, -1, -5, -12, -5, -1, -1, -8, -3, 6, -5, -2, -4, 4, -11, 0, -10, -7, 0, -11, 12, 7, -4, -3, 0, 16, -6, 11, 4, -5, 2, 14, 13, 1, -3, 3, 1, -6, 3, 3, 5, -1, -1, 6, 5, 2, 2, -4, 9, -4, 6, 0, -10, -7, -3, -9, -9, -14, -2, -17, -14, -9, -8, 0, -18, -25, -14, -7, -14, 3, -8, -14, -7, -18, -13, -13, -5, -18, 6, -9, -10, -8, -4, -5, -1, 2, 0, -2, -6, 14, 6, -3, -3, 5, 12, 8, -8, 8, 12, 3, 19, 2, 6, 3, 13, 10, -5, 3, -8, -6]
6739flOMqqjRLjj4MRrJ3PpplJ5njJmkLjlNNMkj5K2j0J0j2pJ3kjJKJnljRnnJ7j2
6790@Oj4J6j2K%j2J5qJ6Jj7klJ3j7%LKpPJmjJ5j3J4pjjoK1j5RqjJ3j1MPOj0Nr
6834cJ0j0mNQjk1K8rkjOj0NJ3j1oOpLkLj2lJ2Oj0Nlj%m%JPkJqKLlNj0Qj0RJOj7
6883a7PQJj8J4J0kLjj0J3nlJ5k8K2o%j2POkKKmrMqK1j2OKk%nmJmLL%kONj3J4j6
6930hLkj0J9j1QmQrJnOKMj0QJ%lqQJ0JMNmj7RMj5J4lmj0LPNmJ2nMj4Ojj5Q%Qj3
6979gmJ0l%nLkMrQRj3PnJQk4J8oJ5j0JrNJ0KooJ4mNoRLrmJ1Jj3%J7k0J9j4Lkm
7026bJ0%rKMkJ0Nj9KKj4J1pMmLJJ%nQm%Rj4mJ9rmmOOp%Rj0nRQKrPlKJkMlkkQQ
7079A7j7PnMqKJ0JpoOmKKnLjrJ4j3j0PLj3J5P%oj2J5KkklMjkLj1J6nJojJ0jOp
$$ y = [-6, -9, -3, 1, -7, -15, -16, -7, -4, -5, -19, -15, -6, -15, -2, 5, -2, -9, -12, 3, -2, -3, -2, -6, -8, -5, -6, -9, -4, 1, 5, 3, -12, 10, 0, 10, -2, -9, 4, 2, 1, 2, 4, 5, 0, -3, -4, 5, 0, -5, 12, 0, 6, -8, 8, -4, -2, -2, -14, 1, -7, 9, 10, -7, -9, -12, 1, -16, -16, -13, -11, -18, -11, -10, -14, -15, 0, -13, 1, -6, -7, -8, -14, 7, -8, 1, -7, -8, 5, -6, -2, 5, 11, 1, 6, -3, 7, -3, -7, -2, 6, 5, -16, 12, 3, 1, 0, 6, -4, 1, 14, 3, -3, 3, -4, -1, -3, 0, -12, -15, -3, 3, -7, -2, -5, -6, -6, -10, -10, -9, -2, -4, -3, -11, -9, -6, -9, -4, -14, -6, -16, -7, -6, 0, -17, -10, -2, -1, -19, -5, 5, 3, 6, 5, -5, 8, 3, 0, 15, -13, 9, 3, 3, -9, -2, 4, 2, 4, 6, 2, -7, -3, -11, 10, -2, 4, 6, 4, 4, -1, -5, -4, -8, -5, -2, -2, -4, 2, 7, -6, 8, -8, -5, -7, -17, 2, -9, -1, -5, 3, -6, -5, -10, -4, -2, 2, -8, 0, 1, 1, -2, -10, -2, 8, 9, 13, 18, 14, -3, 6, 10, -5, 9, 6, 2, -8, -5, 2, 7, 3, 15, 10, 14, 0, 6, 5, -10, -2, -2, 6, -7, -11, -1, -4, -4, -9, -6, -8, -4, -13, -5, 4, -9, -2, -7, -6, 2, -22, -4, -10, 5, -5, -4, -13, -8, 2, 4, -2, -8, 6, 2, 7, 1, 10, 13, 4, 0, 11, 12, -1, -1, 16, -4, 15, 1, 4, 2, -2, 8, 8, -1, 1, 5, 3, 13, 18, -1, 1, 3, -11, 0, -7, -3, -7, -4, -3, -2, -2, -7, 1, -3, -3, 6, -8, -12, 7, -2, -6, -10, -4, 2, -5, -5, 4, -6, -11, -2, 6, 8, -1, 6, 3, 5, 6, 4, 8, 5, 3, 1, 9, 17, 0, 7, 2, 6, -2, 0, 10, 11, 4, -2, 4, 0, 2, 4, -1, 2, 1, -8, 6, -7, -17, -10, -7, -20, -5, 2, 2, -4, -16, -1, 1, -1, -3, -6, -2, -3, -5, -2, -13, 3, -2, -1, -7, -8, 2, 1, 7, 0]
7127@RrjRQoRnnJj0OQj3qJ0MMlL%j3NOj7MJ7j4%qQPkrLlkj2J7j0JNMPlj2jJ0O
7176Ej6J3Rj7Rjj5PkJ4j2QNLqJ0RrmPnkpMJ1mrjJ2j2j2J0MokJ3pPj1rJ8k8J4L
7220dOPk3K1jpjJJpJ5nJ0j6JNJj0PJ0k2RPQkj6J3Rj1pJ2lkKNLjpnRjJ1j8MJ0j9
7266aRplQJ0j7j0J1kQj3jLnOKNJj1%LrPJmJ6oJlJkNkLLqNKnQj6NJ2kj6K0j1J3
7314A4Kk0J2qLRnlJJmQLmj4ONoMkLmkRj4NqkNJ0Kj3J1rMPj2QKoJ0mOlJ2j8jLk
7363APlNjkJMJjkj1Q%Mj1jlK0onj%JQqqQkkJ0j8KMnQoOllOpNj5NOj%J6j0rQrP
7416bJ0JmjQj5RPjj0qJ9JjlnRLplmKjKNMmj2J4j3QrKnQPpQj8PoQljpNp%RMPop
7469c%PLj1kRLj3%J6j2OlLLpJ0nqJ2Rj3pQlLN%Pj8RMMJj1JOj4J3j3jj2K1noQk
$$ y = [0, 9, 0, -1, 8, 16, 10, 19, 14, 9, 10, 0, 6, 14, 1, -7, 3, 7, 11, 8, 11, 11, -2, 3, 9, -8, -4, 13, -1, -1, -9, -1, 6, 4, -5, -2, -5, -7, -19, -2, -12, -11, -6, -2, 5, 2, -10, -11, -1, 5, -11, 2, 11, -6, 3, 2, -13, -6, -8, 6, -6, 2, 7, 10, 2, 12, 21, 12, 8, 15, 10, 8, 1, 5, 16, 12, 3, 2, 14, 2, -10, 0, 4, -2, -4, 9, 2, 9, -2, -11, 7, -21, -7, -4, 2, 9, -14, 7, 6, -1, -2, -1, 0, -7, 8, 3, 13, -3, -2, 3, 4, -6, 1, 11, -11, -2, 5, 13, 11, -5, 8, 17, 6, -1, 11, 8, 6, 8, 13, 16, 15, 8, 3, 12, 11, 22, 4, 8, 18, -1, 8, 1, -2, 6, 16, -1, -11, 0, -2, 6, -7, -8, -5, -10, -4, -2, 3, 4, -7, -7, -4, -13, -6, -5, -9, 7, 1, 2, -1, 0, -2, 3, 1, 4, 7, -1, 4, 6, 1, 9, -7, -2, 10, 8, -8, 12, 1, 14, 16, -4, 8, 0, 3, 12, 7, 4, 5, 6, 2, 10, 13, 9, -5, 1, 6, 0, 4, 2, 5, 1, -1, 8, -6, -1, -9, -11, -6, 4, 6, -7, 4, -5, -1, 6, -6, 2, 4, -2, 8, 4, 10, 7, 19, 1, 0, 3, 1, 8, 5, 10, 9, 7, 8, 12, 13, 12, 10, -1, 7, 7, 11, 0, -1, -4, 16, 10, 5, 4, 4, 5, 13, 5, -3, 5, 3, 1, 11, -7, -5, -1, -6, 2, -4, 2, -1, -4, 2, -5, 0, -15, -10, -4, -5, -5, 11, 1, -8, 0, -9, -2, 8, 9, 5, 4, 12, -3, 6, 13, 12, 2, -6, 13, 14, 13, 10, 5, 14, 17, 10, 7, 3, 5, 4, 6, 11, 15, 11, -1, 13, 0, 8, -1, 1, -4, 4, 11, 4, 12, -6, 1, -5, 3, 0, -1, -8, -3, -10, -10, -1, 3, 10, 4, -3, -3, 4, 7, -4, -6, 3, 6, -7, -7, 9, -3, 3, 0, 3, 6, -1, 9, 4, -4, 8, 17, 4, -3, 5, 2, 5, 10, 10, 17, -1, 8, 12, 16, 17, 6, 7, 13, -1, 12, -1, -2, -14, 7, 2, -4, 4, 2]
7516Bj4J3Lj6J1Ko%MolMJ6j6jJ6Nj6J3qPmPj4KJ5j2Pj2jPJ1molO%KrJ1Kj5J4j1
7560CkQPk3OMJlkNJ0qknMj7J2Jp%qJ5k1RpJ5%j1J1JmmRj0K2k1J4j3RkONj0j0Q
7605eJ2j1NjJ%ONJrkROqjk4K3NLj6KmMNpNqJ1j8J2J0Lj2oLqJ0j2PrRjMQmj3Lk
7653iJ1Qk0LQ%mmJJ5qqJ4MjMmKmJJNk%j1qNjJ5j3pRPrlj2J1LNnlLjmRqPpmkJ5
7704DqllrQkMRnKoMJ0Pj3LjNnjJ4mjOj0ONj3RMj1kLpnPMnJ1j1JkMoLlj1J2J4k1
7754i%PMmJ2p%j2JjlJ1jjmJ1j8ONLKnMMk%olPLLoLJ2rJNj1mPkJ2j5MJ1j0NKj9
7803gJ0jrNOp%Rj0NRj7J0j2kPj6J0JJLlNJ0j5KLpPQmj0Lj2J3nJ3JOj2mJ0Kj4J3
7848E%JmJ4j0KjNmNj4J2Nlj1Qlj0J2Jnj3J6j7Pj3J2jkj8K5jlqJ2ojJ4jj4jKpQ
$$ y = [2, -12, 1, 4, -12, -1, 1, -5, -5, -1, -7, -10, -6, 10, -6, -7, 9, 14, -2, 11, 3, 10, 6, 13, -1, 1, 16, 4, 11, -1, -2, 5, 16, 12, 6, 3, 9, 9, 11, 2, 13, 15, 0, 14, 3, 1, 9, 16, -7, -1, 3, 4, 1, -1, 4, 14, 6, 4, -1, 3, -14, -2, -1, -8, -8, -16, -1, -22, -13, -20, -5, -5, -16, -5, -4, -8, -12, -3, -13, 9, -12, 2, -11, -2, -4, 2, 7, -3, -13, -5, 7, -4, 1, 0, 1, 1, 7, 12, 13, 4, 2, 11, 17, 9, 8, -16, 7, 12, 15, -1, 1, -3, 1, 6, -1, 4, -4, 7, -11, 1, 11, 14, 2, -4, -1, -9, 1, -11, -4, -13, -4, -5, -1, 7, 3, -10, -7, -9, 2, 10, -10, -7, 1, 1, -3, -7, -6, 9, 1, -7, 7, 11, 10, 14, 10, 12, 8, 9, 10, 15, 13, 13, 2, -6, -1, -2, 13, 0, -7, 2, 9, 0, -3, -15, -4, -1, 4, -1, -4, -1, -2, -6, 3, -5, 2, -5, -9, -11, 4, -4, -7, -10, -19, -11, -13, -9, 0, -5, -3, -9, -5, 5, 12, -1, 2, 1, 6, 1, 0, 14, 10, 9, 15, 5, 11, 16, 3, 12, 16, 5, 3, 6, -1, -6, 1, 5, 0, 11, 0, 1, -1, 3, -3, 0, -3, -14, -2, 12, -9, -9, -2, 2, -2, 10, 3, 3, -9, -8, -9, -12, -1, -2, -3, -7, 4, -14, -8, -3, 0, 2, -3, 1, 5, 3, 3, -3, -6, 1, 4, 7, 1, 4, 16, 7, 8, 13, 2, -2, 5, 3, 15, 0, 4, 15, 5, 10, 12, -7, 3, 2, -7, -2, 4, -3, -3, 6, -4, 1, 10, -7, 3, -9, -11, -4, -20, -10, -9, -8, -5, -8, -3, 7, -8, -6, -3, -10, -3, 5, 1, -9, -6, -18, -5, -10, 3, 4, 10, -2, -6, 4, 6, -8, 5, 5, 6, 2, 16, 6, 8, 7, 12, 8, 13, -1, 11, 16, 13, 2, 10, 7, -3, 9, 10, 5, -8, 8, -9, -2, -15, -3, -4, -6, -24, 1, 0, -3, -11, 1, -5, -6, 8, 7, -7, -8, -6, -13, -5]
7892eLmkJkJ6Jj3Pj2J2jlNrMNJ0j8J0qPLJM%opNnpL%J1j3NJjNlJ5j3njRj3Qn%
7941ej1KJ5j4QoKO%OLj0LJLlmOoPllJ1oOlPLrnKNkLOj5J1j9J5Kj6MLprJ3KoPl
7991clMPrj0MMJMqQJj0J3plRrPjJLLj1J0j5R%lJRMjrj%Roj1K2jmKjPj3NRj6Kj
8042BLnJj6J3MlKnmPj0lKRonMPoNqjJLJ4qQj0QpjkOLp%J2JKj8JPoJ5kjOqOrmJ
8095bOkKKkL%orNrrJ1Nj4J4j2OkJ5j4nJ6j3%QmNPnjj0RJkRpPPk0LJ0Jj1J5oJ0
8142A2Lj2lMJ4oqMl%nPnMrJ2%pJ9j4Jj0kLnKOoj%jkPjrJ3jKj0NmoLPmjOMj
$$ y = [-5, -2, -6, -8, -7, -9, 7, 8, -5, 2, -10, 2, 1, -2, 3, -6, -2, 3, 13, -5, 5, -3, 4, 7, 8, 12, 12, 6, -1, 4, -1, -8, -5, -5, 6, -7, -2, -1, -2, 3, 0, 15, 2, -3, -4, 5, -8, 0, -5, -5, -16, -14, 1, -13, -5, -11, -9, -3, -3, 3, 6, -4, -1, 0, 3, 0, -4, 2, -4, 3, 0, -3, 8, 2, 8, 5, 12, 15, 6, 1, 3, 8, 6, 9, 15, 0, 11, -8, 7, 9, -7, -3, 0, -7, -16, -3, -1, -7, 0, -3, -6, -2, 5, -4, -14, -10, -6, -5, -1, -9, -1, 0, -10, 3, -4, -7, 2, -7, 0, -1, 0, 3, 6, -5, 5, -10, -1, -1, -4, -3, 6, 10, 9, 0, -1, -1, 8, 2, -9, 13, 12, 8, 10, 9, 16, 3, 8, 17, 1, 3, 2, 5, 0, 1, -15, -2, 2, -1, 1, -4, -8, -1, -11, -14, -12, -3, -9, -14, -10, -3, -9, -4, -12, -13, -12, -9, 5, -3, 5, -5, 3, -4, -5, -7, -1, 2, -5, -5, 7, 8, 10, -8, -7, 0, -6, 9, 7, 6, 12, 4, 10, 1, -3, -2, 4, 2, 4, 6, 4, 7, 7, 1, -8, -3, -12, -21, -10, -5, -19, -5, -17, -11, -13, 2, -12, -17, -1, -14, -14, -6, -10, -5, 2, -3, -4, -14, -5, -4, -6, 3, -4, 3, 10, -10, -7, 3, 4, -7, 8, 2, 12, 15, 3, 0, 4, 18, 12, 4, 8, 5, 5, 0, 7, 2, 6, -3, 9, 9, 2, 21, 7, 8, -2, -4, -1, -6, -4, 2, -4, -5, -5, -6, -8, -1, -2, -11, 2, 1, 3, -7, -2, -6, -12, -9, -2, -6, -7, -1, 3, 2]
8191B
##END NTUPLES=NMR FID
##END=
