##TITLE=1H_CA-8047-3-1
 CDCl3, 8 sc, 
 14.1.2019
##JCAMPDX= 6.0         $$ Bruker NMR JCAMP-DX V2.0
##DATA TYPE= NMR FID
##DATA CLASS= NTUPLES
##ORIGIN= UXNMR, Bruker Analytische Messtechnik GmbH
##OWNER= root
$$ XWIN-NMR		Version 3.5
$$ Mon Jan 14 15:47:57 2019 Russian Standard Time (UT+4h)  she@DPX200
##.OBSERVE FREQUENCY= 200.1313
##.OBSERVE NUCLEUS= ^1H
##.DELAY= (6, 6)
##.ACQUISITION MODE= SIMULTANEOUS
##.ACQUISITION SCHEME= undefined
##.AVERAGES= 8
##.DIGITISER RES= 18
##SPECTROMETER/DATA SYSTEM= spect
##.PULSE SEQUENCE= zg30
##.SOLVENT NAME= CDCl3
##.SHIFT REFERENCE= (INTERNAL, CDCl3, 0, 15.7039)
##AUDIT TRAIL= $$ (NUMBER, WHEN, WHO, WHERE, WHAT)
$$ ##TITLE= Audit trail, XWIN-NMR		Version 3.5
$$ ##JCAMPDX= 5.01
$$ ##ORIGIN= Bruker BioSpin GmbH
$$ ##OWNER= she
$$ F:/spectra/data/she/nmr/H-F/1/audita.txt
$$ ##AUDIT TRAIL=  $$ (NUMBER, WHEN, WHO, WHERE, WHAT)
(   1,<2019-01-14 15:46:44.15 +0400>,<she>,<DPX200>,
      <created by zg, POWCHK disabled, PULCHK disabled
       configuration hash MD5:
       00 E9 B6 7A A2 85 ED C7 34 08 36 98 17 FE 4E 26
       data hash MD5: 16K
       A6 38 40 CC 43 0A 9B 59 E9 8D 5B 00 AD 9D A0 D7>)
$$ ##END=
$$ 
$$ hash MD5
$$ 3F 26 AE 51 31 81 4D 08 EA BB 19 32 46 DE 4B D6
##$RELAX= 
##$RELAX= 
##$RELAX= 
##$RELAX= 
##$RELAX= 
##$RELAX= 
$$ Bruker specific parameters
$$ --------------------------
##$DU= <F:/spectra>
##$EXPNO= 1
##$NAME= <H-F>
##$PROCNO= 1
##$TYPE= <nmr>
##$USER= <she>
##$AMP= (0..31)
100 100 100 100 100 100 100 100 100 100 100 100 100 100 100 100 100 100 
100 100 100 100 100 100 100 100 100 100 100 100 100 100 
##$AQSEQ= 0
##$AQ_mod= 1
##$AUNM= <au_zg>
##$AUTOPOS= <>
##$BF1= 200.13
##$BF2= 200.13
##$BF3= 200.13
##$BF4= 200.13
##$BF5= 200.13
##$BF6= 200.13
##$BF7= 200.13
##$BF8= 200.13
##$BYTORDA= 1
##$CFDGTYP= 0
##$CFRGTYP= 5
##$CHEMSTR= <none>
##$CNST= (0..31)
1 1 145 1 1 1 1 1 1 1 1 1 1 1 1 1 1 1 1 1 1 1 1 1 1 1 1 1 1 1 1 1 
##$CPDPRG= <>
##$CPDPRG1= <>
##$CPDPRG2= <>
##$CPDPRG3= <>
##$CPDPRG4= <mlev>
##$CPDPRG5= <mlev>
##$CPDPRG6= <mlev>
##$CPDPRG7= <mlev>
##$CPDPRG8= <mlev>
##$CPDPRGB= <>
##$CPDPRGT= <>
##$D= (0..31)
0 1.2 0 0 0 0 0 0 0 0 0 0.03 0 0 0 0 0 0 0 0 0 0 0 0 0 0 0 0 0 0 0 0 
##$DATE= 1547466403
##$DBL= (0..7)
120 120 120 120 120 120 120 120 
##$DBP= (0..7)
150 150 150 150 150 150 150 150 
##$DBP07= 0
##$DBPNAM0= <>
##$DBPNAM1= <>
##$DBPNAM2= <>
##$DBPNAM3= <>
##$DBPNAM4= <>
##$DBPNAM5= <>
##$DBPNAM6= <>
##$DBPNAM7= <>
##$DBPOAL= (0..7)
0.5 0.5 0.5 0.5 0.5 0.5 0.5 0.5 
##$DBPOFFS= (0..7)
0 0 0 0 0 0 0 0 
##$DE= 6
##$DECBNUC= <off>
##$DECIM= 24
##$DECNUC= <off>
##$DECSTAT= 4
##$DIGMOD= 1
##$DIGTYP= 9
##$DL= (0..7)
0 120 120 120 120 120 120 120 
##$DP= (0..7)
150 150 150 150 150 150 150 150 
##$DP07= 0
##$DPNAME0= <>
##$DPNAME1= <>
##$DPNAME2= <>
##$DPNAME3= <>
##$DPNAME4= <>
##$DPNAME5= <>
##$DPNAME6= <>
##$DPNAME7= <>
##$DPOAL= (0..7)
0.5 0.5 0.5 0.5 0.5 0.5 0.5 0.5 
##$DPOFFS= (0..7)
0 0 0 0 0 0 0 0 
##$DQDMODE= 0
##$DR= 18
##$DS= 0
##$DSLIST= <SSSSSSSSSSSSSSS>
##$DSPFIRM= 0
$$ [...]
##$SUBNAM2= <"">
##$SUBNAM3= <"">
##$SUBNAM4= <"">
##$SUBNAM5= <"">
##$SUBNAM6= <"">
##$SUBNAM7= <"">
##$SUBNAM8= <"">
##$SUBNAM9= <"">
##$SW= 24.933730806125
##$SWIBOX= (0..15)
0 0 2 0 0 0 0 0 0 0 0 0 0 0 0 0 
##$SW_h= 4990.01996007984
##$TD= 16384
##$TD0= 1
##$TE= 0
##$TE2= 300
##$TE3= 300
##$TEG= 300
##$TL= (0..7)
0 120 120 120 120 120 120 120 
##$TP= (0..7)
150 150 150 150 150 150 150 150 
##$TP07= 0
##$TPNAME0= <>
##$TPNAME1= <>
##$TPNAME2= <>
##$TPNAME3= <>
##$TPNAME4= <>
##$TPNAME5= <>
##$TPNAME6= <>
##$TPNAME7= <>
##$TPOAL= (0..7)
0.5 0.5 0.5 0.5 0.5 0.5 0.5 0.5 
##$TPOFFS= (0..7)
0 0 0 0 0 0 0 0 
##$TUNHIN= 0
##$TUNHOUT= 0
##$TUNXOUT= 0
##$USERA1= <user>
##$USERA2= <user>
##$USERA3= <user>
##$USERA4= <user>
##$USERA5= <user>
##$V9= 5
##$VALIST= <valist>
##$VCLIST= <CCCCCCCCCCCCCCC>
##$VD= 0
##$VDLIST= <DDDDDDDDDDDDDDD>
##$VPLIST= <PPPPPPPPPPPPPPP>
##$VTLIST= <TTTTTTTTTTTTTTT>
##$WBST= 1024
##$WBSW= 4
##$XGAIN= (0..3)
0 0 0 0 
##$XL= 0
##$YL= 0
##$YMAX_a= 309415
##$YMIN_a= -414390
##$ZGOPTNS= <>
##$ZL1= 120
##$ZL2= 120
##$ZL3= 120
##$ZL4= 120
##$ABSF1= 10
##$ABSF2= 0
##$ABSG= 5
##$ABSL= 3
##$ALPHA= 0
##$AQORDER= 0
##$ASSFAC= 0
##$ASSFACI= 0
##$ASSFACX= 0
##$ASSWID= 0
##$AUNMP= <proc_1d>
##$AZFE= 0.1
##$AZFW= 0.1
##$BCFW= 1
##$BC_mod= 2
##$BYTORDP= 1
##$COROFFS= 0
##$CY= 11.3945322036743
##$DATMOD= 1
##$DC= 2
##$DFILT= <>
##$DTYPP= 0
##$F1P= 18.9103706918063
##$F2P= -1.10871071338519
##$FCOR= 0.5
##$FTSIZE= 0
##$FT_mod= 4
##$GAMMA= 1
##$GB= 0.15
##$INTBC= 1
##$INTSCL= 1
##$ISEN= 128
##$LB= 0.24
##$LEV0= 0
##$LPBIN= 0
##$MAXI= 10000
##$MC2= 0
##$MEAN= 0
##$ME_mod= 0
##$MI= 1.114404
##$NCOEF= 0
##$NC_proc= 0
##$NLEV= 6
##$NOISF1= 3.799351
##$NOISF2= 2.8
##$NSP= 1
##$NTH_PI= 0
##$NZP= 0
##$OFFSET= 15.70392
##$PC= 1
##$PHC0= -8873.284
##$PHC1= 14.20006
##$PH_mod= 1
##$PKNL= yes
##$PPARMOD= 0
##$PSCAL= 0
##$PSIGN= 0
##$REVERSE= no
##$SF= 200.130013532006
##$SI= 16384
##$SIGF1= 3
##$SIGF2= 2
##$SINO= 400
##$SIOLD= 16384
##$SREGLST= <1H.CDCl3>
##$SSB= 0
##$STSI= 0
##$STSR= 0
##$SW_p= 3612.71676300578
##$SYMM= 0
##$S_DEV= 0
##$TDeff= 0
##$TDoff= 0
##$TI= <>
##$TILT= no
##$TM1= 0
##$TM2= 0
##$TOPLEV= 0
##$USERP1= <user>
##$USERP2= <user>
##$USERP3= <user>
##$USERP4= <user>
##$USERP5= <user>
##$WDW= 1
##$XDIM= 8192
##$YMAX_p= 0
##$YMIN_p= 0
$$ End of Bruker specific parameters
$$ ---------------------------------
##NTUPLES= NMR FID
##VAR_NAME=  TIME,          FID/REAL,        FID/IMAG
##SYMBOL=    X,             R,               I
##VAR_TYPE=  INDEPENDENT,   DEPENDENT,       DEPENDENT
##VAR_FORM=  AFFN,          ASDF,            ASDF
##VAR_DIM=   8192,          8192,            8192
##UNITS=     SECONDS,       ARBITRARY UNITS, ARBITRARY UNITS
##FACTOR=    0.0002004,     1,               1
##FIRST=     0,             0,               0
##LAST=      1.6414764,     0,               0
##MIN=       0,             -414390,         0
##MAX=       1.6414764,     309415,          0
$$ Real data points
##PAGE= N=1
##DATA TABLE= (X++(R..R)), XYDATA
$$ [...]
$$ plain form
2160 2448 2632 4 -1317 -1001 175 820 607 -392 789 2215 1144 -1756 -932 1968 1507 -2774 -2562
2177 -2562 2041 3518 -1145 -4014 -125 2389 -490 -3192 -564 1691 581 -1423 -375 1509 1049
2192 1049 -743 -1507 -461 1125 2370 687 -1046 -293 2100 1118 -2401 -1915 2204 2371 -1205 -1610
2208 -1610 1537 1797 -2906 -4249 464 3184 783 -1995 -424 1318 -46 -2383 -1855 470 1541
2223 1541 1448 596 150 265 503 -1219 -2337 309 3786 2299 -1869 -1752 1591 1543 -2694 -3055 1667
2240 1667 3283 -71 -2056 161 1078 -1714 -3407 -645 2536 1698 -203 -817 -624 -25 101 -1044
2256 -1044 -1072 1009 2878 1373 -1699 -888 1634 354 -2244 -941 3086 2894 -1930 -2643 821 1642
2272 1642 -1187 -2643 -2 1795 344 -1399 -580 24 -457 -742 -591 220 1193 1025 -179 -799 209
$$ packed form
2160B448J84k628j321L16J176O45k13r99J181J426j071k900Q24K900m61m281K12
2177b562M603J477m663k869L889K514k879k702K628K255j110k004J048J884m60
2192A049j792p64J046J586J245j683j733P53K393r82l519M86M119J67l576m05
2208a610L147K60m703j343M713K720k401k778J571J742j364k337N28K325J071
2223A541r3q52m46J15K38j722j118K646L477j487m168J17L343m8m237l61M722
2240A667J616l354j985K217R17k792j693K762L181q38j901o14J93N99J26j145
2256a044k8K081J869j505l072Q11K522j280k598J303M027j92m824p13L464Q21
2272A642k829j456K641J797j451j743Q19O04m81k85J51Q11R73j68j204o20J008
$$ plain form
2289 209 1891 278 -2094 -466 2603 1663 -1683 -1091 1863 1185 -2145 -2345 1038 1766 -975 -1971 271
2306 271 1457 -231 -1767 -1268 88 714 720 -253 -377 311 669 -554 -2069 180 2526 953 -1068
2323 -1068 63 2686 923 -3033 -2042 1511 2025 -508 -1166 903 646 -1598 -2294 -495 1110 368
2339 368 102 -210 288 208 -572 -1662 -1680 1004 2702 1036 -1357 -158 1489 -45 -2598 -427 2787
2356 2787 2011 -1125 -871 1385 551 -2197 -1901 337 1429 621 -183 -222 -339 -607 -1092 -840 94 986
2374 986 1017 -322 -1132 330 1205 -717 -1944 817 2684 1157 -1647 -475 1760 269 -1480 -1003
2390 -1003 1411 1385 -961 -1017 591 739 -861 -1382 -582 211 728 236 -1055 -380 288 741 -754 -1680
2408 -1680 462 1627 85 -1235 623 2500 250 -2170 -821 1594 976 -813 -584 1399 1111 -802
$$ packed form
2289B09J682j613k372J628L069r40l346N92K954o78l330k00L383P28k741r96K242
2306B71J186j688j536M99J356O26Or73j24O88L58j223j515K249K346j573k021
2323a068J131K623j763l956R91L553N14k533o58K069k57k244o96J799J605p42
2339C68k66l12M98q0p80j090j8K684J698j666k393J199J647j534k553K171L214
2356B787p76l136K54K256q34k748K96K238J092q08q04l9j17k68m85K52R34Q92
2374I86L1j339q10J462Q75j922j227K761J867j527k804J172K235j491j749M77
2390a003K414k6k346n6J608J48j600n21Q00P93N17m92j291O75O68M53j495r26
2408a680K142J165j542j320J858J877k250k420J349K415o18j789K29J983k88j913
$$ plain form
2424 -802 -1047 -305 460 65 50 -352 241 269 -117 -1295 -1353 629 1621 -52 -1073 768 1539 -503 -2442
2443 -2442 -197 1773 1124 -679 357 1783 463 -1478 -1404 755 811 7 107 593 63 -80 -646 -1236
2461 -1236 -239 605 966 -41 -533 481 788 -1148 -1876 758 2066 112 -888 76 1520 -63 -1722
2478 -1722 -429 1493 997 -116 -198 635 330 -708 -937 -388 201 465 194 -638 -667 384 295 -1087 -1247
2497 -1247 864 1420 -529 -1131 373 1445 -448 -1325 106 1355 126 -874 32 1179 379 -738
2513 -738 -443 10 194 51 -383 -255 -163 494 268 -1137 -1100 241 629 -643 -770 993 921 -855 -1414
2532 -1414 31 1205 -122 -490 474 1506 160 -877 -372 371 191 -176 169 551 612 -113 -579 -1340
2550 -1340 -650 323 402 -647 -278 665 357 -1511 -1556 410 1173 -97 -767 833 1248 -675 -1490 -47
$$ packed form
2424h02k45P42P65l95j5m02N93K8l86j178n8J982R92j673j021J841P71k042j939
2443b442K245J970o49j803J036J426j320j941P4K159N6q04J00M86n30j43n66n90
2461a236R97Q44L61j007m92J014L07j936p28K634J308j954j000R64J444j583j659
2478a722J293J922m96j113q2Q33l05j038k29N49N89K64k71q32k9J051q9j382j60
2497a247K111N56j949o02J504J072j893q77J431J249j229j000R06J147q00j117
2513g38K95M53J84j43m34J28R2O57k26j405L7J341L88j272j27J763p2j776n59
2532a414J445J174j327l68R64J032j346j037N05P43j80l67L45L82O1p25m66p61
2550a340O90R73P9j049L69R43l08j868m5J966P63j270o70J600M15j923q15J443
$$ plain form
2568 -47 1075 539 -71 416 647 17 -349 -486 -161 -65 487 505 -636 -123 302 -262 -1180 -600 792 948
2588 948 -758 -839 362 562 -1019 -1224 382 975 53 -609 683 919 -138 -780 9 71 305 414 6
2607 6 -310 127 502 118 -918 -481 830 453 -698 -377 725 351 -889 -889 465 823 -616 -527 646
2626 646 993 -179 -820 -109 313 -53 123 254 276 65 261 -21 -698 -347 465 257 -510 -326 827 123
2646 123 -1172 -945 258 534 -649 -418 653 516 -581 -716 252 355 -241 -130 533 601 524 -197 -133
2665 -133 -232 -159 250 72 -104 8 605 -159 -1024 -412 676 300 -668 -222 1013 314 -1040 -699 240 557
2685 557 -424 -89 388 215 -169 -455 23 154 494 335 360 -134 292 514 -307 -731 186 874 198 -570
2705 -570 -133 678 99 -905 -444 396 466 -595 -463 781 441 -549 -336 39 353 134 183 79 60 252
$$ packed form
2568d7J122n36o10M87K31o30l66j37L25R6N52J8j141N13M25n64r18N80J392J56
2588I48j706q1J201K00j581k05J606N93r22o62J292K36j057o42P89O2K34J09m08
2607Fl16M37L75l84j036M37J311l77j151L21J102l74j240%J354L58j439Q9J173
2626F46L47j172o41P11M22l66J76J31K2k11J96k82o77L51Q12k08p67J84J153p04
2646A23j295K27J203K76j183K31J071j37j097j35R68J03n96J11O63O8p7p21O4
2665a33r9P3M09j78j76J12N97p64q65O12J088l76r68M46J235o99j354L41R39L17
2685E57r81L35M77j73l84k86M78J31L40j59K5m94M26K22q21m24R17O88o76p68
2705e70M37Q11n79j004M61Q40P0j061J32J244l40r90K13L75L14k19M9j04j9J92
$$ plain form
2725 252 308 -1 -413 166 261 195 -521 -170 554 -37 -996 72 286 79 -838 -209 544 19 -369 -331 232
2746 232 236 -184 46 310 7 94 -29 28 -279 228 185 44 -28 358 505 -144 -497 37 584 -63 -569 186
2768 186 668 -121 -710 -255 274 -136 -342 -45 425 317 -227 -89 -2 -198 -126 338 303 76 234 504 -104
2789 -104 -256 182 187 123 -497 238 585 -60 -721 169 527 -143 -648 -229 356 -85 -652 -307 170 -202 -72
2810 -72 -141 194 143 233 216 -334 -467 130 623 -152 -13 131 488 -193 -613 268 322 -280 -412 263 155 -146
2832 -146 -560 17 380 -145 -219 181 101 -182 -65 246 62 -245 33 435 -165 -66 538 465 -164 -309 490
2853 490 252 -361 -210 273 523 -511 -345 -19 147 -372 -687 248 13 -236 -326 80 -123 -108 -38 78 -21
2874 -21 -67 176 64 -206 -249 166 262 -323 -90 378 474 -273 -218 13 447 -90 -315 307 259 -291 -558 144
$$ packed form
2725B52N6l09m12N79R5o6p16L51P24n91r59J068K14k07r17O29P53n25l88L8N63
2746B32Mm20K30K64l03Q7j23N7l07N07m3j41p2L86J47o49l53N34N47o47n06P55
2768A86M82p89n89M55N29m10k06K97M70j08n44J38Q7j96P2M64l5k27J58K70o08
2789a04j52M38No4o20P35L47o45o61Q90L58o70n05M19N85m41n67L45M77l72J30
2810g2o9L35n1R0j7n50j33N97M93p75J39J44L57o81m20Q81N4o02j32O75j08l01
2832a46m14N77L63n25p4M00q0k83J17L11j84l07K78M02o00R9O04p3o29j45P99
2853D90k38o13J51M83K50j034J66L26J66n19l15R35k35k49r0M06k03J5P0J16r9
2874b1m6K43j12k70m3M15R6n85K33M68R6p47N5K31M34n37k25O22m8n50k67P02
$$ plain form
2896 144 47 -7 -353 30 19 24 152 22 -328 -151 264 113 -244 -249 592 653 -377 -208 546 328 -112 33
2918 33 364 106 -318 -296 -53 161 -227 -274 65 -19 -140 -78 -332 -295 8 227 104 -98 103 93 -163 -273
2940 -273 -215 357 76 -229 257 443 200 -213 82 157 139 -510 -303 315 -90 52 171 -12 -240 -192 194
2961 194 -134 -74 -37 279 -53 -237 60 81 104 -178 100 572 -51 -312 -226 533 180 -303 -174 150 115 -131
2983 -131 -181 -24 -67 -54 140 51 75 -135 -58 74 -137 -48 31 -47 -215 267 381 -39 -465 -68 363 9 -257
3006 -257 71 123 209 -129 -140 -31 59 -328 13 -36 -152 -155 272 220 -60 -55 19 -126 -57 2 172 -123 -246 291
3030 291 76 151 -138 215 415 -84 21 -9 430 223 37 366 27 83 128 -179 -139 84 184 -264 -56 -186
3052 -186 -94 -137 -111 -157 195 312 -30 -6 318 61 29 -154 105 578 -58 -369 178 301 76 70 111 170 -42
$$ packed form
2896A44r7n4l46L83j1NJ28j30l50J77M15j51l57nQ41O1j030J69P54k18m40J45
2918C3L31k58m24K2K43K14l88m7L39q4j21O2k54L7L03K19j23k02K01j0k56j10
2940b73N8N72k81l05M86J86k43m13K95P5j8o49K07O18m05J42J19j83k28M8L86
2961A94l28O0L7L16l32j84K97K1K3k82K78M72o23k61Q6P59l53m83J29L24l5k46
2983a31n0J57m3J3J94q9K4k10P7J32k11Q9P9p8j68M82J14m20m26L97M31l54k66
3006b57L28N2Q6l38j1J09R0l87L41m9j16lM27n2k80NP4j45O9N9J70k95j23N37
3030B91k15P5k89L53K00m99J05l0M39k07j86L29l39N6M5l07M0K23J00m48K08j30
3052a86R2m3K6m6L52J17l42K4L24k57l2j83K59M73o36l11N47J23k25oM1N9k12
$$ plain form
3075 -42 -110 -161 91 139 47 11 -90 -158 157 -94 13 62 -64 115 -189 -184 345 225 -77 280 278 152 -185 -355
3099 -355 73 60 49 74 183 -36 -21 290 5 -94 -142 -11 -173 -165 -5 -131 36 -67 -201 276 -219 -289 -125
3122 -125 223 74 -311 125 133 309 -83 -41 124 424 -201 -131 335 193 90 243 -13 -35 -89 90 -211 55
3144 55 -79 166 -122 -66 94 32 -371 -239 -29 110 -39 -252 -194 113 248 -255 -212 208 -172 -211 73 -75
3166 -75 -90 201 90 54 -201 -43 119 -16 -174 -90 302 -15 -131 421 168 123 -325 120 150 185 40 -117
3188 -117 174 4 -305 -159 273 -38 159 196 94 8 -89 -19 -142 157 129 287 -319 -49 308 200 -148 -126
3210 -126 45 269 -75 -248 108 111 127 -132 -25 182 426 108 221 -12 175 -316 103 241 150 374 -262
3231 -262 -28 -145 -25 299 -237 -201 172 79 -27 -379 116 266 1 -166 230 -83 28 -193 -63 181 -231
$$ packed form
3075d2o8n1K52M8r2l6j01o8L15k51J07M9j26J79l04NN29j20l02L57kj26l37j70
3099c55M28j3j1K5J09k19J5L11k85r9m8J31j62QJ60j26J67j03j34M77m95p0J64
3122a25L48j49l85M36QJ76l92M2J65L00o25P0M66j42j03J53k56k2n4J79l01K66
3144E5j34K45k88N6J60o2m03J32K10J39j49k13N8L07J35n03M3M20l80l9K84j48
3166g5j5K91j11l6k55J58J62j35j58Q4L92l17j16N52k53m5m48M45L0L5j45j57
3188a17K91j70l09J46M32l11J97L7j02q6r7P0j23K99k8J58o06K70L57j08l48K2
3210a26J71K24l44j73L56LJ6k59J07K07K44l18J13k33J87m91M19J38r1K24o36
3231b62K34j17J20L24n36L6L73r3j06l52M95J50k65j67L96l13J11k21J30K44m12
$$ plain form
3252 -231 -178 -7 -168 -192 -35 157 -1 11 -122 260 -202 -162 223 -141 -120 -310 151 -117 -86 -28 310 -100
3274 -100 -309 -310 12 68 -76 -89 99 205 -85 42 140 -54 54 -104 205 209 266 320 133 -207 305 407 132
3297 132 -380 -302 224 134 -125 -24 155 164 -232 3 283 350 -111 -305 -48 -145 298 -90 271 -33 -45 240
3319 240 212 -123 -222 532 -136 -234 79 264 189 -344 181 11 119 -218 -93 305 -93 -141 -155 59 29 -414
3341 -414 -198 1 -162 36 70 104 -77 -144 32 6 -441 -330 538 -47 -32 -23 163 98 -151 206 296 -55 -126
3364 -126 -148 1 -7 -461 -224 267 1 -142 203 -9 -151 105 49 -151 -195 196 378 148 -112 -279 433 81
3386 81 -182 161 347 -140 70 -119 325 276 74 -146 319 -100 -170 -102 238 75 -85 180 -158 -41 -99 220
3408 220 -23 -344 -49 82 -114 -172 216 406 -28 -151 -18 490 -371 -471 142 77 -359 -201 14 -54 -178
$$ packed form
3252b31N3J71j61k4J57J92j58J2j33L82m62M0L85l64K1j90M61k68L1N8L38m10
3274a00k09jL22N6j44j3J88J06k90J27R8j94J08j58L09MN7N4j87l40N12J02k75
3297A32n12P8N26r0k59J01J79Rl96K35K80O7m61j94K57r7M43l88L61l04j2K85
3319B40k8l35r9P54o68r8L13J85p5n33N25j70J08l37J25L98l98m8j4K14l0m43
3341d14K16J99j63J98L4L4j81o7J76k6m47J11Q68n85J5RJ86o5k49L57R0l51p1
3364a26k2J49qm54K37M91k66j43L45k12j42K56n6k00m4L91J82k30k60j67P12l52
3386H1k63L43J86m87K10j89M44m9k02k20M65m19p0O8L40j63j60K65l38J17n8L19
3408B20k43l21K95J31j96n8L88J90m34j23J33N08q61j00O13o5m36J58K15o8j24
$$ plain form
3429 -178 -87 192 17 -271 -78 -174 78 -200 204 541 -5 -190 -136 212 -116 266 365 315 -119 -11 26 171
3451 171 -203 -279 120 -83 67 -274 -128 -41 -9 -228 354 168 -276 36 -214 66 -370 239 272 -174 -69
3472 -69 238 196 48 -130 315 306 -64 -427 335 165 -279 -144 157 195 -169 -291 152 -78 -255 61 -30 -166
3494 -166 -20 34 407 -227 -195 210 402 -312 -92 243 281 -144 -170 109 479 -186 -10 -23 259 -47 -110 211
3516 211 85 -384 -81 165 50 -120 100 326 -310 -20 196 421 -148 -296 159 116 -461 -149 139 39
3536 39 -358 -121 187 -17 -155 -183 408 159 -6 -232 -13 -50 -139 -134 48 -225 -179 335 14 -178 -303 60
3558 60 25 -349 32 144 122 -433 -25 227 162 -144 -218 517 264 31 36 119 -162 -215 53 49 -64 49 46 6 -277
3583 -277 -374 -55 189 -69 -427 -10 -178 -423 -194 142 77 -352 -216 314 133 -68 -208 270 225 -350 143
$$ packed form
3429a78R1K79j75k88J93r6K52k78M04L37n46j85N4L48l28L82R9n0m34J08L7J45
3451A71l74p6L99k03J50l41J46Q7L2k19N82j86m44L12k50K80m36O09L3m46J05
3472f9L07m2j48j78M45rl70l63P62j70m44J35L01L8l64j22M43k30j77L16r1j36
3494a66J46N4L73o34L2M05J92p14K20L35L8m25k6K79L70o65J76j3K82l06o3L21
3516B11j26m69L03K46j15j70K20K26o36K90K16K25n69j48M55m3n77L12K88j00
3536C9l97K37L08k04j38k8N91k49j65k26K19l7q9NJ82k73M6N14l21j92j25L63
3558F0l5l74L81J12k2n55M08K52o5l06p4P35k53k33NQ3k81n3K68mj13J13lm0k83
3583b77r7L19K44k58l58M17j68k45K29L36o5m29J36N30j81k01j40M78m5n75M93
$$ plain form
3604 143 319 19 -358 178 168 -278 -94 71 159 -328 -169 249 192 -80 -195 325 322 -230 -183 41 88 -421
3626 -421 -58 559 137 -167 159 307 13 65 218 276 32 -14 -74 -86 -280 10 212 263 -151 -145 -100 -120 -475
3649 -475 -181 415 169 -577 -182 345 -296 -62 115 440 260 43 317 760 -33 -69 191 120 243 -24 343
3670 343 -248 -178 52 241 -278 -384 61 274 -136 -476 -39 68 -213 -238 113 420 7 -334 -71 302 111
3691 111 -35 -27 276 24 -201 137 44 -343 -59 463 123 -58 -29 196 -263 -396 111 219 168 -405 -108 313
3713 313 167 -581 388 128 50 -456 67 466 -275 -104 206 450 173 -79 325 206 -216 154 272 -60
3733 -60 -325 -38 204 104 -238 -300 62 -271 -341 66 629 -230 -368 10 114 -10 -70 266 20 63 -258 200
3755 200 295 -211 -97 330 99 103 154 -256 -287 -209 -44 36 -109 -251 178 161 -238 -374 124 448 -136 -117 273
$$ packed form
3604A43J76l00l77N36j0m46J84J65Q8m87J59M18n7k72j15N20ln52M7K24M7n09
3626d21L63O17m22l04L26J48k94N2J53N8k44m6o0j2j94K90K02N1m14OM5k0l55
3649d75K94N96k46p46L95N27o41K34J77L25j80k17K74M43p93l6K60p1J23k67L67
3670C43n91P0K30J89n19j06M45K13m10l40M37J07k81k5L51L07m13l41K63L73j91
3691A11j46QL03k52k25L38r3l87K84N22l40j81K9K25m59j33N07J08n1n73K97M21
3713C13j46p48R69k60p8n06N23L99p41J71L10K44k77k52M04j19m22L70J18l32
3733f0k65K87K42j00l42o2L62l33p0M07N63q59j38L78J04j24o0L36k46M3l21M58
3755B00R5n06J14M27k31MN1m10l1P8J65Q0j45j42M29j7l99j36M98L24n84J9L90
$$ plain form
3778 273 -60 -178 -375 225 72 1 75 469 85 -368 266 139 -50 -280 217 52 -281 -326 378 406 -488
3799 -488 -241 232 145 -311 -290 426 297 -429 -300 231 127 -469 64 174 116 -248 -125 264 280 56 244
3820 244 294 -62 -210 303 632 -147 -338 372 -121 -352 -305 333 -2 -105 -478 76 160 -411 -207 314 83
3841 83 -139 219 303 -15 -242 -7 225 117 -82 475 92 -548 -78 376 344 -67 -325 401 354 -289 -545
3862 -545 103 -76 -420 38 352 308 -531 -215 -10 -129 -170 197 416 -29 -252 -32 140 -216 -79 425 283
3883 283 -23 -185 320 -47 -464 -63 381 223 -344 10 222 -44 -506 -261 74 -106 -212 32 284 -177
3903 -177 -329 -133 121 -126 -61 301 257 -94 -160 353 68 70 80 446 332 -232 -124 480 64 -462 -183 512
3925 512 64 -589 -167 181 -245 -413 228 326 -282 -90 42 277 -90 119 240 221 -214 279 329 -6 -397
$$ packed form
3778B73l33j18j97O00j53p1P4L94l84m53O34j27j89k30M97j65l33m5P04K8q94
3799d88K47M73q7m56K1P16j29p26J29N31j04n96N33J10n8l64J23L89J6k24J88
3820B44N0l56j48N13L29p79j91P10m93k31M7O38l35j03l73N54Q4n71K04N21k31
3841H3k22L58Q4l18k27K35K32j08j99N57l83o40M70M54l2m11k58P26m7o43k56
3862e45O48j79l44M58L14m4q39L16K05j19m1L67K19m45k23K20J72l56J37N04j42
3883B83l06j62N05l67m17M01M44j58n67L54K12k66m62K45L35j80j06K44K52m61
3903a77j52J96K54k47O5L62m4l51o6N13k85KJ0L66j14n64J08O04m16n26K79O95
3925E12m48o53M22L48m26j68O41R8o08J92J32K35l67K09J21j9m35M93N0l35l91
$$ plain form
3946 -397 65 230 132 -205 -125 253 -185 -460 202 560 10 -281 -48 244 -229 -489 -126 -62 45 -140 202
3967 202 -92 -608 -72 525 173 -218 218 484 -111 -206 -155 431 113 -395 18 515 -333 -117 9 34 -440
3988 -440 -382 300 189 -99 -437 -138 -19 -353 99 340 4 -276 199 430 -60 -374 56 445 232 100
4008 100 440 298 -173 -485 -287 202 40 -237 140 173 -383 -341 -51 285 -194 47 434 -55 -31 57 -58
4029 -58 26 48 215 426 -55 -294 268 385 180 -187 60 212 -46 -188 318 49 -476 -298 197 207 -197
4050 -197 -333 -64 352 -526 12 425 -132 -360 -131 324 40 -31 335 312 -29 -172 -32 56 -276 -522 647
4071 647 660 -242 -199 -166 -157 -719 184 159 189 -311 -243 339 -119 -593 8 289 89 40 275 445 -223 -552 116
4094 116 497 47 159 866 490 -149 -265 245 -29 -423 -19 443 252 -82 -505 70 -239 -316 -17 214
$$ packed form
3946c97M62J65r8l37Q0L78m38k75O62L58n50k91K33K92m73k60L63O4J07j85L42
3967B02k94n16N36N97l52l91M36K66n95r5N1N86l18n08M13M97q48K16J26K5m74
3988d40N8O82j11k88l38K99J19l34M52K41l36k80M75K31m90l14M30L89k13j32
4008A00L40j42m71l12J98M89j62k77L77L3n56M2K90L36m79K41L87m89K4Q8j15
4029e8Q4K2J67K11m81k39N62J17k05l67K47J52k58j42N06k69n25J78M95J0m04
4050a97j36K69M16q78N38M13n57k28K29M55k84p1L66k3l41j43J40Q8l32k46J169
4071F47J3r02M3L3Rn62R03k5L0n00O8N82m58m74O01K81k00m9K35J70o68l29O68
4094A16L81m50J12P07l76o39j16N10k74l94M04M62j91l34m23N75l09p7K99K31
$$ plain form
4114 214 -189 -95 105 176 -323 -221 344 448 17 -309 362 167 -506 -133 276 771 125 -325 192 -19 -224
4135 -224 -356 473 55 -400 -213 243 166 -163 15 125 -40 -233 57 342 -407 -467 235 137 51 -59 236
4156 236 353 -564 -123 427 157 -75 -184 243 17 -513 -299 34 -43 -183 82 338 -386 -589 6 -151
4176 -151 -385 -192 239 335 -459 -233 123 252 -662 -183 461 431 -74 38 317 50 -530 80 628 263 -63
4197 -63 167 123 -151 -497 112 315 -290 -36 512 168 -392 -690 -34 8 -450 138 398 131 -477 -226 307
4218 307 259 -419 71 561 -101 -215 -23 680 -7 -501 -3 461 -31 -272 223 -122 -464 -466 347 -34 -374
4239 -374 -445 185 230 -747 -254 85 41 -371 157 492 -163 -589 -87 360 107 -90 288 368 -270 -85 85
4260 85 415 -198 -206 193 -113 -351 -61 452 160 -413 -61 89 -78 -462 -63 260 81 -88 136 384 -205
$$ packed form
4114B14m03R4K00P1m99J02N65J04m31l26O71j95o73L73M09M95o46m50N17k11k05
4135b24j32Q29m18m55J87M56p7l29J78J10j65j93K90K85p49o0P02r8q6j10K95
4156B36J17r17M41N50k70k32j09M27k26n30K14L33p7j40K65K56p24k03N95j57
4176a51k34J93M31R6p94K26L56J29r14M79O44l0n05J12K79k67n80O10N48l65l26
4197f3K30m4k74l46O09K03o05K54N48l44n60k98O56M2m58N88K60k67o08K51N33
4218C07m8o78M90M90o62j14J92P03o87m94M98M64m92k41M95l45l42kQ13l81l40
4239c74p1O30M5r77M93L39m4m12N28L35o55m26N02M47k53j97L78Q0o38J85J70
4260H5L30o13qL99l06k38K90N13k92n73L52J50j67l84L99L23j79j69K24K48n89
$$ plain form
4281 -205 -357 186 152 -61 -22 328 363 0 -277 94 70 -165 -189 452 -52 -508 -291 279 -117 -640 -21 397
4303 397 102 -382 56 384 -382 -487 62 577 312 -41 161 238 -265 -187 595 422 -33 43 415 -15 -332
4324 -332 -175 219 -454 -251 31 467 138 -496 -157 325 -135 -429 213 442 -30 -680 54 499 -104 -13
4344 -13 254 304 -214 264 330 192 -181 -22 238 -142 1 37 501 -102 -192 134 488 -368 -531 125 306 -186
4366 -186 -393 225 298 -189 -154 442 78 -453 -291 555 485 -154 -425 390 -5 -172 138 573 147 -214 124
4387 124 53 -296 -532 108 -62 -328 -178 294 76 -266 -444 -27 348 -170 -225 314 185 -504 -80 16 163
4408 163 -432 182 552 152 34 -134 76 -243 -438 210 385 -68 -349 -5 69 -614 -245 277 380 -415
4428 -415 -190 471 270 -712 -106 292 39 -185 -28 358 145 -195 -43 198 -2 31 198 435 -129 -344
$$ packed form
4281b05j52N43l4k13L9L50L5l63k77L71k4k35k4O41n04m56K17N70l96n23O19M18
4303C97k95m84M38L28p66j05N49N15k65l53K02P7n03P8P82j73m55P6L72m30l17
4324c32J57L94o73K03K82M36l29o34L39M82m60k94O42K29m72o50P34M45o03R1
4344a3K67N0n18M78O6j38l73J59K60l80J43L6M64o03r0L26L54q56j63O56J81m92
4366a86k07O18P3m87L5N96l64n31J62Q46p0o39k71Q15l95j67L10M35m26l61L38
4387A24p1l49k36O40j70k66J50M72k18l42j78M17L75n18n5N39j29o89M24R6J47
4408A63n95O14L70m00j18j68K10l19j95O48J75m53k81L44P4o83L69N22J03p95
4428d15K25O61k01r82O06L98k53k24J57L86k13l40J52K41k00L3J67K37n64k15
$$ plain form
4448 -344 38 74 -783 -314 550 201 -520 -430 2 192 -393 -149 304 14 -279 30 241 -46 -95 114 384
4469 384 -64 -268 343 121 2 -13 393 134 -382 -212 66 152 -372 -25 303 340 -507 -417 641 353 -412
4490 -412 -38 411 -193 -637 -17 500 -126 -248 223 281 237 -13 145 433 -375 -97 352 236 -327 42 411
4511 411 -131 -564 -355 184 -78 -588 186 20 -141 -552 -313 143 -16 -115 679 575 124 17 291 437
4531 437 -69 -166 501 444 -166 -55 364 -35 -425 -97 570 148 -445 -83 313 -124 -579 -264 466 -147 -329
4552 -329 121 261 97 -383 217 343 -139 5 474 164 -600 -185 676 192 -242 -293 702 74 -488 -26
4572 -26 410 -47 -438 73 252 -225 -430 -117 374 0 -594 154 422 -165 -212 211 518 -213 -2 378 -17
4593 -17 -252 109 222 171 -491 265 696 240 -720 -137 480 -81 -627 326 541 -62 -417 -61 86 -116 -520
$$ packed form
4448c44L82L6q57M69Q64l49p21R0M32J90n85K44M53k90k93L09K11k87m9K09K70
4469C84m48k04O11k22j19j5M06k59n16J70K78Q6n24L47L28L7q47R0J058k88p65
4490d12L74M49o04m44O20N17o26j22M71N8m4k50J58K88q08K78M49j16n63L69L69
4511D11n42m33K09N39k62n10P74j66j61m11K39M56j59r9P94j04m51j07K74J46
4531D37n06r7O67n7o10J11M19l99l90L28O67m22n93L62L96m37m55L15P30o13j82
4552c29M50J40j64m80O00J26m82J44M69l10p64M15Q61m84m34n1R95o28n62M62
4572b6M36m57l91N11J79m77k05L13M91l74n94P48K68n87m7M23L07p31K11L80l95
4593a7k35L61J13n1o62P56M31m56r60N83O17n61n46R53K15o03l55L56J47k02m04
$$ plain form
4614 -520 127 312 17 22 83 105 -506 -77 325 318 -297 86 727 -106 -595 -101 234 -171 -289 97 406 -318
4636 -318 -540 -12 197 0 -21 330 328 -386 -436 -109 19 -79 -2 424 -28 -363 -240 465 -204 -313 357 541
4658 541 86 -198 315 292 -390 -667 400 623 -75 -450 52 237 -396 -474 117 117 -54 -217 15 115 -244
4679 -244 204 207 -12 -157 97 391 -185 -131 233 846 168 -286 279 378 -256 -208 357 349 -418 -516 144 154 -221
4702 -221 -325 28 16 -579 160 379 -180 -289 57 236 -186 -102 305 598 -328 -330 273 222 -322 -283 346 576
4724 576 -321 -416 313 38 -222 74 274 127 -334 51 217 -245 -236 -32 43 -257 -423 209 518 -154 -163 158
4746 158 196 -127 259 278 265 -396 -381 349 47 -197 -65 554 -72 -292 -225 100 -146 -429 -149 278 -155 -363
4768 -363 -80 214 -395 -103 161 276 -288 -56 524 670 -192 -154 201 331 -206 21 502 380 -394 -76
$$ packed form
4614e20O47J85k95NO1K2o11M29M02po15L83O41q33m89M94L35m05j18L86L09p24
4636c18k22N28K09j97k1L51kp14n0L27J28r8P7M26m52l35J23P05o69j09O70J84
4658E41m55k84N13k3o82k77J067K23o98l75N02J85o33p8N91%j71j63K32J00l59
4679b44M48Lk19j45K54K94n76N4L64O13o78m54N65R9o34M8N65qp67r8O60J0l75
4702b21j04L53j2n95P39K19n59j09L46J79m22Q4M07K93r26kO03n1n44L9O29K30
4724E76q97r5P29k75k60K96K00j47m61L85J66m62RK04P5l00j66O32L09o72rL21
4746A58L8l23L86J9j3o61J5P30l02k44J32O19o26k20O7L25k46k83K80M27m33k08
4768c63K83K94o09K92K64J15n64K32N80J46q62L8L55J30n37K27M81j22p74L18
$$ plain form
4788 -76 266 38 -481 -177 433 -163 -246 239 381 -390 -185 277 123 -263 72 430 315 -236 -9 366 160
4809 160 -337 -43 418 461 -369 -275 347 100 -526 -220 137 62 -420 -107 192 -317 -316 254 364 -393 64 285
4831 285 205 -174 -342 392 87 -76 4 632 146 -291 -163 454 139 -526 127 428 199 -484 -53 199 -4
4852 -4 -372 15 168 -512 -22 100 180 -409 -207 213 202 -308 -123 555 52 -359 49 326 243 -273 32 622
4874 622 45 -358 -29 214 -213 -16 105 270 -261 -49 136 6 -127 -217 208 -112 -496 -22 389 282
4894 282 -132 -220 539 118 -449 -159 454 38 -466 157 172 137 -58 182 208 -317 -166 305 22 -342 -97
4915 -97 264 -131 -360 173 530 222 -614 91 287 -138 -325 332 611 -18 -198 -209 285 198 -246 304 568
4936 568 161 -359 396 192 -76 -471 -8 24 -212 -150 296 2 -683 -31 -78 -154 -241 -2 427 -296 -439 172
$$ packed form
4788g6L42k28n19L04O10n96q3M85J42p71K05M62j54l86L35L58j15n51K27L75k06
4809A60m97K94M61M3q30R4O22k47o26L06L57p5m82L13K99n09JN70J10p57M57K21
4831B85q0l79j68P34l05j63Q0O28m86m37J28O17l15o65O53L01k29o83M31K52k03
4852dl68L87J53o80M90J22Q0n89K02M20j1n10J85O78n03m11M08K77q3n16L05N90
4874F22n77m03L29K43m27J97J21J65n31K12J85j30j33r0M25l20l84M74M11j07
4894B82m14q8P59m21n67K90O13m16n04O23J5l5j95K40K6n25J51M71k83l64K45
4915i7L61l95k29N33L57l08q36P05J96m25j87O57K79o29j80j1M94q7m44N50K64
4936E68m07n20P55k04k68l95M63L2k36O2M46k94o85O52m7p6q7K39M29p23j43O11
$$ plain form
4958 172 487 -77 -598 -42 475 101 -355 398 560 -181 -270 -28 -24 6 -147 265 -215 -368 -89 -9 147 -195
4980 -195 8 266 -270 -461 31 171 147 -224 157 296 -75 -316 435 176 -193 -205 134 397 -198 -35 288
5001 288 151 -445 -186 333 47 -221 95 290 -236 -511 27 307 -227 -663 217 544 -76 -580 159 380
5021 380 -209 -251 148 500 -121 -17 104 124 -131 -428 187 32 -157 236 348 37 -90 -6 340 -94 -174
5042 -174 74 332 -449 -263 365 272 -545 -186 270 563 -90 -47 238 -91 -20 -196 239 88 -87 34 212
5063 212 -120 -277 41 69 -386 -213 105 360 -397 -194 287 148 -178 -469 239 442 -341 -380 119 114 -226
5084 -226 -182 557 150 -83 70 250 -105 -119 65 220 -178 -227 188 195 -307 -350 231 -7 -358 -134 214 123
5106 123 -364 -173 234 172 -271 181 229 364 181 10 340 150 -333 -38 250 15 -149 178 263 -93 -401
$$ packed form
4958A72L15n64n21N56N17l74m56P53J62p41q9K42ML0j53M12m80j53K79Q0J56l42
4980a95K03K58n36j91M92J40k4l71L81J39l71k41P51k59l69j2L39K63n95J63L23
5001B88j37n96K59N19k86k68L16J95n26k75N38K80n34m36Q80L27o20n04P39K21
5021C80n89m2L99L52o21J04J21K0k55k97O15j55j89L93J12l11j27Q4L46m34q0
5042a74K48K58p81J86O28r3q17L59M56K93o53M3K85l29P1j76M35j51j75J21J78
5063B12l32j57L18K8m55J73L18K55p57K03M81j39l26k91P08K03p83l9M99nl40
5084b26M4P39m07k33J53J80l55j4J84J55l98m9M15Pn02m3N81k38l51K24L48r1
5106A23m87J91M07o2m43M52M8J35j83j71L30j90m83K95K88k35j64L27Q5l56l08
$$ plain form
5127 -401 302 557 -144 -387 178 174 -215 -241 253 177 -182 -167 172 249 -96 76 154 206 -350 41 169 -102 -107
5150 -107 349 107 97 -430 183 390 -147 35 297 -48 -476 -27 108 323 -199 -179 420 229 -335 -204 426
5171 426 -86 -410 -38 235 230 -224 -9 396 163 -252 361 427 -262 54 214 20 -31 82 187 -21 -517
5192 -517 -374 314 21 -358 -125 330 55 -296 -168 205 -37 -357 -183 80 -88 -49 301 234 -61 -80 399
5213 399 319 -334 -6 574 -2 -419 71 309 226 -469 -390 222 -86 -422 -345 206 -14 -230 -14 -1 -35 -56
5235 -56 92 135 -81 29 176 188 -301 -19 374 190 -357 1 530 199 -192 -103 164 219 -383 -191 341 19
5257 19 -397 -40 298 -82 -286 248 1 -157 -147 146 111 -406 -122 271 -39 -47 89 154 213 -314 72 410
5279 410 -7 -290 17 410 -57 -264 -126 373 137 -283 -58 57 -155 -107 18 225 -264 293 79 136 -321
$$ packed form
5127d01P03K55p01k43N65ml89k6M94p6l59J5L39P7l45J72P8N2n56L91J28k71n
5150a07M56k42j0n27O13K07n37J82K62l45m28M49J35K15n22K0N99j91n64J31O30
5171D26n12l24L72K73nm54K15M05k33m15O13O6o89L16J60j94n1J13J05k08m96
5192e17J43O88k93l79K33M55k75l51J28L73k42l20J74K63j68L9L50o7k95j9M79
5213C99q0o53L28N80n76m17M90K38q3o95P9O12l08l36P7N51k20k16K16J3l4k1
5235e6J48M3k16J10J47J2m89K82L93j84n47L58N29l31l91Q9K67N5o02J92N32l22
5257A9m16L57L38l80k04N34k47j58J0K93l5n17K84L93l10qJ36O5N9n27L86L38
5279D10m17k83L07L93m67k07J38M99k36m20K25J15k12M8J25K07m89N57k14N7m57
$$ plain form
5300 -321 95 364 34 -286 306 354 47 -352 212 202 -46 -341 61 166 38 -300 -129 272 -393 -400 -348 331
5322 331 -295 -546 143 -6 -150 -115 417 -38 -168 332 504 48 -325 144 195 -20 -304 348 407 -44 -351
5343 -351 65 262 -121 -272 99 208 -346 -244 113 264 -210 -79 -190 8 -469 29 297 65 -317 129
5363 129 301 26 -343 118 336 131 -100 22 235 -150 -176 291 192 -195 -128 -82 111 -272 -475 198 10
5384 10 -497 -334 87 66 -206 256 45 -398 -25 240 186 75 -1 297 281 -16 -386 242 627 -102 -214 85
5406 85 165 1 -306 -87 -49 -5 -253 -1 -339 -52 99 214 -223 -139 113 377 -303 -123 211 229 45 -181
5428 -181 505 292 -114 -135 297 126 -159 -282 84 309 -98 -152 28 -61 -390 -35 289 88 12 -110 205
5449 205 -306 -22 299 59 -332 -155 425 455 -86 -273 329 -32 -205 -55 717 284 -170 35 50 64 -136
$$ packed form
5300c21M16K69l30l20N92M8l07l99N64j0k48k95M02J05j28l38J71M01o65pN2O79
5322C31o26k51O89j49j44L5N32m55j30N00J72m56l73M69N1k15k84O52N9m51l07
5343c51M16J97l83j51L71J09n54J02L57J51m74J31j11J98m77M98K68k32l82M46
5363A29J72k75l69M61K18k05k31J22K13l85k6M67r9l87O7M6J93l83k03O73j88
5384A0n07J63M21k1k72M62k11m43L73K65n4j11p6K98j6k97l70O28L85p29j12K99
5406H5Q0j64l07K19L8M4k48K52l38K87J51J15m37Q4K52K64o80J80L34J8j84k26
5428a81O86k13m06k1M32j71k85j23L66K25m07n4J80q9l29L55L24k01p6j22L15
5449B05n11K84L21k40l91J77N80L0n41j87O02l61j73J50P72m33m54K05J5J4k00
$$ plain form
5470 -136 -72 102 -165 -346 96 20 -398 -71 298 219 -237 -253 181 187 -11 -62 318 337 -61 24 186 287 -208
5493 -208 -265 169 299 -295 -156 89 -16 -454 16 230 -151 6 338 18 -511 -352 210 353 -163 -105 114
5514 114 21 -566 -190 358 154 -144 -158 81 147 -187 83 55 -25 -168 -14 130 -39 -108 -85 -21 59 15 153
5537 153 28 -89 -248 159 -43 -459 55 231 276 -210 -183 351 153 -9 -26 96 23 -30 -22 173 -64 72
5559 72 127 -64 -15 24 72 230 -257 51 302 -7 -194 -127 165 -203 -130 -125 436 325 -91 -92 314 127 -206 137
5583 137 285 37 -126 44 55 -278 -217 158 -113 102 -15 311 -293 -222 -88 96 -74 -111 -113 459 -37 42
5605 42 -179 279 4 -405 89 275 322 -24 -30 71 126 -104 337 492 -118 -268 122 -117 -267 0 160 -120
5627 -120 -179 -99 -152 184 -507 -185 278 -69 -155 55 301 102 -309 -40 109 -81 -104 -129 164 180 -46 125
$$ packed form
5470a36O4J74k67j81M42p6m18L27L69p9m56j6M34Oj98n1L80J9l98Q5J62J01m95
5493b08n7M34J30n94J39K45j05m38M70K14l81J57L32l20n29J59N62J43n16N8K19
5514A14r3n87L76N48k04k98j4K39O6l34K70k8q0j43J54J44j69o9K3O4Q0m4J38
5537A53j25j17j59M07k02m16N14J76M5m86K7N34j98j62j7J22p3n3QJ95k37J36
5559G2N5j91M9L9M8J58m87L08K51l09j87O7K92l68P3NN61j11m16jM06j87l33L43
5583A37J48k48j63J70J1l33O1L75k71K15j17L26o04P1J34J84j70l7kN72m96P9
5605D2k21M58k75m09M94J86M7l46oJ01N5k30M41J55o10j50L90k39j50K67J60k80
5627a20n9Q0n3L36o91L22M63l47q6K10K46j99m11K69J49j90k3k5K93J6k26J71
$$ plain form
5649 125 127 -107 -71 97 154 -309 212 -58 -228 -391 202 223 73 -458 -261 443 -52 -242 64 184 -70 -155
5671 -155 296 331 18 55 272 20 -241 -82 104 146 -77 70 152 -31 -103 -21 -252 -252 -415 -4 112 -18 -61
5694 -61 -200 157 109 -292 177 69 183 -59 168 429 -79 -106 199 175 -249 397 284 47 -341 143 162 20
5716 20 -347 59 120 -155 -384 -111 91 -271 -551 135 553 -267 -107 -138 -110 -128 -91 82 -23 -124 -53 495
5738 495 97 -313 209 358 -62 -17 251 130 -36 -439 -105 58 -101 -389 18 228 -398 -477 48 311 -285
5759 -285 -80 -16 68 -83 138 116 91 185 65 -46 -30 91 324 170 -272 -264 210 178 -124 -252 -113 -43 -167
5782 -167 -199 38 205 -247 -161 277 246 -196 -432 75 -114 76 243 345 189 -191 210 303 14 -284 -42
5803 -42 83 -215 -73 212 161 32 -431 -11 129 -348 -177 -30 275 -137 -141 5 -90 -232 -398 155 82 -223
$$ packed form
5649A25Kk34L6J68N7m63N21k70j70j63N93K1j50n31J97P04m95j90L06J20k54q5
5671a55M51L5l13L7K17k52k61J59J86M2k23J47Q2j83p2Q2k31%j63M11J16j30m3
5694f1j39L57m8m01M69j08J14k42K27K61n08k7L05k4m24O46j13k37l88M84J9j42
5716B0l67M06O1k75k29K73K02l62k80O86M18q20J60l1K8j8L7J73j05j01P1N48
5738D95l98m10N22J49m20M5K68j21j66m03L34J63j59k88M07K10o26p9N25K63n96
5759b85K05O4Q4j51K21k2k5R4j20j11J6J21K33j54m42QM74l2l02j28J39P0j24
5782a67l2K37J67m52Q6M38l1m42k36N07j89J90J67J02j56l80M01R3k89k98K42
5803d2J25k98J42K85n1j29m63M20J40m77J71J47L05m12mJ46r5j42j66N53p3l05
$$ plain form
5825 -223 128 309 -123 -136 -134 206 -40 50 215 235 -282 -359 156 161 -229 -57 300 124 -168 -117 -66 -69 -274 -166
5849 -166 188 251 -64 -99 201 148 -66 34 72 -119 -58 -7 207 -123 -253 358 349 -142 -92 337 196 -164 -376
5872 -376 139 205 -385 -171 109 16 -24 -88 150 -6 -414 -112 216 -100 -67 249 107 -195 111 256 239 38
5894 38 -161 184 268 -241 -123 139 -194 -239 -215 75 114 -340 48 132 65 -459 -216 -74 -117 -184 -126 45 126 -80
5918 -80 338 -8 85 -164 249 306 -323 -121 92 28 -210 65 118 194 64 -325 109 39 -247 -142 163 -117
5940 -117 -159 72 -65 -273 46 83 -18 -98 51 405 10 -80 -14 206 214 -200 42 153 22 -277 -20 260
5962 260 115 -232 127 98 -8 -122 -197 96 -350 -54 78 37 175 -99 257 60 -106 227 143 71 -229 -65
5984 -65 326 173 46 96 222 201 -261 1 385 -148 20 -210 173 81 -64 36 -21 -2 -100 -188 111 -356 -121
$$ packed form
5825b23L51J81m32j3KL40k46R0J65K0n17p7N15Nl90J72L57j76k92N1N1lk05J08
5849a66L54O3l15l5L00n3k14J00L8j91O1N1K14l30j30O11rm91N0M29j41l60k12
5872c76N15O6n90K14K80r3m0o4K38j56m08L02L28l16L3L16j42l02L06J45j7k01
5894C8j99L45Q4n09J18K62l33m5K4K90L9m54L88Q4o7n24K43J42m3o7N8J71Q1k06
5918h0M18l46R3k49M13N7o29K02K13o4k38K75N3P6j30l89M34p0k86J05L05k80
5940a17m2K31j37k08L19L7j01q0J49L54l95r0O6K20Qm14K42J11j31k99K57K80
5962B60j45l47L59k9j06j14p5K93m46K96J32m1J38k74L56j97j66L33q4p2l00J64
5984f5L91j53j27N0J26k1m62K62L84n33J68k30L83r2j45J00n7J9r8q8K99m67K35
$$ plain form
6007 -121 161 -153 -86 190 317 -82 -125 193 75 -100 -456 167 127 -62 -110 66 254 -29 -211 116 254
6028 254 -71 -42 171 -227 -227 -107 -235 113 -247 -130 241 -239 -42 261 162 24 90 -4 191 -34 -115 237
6050 237 -122 59 -97 94 429 -101 -274 17 -139 10 -80 243 38 -121 52 177 -55 -269 47 185
6070 185 -197 -158 250 115 220 61 130 168 113 -98 133 -14 -58 -91 192 -31 -151 -281 -25 132 77 76 -32
6093 -32 -347 -382 170 179 -153 -165 -27 195 -263 -16 238 267 57 -511 312 371 -114 105 -35 311 -11 -137
6115 -137 248 -138 -94 18 93 -6 -123 -244 -51 -137 -135 124 -113 -231 -48 256 606 -327 38 190 215 -114
6137 -114 48 207 43 -109 -4 196 93 -47 -25 343 -24 63 -165 -114 -62 -180 310 313 159 -106 -66 90
6159 90 -45 -87 -140 504 -40 -67 100 230 106 47 404 -37 14 122 342 311 -310 172 269 -51 70 64 75 -249
$$ packed form
6007a21K82l14O7K76J27l99m3L18j18j75l56O23m0j89m8J76J88k83j82L27J38
6028B54l25K9K13l98%J20j28L48l60J17L71m80J97L03r9j38O6r4J95k25q1L52
6050B37l59J81j56J91L35n30j73K91j56J49r0L23k05j59J73J25k32k14L16J38
6070A85l82L9M08j35J05j59O9L8n5k11K31j47m4l3K83k23j20j30K56J57n5jj08
6093c2l15l5N52Rl32j2J38K22m58K47K54K9k10n68Q23N9m85K19j40L46l22j26
6115a37L85l86M4J12P5r9j17j21J93q6KK59k37j18J83L04L50r33L65J52K5l29
6137a14J62J59j64j52J05K00j03j40K2L68l67Q7k28N1N2j18M90Lj54k65M0J56
6159I0j35m2n3O44n44k7J67J30j24n9L57m41N1J08K20l1o21M82R7l20J21oJ1l24
$$ plain form
6183 -249 -269 85 78 -385 20 292 409 -111 -140 224 -185 -395 -325 179 0 11 96 330 -56 -190 124 244
6205 244 56 -101 49 -2 -22 -128 216 -9 -90 -334 -5 370 -221 -313 261 42 -252 -445 210 134 -2 54
6227 54 37 235 61 -50 -36 196 141 28 188 -107 -104 56 -17 -128 -150 164 280 48 135 254 -34 -124 -55 36
6251 36 0 -55 -74 349 210 -140 -111 169 153 -183 324 176 14 -257 191 64 -25 321 170 349 -14 -324
6273 -324 142 26 -279 -99 298 116 -211 16 49 -25 -251 -85 -31 -266 51 -9 63 -213 -256 -273 -18 9 -193
6296 -193 -20 70 28 -24 109 -117 -280 -181 100 -27 -139 -253 213 17 -356 14 425 -140 -386 -117 43
6317 43 -37 42 65 -10 -44 115 66 57 64 -153 -75 -36 -208 33 -22 195 96 -81 302 170 -217 -298 -188 -71 -342
6342 -342 -342 -39 235 -236 110 109 -74 105 -132 314 13 -3 -4 90 -277 -92 -79 163 19 161 154 -30 -137 -181
$$ packed form
6183b49k0L54pm63M05K72J17n20k9L64m09k10P0N04j79J1Q5K34l86j34L14J20
6205B44j88j57J50n1k0j06L44k25q1k44L29L75n91r2N74k19k94j93O55p6j36N6
6227E4j7J98j74j11J4K32n5j13J60k95LJ60p3j11k2L14J16k32Q7J19k88r0O9R1
6251C6l6n5j9M23j39l50K9K80j6l36N07j48j62k71M48j27q9L46j51J79l63l10
6273c24M66j16l05J80L97j82l27K27L3p4k26J66N4k35L17o0P2k76m3j7K55K7k02
6296a93J73R0m2n2J33k26j63R9K81j27j12j14M66j96l73L70M11n65k46K69J60
6317D3q0P9K3p5l4J59m9rPk17P8L9j72K41n5K17r9j77L83j32l87q1J10J17k71
6342c42%L03K74m71L46jj83J79k37M46l01j6jR4l67J85J3K42j44J42pj84j07m4
$$ plain form
6366 -181 132 -276 -96 -256 -170 126 -36 -261 33 70 66 114 9 55 -4 248 233 -70 125 111 169 -124 129
6389 129 43 129 -15 -248 141 -229 -80 -125 305 -169 -283 135 107 -84 -240 -232 246 -118 -29 -37 134 33 -19
6412 -19 309 -117 99 -138 284 253 -30 33 107 -67 -131 205 22 221 137 -169 197 -77 -326 -119 116 173
6434 173 -118 162 49 -117 -88 141 499 143 169 -7 21 -119 -85 259 -207 -261 187 -38 -301 -80 99 94
6456 94 -106 -158 -192 126 -190 70 -34 245 -187 -299 80 425 94 -309 150 148 -219 128 144 183 79 220
6478 220 195 -103 -357 181 352 58 -145 168 -27 46 -208 -89 256 44 -173 191 14 -215 105 105 71 -136
6500 -136 -20 -60 139 -115 7 37 -60 164 -63 -292 -57 -184 104 -12 50 9 288 8 -188 -4 129 146
6522 146 -72 -94 -139 -71 -201 -96 10 -141 117 -221 -27 -56 -231 230 277 -178 -179 105 66 -354 -269 96 -63
$$ packed form
6366a81L13m08J80j60Q6K96j62k25K94L7mM8j05M6n9K52j5l03J95j4N8k93K53
6389A29q6Q6j44k33L89l70J49m5M30m74j14M18k8j91j56QM78l64Q9qJ71j01n2
6412a9L28m26K16k37M22l1k83O3P4j74o4L36j83J99q4l06L66k74k49K07K35N7
6434A73k91K80j13j66K9K29L58l56K6j76K8j40L4L44m66n4M48k25k63K21J79n
6456I4k00n2l4L18l16K60j04K79m32j12L79L45l31m03M59kl67L47J6L9j04J41
6478B20k5k98k54N38J71k94k03L13j95P3k54J19L45k12k17L64j77k29L20%l4k07
6500a36J16m0J99k54J22L0r7K24k27k29K35j27K88j16O2m1K79k80j96J84J33J7
6522A46k18k2m5O8j30J05J06j51K58l38J94k9j75M61M7m55jK84l9m20Q5L65j59
$$ plain form
6545 -63 -63 -34 120 -198 -50 29 41 44 -91 -115 -219 119 -91 63 31 -131 -63 -206 -338 -30 112 71 55 -55
6569 -55 -221 27 43 -152 -16 154 374 -17 97 142 173 -102 181 38 205 -233 -184 265 -96 18 174 11
6591 11 102 -406 45 -235 -126 -202 122 81 -179 165 12 136 -202 -54 -44 228 -225 97 213 -92 -89 -260
6613 -260 -111 120 -342 -87 163 -113 -81 225 220 174 87 -157 137 -97 -161 165 148 -98 -111 109 -12 -223 -38
6636 -38 139 51 -26 -60 219 -109 -75 -39 360 -126 57 -197 0 -104 8 -108 -18 -18 -91 267 87 -22 33 337
6660 337 -158 -108 -113 129 34 46 -151 185 -39 92 66 141 -129 -180 59 268 -182 -131 -13 -19 -146 -6 140 -318
6684 -318 29 -9 -38 112 -138 256 197 -278 26 66 106 -8 -27 117 121 -59 -16 -77 -27 348 133 57 -10 92
6708 92 -16 -17 65 87 126 107 2 -205 46 25 102 -47 -61 261 -260 -121 264 156 233 205 113 47 -30 -73 -166 -187
$$ packed form
6545f3%K9J54l18J48P9J2Lj35k4j04L38k10J54l2j62O8j43j32L08J42m1j6j10
6569e5j66K48J6j95J36J70K20l91J14M5L1k75K83j43J67m38M9M49l61J14J56j63
6591A1R1n08M51k80J09p6L24m1k60L44j53J24l38J48J0K72m53L22J16l05Lj71
6613b60J49K31m62K55K50k76L2L06nm6q7k44K94k34o4L26j7k46j3K20j21k11J85
6636c8J77q8p7l4K79l28L4L6L99m86J83k54J97j04J12j16R0%p3L58j80j09N5L04
6660C37m95N0nK42r5J2j97L36k24J31k6P5k70n1K39K09m50N1J18oj27J40J46m58
6684c18L47l8k9J50k50L94n9m75L04M0M0j14j9J44Mj80M3o1N0L75k15p6o7J02
6708I2j08jQ2K2L9j9j05k07K51k1P7j49j4L22n21J39L85j08P7k8r2o6p7m3r3k1
$$ plain form
6734 -187 131 -119 6 228 250 120 200 33 -203 -42 -185 -58 -160 -202 -98 70 -318 30 133 236 -200
6755 -200 -82 149 -127 -57 -34 210 77 -165 117 104 -94 115 161 -104 -105 111 29 -146 -67 -177 151 -28 -8
6778 -8 26 240 218 -241 150 -14 -164 129 -134 103 114 -137 -188 45 68 -189 54 160 -30 -50 94 -90 -289
6801 -289 -30 -16 -102 -238 1 -117 -92 -145 -13 -40 75 -168 21 22 -135 -247 60 91 -348 85 -217 -24 -53
6824 -53 -5 110 25 175 72 -228 -59 68 -145 299 -35 -18 239 -47 -116 -184 -118 -77 8 -153 44 0 -166
6847 -166 46 151 28 -20 -79 112 -12 23 25 97 82 -47 83 138 -131 62 -73 266 271 -128 -1 -71 9 -126
6871 -126 52 50 -141 -140 272 -24 110 9 119 66 -67 -22 309 -182 -6 34 -76 -63 171 -67 -13 -51 -1 14
6895 14 173 -62 -206 40 -60 -16 128 185 -53 -198 -185 174 256 65 -5 41 -57 106 191 -137 -337 186 -146
$$ packed form
6734a87L18k50J25K22K2j30Q0j67k36J61j43J27j02m2J04J68l88L48J03J03m36
6755b00J18K31k76P0K3K44j33k42K82j3j98K09M6k65jK16q2j75P9j10L28j79K0
6778hL4K14k2m59L91j64j50K93k63K37J1k51n1K33K3k57K43J06j90k0J44j84j99
6801b89K59J4q6j36K39j18K5n3J32k7J15k43J89Jj57j12L07L1m39M33l02J93k9
6824e3M8J15q5J50j03l00J69J27k13M44l34J7K57k86o9o8O6M1Q5j61J97m4j66
6847a66K12J05j23m8n9J91j24L5KP2j5j29J30N5k69J93j35L39Nl99J27p0Q0j35
6871a26J78kj91JM12k96J34j01J10n3j33M5L31m91J76M0j10J3K34k38N4l8N0J5
6895A4J59k35j44K46j00M4J44N7k38j45J3L59Q2j91p0M6r8J63Q5l28k00N23l32
$$ plain form
6918 -146 80 -179 179 -116 51 -40 -23 47 19 -95 -98 -61 22 -348 -33 -93 -189 114 -42 7 183 128 -13 233
6942 233 -221 -45 76 272 -111 -111 -24 81 -24 150 -8 65 44 79 133 188 -79 -8 -9 34 -37 -188 -74 -66 60
6967 60 -66 1 -6 -194 -108 326 -104 -201 322 -8 -89 -229 34 0 -112 84 -210 4 -64 25 -52 219 -111 292
6991 292 191 -132 48 219 -10 -100 -31 -57 -10 29 171 69 -180 99 12 -120 -47 -102 52 125 111 23 19 267
7015 267 385 158 -176 170 6 -328 249 126 8 -138 88 -25 125 142 196 -61 -52 -93 126 44 -102 89
7037 89 -53 -22 161 -61 -89 -28 3 -101 255 -106 -62 163 -44 16 -15 100 93 -76 45 61 66 64 20 60 204 -133
7063 -133 63 -42 134 -107 -72 365 110 41 -77 242 -28 -165 52 69 112 -184 29 209 17 78 207 -98
7085 -98 1 -187 -45 -82 24 15 -34 -149 154 84 -45 162 -114 -39 -117 -129 -407 51 117 -28 -12 67 -37 -380
$$ packed form
6918a46K26k59L58k95J67r1J7P0k8j14lL7Q3l70L15o0r6L03j56M9J76n5j41K46
6942B33m54J76J21J96l83%Q7J05j05J74j58P3k1L5N4N5k67P1jM3p1j51J14QJ26
6967F0j26O7pj88Q6M34m30r7N23l30q1j40K63l4j12J96k94K14o8Q9p7K71l30M03
6991B92j01l23J80J71k29r0O9k6M7L9J42j02k49K79q7j32P3n5J54P3j4q8mK48
7015B67J18k27l34L46j64l34N77j23j18j46K26j13J50J7N4k57Rm1K19q2j46J91
7037H9j42L1J83k22k8O1L1j04L56l61M4K25k07O0l1J15pj69J21J6Nkm4M0J44l37
7063a33J96j05J76k41L5M37k55o9j18L19k70j37K17J7M3k96K13J80j92O1J29l05
7085i8R9j88J42l7J06rm9j15L03p0j29K07k76P5p8j2k78M58O6j45J6P9j04l43
$$ plain form
7109 -380 -259 238 -133 -171 273 8 -145 -78 -11 133 -101 -58 201 95 -132 54 -127 121 -309 -52 -187
7130 -187 177 -58 0 -30 81 -64 -117 162 231 26 115 232 -14 70 -101 -7 -46 -7 -141 239 11 117 205
7153 205 67 -28 -80 287 138 265 58 141 -48 109 -269 -7 36 -246 -167 142 -7 162 -113 -113 269 -46
7175 -46 -23 -97 -13 -106 4 137 215 -188 -230 122 -203 -141 -12 16 206 -248 -35 -82 -132 -109 105 41 -242 91
7199 91 -84 -12 -17 24 234 194 -146 225 -179 31 146 -62 -22 -206 -7 -192 -167 89 74 -29 74 100 -34
7222 -34 -29 14 -118 85 -136 -391 95 -87 412 372 178 -19 -18 381 48 -6 204 -110 -8 113 214 283 91
7245 91 -2 146 -76 55 24 10 207 86 181 -231 26 -41 192 -98 -93 133 77 46 167 -25 -186 5 188
7268 188 82 33 -223 266 47 14 -82 -211 176 -84 -108 150 -18 10 -13 79 403 -419 83 -330 24 -46 -50
$$ packed form
7109c80J21M97l71l8M44k65j53O7O7J44k34M3K59j06k27J86j81K48m30K57j35
7130a87L64k35N8l0J11j45n3K79O9k05Q9J17k46Q4j71R4l9L9j34L80k28J06Q8
7153B05j38r5n2L67j49J27k07Q3j89J57l78K62M3k82P9L09j49J69k75%L82l15
7175d6K3p4Q4r3J10J33P8m03m2L52l25O2J29K8J90m54K13m7n0K3K14o4k83L33
7199I1j75P2nM1K10m0l40L71m04K10J15k08M0j84J99j85K5K56j5j03J03K6j34
7222c4NM3j32K03k21k55M86j82M99m0j94j97JL99l33n4K10l14J02J21J01O9j92
7245I1r3J48k22J31l1j4J97j21R5m12K57o7K33k90NK26n6l1J21j92j61J91J83
7268A88j06m9k56M89k19l3r6j29L87k60k4K58j68K8k3R2L24q22N02m13L54p0m
$$ plain form
7291 -50 -56 12 -154 246 46 -23 -22 -6 225 -253 -129 4 -52 -21 -71 111 86 -174 -46 85 -17 143 -66 -12
7315 -12 237 -18 -136 -100 104 12 151 -40 131 -121 -75 293 51 -62 352 159 -84 74 11 -1 118 12
7337 12 -329 -63 -209 34 -463 -11 -64 -51 -15 146 -2 23 234 204 -65 197 -100 381 -183 36 -38 166
7359 166 -116 -169 48 -55 -12 89 -52 -42 -94 -188 -75 9 -111 45 91 -92 -17 207 53 41 -9 -42 -143 -53
7383 -53 107 -4 -48 9 14 116 37 210 9 -205 127 -315 216 -212 60 -178 87 -145 59 -110 150 -56
7405 -56 -72 -107 -10 51 191 -63 195 -102 -215 231 112 175 87 229 -114 195 39 54 169 -221 37 168 121
7428 121 -15 295 243 -49 -19 6 112 -197 -139 -284 -17 -73 223 -128 128 193 65 -115 95 -101 -201 -211
7450 -211 320 -70 -83 162 -146 153 86 119 106 -68 90 185 19 -53 -152 -29 -164 118 -37 -124 201 -224 -28
$$ packed form
7291e0oO8j66M00k00o9JJ6K31m78J24J33n6L1n0J82k5k60J28J31j02J60k09N4
7315a2K49k55j18L6K04r2J39j91J71k52M6L68k42j13M14j93k43J58o3j2J19j06
7337A2l41K66j46K43m97M52n3J3L6J61j48K5K11l0k69K62k97M81n64K19p4K04
7359A66k82n3K17j03M3J01j41J0n2r4J13Q4j20J56M6j83P5K24j54j2n0l3j01R0
7383e3J60j11m4N7NJ02p9J73k01k14L32m42N31m28K72k38K65k32K04j69K60k06
7405e6j6l5R7O1J40k54K58k97j13M46j19O3q8J42l43L09j56J5J15l90K58J31m7
7428A21j36L10n2k92L0K5J06l09N8j45K67n6K96l51K56O5j28j80K10j96j00j0
7450b11N31l90j3K45l08K99o7L3j3j74J58R5j66p2r9J23j35K82j55q7L25m25J96
$$ plain form
7473 -28 -49 -20 -18 -20 -22 -191 24 74 -54 171 159 24 -89 -72 164 141 197 -129 124 66 85 19 123 13 -34 -104
7499 -104 -29 -286 166 -187 17 193 -55 204 8 108 -83 -58 290 -131 -209 51 75 31 -66 125 -30 -145
7521 -145 -188 -66 153 -134 -115 229 31 -218 -124 62 -29 -88 70 19 -100 -226 110 -158 -49 -230 -8 4
7543 4 -187 107 65 41 -97 -147 151 93 147 -193 116 -232 169 -303 6 -35 -74 88 31 11 197 39 -230 183
7567 183 51 101 1 -4 -28 12 -90 -102 -178 -44 -199 -119 23 136 14 -61 -66 7 -67 128 70 -173 -244 26 -76
7592 -76 -46 -15 9 135 -107 -153 -48 -6 -38 -124 -18 112 19 167 -8 -147 -69 5 9 44 128 -230 -19 238 76
7617 76 10 -56 107 167 59 -13 -30 85 60 -353 149 63 -155 123 54 -53 -42 230 251 -77 75 -42 -58 -38
7641 -38 -361 131 22 -121 -63 -228 99 -171 -55 -119 -167 -4 79 -166 105 -82 -22 -57 -14 103 -78 203 261
$$ packed form
7473b8k1K9Kkkj69K15N0j28K25j2j35j13J7K36k3N6l26K53n8J9o6J04j10m7p0
7499a04P5k57M52l53K04J76k48K59j96J00j91K5L48m21p8K60K4m4r7J91j55j15
7521a45m3J22K19k87J9L44j98k49R4J86r1n9J58n1j19j26L36k68J09j81K22J2
7543Dj91K94m2k4j38n0K98n8N4l40L09l48M01m72L09m1l9J62n7k0J86j58k69M13
7567A83j32N0j00nk4M0j02j2p6J34j55Q0J42J13j22p5nP3p4J95n8k43p1K70j02
7592g6L0L1K4J26k42m6J05M2l2q6J06J30r3J48j75j39P8P4ML5Q4l58K11K57j62
7617G6o6o6J63O0j08p2j7J15k5m13N02q6k18K78o9j07J1K72K1l28J52j17j6K0
7641c8l23M92j09j43N8j65L27k70J16o4m8J63Q3k45K71j87O0l5M3J17j81K81N8
$$ plain form
7664 261 -82 -38 -42 -163 22 -107 167 -12 -143 16 -21 -212 260 121 -169 47 164 292 237 -54 -246 183
7686 183 17 16 104 51 -88 -184 7 45 179 116 -241 54 221 238 61 42 -167 -27 -160 -301 -8 -409 -139
7709 -139 -5 291 -115 177 -98 -181 103 145 111 -50 63 -48 -105 16 -59 -1 -84 128 -35 -42 162 243 121
7732 121 -54 92 -17 5 -115 327 -26 204 -61 91 218 164 -147 -17 -21 -4 11 141 107 3 5 162 43
7755 43 -141 93 -46 103 -130 58 42 175 233 87 -146 -39 -48 13 -96 -26 118 -211 -77 -238 22 111 179
7778 179 -52 -168 29 142 101 -134 -177 47 -73 166 15 206 181 -5 -13 -68 -146 -88 121 199 -221 -116 22
7801 22 -124 45 -141 153 160 -144 186 209 188 139 -156 105 10 56 278 256 -101 -247 205 -375 66 -48 131
7824 131 -161 -105 -5 75 -39 19 162 -44 205 138 -267 -231 -385 112 102 -254 72 -87 41 200 39 -21
$$ packed form
7664B61l43M4mj21J85j29K74j79j31J59l7j91M72j39k90K16J17J28n5k91j92M29
7686A83j66jQ8n3j39r6J91L8J34o3l57K95J67J7j77j9k09J40j33j41K93m01K70
7709a39J34K96m06K92k75q3K84M2l4j61J13j11n7J21p5N8q3K12j63pK04Q1j22
7732A21j75J46j09K2j20M42l53K30k65J52J27n4l11J30mJ7J5J30l4j04KJ57j19
7755D3j84K34j39J49k33J88j6J33N8j46k33J07rO1j09P0J44l29J34j61K60Q9O8
7778A79k31j16J97J13m1k35m3K24j20K39j51J91k5j86qn5p8N8K09P8m20J05J38
7801B2j46J69j86K94Pl04L30K3k1m9k95K61r5M6K22k2l57j46M52n80M41j14J79
7824A31k92N6J00Q0j14N8J43k06K49o7m05L6j54M97j0l56L26j59J28J59j61o0
$$ plain form
7846 -21 45 297 -77 85 -72 -20 -112 32 -83 56 -34 16 263 -62 7 -54 -120 -130 -129 -98 -220 7 -203 374
7870 374 -94 29 5 -23 137 -11 -56 446 58 45 -48 137 -25 10 132 96 51 -61 -127 38 -184 5 223
7893 223 -188 -181 128 258 -82 89 21 187 -207 -18 36 251 291 75 -35 269 -163 -43 190 -188 -71 -229
7915 -229 -194 -81 -20 -33 11 -74 -102 -247 -23 25 84 6 156 -32 -74 -69 -59 -20 35 -25 93 -45 -235 -344 -103
7940 -103 -27 -68 77 -1 130 149 129 -198 27 -43 200 -31 -111 -50 201 -52 13 130 -97 -73 -113 73 261 -47
7964 -47 -87 -108 -77 -56 -41 -155 -29 -10 171 96 -96 41 -96 120 206 92 -144 24 132 135 -184 -55 69 -247
7988 -247 -29 -82 67 166 -107 -143 -26 -138 -374 -32 139 -40 80 -136 -88 -30 120 -68 -115 -246 161 132
8010 132 137 -36 -160 59 54 -79 -30 65 217 42 -140 173 -284 -15 71 269 -100 67 59 -14 -162 237 159 -12
$$ packed form
7846b1O6K52l74J62j57N2r2J44j15J39r0N0K47l25O9o1o6j0JL1j22K27k10N77
7870C74m68J23k4k8J60j48m5N02l88j3r3J85j62L5J22l6m5j12o6J65k22J89K18
7893B23m11PL09J30l40J71o8J66l94J89N4K15M0k16j10L04m32J20K33l78J17j58
7915b29L5J13O1j3M4q5k8j45K24M8N9p8J50j88m2NJ0L9N5o0J18j38j90j09K41
7940a03P6m1J45p8J31J9k0l27K25p0K43k31q0O1K51k53O5J17k27K4m0J86J88l08
7964d7m0k1L1K1J5j14J26J9J81p5j92J37j37K16Q6j14k36J68J08Ll19J29J24l16
7988b47K18n3J49R9k73l6J17j12k36L42J71j79J20k16M8N8J50j88m7j31M07k9
8010A32Nj73j24K19nj33M9R5J52j75j82L13m57K69Q6J98l69J67qp3j48L99p8j71
$$ plain form
8034 -12 10 -128 -69 -32 -31 181 48 -19 -85 62 82 -102 -54 -5 -112 66 -51 4 -175 -65 42 261 -144 -1
8058 -1 -169 28 3 204 153 -43 -98 -86 -18 4 -97 3 -15 -134 -257 -40 -27 -2 -136 -220 -260 253 42 -13 -160
8083 -160 27 -72 185 7 -69 78 -36 8 39 183 -29 185 -144 185 -7 -222 -100 -5 -183 -65 -68 73
8105 73 3 -5 -49 -43 -226 168 -182 -68 18 -9 20 -32 53 -8 -56 -45 -148 -315 -70 -141 229 -158 -55 -42 82 -192
8131 -192 193 82 -220 153 100 -128 -173 29 27 -3 73 -71 -122 -229 152 -153 81 -314 277 44 56 25 74
8154 74 93 85 130 44 259 28 -60 -90 16 -19 -50 -31 -138 368 -8 -120 10 73 -337 48 -53 175 -64 -113
8178 -113 -157 -88 90 79 356 53 -175 -173 -199 23 63 -41 199
$$ packed form
8034a2K2j38N9L7JK12j33o7o6J47K0j84M8M9j07J78j17N5j79J10J07K19m05J43
8058aj68J97k5K01n1j96n5J2O8K2j01J00j8j19j23K17J3K5j34q4m0N13k11n5j47
8083a60J87r9K57j78p6J47j14M4L1J44k12K14l29L29j92k15J22R5j78J18lJ41
8105G3p0qm4Oj83L94l50J14Q6k7K9n2Q5o1m8J1j03j67K45p1L70l87J03J3J24k74
8131a92L85j11l02L73n3k28m5K02kl0P6j44n1j07L81l05K34l95N91k33J2l1M9
8154G4J9qM5q6K15k31q8l0J06l5l1J9j07N06l76j12J30O3m10L85j01K28k39m9
8178a13m4O9J78j1K77l03k28Kk6K22M0j04K40
8191A99
$$ Imaginary data points
##PAGE= N=2
##DATA TABLE= (X++(I..I)), XYDATA
$$ plain form
0 0 0 0 0 0 -1 0 -8 8 -8 8 -16 16 -24 27 -32 40 -48 56 -67 80 -91 107 -123 143 -165 187 -214 244 -276 312
30 312 -350 394 -441 494 -550 611 -681 758 -839 928 -1030 1139 -1260 1398 -1550 1720 -1911
47 -1911 2133 -2386 2679 -3032 3454 -3979 4646 -5530 6757 -8584 11601 -17459 33081 -161605
61 -161605 -414390 18381 309415 140494 -198315 -151606 126690 210179 -23798 -200136
71 -200136 -105784 104993 132099 -3298 -74866 28859 108973 6693 -147181 -108689 66195
82 66195 132288 25280 -59301 -31491 6728 -10626 -15229 -2906 -31276 -54310 28524 127303
94 127303 63899 -105398 -135087 13306 110407 32102 -63325 -21726 74265 66228 -30811 -72583
106 -72583 -4993 60516 14873 -69255 -33623 98465 110498 -62703 -172475 -34054 143375
$$ packed form
0@%%%%jJqJ6j6J6k4L2m0N1n9P2q8J04j23J47j71J98k30K66l08L52m01M58n20N88
30C12o62P44q35R35j044J161j292J439j597J767j958K169k399K658k948L270l631
47a911M044m519N065n711O486p433Q625j0176J2287j5341K0185k9060N0540j94686
61a61605k52785M32771K91034j68921l38809M6709K78296Q3489k33977j76338
71b00136R4352K10777K7106j35397p1568J03725Q0114j02280j53874L8492J74884
82F6195O6093j07008q4581K7810L8219j7354m603J2323k8370k3034Q2834R8779
94A27303o3404j69297k9689J48393R7101p8305r5427M1599R5991q037r7039m1772
106g2583O7590O5509m5643q4128L5632J32088J2033j73201j09772J38421J77429
$$ plain form
117 143375 76009 -121143 -119131 73158 139098 -11513 -123197 -44677 56649 25505 -40017
128 -40017 -7335 65854 55517 -24566 -60320 -13456 40203 23692 -29829 -23926 49149 75973
140 75973 2946 -64516 -37008 6131 -20601 -32865 48645 98807 -2934 -117022 -54100 77045
152 77045 44169 -96996 -89871 76766 144212 14940 -108137 -62752 39626 32991 -41624
163 -41624 -30818 74323 114119 1985 -119600 -71794 75359 84910 -66136 -115014 55501
174 55501 184832 43112 -171784 -140045 63017 111958 -30083 -91033 27996 113649 21165
185 21165 -104700 -87512 24293 68897 11730 -38548 -2914 65254 54510 -39618 -92810 -31057
197 -31057 57845 61246 11180 -5537 1440 -14865 -22705 8908 14751 -38291 -48591 41282 96970
$$ packed form
117A43375o7366j97152K012J92289O5940j50611j11684P8520J01326l1144o5522
128d0017L2682P3189j0337q0083l5754M6864N3659j6511n3521N903P3075K6824
140G5973p3027o7462K7508M3139k6732j2264Q1510N0162j01741j14088O2922J31145
152G7045l2876j41165P125J66637O7446j29272j23077M5385J02378o635p4615
163d1624J0806J05141L9796j12134j21585M7806J47153R551j51046m8878J70515
174E5501J29331j41720k14896L1739K03062M8941j42041o0950J19029Q5653r2484
185B1165j25865J7188J11805M4604n7167n0278L5634O8168j0744r4128n3192O1753
197c1057Q8902L401n0066j6717O977j6305p840L1613N843n3042j0300Q9873N5688
$$ plain form
210 96970 7266 -99827 -59435 48661 41497 -50173 -51530 46834 80595 -6224 -76018 -26560
222 -26560 57823 43979 -48279 -71739 30404 119074 48916 -92056 -90052 52043 98995 -29436
234 -29436 -111746 2246 125585 49509 -98909 -81731 48956 62759 -50276 -87347 15532
245 15532 97091 44255 -54693 -70489 -8378 34245 11917 -23153 -5425 42332 44797 -4138
257 -4138 -29225 -9228 -6854 -30516 -2326 72793 69563 -32785 -77998 4340 59929 -21568
269 -21568 -96668 -13862 109831 76187 -62059 -96202 1248 57766 -8586 -75419 -23283 84478
281 84478 95216 -14852 -101685 -51058 54063 54450 -33170 -45435 49747 91107 156 -79510
293 -79510 -34116 34371 9761 -34018 7727 64630 25832 -51687 -50101 7336 15919 -20937
$$ packed form
210I6970q9704j07093M0392J08096p164r1670j357R8364L3761q6819o9794M9458
222b6560Q4383j3844r2258k3460J02143Q8670p0158j40972K004J42095M6952j28431
234b9436q2310J13992J23339p6076j48418J7178J30687J3803j13035l7071J02879
245A5532Q1559n2836r8948j5796O2111M2623k2328l5070J7728M7757K465m8935
257d138k5087J9997K374k3662K8190P5119l230j02348m5213Q2338N5589q1497
269b1568p5100Q2806J23693l3644j38246l4143R7450N6518o6352o6833N2136J07761
281H4478J0738j10068q6833N0627J05121L87q7620j2265R5182M1360r0951p9666
293g9510M5394O8487k4610m3779M1745N6903l8798p7519J586N7437Q583l6856
$$ plain form
305 -20937 -21808 22036 40646 7838 -29824 -29653 -2597 10112 -4397 -10117 22525 49461 13160
318 13160 -43911 -30410 30402 28182 -34706 -32282 48155 66137 -21257 -68902 1238 56170
330 56170 -6889 -76435 -23353 70918 56502 -39375 -69054 556 51283 8255 -57779 -41081
342 -41081 42390 73046 3449 -61770 -20767 53064 25588 -59288 -44064 63934 87599 -16910
354 -16910 -76988 -2513 63493 3651 -73604 -31100 61984 62183 -15619 -50037 -13001 14401
366 14401 -10176 -36277 -12817 36143 45342 -592 -39111 -19023 15615 -876 -34989 -5881
378 -5881 55928 47600 -19925 -35224 13112 17155 -38511 -38275 43222 77377 4163 -59326 -21463
391 -21463 34463 7969 -50911 -37957 32592 62216 15359 -41021 -40199 1110 15215 -15763
$$ packed form
305b0937q71M3844J8610l2808l7662J71K7056J2709j4509n720L2642K6936l6301
318A3160n7071J3501O0812k220o2888K424Q0437J7982q7394m7645P0140N4932
330E6170o3059o9546N3082R4271j4416r5877k9679O9610N0727m3028o6034J6698
342d1081Q3471L0656o9597o5219M1003P3831k7476q4876J5224J07998K3665j04509
354a6910o0078P4475O6006n9842p7255M2504R3084J99p7802l4418L7036K7402
366A4401k4577k6101K3460M8960R199m5934l8519K0088L4638j6491l4113K9108
378e881O1809q328o7525j5299M8336M043n5666K36Q1497L4155p3214o3489L7863
391b1463N5926k6494n8880J2954P0549K9624m6857n6380Q22M1309J4105l0978
$$ plain form
403 -15763 -28368 18468 59131 20152 -44251 -32735 25974 22027 -32893 -25295 46238 59727
415 59727 -11179 -48207 -967 29978 -12262 -42384 3043 52464 25441 -33851 -39447 4694
427 4694 24887 -7474 -40324 -17517 36598 45193 -10389 -48393 -11031 34595 8169 -38155
439 -38155 -10312 50805 35275 -32098 -30448 34957 38274 -34763 -55645 18831 67514 14843
451 14843 -47761 -25303 31617 25783 -31498 -50507 -585 48181 27640 -30496 -38746 13871
463 13871 36170 -18509 -60211 -7285 65976 42756 -34564 -37197 24408 30388 -28844 -40548
475 -40548 20923 52153 10673 -23300 299 19622 -10482 -41334 -17663 28651 37629 4104
487 4104 -24673 -15154 8207 1531 -30106 -29496 19669 47499 8727 -32244 -10986 22394 -5623
$$ packed form
403a5763j2605M6836M0663l8979o4403J1516N8709l947n4920P598P1533J3489
415E9727p0906l7028M7240L0945m2240l0122M5427M9421k7023n9292n596M4141
427D694K0193l2361l2850K2807N4115Q595n5582l8004L7362M5626k6426m6324
439c8155K7843O1117j5530o7373J650O5405L317p3037k0882P4476M8683n2671
451A4843o2604K2458N6920n834n7281j9009M9922M8766k0541n8136q250N2617
463A3871K2299n4679m1702N2926P3261k3220p7320k633O1605N980n9232j1704
475d0548O1471L1230m1480l3973K3599J9323l0104l0852K3671M6314Q978l3525
487D104k8777R519K3361o676l1637O10M9165K7830l8772m0971K1258L3380k8017
$$ plain form
500 -5623 -44688 -9189 56243 44601 -23196 -34017 17622 27938 -23991 -43313 7556 50719
512 50719 25222 -21686 -23434 6354 11941 -19010 -36286 -3070 42814 32646 -25168 -43966
524 -43966 4200 34488 -9046 -48443 -4974 54549 30594 -32074 -27251 24949 22734 -27769
536 -27769 -28502 27336 45899 -662 -33061 -4760 27409 9545 -29320 -28785 12784 37087 9501
549 9501 -31090 -23022 18890 20668 -27789 -43122 10941 48771 6372 -41045 -10913 39042 16020
562 16020 -41032 -29518 30240 39401 -5265 -20382 12116 24399 -8728 -30750 -7010 24639
574 24639 20598 -7443 -15589 5965 19556 -7391 -41991 -25144 28860 38583 -11019 -35308 6010
587 6010 32872 -11564 -51517 -10854 47679 30328 -23777 -18537 27581 24668 -26768 -40469 6535
$$ packed form
500e623l9065L5499O5432j1642o7797j0821N1639J0316n1929j9322N0869M3163
512E0719k5497m6908j748K9788N587l0951j7276L3216M5884j0168n7814j8798
524d3966M8166L0288m3534l9397M3469N9523k3955o2668M823N2200k215n0503
536b7769p33N5838J8563m6561l2399K8301L2169j7864l8865N35M1569K4303k7586
549I501m0591Q068M1912J778m8457j5333N4063L7830m2399m7417L0132M9955k3022
562A6020n7052J1514N9758R161m4666j5117L2498J2283l3127k2022K3740L1649
574B4639m041k8041q146K1554J3591k6947l4600J6847N4004R723m9602k4289M1318
587F010K6862m4436l9953M0663N8533j7351n4105N240M6118k913n1436j3701M7004
$$ plain form
600 6535 42620 22740 -13575 -15490 8182 13555 -13012 -31616 -7354 30936 25420 -14986 -24449
613 -24449 8090 14894 -25049 -37523 11108 44992 8800 -31404 -6899 28855 3593 -38593
625 -38593 -18571 35088 36806 -8912 -24031 8720 26781 -1891 -34364 -19739 25602 38958
637 38958 1086 -35482 -15946 26406 17238 -32599 -37368 17575 42416 -3278 -37909 -4668
649 -4668 29785 992 -35875 -11869 32134 22981 -15508 -15115 15964 19060 -10231 -21382 2160
662 2160 22349 12053 -10015 -9312 12919 18558 -11913 -35435 -9193 33736 21714 -28156 -30290
675 -30290 21964 35662 -19455 -51257 -5399 40937 15067 -27819 -12145 27349 18126 -23298
687 -23298 -27504 8830 28038 8565 -11863 -2751 17813 13122 -15882 -27645 -218 28821 13600
$$ packed form
600F535L6085j9880l6315j915K3672N373k6567j8604K4262L8290n516m0406r463
613b4449L2539O804l9943j2474M8631L3884l6192m0204K4505L5754k5262m2186
625c8593K0022N3659J718m5718j5119L2751J8061k8672l2473J4625M5341J3356
637C8958l7872l6568J9536M2352r168m9837m769N4943K4841m5694l4631L3241
649d668L4453k8793l6867K4006M4003r153l8489L93L1079L096k9291j1151K3542
662B160K0189j0296k2068P03K2231N639l0471k3522K6242M2929j2022m9870k134
675c0290N2254J3698n5117l1802M5858M6336k5870m2886J5674L9494r223m1424
687b3298m206L6334J9208j9473k0428R112K0564m691k9004j1763K7427K9039j5221
$$ plain form
700 13600 -18504 -10858 21617 11921 -33461 -35189 16573 36464 -6269 -32068 4281 33595 -186
713 -186 -41252 -20308 26690 28326 -5899 -15471 8562 20708 -911 -24530 -13942 19022 29086
726 29086 1136 -21738 -2567 24240 5151 -34207 -24454 23241 30717 -11560 -27666 6398
738 6398 21361 -13264 -33318 -485 28637 7580 -20000 -5718 21474 11758 -18524 -20898 8058
751 8058 25800 10024 -12878 -9631 15486 19217 -11216 -29670 -313 33271 12444 -29771 -19234
764 -19234 26390 23667 -27553 -39872 9040 36058 -84 -31101 -6522 26146 10760 -23191
776 -23191 -19401 11177 20454 1325 -12411 1165 19542 11195 -15356 -20872 7470 26281 3883
789 3883 -21643 -2859 27081 9122 -31588 -24083 20370 23923 -16985 -25986 13406 29748 -8607
$$ packed form
700A3600l2104P646L2475r696m5382j728N1762J9891m2733k5799L6349K9314l3781
713a86m1066K0944M6998J636l4225r572K4033J2146k1619k3619J0588L2964J0064
726B9086k7950k2874J9171K6807j9089l9358R753M7695P476m2277j6106L4064
738F398J4963l4625k0054L2833K9122k1057k7580J4282K7192r716l0282k374K8956
751H058J7742j5776k2902L247K5117L731l0433j8454K9357L3584k0827m2215J0537
764a9234M5624k723n1220j2319M8912K7018l6142l1017K4579L2668j5386l3951
776b3191L790L0578R277j9129j3736J3576J8377q347k6551n516K8342J8811k2398
789C883k5526J8784K9940j7959m0710P505M4453L553m0908r001L9392J6342l8355
$$ plain form
802 -8607 -37533 -11450 24627 16932 -12761 -14579 10213 20797 417 -21576 -13632 15047 22898
815 22898 -873 -16049 5069 24088 675 -30320 -13864 24713 19257 -16874 -17245 15950 17975
828 17975 -18177 -28867 3685 21639 -764 -18429 -253 19149 5199 -19916 -17525 8311
840 8311 21493 5777 -13998 -6913 18311 18347 -13186 -26885 4121 31603 8842 -25828 -10070
853 -10070 26037 14978 -26215 -26483 13914 24841 -7969 -23562 1774 19389 -273 -21279
865 -21279 -10547 11676 11150 -5849 -10402 4879 16045 3916 -16707 -11466 16067 21742 -6882
878 -6882 -22039 6797 30956 3601 -31777 -14389 25932 18681 -21311 -22342 15746 24636 -10518
891 -10518 -29742 -5454 19304 7672 -14967 -12378 9320 17150 -420 -18975 -10486 13423 17070
$$ packed form
802h607k8926K6083L6077p695k9693j818K4792J0584k0380k1993P944K8679P851
815B2898k3771j5176K1118J9019k3413l0995J6456L8577n456l6131l71L3195K025
828A7975l6152j0690L2552J7954k2403j7665J8176J9402j3950k5115K391K5836
840H311J3182j5716j9775P085K5224L6l1533j3699L1006K7482k2761l4670J5758
853a0070L6107j1059m1193k68M0397J0927l2810j5593K5336J7615j9662k1006
865b1279J0732K2223n26j6999m553J5281J1166j2129k0623N241K7533N675k8624
878f882j5157K8836K4159k7355l5378J7388M0321p251l9992j031L8088Q890l5154
891a0518j9224K4288K4758j1632k2639K589K1698P830j7570j8555Q489K3909L647
$$ plain form
904 17070 -5441 -13977 8923 22736 -1530 -23417 -3885 22344 8451 -18663 -7010 21376
916 21376 12630 -20635 -21418 9146 16704 -7527 -18029 2557 17452 2633 -18475 -15306 6249
929 6249 16331 1714 -15020 -4651 19290 16046 -14137 -22965 7428 27274 2976 -21478 -1816
942 -1816 24749 8651 -22973 -15032 15817 15300 -11986 -15610 8384 14401 -6294 -18963 -5398
955 -5398 10409 6061 -7727 -9116 4483 13135 489 -16246 -8225 15948 16120 -10476 -16933 12171
969 12171 25817 -3013 -26789 -3052 26392 10155 -21407 -12917 17861 16609 -13039 -20896 2043
982 2043 15455 671 -14855 -8329 9062 11513 -5006 -16930 -4920 14655 9782 -12094 -12386
995 -12386 12882 19862 -6555 -20290 3389 22292 2293 -18540 -1696 21162 8361 -17846
$$ packed form
904A7070k2511q536K2900J3813k4266k1887J9532K6229j3893k7114J1653K8386
916B1376q746l3265p83L0564P558k4231j0502K0586J4895j4819k1108L169K1555
929F249J0082j4617j6734J0369K3941l244l0183q828L0393J9846k4298k4454J9662
942a816K6565j6098l1624P941L0849n17k7286l624K3994O017k0695j2669J3565
955e398J5807m348j3788j389J3599Q652j2646j6735Q021K4173J72k6596o457K9104
969A2171J3646k8830k3776K3737K9444j6237l1562Q490L0778j252k9648p857K2939
982B043J3412j4784j5526O526J7391K451j6519j1924J2010J9575m873k1876k92
995a2386K5268O980k6417j3735K3679J8903j9999k0833J6844K2858j2801k6207
$$ plain form
1007 -17846 -11881 12085 11073 -9561 -13241 4176 12611 -195 -13839 -9519 5808 10147 -4182
1020 -4182 -14674 -1703 17167 9339 -16380 -15842 12560 20796 -5826 -19316 5509 23890 3179
1033 3179 -20205 -5829 17913 9461 -13205 -9366 10685 11446 -7049 -13692 -1607 8813 2840
1046 2840 -9351 -9683 3892 11543 -866 -16027 -6953 14467 11272 -12277 -13557 12286 19438
1059 19438 -5810 -18921 3518 20676 2306 -16398 -2694 17191 7880 -13016 -9594 8444
1071 8444 9541 -5678 -12151 -879 9807 4519 -10097 -13168 2268 14023 354 -17827 -7394
1084 -7394 17864 14070 -14522 -18340 10603 22362 -3740 -19836 1807 22173 6522 -15893
1096 -15893 -7852 12344 10391 -6593 -9397 1713 8637 1308 -8101 -7055 2280 6331 -2876 -10578
$$ packed form
1007a7846N965K3966j012k0634l680J7417Q435j2806j3644M320J5327M339j4329
1020d182j0492J2971J8870p828k5719N38K8402Q236k6622j3490K4825J8381k0711
1033C179k3384J4376K3742q452k2666L839K0051P61j8495o643J2085J0420n973
1046B840j2191l32J3575P651j2409j5161R074K1420l195k3549j280K5843P152
1059A9438k5248j3111K2439J7158j8370j8704J3704J9885r311k0896L422J8038
1071H444J097j5219o473J1272J0686n288j4616l071J5436J1755j3669j8181J0433
1084g394K5258l794k8592l818K8943J1759k6102j6096K1643K0366j5651k2415
1096a5893Q041K0196j953j6984k804J1110O924p329r409J046R335M051r207p702
$$ plain form
1110 -10578 -1587 10544 2599 -13667 -7796 12885 10802 -10967 -12137 11214 16917 -6223 -16228
1123 -16228 4449 18145 1697 -14272 -2754 14027 7703 -9702 -10293 3668 10539 984 -11025
1136 -11025 -8153 5977 10336 -4910 -16664 -2528 16183 6263 -16537 -12122 13704 15130 -9909
1149 -9909 -15963 7780 18887 -692 -14759 -378 13908 4912 -8388 -3971 7342 6740 -2855
1162 -2855 -6712 -837 4877 2250 -6240 -7252 3240 8668 -3619 -14497 -2470 13621 4552 -15157
1176 -15157 -8640 14183 12170 -11634 -13880 9203 16509 -3339 -13845 2568 15641 3752 -10724
1189 -10724 -5818 8404 9708 -2580 -10101 -2887 8952 6977 -8750 -13723 2412 14401 -427
1202 -427 -17787 -6998 14989 9162 -14237 -12618 10350 14157 -5723 -13287 3576 13072 1382
$$ packed form
1110a0578Q991J2131p945j6266N871K0681k083k1769j170K3351N703k3140j0005
1123a6228K0677J3696j6448j5969J1518J6781o324j7405n91J3961O871r555j2009
1136a1025K872J4130M359j5246j1754J4136J8711r920k2800M415K5826J426k5039
1149i909o054K3743J1107j9579j4067J4381J4286q996j3300M417J1313o02r595
1162b855l857N875N714k627q490j012J0492N428j2287j0878J2027J6091r069j9709
1176a5157O517K2823k013k3804k246K3083P306j9848j0506J6413J3073j1889j4476
1189a0724M906J4222J304j2288p521P214J1839j975j5727m973J6135J1989j4828
1202d27j7360J0789K1987n827k3399J619K2968L807j9880p564J6863R496j1690
$$ plain form
1215 1382 -7901 -429 7629 3169 -3694 -2328 3104 4283 -104 -4243 -2239 4309 3432 -6803 -9813
1230 -9813 3557 11810 -2091 -15545 -3058 14049 3874 -16302 -9038 14391 13534 -8941 -12909
1243 -12909 6456 14084 -1116 -12077 -988 11882 8297 -4046 -7976 283 7811 3215 -8051
1256 -8051 -7185 6971 11216 -4721 -15562 -1689 12657 880 -15832 -5782 14332 9284 -11764
1269 -11764 -11966 6484 10005 -4048 -8152 4036 10183 1245 -5196 -985 4458 2846 -1639 -2122
1283 -2122 2242 6000 2098 -7027 -6528 4968 7217 -6182 -11596 3708 13572 -2342 -17535 -4312
1297 -4312 15227 6251 -14700 -10389 11465 13411 -5677 -12750 1096 11931 4750 -6412 -5666
1310 -5666 4466 9067 2444 -7175 -4679 7012 7506 -6054 -11027 3261 11827 -2055 -13469 -2030
$$ packed form
1215A382r283P472Q058m460o863J366N432J179m387m139K004O548q77j0235l010
1230i813J3370Q253j3901j3454J2487J7107j0175k0176P264K3429q57k2475l968
1243a2909J9365P628j5200j0961J1089J2870l585j2343l930Q259P528m596j1266
1256h051Q66J4156M245j5937j0841J3873J4346j1777j6712J0050K0114n048k1048
1269a1764k02J8450L521j4053m104J2188O147q938o441M211N443j612m485m83
1283b122M364L758l902r125M99J1496K249j3399n414J5304R864j5914j5193J3223
1297d312J9539q976k0951M311K1854J946j9088p073J3846J0835p181j1162P46
1310e666J0132M601o623r619K496J1691M94j3560m973J4288Q566j3882j1414J1439
$$ plain form
1324 -2030 10753 1522 -13221 -6094 9859 6089 -8071 -5969 6669 6114 -5411 -7064 3535
1337 3535 8441 2578 -3557 -1636 3897 5255 -1409 -7644 -1988 9808 7923 -6862 -9802 4656
1351 4656 9764 -6525 -15505 1246 15662 2805 -14677 -6654 10331 5372 -10627 -9714 6705
1364 6705 11893 775 -7069 -2381 4643 3589 -2604 -4376 2591 10132 5061 -7566 -6998 5463
1378 5463 7503 -6484 -10645 5138 13443 -1385 -14247 -3823 9188 865 -11114 -3671 9459
1391 9459 5973 -6494 -6522 2748 4542 -1938 -4239 1099 6436 4921 -1552 -5099 0 6907 2603
1406 2603 -7249 -3545 9971 8287 -8628 -11994 5429 11841 -4977 -15506 -555 14292 3128
1419 3128 -12702 -7588 7808 7686 -4887 -8990 205 7479 4363 -2362 -4292 1802 7006 1574
$$ packed form
1324b030J2783r231j4743P127J5953l770j4160K102J2638n55j1525j653J0599
1337C535M906n863o135J921N533J358o664o235N656J1796j885j4785k940J4458
1351D656N108j6289q980J6751J4416j2857j7482Q023J6985m959j5999R13J6419
1364F705N188j1118p844M688P024j054o193j772O967P541n071j2627N68J2461
1378E463K040j3987m161J5783Q305j4828j2862J0424J3011q323j1979P443J3130
1391I459l486j2467k8R270J794o480k301N338N337j515o473l547N099O907m304
1406B603r852L704J3516j684j6915l366J7423O412j6818j0529J4951J4847j1164
1419C128j5830N114J5396j22j2573m103R195P274l116o725j930O094N204n432
$$ plain form
1433 1574 -6650 -2915 8174 7093 -5082 -6248 5849 7467 -7131 -11032 3207 10917 -1457
1446 -1457 -10283 -48 8609 -1043 -11780 -5007 6965 5840 -2880 -4413 1974 4893 106 -6193
1460 -6193 -4968 4441 10546 3193 -6595 -2666 8177 4016 -10076 -7995 9400 12210 -4612 -11072
1474 -11072 2408 9347 -4350 -13859 -2243 11231 5589 -6449 -6284 1534 3170 -2701 -6145 -1170
1488 -1170 5972 7295 23 -5867 -1099 5709 1431 -7289 -1871 11146 8600 -6744 -8655 4790
1502 4790 7004 -5846 -9326 3835 10218 -1422 -9671 -1853 5727 -287 -8191 -3995 4824 6088
1516 6088 -826 -5717 -2649 4259 5346 -2225 -7132 1654 10625 3657 -8468 -3996 9113 6553
1530 6553 -8295 -8354 7046 10726 -4378 -10441 1503 8968 -241 -10252 -4758 4270 3850 -2434
$$ packed form
1433A574q224L735J1089j081j2175j166J2097J618j4598l901J4239P710j2374
1446a457q826J0235Q657r652j0737O773J1972j125q720j533O387K919m787o299
1460f193J225R409O105p353r788L929J0843m161j4092K081J7395K810j6822o460
1474a1072J3480O939j3697r509J1616J3474n642j2038J65P818J636n871l444M975
1488a170P142J323p272n890M768O808m278q720N418J3017k546j5344j911J3445
1502D790K214j2850l480J3161O383j1640q249P818P580o014p904M196Q819J264
1516F088o914m891L068O908J087p571m907Q786Q971o968j2125M472J3109k560
1530F553j4848n9J5400L680j5104o063J1944P465r209j0011N494R028m20o284
$$ plain form
1544 -2434 -3538 249 3338 840 -4371 -4792 2386 7286 1322 -5083 828 8763 2055 -9709 -5340
1559 -5340 8755 8496 -4587 -5471 6115 6437 -6957 -10502 1324 8197 657 -5641 -1166 4801
1573 4801 1346 -6157 -7666 -1020 6118 5751 -1529 -4477 1809 5765 -2468 -9323 91 11986 6154
1588 6154 -7045 -3968 8361 4824 -9644 -9300 5832 11052 -121 -7309 -1056 4068 -1293 -6830
1602 -6830 -4083 2769 4906 1142 -3345 -3227 1433 2120 -4056 -5775 3435 9974 2157 -6950 -1874
1617 -1874 7783 2489 -7632 -3263 8996 6868 -5464 -6091 4603 6280 -4125 -8015 408 6348
1631 6348 1947 -4769 -4454 636 3201 -95 -5462 -4084 4046 6364 -2102 -6821 1976 8787 105
1646 105 -9489 -1936 9586 5207 -6085 -3307 7709 6260 -5154 -7169 1926 5149 -759 -3734
$$ packed form
1544b434j104L787L089k498n211m21P178M900n964o405N911P935o708j1764M369
1559e340J4095k59j3083q84J1586L22j3394l545J1826O873p540o298M475N967
1573D801l455p503j509O646P138l67p280k948O286L956q233o855R414J1895n832
1588F154j3199L077J2329l537j4468L44J5132N220j1173p188O253N124n361n537
1602f830K747O852K137l764m487J18M660O87o176j719R210O539p817r107N076
1617a874R657n294j0121M369J2259k128j2332o27J0694J677j0405l890Q423N940
1631F348m401o716L15N090K565l296n367J378Q130K318q466m719Q797O811q682
1646A05r594P553J1522m379j1292K778J1016j449j1414k015R095L223n908k975
$$ plain form
1660 -3734 401 3771 1150 -4476 -5808 -1586 3455 2780 -2476 -3041 3569 4770 -4242 -9230 414
1675 414 9191 2722 -5541 432 8794 2297 -9024 -5968 5986 6605 -1711 -2925 3684 4720 -2977
1690 -2977 -7608 -3450 2598 4254 561 -2762 -1252 2949 521 -7117 -6747 3535 9112 416 -6003
1705 -6003 784 7086 -1145 -9267 -1975 9316 6549 -3663 -2878 4730 3713 -4810 -6097 877 4836
1720 4836 2422 -1356 -1779 -21 591 -2000 -5188 -2177 4496 4554 -3584 -5576 2814 5743 -3155 -8032
1736 -8032 1079 9218 2056 -6760 -1300 7109 2942 -5354 -3470 4778 4800 -1871 -3557 906 3764
1751 3764 1099 -3205 -4896 -541 3501 1666 -4520 -3346 3782 4590 -4579 -7272 1594 6154 -1216
1766 -1216 -5461 2588 8846 721 -7662 -2832 5252 3743 -2556 -1374 4288 4314 -1270 -3952 -2337
$$ packed form
1660c734M135L370k621n626j332M222N041o75n256n65O610J201r012m988R644
1675D14Q777o469q263N973Q362o497j1321L056J1954O19q316j214O609J036p697
1690b977m631M158O048J656l693l323J510M201k428p638L70J0282N577q696o419
1705f003O787O302q231q122P292J1291k767j0212P85P608j017q523j287O974L959
1720D836k414l778m23J758O12k591l188L011O673N8q138j992Q390K929q898m877
1736h032R111Q139p162q816N460Q409m167q296J884Q248K2o671j686M463K858
1751C764k665m304j691M355M042j835o186J174P128Q08r169k693Q866M560p370
1766a216m245Q049O258q125q383M830Q084j509o299J182N662K6n584k682J615
$$ plain form
1781 -2337 534 1617 129 -1033 1329 3814 -711 -7852 -6121 3663 5906 -2113 -4348 3340 6179
1796 6179 -2797 -8774 -1136 6467 2209 -2782 1582 6752 2151 -5804 -5323 1367 4269 1982 -785
1811 -785 -1084 1382 1778 -2316 -6534 -3084 3920 3784 -2495 -2805 3042 2524 -6249 -7468 2981 7665
1827 7665 500 -5081 634 5737 169 -5540 -1928 3729 3198 -252 3 2415 1903 -1426 -3432 -2134
1843 -2134 1873 4186 -179 -4634 -2083 4481 2340 -5753 -5598 2984 4934 -2360 -4400 2639 5306
1858 5306 -1835 -6324 455 5508 1445 -3639 -1095 3979 3745 -236 -2533 -1886 759 1727 209 -1378
1874 -1378 989 3301 -590 -5358 -2915 3034 1521 -5111 -3419 5369 5820 -3771 -7158 -292 3608
1889 3608 -462 -2490 2411 5398 891 -3716 -2148 1492 1896 -246 -622 1955 4045 2799 -2895
$$ packed form
1781b337K871J083j488j162K362K485m525p141J731R784K243q019k235P688K839
1796F179q976n977P638P603m258m991M364N170m601p955M81O690K902k287k767
1811g85k99K466L96m094m218L450P004j36o279l10N847n18q773j219J0449M684
1827G665p165n581N715N103n568n709L612N657n31l450K55K412n12l329k006J298
1843b134M007K313m365m455K551O564k141q093J55Q582J950p294k040P039K667
1858E306p141m489O779N053m063n084K544N074k34l981k297O47K645R68j518j587
1874a378K367K312l891m768K443N949j513o632J692Q788M51r591l387O866L900
1889C608m070k028M901K987m507m607J568L640M04k142l76K577K090j246n694
$$ plain form
1904 -2895 -6429 -2087 3834 2228 -2379 -1086 4467 1656 -6528 -6009 2362 3887 -2410 -3280 3831
1919 3831 5480 -1512 -6359 -2521 2701 2622 764 1115 1861 1377 -598 -2397 -1833 1129 3334 310
1935 310 -1854 1202 3972 -886 -7111 -4062 4573 4297 -2608 -3267 2678 2268 -3583 -4449 1442 3553
1951 3553 -735 -2573 1313 4069 1335 -2095 -2700 202 2946 2753 -636 -2096 1077 3106 -530
1966 -530 -3939 -751 3423 286 -4448 -1393 4836 2462 -5076 -4792 1750 3383 -2039 -3523 1404
1981 1404 3467 347 -1761 -505 712 -325 -929 238 2169 3580 2290 -2311 -3936 170 3029
1996 3029 -194 -3663 690 5269 1418 -4789 -3361 1645 135 -3772 -1368 5051 3991 -2991 -5043
2011 -5043 -1204 1985 276 -1074 538 2744 2773 755 -2361 -2857 286 1850 327 -317 3210 4375
$$ packed form
1904b895l534M342N921j606m607J293N553k811q184N19Q371J525o297q70P111
1919C831J649o992m847L838N222p9j858L51P46m84j975j799N64K962K205l024
1935C10k164L056K770m858o225L049Q635k76o905o59N945m10n851q66N891K111
1951C553m288j838L886K756k734l430o05K902K744j93l389j460L173K029l636
1966e30l409L188M174l137m734L055O229k374p538K84O542J633n422j484M927
1981A404K063l120k108J256J217j037o04J167J931J411j290m601j625M106K859
1996C029l223l469M353M579l851o207J428N006j510l907K404O419j060o982k052
2011e043L839L189j709j350J612K206K9k018l116m96L143J564j523o44L527J165
$$ plain form
2027 4375 -2086 -6346 -2069 4120 1703 -3550 -1180 4104 2446 -3881 -4484 51 1231 -1273 -532
2042 -532 2479 2786 -327 -2850 -2136 401 2374 1705 -697 -759 2475 2798 -1914 -3971 48 3572 177
2059 177 -2810 696 4081 -319 -5380 -2296 3227 2053 -3184 -2774 1721 2461 -547 -1869 -1038 393
2075 393 664 -47 -179 736 2062 1289 -1546 -1385 2236 2722 -1695 -3237 1762 4953 851 -3973 -1545
2092 -1545 2372 -357 -3234 -702 3304 1421 -2356 -2279 870 648 -1689 -2261 168 2472 3151 662
2108 662 -1991 -2058 536 1226 -998 -483 3350 3898 -1616 -3562 414 2429 -1702 -3824 811 5401
2124 5401 1723 -3755 -3341 42 111 -1711 -326 2053 1902 -106 -1472 -1885 -540 610 -107 -772 991
2141 991 4323 2738 -2994 -3905 797 3114 -125 -1628 2077 3623 -686 -3907 -1070 2302 24
$$ packed form
2027D375o461m260M277O189k417n253K370N284j658o327o03M535J180k504P41
2042e32L011L07l113k523P14K537J973o69k402o2L234L23m712k057M019L524l395
2059A77k987L506L385m400n061L084N523j174n237M10M495P40l008j322Q31J431
2075C93K71p11j32R15J326p73k835J61L621M86m417j542M999L191m102m824K428
2092a545L917k729k877K532M006j883l777P7L149k22k337n72K429K304O79k489
2108F62k653o7K594O90k224N15L833N48n514j946L976K015m131k122M635M590
2124E401l678n478M14L383O9j822J385K379j51k008j366m13J345J150p17o65J763
2141I91L332j585n732r11M702K317l239j503L705J546m309l221K837L372k278
$$ plain form
2156 24 -2829 -646 2404 1366 -1873 -2758 -1288 276 996 275 -180 482 1396 178 -1822 -844 2304
2173 2304 1571 -1946 -1523 2972 3746 -1355 -3456 617 3381 222 -2891 -142 2171 359 -2000 -836
2189 -836 1033 218 -1771 -1694 -39 1447 1515 -611 -1882 -784 1380 763 -1989 -1187 2742 2794 -897
2206 -897 -1849 1406 1575 -2128 -2636 2133 4313 590 -2769 -787 1224 -533 -2327 -883 1186 1454
2222 1454 145 -771 -1158 -904 -542 -1071 -1484 1100 3598 1621 -2644 -2252 1620 1714 -2172 -1653 2889
2239 2889 3903 -265 -2604 -323 974 -1181 -1978 925 3108 889 -1561 -2099 -977 -194 -170 -617
2255 -617 -611 792 2103 26 -2567 -1389 1406 958 -1258 -17 3432 2528 -2118 -2810 1239 2754 -718
2272 -718 -1704 944 2476 80 -1725 -837 106 -268 -822 -461 -31 914 247 -1342 -1493 197 1407 -9
$$ packed form
2156B4k853K183L050j038l239q85J470J564P20p21m55O62R14j218k000R78L148
2173B304p33l517M23M495P74n101k101M073K764l159l113K749K313j812k359J164
2189h36J869q15j989P7J655J486O8k126j271J098K164o17k752Q02L929N2l691
2206h97r52L255J69l703n08M769K180l723l359J982K011j757j794J444K069K68
2222A454j309r16l87K54L62n29m13K584K498j977m265L92L872R4l886N19M542
2239B889J014m168k339K281J297k155p97K903K183k219k450n38J122P83K4m47
2255f17OJ403J311k077k593J178K795m48k216J241L449r04m646o92M049J515l472
2272g18r86K648J532k396j805Q88R43l74n54L61M30R45o67j589j51J690J210j416
$$ plain form
2290 -9 -2167 -165 2426 1517 -1625 -1198 2162 1460 -1610 -1140 2040 2317 -412 -1987 582 1793 -504
2307 -504 -2071 -924 906 804 276 -599 -811 -476 -62 -1107 -1613 197 2387 481 -1874 -367 1975
2324 1975 15 -2729 -1356 2914 2874 -257 -1134 890 1008 -1608 -1563 961 1972 570 -309 -294 -248 -269
2342 -269 -1091 -1618 -669 1661 2207 -80 -2482 -791 989 -311 -1751 -142 3144 1717 -1654 -1378
2358 -1378 1317 731 -1391 -1179 1830 2853 362 -998 -496 65 -296 -683 -80 166 653 662 -672 -1591
2376 -1591 -164 588 -915 -1662 448 2306 369 -2331 -1011 1655 778 -1296 -562 2153 1588 -754
2392 -754 -719 857 1065 -25 -862 64 997 695 45 -746 -595 410 344 -952 -1548 290 1223 -199 -1681
2411 -1681 -128 1528 -480 -2269 -387 2385 1047 -1109 -482 1563 991 -845 -1092 410 1185 412
$$ packed form
2290ik158K002K591r09l142M27L360p02l070M70L180K77k729j575K569J211k297
2307e04j567J147J830j02n28q75k12L35M14j045n06J810K190j906k355J507K342
2324A975j960k744J373M270m0l131q77K024J18k616M5K524J011j402q79J5M6k1
2342b69q22n27R49K330N46k287k402J691J780j300j440J609L286j427l371K76
2358a378K695n86k122K12L009J023k491j360N02N61l61l87O03K46M87Rj334r19
2376a591J427P52j503p47K110J858j937k700J320K666q77k074P34K715n65k342
2392g54L5J576K08j090q37R26R33l02o50p91J51J005o6j296n96J838R33j422j482
2411a681J553J656k008j789J882K772j338k156O27K045n72j836k47J502P75p73
$$ plain form
2427 412 216 -196 126 -65 -460 -1437 -703 1030 1595 -166 -1390 -55 903 -963 -2060 81 2204
2444 2204 997 -1144 -212 1388 -124 -1456 -466 1449 1531 142 -272 404 65 -365 -603 -337 198 1095
2462 1095 602 -519 -1042 -183 350 -1213 -1243 1089 1850 -136 -1568 -238 1189 -297 -1713 73 1918
2479 1918 1150 -422 -253 385 264 -445 -184 818 942 261 222 -477 -341 457 155 -1108 -999 809 1239
2498 1239 -703 -1565 168 1190 -521 -1473 53 1412 -139 -1297 -58 1325 314 -707 -82 555
2514 555 594 225 -321 -12 191 570 208 -671 -681 725 572 -532 -656 645 673 -1125 -1710 377 1153
2533 1153 -37 -1022 389 1062 -251 -1289 -140 1208 694 -107 201 564 272 -294 -578 -603 333 1047
2551 1047 795 -345 -641 578 -136 -1103 -1202 802 1029 -471 -727 287 552 -1004 -1494 91 1197
$$ packed form
2427D12j96m12L22j91l95r77P34J733N65j761j224J335R58j866j097K141K123
2444B204j207k141R32J600j512j332R90J915Q2j389m14O76l39m30k38K66N35Q97
2462A095m93j121n23Q59N33j563l0K332P61j986j432J330J427j486j416J786J845
2479A918p68j572J69O38j21p09K61J002J24o81l9o99J36P98l02j263J09J808M30
2498A239j942q62J733J022j711r52J526J359j551j158J239J383j011j021O25O37
2514E55L9l69n46L09K03L79l62q79j0J406j53j104j24J301K8j798n85K087P76
2533A153j190r85J411O73j313j038J149J348n14q01L08L63k92n66k84k5R36P14
2551A047k52j140k96J219p14r67r9K004K27j500k56J014K65j556m90J585J106
$$ plain form
2568 1197 246 -533 159 600 -246 -332 -266 503 571 771 118 140 -236 200 121 -662 -342 1161 992 -723 -769
2589 -769 539 356 -1035 -1220 495 1097 -176 -930 84 652 -514 -823 197 954 234 7 215 66
2607 66 82 296 144 -185 16 443 313 -734 -312 825 391 -961 -902 573 665 -869 -808 481 760 -623
2627 -623 -1128 -180 439 132 -301 73 -27 -66 159 -17 -327 183 904 390 -331 -197 667 32 -1123 -737
2647 -737 802 512 -577 -720 682 163 -891 -758 135 389 -278 -372 510 339 -661 -562 -200 35 146
2666 146 659 298 -17 90 571 -294 -895 -9 906 419 -522 97 754 103 -934 -545 575 416 -436
2685 -436 -503 142 -41 -433 -494 97 225 322 129 499 -232 -292 76 -253 -301 371 833 156 -558 132 670 67
2707 67 -785 -356 741 473 -751 -214 752 277 -572 -498 320 116 -116 -258 22 -111 -206 -119 -163 -112 171
$$ packed form
2568A197r51p79O92M41q46q6O6P69O8K00o53K2l76M36p9p83L20J503j69j715m6
2589g69J308j83j391j85J715O02j273p54J014N68j166l09J020P57p20k27K08j49
2607F6J6K14j52l29K01M27j30j047M22J137m34j352N9J475R2j534O1J289K79j383
2627f23n05R48O19l07m33L74j00l9K25j76l10N10P21n14p21J34Q64o35j155L86
2647g37J539k90j089j43J402n19j054J33Q93K54o67r4Q82j71j000R9L62K35J11
2666A46N13l61l15J07M81q65o01Q86R15m87r41O19O57o51j037L89J120j59q52
2685d36o7O45j83l92o1N91J28R7j93L70p31o0L68l29m8O72M62o77p14O90N38o03
2707F7q52M29J097k68j224N37R66m75q49P4Q18k04k32j42K80j33r5Q7m4N1K83
$$ plain form
2728 171 724 -9 -270 323 700 -60 -406 132 877 468 -716 -14 638 137 -676 -236 178 153 -621 -150
2748 -150 351 -259 -101 -276 -271 -142 122 405 64 43 305 489 -203 -775 -68 646 201 -726 215 852 -208
2769 -208 -742 -265 684 62 -500 -27 407 -75 -329 -393 -445 -8 49 158 293 89 169 258 -75 -102 351 775
2791 775 207 -286 440 368 -237 -454 -119 856 218 -470 167 620 -128 -306 -242 478 98 -155 -152 238 157 -188
2813 -188 -178 -488 -194 243 488 -400 -443 104 504 130 -399 215 602 -85 -61 265 428 -13 -643 -43 387
2834 387 290 -488 -52 164 -286 -230 32 -60 -109 289 123 -258 -94 131 159 -552 -256 285 264 -413 -189 336
2856 336 501 -202 -274 363 388 -90 -15 -101 425 101 -600 62 -41 -189 -208 -95 67 -73 -19 -81 -203 -2
2878 -2 84 -128 -228 -66 289 308 -383 -732 389 377 58 27 379 636 -27 -73 98 161 -123 -13 133 82 -65
$$ packed form
2728A71N53p33k61N93L77p60l46N38P45m09j184P02O52n01q13M40M14k5p74M71
2748a50N01o10J58j75NJ29K64K83l41k1K62J84o92n72P07P14m45r27R41O37j060
2769b08n34M77R49o22n62M73M34m82k54o4n2M37N7J09J35k04Q0Q9l33k7M53M24
2791G75n68m93P26p2o05k17L35R75o38o88O37M53p48j78O4P20l80k53LL90q1l45
2813a88J0l10K94M37K45q88m3N47M00l74n29O14L87o87K4L26J63m41o30O00M30
2834C87r7p78M36K16m50N6K62r2m9L98j66l81J64K25K8p11K96N41k1o77K24N25
2856C36J65p03p2O37K5m78P5q6N26l24p01O62j03j48j9J13J62j40N4o2j22K01
2878bQ6k12j00J62L55J9o91l49J121j2l19l1L52K57o63m6J71O3k84J10J46n1j47
$$ plain form
2901 -65 -126 -178 -482 -235 335 232 -291 -88 185 53 -617 -87 310 128 -259 -65 407 302 -455 -127 207
2922 207 233 49 -29 322 -17 236 -53 -53 -82 -308 40 59 -77 -48 22 167 -387 -187 156 68 -419 67 336
2945 336 288 -384 -148 171 219 -170 125 304 -78 -101 -32 97 11 -130 -203 66 71 154 109 0 -96 22 -12 -152
2969 -152 -230 52 69 10 -176 242 350 38 -280 203 287 -39 -321 74 104 252 98 -138 210 51 128 240
2991 240 -123 -104 -285 -108 -242 -132 181 218 -378 -511 -148 299 -348 -371 87 -6 226 -438 39 504 213
3012 213 17 209 -106 95 -13 -130 -133 -189 -46 -62 -92 -33 -190 147 -184 -337 110 418 -58 -124 128 217 -48
3035 -48 -315 -327 186 26 -234 101 129 6 -65 41 32 -139 24 26 131 -56 40 -221 -160 -160 132 336 -85 -264
3059 -264 -20 32 -153 -126 -19 143 47 -183 -19 141 -187 -41 167 -35 33 144 334 228 182 71 -68 4
$$ packed form
2901f5o1n2l04K47N70j03n23K03K73j32o70N30L97j82l87J94M72j05p57L28L34
2922B07K6j84p8L51l39K53k89%k9k26L48J9j36K9P0J45n54K00L43q8m87M86K69
2945C36m8o72K36L19M8l89K95J79l82k3O9J29q6j41p3K69NQ3m5j09r6J18l4j40
2969a52p8K82J7n9j86M18J08l12l18M83Q4l26k82L95L0J48j54k36L48j59P7J12
2991B40l63J9j81J77j34J10L13L7n96j33L63M47o47k3M58r3K32o64M77M65k91
3012B13j96J92l15K01j08j17ln6J43j6l0N9j57L37l31j53M47L08m76o6K52Q9k65
3035d8k67j2N13j60k60L35K8j23p1J06rj71J63KJ05j87R6k61O1%K92K04m21j79
3059b64K44N2j85K7J07J62r6k30J64J60l28J46K08k02O8J11J90j06m6j11j39P2
$$ plain form
3081 4 -88 139 291 -449 -189 134 234 -365 -255 368 201 -10 -259 119 -69 -206 -403 -91 21 -258 160
3102 160 9 200 35 93 -92 182 22 16 252 229 -7 251 -31 -224 -78 94 144 -134 -218 55 87 -138
3124 -138 -107 -207 117 96 -260 -110 183 -73 -124 264 20 -28 316 178 3 -20 93 -64 53 105 447 81
3146 81 -80 -163 34 59 240 -347 -6 -38 -215 -49 361 -10 -65 241 18 39 -23 0 134 56 -13 -214 -5
3169 -5 -145 196 297 -79 131 225 357 -6 -117 -97 332 -303 -292 276 49 -58 -182 119 15 6 -143 -62 -33
3192 -33 -126 -35 -74 -47 -130 191 230 91 19 -87 -29 -36 -222 57 312 79 -7 24 185 -28 -279 266 236 48 -350
3217 -350 -166 -69 176 -273 84 -272 -194 -108 182 53 -22 -158 148 7 195 -7 25 -251 -48 328 399 133
3239 133 -101 281 434 -49 -92 -5 17 -191 -207 -75 261 96 -265 34 29 -68 180 107 -12 -160 -96 212 -116
$$ packed form
3081Dr2K27J52p40K60L23J00n99J10O23j67k11k49L78j88j37j97L12J12k79M18
3102A60j51J91j65N8j85K74j60oK36k3k36K58k82j93J46J72N0k78q4K73L2k25
3124a38L1j00L24k1l56J50K93k56n1L88k44m8L44j38j75k3J13j57J17N2L42l66
3146H1j61q3J97K5J81n87L41l2j77J66M10l71n5L06k23K1o2K3J34p8o9k01K09
3169ej40L41J01l76K10R4J32l63j11K0M29o35J1N68k27j07j24L01j04rj49Q1K9
3192c3r3R1l9K7q3L21L9j39p2j06N8pj86K79K55k33q6L1J61k13k51N45l0j88l98
3217c50J84R7K45m49L57l56P8Q6K90j29p5j36L06j41J88k02L2k76K03L76P1k66
3239A33k34L82J53m83m3Q7K2k08j6J32L36j65l61K99nr7K48p3j19j48O4L08l28
$$ plain form
3262 -116 -175 203 220 -68 103 238 70 -83 -98 304 22 -62 -354 16 192 -277 139 353 70 -260 -49
3283 -49 -176 -18 -303 -54 83 105 -93 77 152 83 -243 249 349 -31 25 327 176 -71 -87 253 109 -249
3305 -249 150 52 226 -92 -50 95 21 -53 76 254 -418 151 314 -159 196 346 406 -181 -307 124 147 -29
3327 -29 -388 -189 299 50 -242 -29 318 -111 -288 -50 140 26 -153 -50 -42 -21 -57 -12 120 -209 -263 233
3349 233 -76 -229 -195 208 79 -337 -57 578 248 -369 144 488 -3 -240 227 324 294 -330 -253 281 37
3370 37 -192 86 -240 -181 -103 -92 149 -197 383 282 106 -123 -77 604 179 -250 -174 237 -25 18 35 129 67
3393 67 91 -67 468 220 -212 -27 490 -74 114 213 147 -85 -250 356 -266 -69 -236 6 -162 -637 -62
3414 -62 263 147 -296 -56 238 143 -75 296 342 -243 -160 28 76 82 -50 75 -54 -266 20 -97 26 -163
$$ packed form
3262a16n9L78J7k88J71J35j68j53j5M02k82q4k92L70J76m69M16K14k83l30K11
3283d9j27J58k85K49J37K2j98J70P5o9l26M92J00l80N6L02j51k47j6L40j44l58
3305b49L99r8J74l18M2J45p4p4J29J78o72N69J63m73L55J50O0n87j26M31K3j76
3327b9l59J99M88k49k92K13L47m29j77K38J90j14j79J03QK1l6M5J32l29n4M96
3349B33l09j53L4M03j29m16K80O35l30o17N13L44m91k37M67R7l0o24P7N34k44
3370C7k29K78l26N9P8J1K41l46N80j01j76k29M6O81m25m29P6M11k62M3J7R4o2
3393F7K4j58N35k48m32J85N17n64J88R9o6k32j65O06o22J97j67K42j68m75N75
3414f2L25j16m43K40K94r5k18L71M6n85Q3J88M8Oj32J25j29k12K86j17J23j89
$$ plain form
3436 -163 74 233 -274 -447 -14 310 -63 -406 -187 194 -188 -580 77 161 -113 -283 271 315 -143 -229 41
3457 41 110 -72 148 484 46 -119 -46 205 -132 -289 62 96 14 -360 321 141 -256 -257 -74 636 -368 -437
3479 -437 87 159 -243 -58 388 315 204 -94 51 1 -24 -250 67 231 -215 113 170 -246 -18 90 262 -132
3501 -132 -212 358 -8 -237 -71 111 199 -385 -147 21 323 2 58 210 178 -123 241 387 180 -224 -136 -18
3523 -18 -143 -611 174 215 10 -449 180 -9 -153 -41 212 107 -374 -62 384 -110 -646 -83 150 285 77
3544 77 -55 213 56 111 -167 167 175 -181 273 123 -259 -455 394 -245 -264 -196 164 -10 -212 -379 -180 70
3566 70 -102 -90 272 168 -305 -291 349 -9 -557 65 144 8 -216 177 4 3 15 194 69 -74 -5 332 -29
3589 -29 -306 30 157 -129 -267 -372 -38 -89 -176 131 306 270 -251 29 178 134 -253 6 454 -285 -97 470
$$ packed form
3436a63K37J59n07j73M33L24l73l43K19L81l82l92O57Q4k74j70N54M4m58q6K70
3457D1O9j82K20L36m38j65P3K51l37j57L51L4q2l74O81j80l97jJ83P10j004o9
3479d37N24P2m02J85M46p3j11k98J45n0k5k26L17J64m46L28N7m16K28J08J72l94
3501a32q0N70l66k29J66J82Q8n84K38J68L02l21N6J52l2l01L64J46k07m04Q8J18
3523a8j25m68P85M1k05m59O29j89j44J12K53j05m81L12M46m94n36N63K33J35k08
3544G7j32K68j57N5k78L34Ql56M54j50l82j96Q49o39j9O8L60j74k02j67J99K50
3566G0j72J2L62j04m73J4O40l58n48O22P9j36k24L93j73jJ2J79j25j43O9L37l61
3589b9k77L36J27k86j38j05L34n1q7L07J75l6n21K80J49m4l87K59M48p39J88N67
$$ plain form
3611 470 174 -67 -9 29 443 -363 -1 256 -5 -579 -364 454 -90 -303 -28 161 168 -341 -42 234 267 -164
3633 -164 222 583 -59 -46 136 235 -100 -6 456 280 -30 -95 209 -268 -310 223 155 25 -647 -124 71 -49
3655 -49 -400 -304 406 -111 -150 -171 -76 -104 -233 170 511 253 100 171 122 -126 -87 267 30 -171 -61 499 85
3678 85 -223 -162 129 -140 -127 317 526 -62 -311 -12 56 -225 -287 185 277 -238 44 48 65 -231 -1 340 -65
3701 -65 -114 40 404 -242 -93 178 507 -28 -306 3 208 8 -586 -58 22 -235 -287 245 15 -214 -471
3722 -471 -156 284 -30 -45 204 127 -252 130 445 284 -100 128 113 90 -540 38 419 -166 -142 348 289 -291
3744 -291 -195 -131 188 79 -347 171 332 -176 -436 118 68 84 4 309 -66 -67 -157 7 -109 -181 75 29 -146
3767 -146 -427 306 219 -289 -259 357 147 73 -408 316 -21 -309 -137 -49 11 102 -107 150 6 -394 66 105
$$ packed form
3611D70k96k41N8L8M14q06L62K57k61n74K15Q18n44k13K75J89Pn09K99K76L3m31
3633a64L86L61o42J3J82R9l35R4M62j76l10o5L04m77m2N33o8j30o72N23J95j20
3655d9l51R6P10n17l9k1R5k8j29M03L41k58j53P1m9k48L9L54k37k01J10N60m14
3678H5l08O1K91k69J3M44K09n88k49K99O8k81o2M72R2n15K82MJ7k96K30L41m05
3701f5m9J54L64o46J49K71L29n35k78L09K05k00n94N28Q0k57n2N32k30k29k57
3722d71L15M40l14j5K49p7l79L82L15j61l84K28j5k3o30N78L81n85K4M90n9n80
3744b91R6O4L19j09m26N18J61n08k60N54n0J6q0L05l75jr0J64j16p2K56m6j75
3767a46k81P33q7n08L0O16k10p4m81P24l37k88J72Q8O0R1k09K57j44m00M60L9
$$ plain form
3789 105 76 -124 177 200 31 -339 162 378 -287 -212 245 351 -235 -406 94 32 -217 -411 240 133 -276
3810 -276 -135 -45 173 -290 -94 372 228 19 228 196 -319 -266 108 133 -270 -44 14 307 -168 -181 561 207
3832 207 -255 -530 129 360 -246 -42 410 -247 -356 -280 119 -137 -630 242 221 -52 -99 -41 125 -175 -81 260
3854 260 372 -183 -97 318 454 -402 -188 341 351 -491 49 590 -65 -693 -171 161 -112 -537 190 248 -225
3875 -225 -434 -155 231 -478 84 270 516 5 -164 218 -283 -355 -164 479 435 -183 193 355 164 -213 52
3896 52 351 -17 -346 209 10 -252 -514 152 269 -461 -272 238 382 -165 -161 218 188 -250 43 643 287
3917 287 -244 -67 533 61 -279 199 395 35 -207 -99 322 -233 -292 219 54 -131 -690 11 266 -150
3937 -150 -219 -42 20 -437 -115 377 134 -440 -87 585 324 -361 -89 193 -263 -137 342 483 131 -283 -237
$$ packed form
3789A05k9k00L01K3j69l70N01K16o65P5M57J06n86j71N00o2k49j94O51j07m09
3810b76J41R0K18m63J96M66j44k09K09l2n15N3L74K5m03K26N8K93m75j3P42l54
3832B07m62k75O59K31o06K04M52o57j09P6L99k56m93Q72k1k73m7N8J66l00R4L41
3854B60J12n55Q6M15J36q56K14N29J0q42N40N41o55o28N22L32k73m25P27N8m73
3875b25k09K79L86p09N62J86K46n11j69L82n01p2J91O43m4o18L76J62j91l77K65
3896E2K99l68l29N55j99k62k62O66J17p30J89N10J44n47ML79l0m38K93O00l56
3917B87n31J77O00m72l40M78J96l60k42J08M21n55n9N11j65j85n59P01K55m16
3937a50o9J77O2m57L22M92k43n74L53O72k61o85K72K82m56J26M79J41l52m14M6
$$ plain form
3958 -237 243 -34 -371 46 41 -125 -270 305 -189 -671 -21 199 70 239 -72 1 -275 -431 282 399 133
3979 133 -452 216 285 -99 -255 159 -86 118 -40 456 302 -356 -496 -218 22 -387 88 529 -132 -180 -53
4000 -53 32 212 -512 213 416 429 -319 109 203 -41 -195 237 704 214 80 159 209 -243 -420 325 -81 -47
4022 -47 55 450 11 -360 -164 -163 110 -487 -41 158 -327 -533 190 558 -35 -255 232 352 -260 -130 146
4043 146 481 -9 -159 207 315 -220 -66 -23 118 -66 -167 41 -9 -462 -238 129 -164 -26 -25 677 -84
4064 -84 -701 221 -65 -205 -478 638 794 21 -212 -43 104 -94 -63 715 189 -170 -159 55 150 -302 -106
4085 -106 100 -309 -126 131 90 -406 -542 151 491 106 -159 331 272 -175 -321 42 228 10 64 334 484
4106 484 -195 -567 406 307 -209 -117 486 276 -534 87 77 -673 -332 65 472 -169 -319 213 13 -602 -263
$$ packed form
3958b37M80k77l37M17nj66j45N75m94m82O50K20j29J69l11P3k76j56P13J17k66
3979A33n85O68O9l84j56M14k45K04j58M96j54o58j40K78K40m09M75M41o61m8J27
4000e3Q5J80p24P25K03J3p48M28R4k44j54M32M67m90j34P9N0m52j77P45m06L4
4022d7J02L95m39l71J96JK73n97M46J99m85k06P23L68n93k20M87J20o12J30K76
4043A46L35m90j50L66J08n35J54M3J41j84j01K08n0m53K24L67k93J38JP02p61
4064h4o17R22k86j40k73J116J56p73k33J69J47j98L1P78n26l59J1K14R5m52J96
4085a06K06m09J83K57m1m96j36O93L40l85k65M90n9m47j46L63J86k18N4K70J50
4106D84o79l72R73r9n16R2O03k10q10O21j0p50L41L97M07o41j50N32k00o15L39
$$ plain form
4127 -263 151 308 -40 -204 76 337 -51 25 269 308 4 51 452 -48 -238 156 378 139 -55 258 285
4148 285 -363 -118 395 541 -281 -104 422 -80 -632 -232 637 385 -531 -195 191 277 -134 -152 15 20 -111
4169 -111 333 352 -50 -402 93 392 -190 -8 239 94 -491 -643 -3 283 -286 -230 590 254 -246 -42 7
4190 7 -252 -694 51 294 245 -88 -200 92 -206 -314 430 481 102 35 498 93 -473 -343 301 359 -556 -191
4212 -191 431 108 -803 -301 270 -13 -413 20 583 -363 -314 -144 26 -124 -123 374 589 -5 -83 268 244 -190
4234 -190 -44 500 90 -504 -214 218 151 -511 -75 219 -211 -396 -10 392 -157 -617 -76 645 -92 -425
4254 -425 87 347 2 -48 228 251 -92 -269 343 145 -106 -138 422 14 -354 -2 334 -95 -656 -367 376
4275 376 47 -432 72 241 -292 -456 -94 370 -98 -149 -85 513 -342 -143 126 199 -39 130 260 255 -515 -381
$$ packed form
4127b63M14J57l48j64K80K61l88P6K44L9l04M7M01n00j90L94K22k39j94L13K7
4148B85o48K45N13J46q22J77N26n02n52M00Q69k52r16L36L86Q6m11j8J67Nj31
4169a11M44J9m02l52M95K99n82J82K47j45n85j52O40K86n69N6Q20l36n00K04M9
4190Gk59m42P45K43m9l33j12K92k98j08P44N1l79o7M63m05n66J30O44N8r15L65
4212a91O22l23r11N02N71k83m00M33N63r46M9J70J70j50JM97K15n94p8L51k4m34
4234a90J46N44m10n94K90M32o7o62M36K94m30j85L86M02n49m60N41P21p37l33
4254d25N12K60l45n0K76K3l43j77O12j98k51l2N60m08l68L52L36m29n61K89P43
4275C76l29m79N04J69n33j64L62M64m68n1O4N98q55J99K69P3k38J69J30np70J34
$$ plain form
4297 -381 303 211 -318 301 415 -3 -677 -133 -88 -213 -566 47 277 -96 -375 -54 179 -572 -184 395 652
4318 652 -412 -79 401 365 -426 -4 282 150 -52 22 408 -179 -478 51 378 -193 13 142 430 -129
4338 -129 -452 139 55 -523 -300 491 261 -177 -169 321 17 -290 -63 534 113 -172 -69 492 -132 -395 199
4359 199 603 -226 -221 301 453 -267 -602 276 73 -287 -450 47 145 -465 -137 377 305 -140 -201 223 66 16
4381 16 215 422 200 -201 106 400 -44 -404 440 346 -122 -204 274 379 -327 -694 466 323 -233 -310 155
4402 155 64 -514 -349 -31 101 -246 322 599 137 -197 10 26 -13 -182 591 414 5 -92 62 259 -360
4423 -360 -190 335 397 -476 -458 238 -225 -446 -282 131 240 -190 -104 398 -12 -248 -215 539 208 2 84 481
4445 481 -340 -201 333 137 -244 144 86 144 -353 -171 192 358 -616 -46 443 17 -660 -444 402 -268 -335
$$ packed form
4297c81O84r2n29O19J14m18o74N44M5j25l53O13K30l73k79L21K33p51L88N79K57
4318F52j064L33M80l6p91M22K86j32k02P4L86n87k99N29L27n71K06J29K88n59
4338a29l23N91q4n78K23P91k30m38QM90l04l07K27N97m21k85J03N61o24k63N94
4359A99M04q29NN22J52p20l35Q78k03l60j63M97R8o10L28N14p2m45o1M24j57n0
4381A6J99K07k22m01L07K94m44l60Q44r4m68q2M78J05p06l67J160j43n56p7M65
4402A55r1n78J65L18J32l47N68K77m62l34K07J6l9j69P73j77m09r7J54J97o19
4423c60J70N25O2q73J8O96m63k21J64M13J09m30Q6N02m10k36L3P54l31k06Q2L97
4445D81q21J39N34j96l81L88n8N8m97J82L63J66r74N70M89m26o77K16Q46o70o7
$$ plain form
4466 -335 14 440 -131 -234 -31 42 -351 -189 340 347 -70 61 392 428 -374 -38 599 342 -733 -291 485
4487 485 234 -574 -139 527 209 -196 -290 118 -258 -494 130 186 -139 -236 125 364 -163 258 729 360 -112
4508 -112 54 164 150 -506 -165 483 247 -206 -216 316 -148 -701 -48 304 188 -386 -341 77 -58 -564 -68
4529 -68 151 -189 -162 283 435 -124 -365 290 192 -375 180 641 404 -447 18 534 60 -555 5 618 -202
4550 -202 -477 -68 373 -353 -609 -112 202 12 -299 208 130 -330 -262 397 113 -379 190 689 -204 -160 -165 390
4572 390 39 -373 179 350 89 -586 -165 465 -145 -407 -64 95 -265 -278 136 298 -215 -171 199 124 -245
4593 -245 -184 262 135 -248 213 468 -39 -376 102 520 391 36 -34 475 -99 -259 -126 -39 -81 -251 11
4614 11 148 -299 -393 40 -85 -551 47 615 114 -435 221 244 36 -410 -23 696 63 -367 -94 351 -189
$$ packed form
4466c35L49M26n71j03K03P3l93J62N29Pm17J31L31L6q02L36O37k57j075M42P76
4487D85k51q08M35O66l18m05r4M08l76k36O24N6l25r7L61K39n27M21M71l69m72
4508a12J66J10j4o56L41O48k36m53j0N32m64n53O53L52j16n74M5M18j35n06M96
4529f8K19l40K7M45J52n59k41O55r8n67N55M61k37q51M65N16m74o15N60O13q20
4550b02k75M09M41p26k56M97L14j90l11N07p8m60O8O59k84m92N69M99q93M4nN55
4572C90l51m12N52J71k61o75M21O30o10k62L43J59l60j3M14J62n13M4L70p5l69
4593b45O1M46j27l83M61K55n07l37M78M18j29l55p0N09n74j60J33Q7m2j70K62
4614A1J37m47r4M33j25m66N98N68n01n49O56K3k08m46L87P19o33m30K73M45n40
$$ plain form
4635 -189 -666 -94 498 -149 -289 14 464 -189 -538 -144 -121 -355 127 445 322 -106 -91 191 -246 -235 211
4656 211 498 -40 -340 30 309 -437 -402 286 673 -82 -482 186 232 -95 -101 99 284 -181 -452 52 85 -173
4678 -173 -481 65 -82 -303 -37 319 -346 -316 218 208 -34 -76 433 336 184 53 290 434 -171 -334 213
4699 213 434 -551 -327 405 121 -378 -153 81 -119 -793 -201 557 57 -240 167 316 -312 -487 237 348
4719 348 -22 -3 417 714 -290 -203 127 293 246 -161 313 241 -192 -180 184 -116 -349 -215 317 -59 -307
4740 -307 -219 58 -575 -520 50 122 -51 -250 388 605 -140 -297 352 382 -92 -245 242 431 -253 -286 222 166
4762 166 -326 -52 431 45 -322 20 39 -381 -229 4 91 -386 -474 534 13 -591 -560 683 476 -91 -93
4783 -93 325 205 -317 -204 216 148 -195 11 393 64 -156 24 270 -238 -236 238 109 -238 -499 204 51
$$ packed form
4635a89m77N72N92o47j40L03M50o53l49L94K3k34M82L18j23m28J5K82m37J1M46
4656B11K87n38l00L70K79p46L5O88L87p55m00O68M6l27oK00J85m65k71N04L3k58
4678a73l08N46j47k21K66L56o65L0N34j0k42m2N09r7j52j31K37J44o05j63N47
4699B13K21r85K24P32k84m99K25K34k00o74N92P58n00k97M07J49o28j75P24J11
4719C48l70J9M20K97j004Q7L30J66m7m07M74p2m33J2L64l00k33J34N32l76k48
4740c07Q8K77o33N5N70P2j73j99O38K17p45j57O49L0m74j53M87J89o84l3N08n6
4762A66m92K74M83l86l67L42J9m20J52K33Q7m77q8J008n21o04L1J243k07n67k
4783i3M18j20n22J13M20o8l43K06L82l29k20J80K46n08KM74j29l47k61P03j53
$$ plain form
4804 51 -458 -51 249 22 -379 -348 572 331 -262 -101 362 145 -172 -142 526 27 -115 167 513 -68 -142
4825 -142 275 72 -18 101 253 -13 -415 -186 465 97 -260 -45 325 177 -424 -21 558 -66 -423 -39
4845 -39 483 119 -200 -70 410 53 -4 175 285 -294 -314 294 246 -491 -341 205 132 -292 -234 243 134 -679
4867 -679 -242 365 171 -329 107 405 444 -309 25 161 -260 -25 510 525 56 -178 269 56 -324 -234 243
4888 243 2 -480 -74 195 -100 -364 -365 -13 -76 -312 256 232 49 -179 -162 479 -119 -303 25 416 -92 2
$$ packed form
4804E1n09M07L00k27m01L1R20k41n93J61M63k17l17L0O68m99j42K82L46n81p4
4825a42M17k03r0J19J52k66m02K29O51l68l57K15L70j48o01M03N79o24l57L84
4845c9N22l64l19J30M80l57n7J79J10n79k0O08m8p37J50N46p3m24N8M77j09q13
4867f79M37O07j94n00M36K98L9p53L34J36m21K35N35J5m69k34M47k13l80R0M77
4888B43k41m82M06K69k95k64jL52o3k36N68k4j83k28J7O41n98j84L28L91n08R4
$$ [...]
8191d6
##END NTUPLES=NMR FID
##END=
