##TITLE=1H_CA-8016-3-2
 CDCl3, 8 sc, 
 7.2.2019
##JCAMPDX= 6.0         $$ Bruker NMR JCAMP-DX V2.0
##DATA TYPE= NMR FID
##DATA CLASS= NTUPLES
##ORIGIN= UXNMR, Bruker Analytische Messtechnik GmbH
##OWNER= root
$$ XWIN-NMR		Version 3.5
$$ Thu Feb  7 15:39:02 2019 Russian Standard Time (UT+4h)  she@DPX200
##.OBSERVE FREQUENCY= 200.1313
##.OBSERVE NUCLEUS= ^1H
##.DELAY= (6, 6)
##.ACQUISITION MODE= SIMULTANEOUS
##.ACQUISITION SCHEME= undefined
##.AVERAGES= 8
##.DIGITISER RES= 18
##SPECTROMETER/DATA SYSTEM= spect
##.PULSE SEQUENCE= zg30
##.SOLVENT NAME= D2O
##.SHIFT REFERENCE= (INTERNAL, D2O, 0, 15.7039)
##AUDIT TRAIL= $$ (NUMBER, WHEN, WHO, WHERE, WHAT)
$$ ##TITLE= Audit trail, XWIN-NMR		Version 3.5
$$ ##JCAMPDX= 5.01
$$ ##ORIGIN= Bruker BioSpin GmbH
$$ ##OWNER= she
$$ F:/spectra/data/she/nmr/H-F/1/audita.txt
$$ ##AUDIT TRAIL=  $$ (NUMBER, WHEN, WHO, WHERE, WHAT)
(   1,<2019-02-07 15:38:03.37 +0400>,<she>,<DPX200>,
      <created by zg, POWCHK disabled, PULCHK disabled
       configuration hash MD5:
       00 E9 B6 7A A2 85 ED C7 34 08 36 98 17 FE 4E 26
       data hash MD5: 16K
       9E 08 1A AC F8 12 DD B4 DA 01 BE E9 3C 74 8D 41>)
$$ ##END=
$$ 
$$ hash MD5
$$ F2 E6 5E 2C 19 7F AC 5C 3C 15 CF 05 84 79 2F 48
##$RELAX= 
##$RELAX= 
##$RELAX= 
##$RELAX= 
##$RELAX= 
##$RELAX= 
$$ Bruker specific parameters
$$ --------------------------
##$DU= <F:/spectra>
##$EXPNO= 1
##$NAME= <H-F>
##$PROCNO= 1
##$TYPE= <nmr>
##$USER= <she>
##$AMP= (0..31)
100 100 100 100 100 100 100 100 100 100 100 100 100 100 100 100 100 100 
100 100 100 100 100 100 100 100 100 100 100 100 100 100 
##$AQSEQ= 0
##$AQ_mod= 1
##$AUNM= <au_zg>
##$AUTOPOS= <>
##$BF1= 200.13
##$BF2= 200.13
##$BF3= 200.13
##$BF4= 200.13
##$BF5= 200.13
##$BF6= 200.13
##$BF7= 200.13
##$BF8= 200.13
##$BYTORDA= 1
##$CFDGTYP= 0
##$CFRGTYP= 5
##$CHEMSTR= <none>
##$CNST= (0..31)
1 1 145 1 1 1 1 1 1 1 1 1 1 1 1 1 1 1 1 1 1 1 1 1 1 1 1 1 1 1 1 1 
##$CPDPRG= <>
##$CPDPRG1= <>
##$CPDPRG2= <>
##$CPDPRG3= <>
##$CPDPRG4= <mlev>
##$CPDPRG5= <mlev>
##$CPDPRG6= <mlev>
##$CPDPRG7= <mlev>
##$CPDPRG8= <mlev>
##$CPDPRGB= <>
##$CPDPRGT= <>
##$D= (0..31)
0 1.2 0 0 0 0 0 0 0 0 0 0.03 0 0 0 0 0 0 0 0 0 0 0 0 0 0 0 0 0 0 0 0 
##$DATE= 1549539483
##$DBL= (0..7)
120 120 120 120 120 120 120 120 
##$DBP= (0..7)
150 150 150 150 150 150 150 150 
##$DBP07= 0
##$DBPNAM0= <>
##$DBPNAM1= <>
##$DBPNAM2= <>
##$DBPNAM3= <>
##$DBPNAM4= <>
##$DBPNAM5= <>
##$DBPNAM6= <>
##$DBPNAM7= <>
##$DBPOAL= (0..7)
0.5 0.5 0.5 0.5 0.5 0.5 0.5 0.5 
##$DBPOFFS= (0..7)
0 0 0 0 0 0 0 0 
##$DE= 6
##$DECBNUC= <off>
##$DECIM= 32
##$DECNUC= <off>
##$DECSTAT= 4
##$DIGMOD= 1
##$DIGTYP= 9
##$DL= (0..7)
0 120 120 120 120 120 120 120 
##$DP= (0..7)
150 150 150 150 150 150 150 150 
##$DP07= 0
##$DPNAME0= <>
##$DPNAME1= <>
##$DPNAME2= <>
##$DPNAME3= <>
##$DPNAME4= <>
##$DPNAME5= <>
##$DPNAME6= <>
##$DPNAME7= <>
##$DPOAL= (0..7)
0.5 0.5 0.5 0.5 0.5 0.5 0.5 0.5 
##$DPOFFS= (0..7)
0 0 0 0 0 0 0 0 
##$DQDMODE= 0
##$DR= 18
##$DS= 0
##$DSLIST= <SSSSSSSSSSSSSSS>
##$DSPFIRM= 0
$$ [...]
##$SUBNAM2= <"">
##$SUBNAM3= <"">
##$SUBNAM4= <"">
##$SUBNAM5= <"">
##$SUBNAM6= <"">
##$SUBNAM7= <"">
##$SUBNAM8= <"">
##$SUBNAM9= <"">
##$SW= 20.0189088683792
##$SWIBOX= (0..15)
0 0 2 0 0 0 0 0 0 0 0 0 0 0 0 0 
##$SW_h= 4006.41025641026
##$TD= 16384
##$TD0= 1
##$TE= 0
##$TE2= 300
##$TE3= 300
##$TEG= 300
##$TL= (0..7)
0 120 120 120 120 120 120 120 
##$TP= (0..7)
150 150 150 150 150 150 150 150 
##$TP07= 0
##$TPNAME0= <>
##$TPNAME1= <>
##$TPNAME2= <>
##$TPNAME3= <>
##$TPNAME4= <>
##$TPNAME5= <>
##$TPNAME6= <>
##$TPNAME7= <>
##$TPOAL= (0..7)
0.5 0.5 0.5 0.5 0.5 0.5 0.5 0.5 
##$TPOFFS= (0..7)
0 0 0 0 0 0 0 0 
##$TUNHIN= 0
##$TUNHOUT= 0
##$TUNXOUT= 0
##$USERA1= <user>
##$USERA2= <user>
##$USERA3= <user>
##$USERA4= <user>
##$USERA5= <user>
##$V9= 5
##$VALIST= <valist>
##$VCLIST= <CCCCCCCCCCCCCCC>
##$VD= 0
##$VDLIST= <DDDDDDDDDDDDDDD>
##$VPLIST= <PPPPPPPPPPPPPPP>
##$VTLIST= <TTTTTTTTTTTTTTT>
##$WBST= 1024
##$WBSW= 4
##$XGAIN= (0..3)
0 0 0 0 
##$XL= 0
##$YL= 0
##$YMAX_a= 882049
##$YMIN_a= -359323
##$ZGOPTNS= <>
##$ZL1= 120
##$ZL2= 120
##$ZL3= 120
##$ZL4= 120
##$ABSF1= 10
##$ABSF2= 0
##$ABSG= 5
##$ABSL= 3
##$ALPHA= 0
##$AQORDER= 0
##$ASSFAC= 0
##$ASSFACI= 0
##$ASSFACX= 0
##$ASSWID= 0
##$AUNMP= <proc_1d>
##$AZFE= 0.1
##$AZFW= 0.1
##$BCFW= 1
##$BC_mod= 2
##$BYTORDP= 1
##$COROFFS= 0
##$CY= 11.3945322036743
##$DATMOD= 1
##$DC= 2
##$DFILT= <>
##$DTYPP= 0
##$F1P= 18.9103706918063
##$F2P= -1.10871071338519
##$FCOR= 0.5
##$FTSIZE= 0
##$FT_mod= 4
##$GAMMA= 1
##$GB= 0.15
##$INTBC= 1
##$INTSCL= 1
##$ISEN= 128
##$LB= 0.24
##$LEV0= 0
##$LPBIN= 0
##$MAXI= 10000
##$MC2= 0
##$MEAN= 0
##$ME_mod= 0
##$MI= 1.114404
##$NCOEF= 0
##$NC_proc= 0
##$NLEV= 6
##$NOISF1= 3.799351
##$NOISF2= 2.8
##$NSP= 1
##$NTH_PI= 0
##$NZP= 0
##$OFFSET= 15.70392
##$PC= 1
##$PHC0= -8676.135
##$PHC1= 5.600183
##$PH_mod= 1
##$PKNL= yes
##$PPARMOD= 0
##$PSCAL= 0
##$PSIGN= 0
##$REVERSE= no
##$SF= 200.130013532006
##$SI= 16384
##$SIGF1= 3
##$SIGF2= 2
##$SINO= 400
##$SIOLD= 16384
##$SREGLST= <1H.CDCl3>
##$SSB= 0
##$STSI= 0
##$STSR= 0
##$SW_p= 3612.71676300578
##$SYMM= 0
##$S_DEV= 0
##$TDeff= 0
##$TDoff= 0
##$TI= <>
##$TILT= no
##$TM1= 0
##$TM2= 0
##$TOPLEV= 0
##$USERP1= <user>
##$USERP2= <user>
##$USERP3= <user>
##$USERP4= <user>
##$USERP5= <user>
##$WDW= 1
##$XDIM= 8192
##$YMAX_p= 0
##$YMIN_p= 0
$$ End of Bruker specific parameters
$$ ---------------------------------
##NTUPLES= NMR FID
##VAR_NAME=  TIME,          FID/REAL,        FID/IMAG
##SYMBOL=    X,             R,               I
##VAR_TYPE=  INDEPENDENT,   DEPENDENT,       DEPENDENT
##VAR_FORM=  AFFN,          ASDF,            ASDF
##VAR_DIM=   8192,          8192,            8192
##UNITS=     SECONDS,       ARBITRARY UNITS, ARBITRARY UNITS
##FACTOR=    0.0002496,     1,               1
##FIRST=     0,             0,               0
##LAST=      2.0444736,     0,               0
##MIN=       0,             -359323,         0
##MAX=       2.0444736,     882049,          0
$$ Real data points
##PAGE= N=1
##DATA TABLE= (X++(R..R)), XYDATA
0@%%%%%%qQqJ0j0J6k4L2m0M8n6P2q8J04j28J53j79K16k55K97l45L99m62N31o08
$$ 0 0 0 0 0 0 0 -8 0 -8 2 -8 8 -16 16 -24 24 -32 40 -48 56 -72 81 -98 118 -137 160 -185 214 -248 283 -325
31c25O95p91Q97j013J141j285J442j611J798k003K227k471K738l030L351l700
$$ -325 370 -421 476 -537 604 -681 761 -850 948 -1055 1172 -1299 1439 -1591 1760 -1940
47a940M079m496M954n456O012o628P312q076Q935r908J1025j2317J3831j5639
$$ -1940 2139 -2357 2597 -2859 3153 -3475 3837 -4239 4696 -5212 5813 -6504 7327 -8312
61h312J7840k0596K4153k8949L5820m6559O5891j11822M33439N21144k03412n8102
$$ -8312 9528 -11068 13085 -15864 19956 -26603 39288 -72534 360905 882049 678637 620535
73F20535j65001n9554p4791N884m8431o917j2482L2256L514J6774l2002m5535
$$ 620535 455534 395980 321189 327073 278642 271725 259243 291499 295013 311787 279785 234250
85B34250o5851k9808k6356q113k2998k5018l7670j2571J521J9918R222k359k5021
$$ 234250 168399 138591 112235 104122 81124 56106 18436 5865 7386 27304 36526 34167 9146
98I146k1935j4742j593m511j0122k7878l1195j9093J545R449J3016N643l264j730
$$ 9146 -12789 -27531 -29124 -33635 -43757 -71635 -102830 -121923 -120378 -110929 -97913 -92270 -95534 -97264
112i7264J1413J4434Q508k987j5006k2099j1799M131J0330P226L303j810k358
$$ -97264 -85851 -71417 -62909 -65896 -80902 -103001 -114800 -110669 -100339 -93113 -89810 -91620 -93978
125i3978P718J5291J2442M924J331o2L528J2329J4441N291k736n761m612K521
$$ -93978 -86260 -70969 -58527 -53603 -52272 -52334 -48806 -36477 -22036 -16745 -19481 -25242 -29854 -27333
139b7333J2243J3600P991M312L097K343L862J515o873j4220j4484r494r54Q170
$$ -27333 -15090 -1490 6501 10813 13910 16253 20115 21630 14757 537 -13947 -23441 -24395 -16225
153a6225J1955Q403N899M507L661L346R86m475r387q821m673J697P152Q812N355
$$ -16225 -4270 4133 10032 14539 18200 21546 22532 18057 8670 -151 -4824 -3127 4025 12837 18192
168A8192J929J415J632J653J205j532n233n800j882J139L335M108J290j135l40
$$ 18192 20121 21536 23168 24821 26026 24494 19261 13461 11579 12718 16053 20161 21451 20316 19976
183A9976J917K752K146J00k314m266k555p78l19p3j235j950p36J809K931K639
$$ 19976 21893 24645 26791 26891 24577 20311 17756 16978 16659 16586 15351 13401 12665 14474 17405 20044
199B0044Q83j037k320j822l7j16j67r55j754r83N27J045O47p98k090k776j326
$$ 20044 20927 19890 17570 15748 15711 15595 15428 14473 12719 11736 12263 13308 13955 13157 11067 8291 6965
216F965m32R6J03q39j036j680n94M03o16q38j360j478J22J129J158P85oj181j732
$$ 6965 6533 6629 6732 5893 4857 3177 2583 2986 2370 1532 172 -1306 -1184 -55 1103 1888 1882 701 -1031
235a031p60l56m57o18p64l35N61J503J452J090m77k97p58q68j95k34k04k67L5
$$ -1031 -1791 -2147 -2604 -3222 -3986 -4321 -3760 -2257 -805 285 -192 -489 -1247 -2115 -2310 -2544 -2748 -3015 -2980
254b980N73P80Q65L22j56n59r3l89l46N58l24k91j6J06O41J090K68J05L05k6j81
$$ -2980 -2407 -1627 -762 -440 -596 -1155 -1248 -1637 -1983 -1425 -1749 -2040 -2056 -1950 -1309 -219 49 154 459 433 252
275B52L52K93j53j84l49j76QO79K82j24o7J23J90Q3J33p3m44k90P9j70N23N8j10
$$ 252 604 897 744 560 211 35 43 722 1004 880 813 936 1126 1209 1342 1269 825 535 614 444 967 1025 915
298I15J67J3P6L1j56j71k24M5K03j13r4L20j90J0j37l21j12L27j54O5j71l0J97
$$ 915 1082 1095 1171 1202 1046 875 651 696 899 786 692 1012 822 832 695 374 262 589 435 500 329 299 496
321D96k3O8k07j84l50J17M55k6r8j12j0K29j56j4O0l61nq3K62k47J58m2p7J3J65
$$ 496 473 541 334 150 -200 -83 372 346 248 136 126 355 199 185 245 -116 -121 -204 58 -189 -31 -73 -150 -137 28
346B8k9j98K78J5m3j15k4L5n6K5RN3L7K69l98J70j43K82j38j65J46Q2M3j01m3
$$ 28 -1 -199 79 94 51 -64 -88 -53 -109 -84 -75 -22 15 284 -114 56 -87 195 57 -108 38 120 163 62 19
371A9P2L2j70K06J81k68N3j08J12K0j66j94J80m3K33l51L04m00Q14m54j47N9K06
$$ 19 91 123 -47 159 340 72 125 17 129 149 -17 -211 -31 -74 159 -192 112 -288 526 72 -75 -16 190
394A90R1m5k41J04J6o0l4j06O5Q6k44K94l6j85M30o02M47j31J69j82J19o7k07
$$ 190 281 236 -5 99 115 55 21 -85 -20 66 -178 116 80 -105 325 -277 170 39 208 26 145 78 -129
417a29p6J62P6j94J77Q5j78j67K59k73q6L41N5K5k06M8j63K20j05j01J90l0N6
$$ -129 -205 -43 33 -161 16 101 -77 -244 15 -258 -344 -3 52 77 -129 -81 -244 -24 -129 -230 -40 -70 -14
440a4j4j65J0L62k79o7J74j79L2J2K75k22J80l84J49J57Q1j43J82j35m7m2J15
$$ -14 -28 -193 -183 179 -100 -167 7 -172 -140 -128 147 -75 105 -279 -130 27 108 -35 147 12 -35 -77 38
463C8J39n67K76K88j10k10K98k42L3L4j39L4l3o5K89L5n2K3j12p7MK86j31O6J08
$$ 38 177 -390 -114 174 64 -146 152 -90 -57 -23 -162 -128 -161 -226 63 98 46 69 -43 -120 -116 170 39 105 213
488B13j23n9j14j7R4J56k19j56K79p2k7p0K40K1kk23j5l3J63j26l1j21J68K35
$$ 213 90 31 -83 -100 -6 150 -69 -225 54 -18 -45 -115 125 146 144 -79 -94 -127 36 -90 -121 -242 -74 161
512A61l51Q4p4N4M18j15o3K9j65M2k75J15J2q7M2o7O4J89J34j51m2J29q4n38M35
$$ 161 -190 -106 -180 -126 292 177 114 143 -22 20 -255 -140 -128 -215 -173 -240 -176 13 147 -4 -46 83 -1 -539 -104
537a04J18M7R4P8j58j23L0j2q2M8lJ5J7K13l63J94J66l46K30l4k37J20K14j13
$$ -104 14 61 155 233 75 -48 -18 -30 -112 -64 -67 -52 -35 178 -185 9 175 -171 59 25 -212 -92 122 9
561Ik65J16L62k85J50j52j53K50r9K48j03k79J38J12o1Q0M1j38o0J69n1j78j11
$$ 9 -256 -140 222 -63 87 -65 -218 32 -67 181 78 -201 -63 49 -12 68 109 -29 -89 80 29 -149 -260
584b60J79K46k20j9j49L50k4K04k15J31m28N1j1J66l15M03k02K28Q0m69N45k27
$$ -260 -81 165 -55 -74 -223 127 103 307 92 223 -205 -154 -165 1 -314 89 -113 115 195 -274 271 44
606D4l00J32Q4q2L07k62K88l83J99o3N3J72o9J7j5N7l6N5M3j29k4j04J91k85K57
$$ 44 -256 -124 -40 -122 185 -77 211 -172 27 -36 17 189 120 137 122 179 143 198 241 112 88 -16 175 -110 147
631A47J0k36r8M09l54N0K1J29J9P0K6n7j63n5Qk13L73j85m5K59m5j39K22k99J25
$$ 147 157 -79 -177 232 -122 -72 -51 78 97 167 193 136 -27 -82 -74 -287 86 -99 -144 115 70 -69 153 -146 -21
656b1j31R7J57m7l2Q0k10K12o7j34j1Mj0J68k1O0l75J27J56m3M1l88K15O0k9J37
$$ -21 -152 -55 102 55 23 103 -107 105 38 -96 -107 -103 -113 55 34 94 -281 -154 2 -41 0 -388 -173 -113 -142 -5
682ej0j87L37Lk48L26K0k45l39M15K8j08k21m6L28j60j39K08j36P1l1K4J61j95
$$ -5 -15 -202 135 138 -110 216 236 -9 -348 67 95 -13 -234 -280 48 -112 -251 -43 -179 -108 -139 -115 46 -149
706a49K88k37J38%J8j76K79l53L40r0k85J92K17l30K81q3k07l9J50Pj18K42M9
$$ -149 139 -98 40 40 58 -118 161 -192 148 58 -227 -35 182 -148 133 50 -157 -196 -46 -39 -157 85 134
729A34m8oj62J01L39o73K88j48J31j00J96J95k57L02l61K70r4k70J39j28L04j16
$$ 134 86 80 -82 19 358 -315 -27 -175 -44 -144 52 247 -10 292 -69 201 107 -163 -24 -152 152 36
751C6k24L27n8r3K09m42J77J99m59L20k7K9R7P0L7j41k77J64o4J09K28j5k69K81
$$ 36 -188 139 81 -12 197 -245 -68 131 -328 -8 -35 -6 91 161 198 57 -220 -56 -120 -11 217 202 -67 214
775B14k46Q8l42J30K7R6K8Q7K8j24j03m3R7ln8L1J75j51L24k49J53j15p8pQ1J25
$$ 214 -32 56 -286 -156 -129 -33 -5 82 110 -14 -117 -160 -63 -66 -124 -93 82 -69 255 6 159 44 -34 -41 40 165
801A65k57j73L36l17L38k15Q9r8J51J67J28m49K02m7P5k29L78j83J7j27Q9J20
$$ 165 -92 -265 71 -246 92 -123 -34 -132 19 186 314 -135 67 20 95 -134 244 61 78 -49 40 160
823A60j74J79k16j31J03J68r9j13P6j00K30j34Q5K06r2k67p8M32k50l0j64K58
$$ 160 -14 165 -51 -182 -79 89 -10 -123 -47 -147 83 -51 34 240 148 -119 -197 235 -15 -45 -209 49
845D9N1j99j45K13J64k02N9J92R2j62K11l41kP8j36l3j42L06J85l24p5k7L76l51
$$ 49 100 -99 -244 -31 133 -69 -10 182 274 112 323 -18 -20 58 -78 -111 -253 53 238 -86 -161 -188 188 -163
869a63n2J01P6J24n0p1K7K12j16O6k21J22j89Q6J05J98l16K6P3j2j46q6K20j82
$$ -163 -215 -114 -38 86 36 -35 -8 204 88 154 -67 55 -134 -48 57 255 -61 -35 38 26 -120 -206 14 -168
893a68J85J89j58K9M5k68j2O4r0K73M0l22L84j80j26J11K78l28r7J08R2pq0J5
$$ -168 17 206 48 77 122 -146 -158 -94 -184 89 129 -193 191 11 -115 -4 274 -54 -151 -43 49 42 -38 -23
917b3N7o6m3R6J18m9r6M5j90N9k27J39K82J11j16o2j41J64j29l8J21l7R6K29k73
$$ -23 34 -32 -75 21 139 90 -6 39 -151 -92 -319 -180 102 213 97 35 -106 58 -71 -109 12 -25 71 300 27
942B7j25J01l4K06l53O0J98k05N5M4kL8k22K95kK71j94j62J43l25J82R7j92K45
$$ 27 -98 3 -31 175 -178 -118 80 -125 -70 -26 -28 10 -212 83 81 352 158 -4 139 -186 -4 93 -99 146
966A46j96K54l88n3K98R2l06L49k89M70m21J53l36Q0J76K8l0k96J84J86J10k24
$$ 146 -50 204 -184 -237 61 153 -153 196 -93 377 -44 109 -227 -147 29 57 27 -269 -85 101 211 -13
988a3k99L42L7l08J11j46J63K94k35L4OJ09l79K60K33o6k4k8k19J03r1R0P2P5
$$ -13 -312 30 67 -241 -130 -276 -113 181 -54 -20 -14 95 -284 -24 209 143 119 91 -128 -25 -116 -26 46 121
1012A21j14j18J31nl10K87J21j75J46l65L37k28O6k10M21p0K03l11L02j73j06
$$ 121 7 -111 20 15 -295 -8 113 -62 84 -281 56 -172 -106 -316 105 35 238 -73 229 56 -50
1033e0l5k31J89J36p7K38j78l8K8M9k4K26j89J9R3l40K10n3j39K60O8m42J19M8
$$ -50 -85 -316 -127 9 -68 170 -8 -46 -18 31 7 233 44 63 156 -184 26 -27 -166 94 162 -280 -161 -113
1057a13K02j12Q0J32k77K70p6j31R5m86N51M1j24R7j18M8j5l26K55J69k06LP1
$$ -113 89 -23 57 189 -88 182 106 -25 70 -416 135 176 52 149 31 79 64 -262 -7 162 -44 -41 30
1080C0o4r5O4L66l27M05j96k38J48j11N0k08K54Q3k49J19p2L4j28M42l27k1J57
$$ 30 -34 -129 -65 301 -26 379 183 -55 93 -18 32 -176 78 161 -88 31 -41 -7 -135 307 -20 -41 116
1103A16l48J23N9K89p0j13j24J45j28K41K1l86mJ22K99k29lP2m47K16j3L33p9
$$ 116 -232 -109 -50 239 169 56 -68 77 -51 190 211 -175 -179 -57 242 13 10 82 -365 -149 -162 171 92
1126I2P0k67Q3N1j19J74Q5r7j79P8j3l7o1L19k21K22l54K51l97M51j03J14J44
$$ 92 162 -105 -22 29 -90 84 169 72 -107 -29 -42 -79 -140 179 -42 180 -174 77 -320 131 28 142 286
1149B86m43J75k3P3J0qlj91m7l3J35j70K77J60k74j1P5J65J7k81K23j24n5K7J53
$$ 286 -157 18 -5 68 78 70 67 -124 -171 -204 -69 -239 38 198 -76 -87 -12 153 170 -111 112 -12 -67 -40 113
1174A13k08pJ12k85J93K45j43J6N8n4j49L16L9k79J48k88M44m19J82j48O6R0j64
$$ 113 -95 -102 10 -275 -82 163 20 36 94 40 -109 207 246 -33 115 -173 271 -148 34 -114 -48 42 -122
1197a22P3J7j78J66M6O3r0j60L01k8K0q2j33k0K48l6j75K92j12j8j69K73k10J32
$$ -122 -49 -32 -210 -44 2 65 -25 -185 116 88 108 26 -107 -127 121 85 -90 202 90 72 -97 176 -34 98
1221I8q2n6M2j32M0m6J79p5Q4R1J6j54l11M29m32J59K91j94N7q7K42l10J74j71
$$ 98 16 -40 2 -130 -90 -136 43 -32 52 143 159 5 -306 123 -309 -150 141 -53 4 -83 159 -151 23 -148
1245a48J17o0jN2nK51l13l6J93J14l21J39q8L4J15K41m81K33R8q9k49K66pN9k06
$$ -148 -31 -91 -92 -40 -45 206 -107 -143 50 164 -157 -18 -106 -72 43 284 -197 36 134 45 -204 62 55 114 -92
1270i2J73k9k57K96L4j3j3l82L51J62l47jR4K34k94j69J63L16j64k29K36q5q3
$$ -92 81 52 -205 91 125 112 99 -283 68 230 -117 -118 -24 210 -84 -253 -90 226 62 -167 69 -16 -99
1293i9J75O9o9P5k08Mj3J16k43K81r9oJ28k92L20j27N9k06L82l75K03j5K7j39
$$ -99 76 145 76 151 -57 -53 -66 50 -193 88 -11 -17 111 -181 139 12 71 -135 247 -128 75 60 87 -52
1317e2N5O4O7j36p7L17j77O0k16l0L07m40L15q7j73K32j11P6r4J72m01L81J1j32
$$ -52 3 67 134 -2 -79 238 61 121 -95 -125 182 -258 57 -30 -203 29 -82 -6 -100 72 -329 52 63 -69
1341f9Q3j7J77m2p3K38n60L28k54lN7L40j81j11j44L95j36K54j79m6%p6o2j78
$$ -69 14 -3 174 132 59 297 -263 65 -189 -192 -135 205 24 -87 -231 164 28 282 103 57 57 -19 -81 -259
1365b59L74j86k0J93j3J5m3j6J05j53j13J66k19K67O7k5k84J76R9K24m97j3K41
$$ -259 115 -71 -91 102 89 104 61 45 150 -3 -116 50 -169 98 165 140 -144 32 131 355 -142 -155 86
1388H6J42l13O0q0k29K81n0K09o2M1L6k70K10P6j80Q9l1j6k60L32j50J60l07K74
$$ 86 228 -85 -25 -105 -334 -53 -103 106 44 85 121 -149 61 137 -43 46 15 -1 -261 71 -79 81 -226 48
1412D8J9p8JJ18j32K49l42L4J28j02LR9j55R3n8k7K09o8j11Oj56J91j06p2K05
$$ 48 67 -11 -10 108 -24 225 -117 -83 45 -57 -54 45 -110 -17 -75 -102 107 39 -72 -66 -222 -31 -137 -209 -4
1437dP7j38j07K63j83K9J6K81l61J87j87j1K06l3p9K02j25J26j81J37j06k60J32
$$ -4 73 -65 -172 91 -92 -63 -47 234 -127 60 -127 -138 68 35 -44 158 33 159 -22 115 9 -251 -119
1460a19J77L0n7m2r3M3R6k20J64j0pK14j19k52K63k21J81l7j74J02R6k00L25L
$$ -119 58 88 31 -11 -104 -61 35 -185 -21 -31 -38 176 57 -195 68 -153 28 -9 -183 -81 15 -185 140 143
1484A43J38k81OQ5J62k79J22j83N9K9j09J17L7Kj08j29Q3J3K25J11l62J65l99
$$ 143 281 0 6 91 253 -26 96 -87 -28 1 -108 9 46 48 -60 -189 -106 -93 132 243 -119 46 -353
1507c53L30J8J04j05j55J05J52Rk4l41L07J40k03o9J27J1j86n4L67r0KMk09P5
$$ -353 -23 -5 99 -6 -161 -56 96 105 81 -260 47 187 -16 -85 42 53 -133 -187 180 90 92 96 -113 -38
1531c8P6J97k66R7j21M10k32k6j8r3R3k68K2L16P6k42k31L3K55Jj12n9J00J07
$$ -38 38 235 -31 66 -55 355 123 97 79 -14 79 -189 -167 149 225 -17 -248 -215 40 41 -71 -130 -30 77
1555G7L51k17m9j57k88M71k90kJ42N1k70M68m01JO0J50K5J6n4j30K26m9k62K76
$$ 77 428 211 162 5 -283 188 -102 -104 38 89 -181 287 -114 -113 -53 97 122 138 84 -46 180 131 -131 145
1579A45Qj1l03J31k4L05k09j39J85K0j68Q3J63l68M16j95J07l24P8K14J97j91
$$ 145 153 142 -161 -30 -54 251 42 -97 88 108 -60 23 186 -182 234 39 146 -178 -100 114 311 120
1601A20j71QP8l91J31P9J25J51Q8j89Qj97J95K94m19j8K89l32K92Oo1R6j57j3
$$ 120 -51 -43 35 -356 -225 -146 -21 130 218 29 37 -160 35 329 -90 -108 181 -151 141 147 86 182 25 12
1625A2J11p1k53N5m2K54J07j30Q6j47J39j16O8j98J84j15J63j78K07k09j54K52
$$ 12 123 52 -201 -146 -188 66 173 43 129 -18 121 5 73 -125 59 -56 107 -71 136 -73 -227 25
1647B5J6k0l50J51J56K60k45K1n8j07oK21R9k46L07p5Nl63j84M22n0J0J41kl67
$$ 25 41 21 -329 -178 -22 238 -7 14 -44 -151 -157 64 163 -83 224 149 154 -209 -393 29 -21 -11 130 128 -239
1672b39J08J02r2o7K40%k55K93k80J91J0jJ08j71N3n4J1J06j31j86L34n2j89P3
$$ -239 -131 -29 -121 -188 52 52 -203 90 -190 1 11 10 118 -53 0 -54 -43 63 -68 -254 80 28 -161 -88
1696h8P2K08p6k49L01j28P2j12R5j41m1J11k4M5j21j74R1K13p1K66l69L29k07
$$ -88 -16 192 116 -133 168 40 112 0 95 -46 -87 24 0 45 -76 -250 -159 54 -17 249 -120 209 2
1719BP7l5O2k19J08L18l21J31q9N6k3k7K0m0L2lJ90l46k9L02j25j69J72m9Lp5
$$ 2 79 44 106 -113 -5 313 -8 123 34 90 67 40 60 20 52 49 239 -107 -136 166 41 -128 44 -5 -2 -77
1745g7j70K61r7j79K87n7R1k5j55Q5k37J56K16Jj20L52k86k48K68r7k60M00R1
$$ -77 -247 14 -83 -262 25 -32 59 34 -121 -36 -273 -117 99 100 -20 332 46 -202 66 -31 -291 109 200
1768B00k02j21J24J14k14O9JK88l65L8j5O8k41O43l42j01l2oK67j34n5R9r0J62
$$ 200 -2 -123 1 115 -99 -30 -29 259 -106 -68 -83 -15 -256 387 45 -56 -88 -94 173 39 -16 83 -7 155
1792A55m8K19l79k41N47n09J61J01j77o5M03P4ol17J68k87J51K8j39J69%j17O3
$$ 155 107 326 -53 -294 253 -256 -95 6 -171 -236 167 241 235 -82 86 -201 -50 -22 -161 8 8 -109 -46
1815d6O0J02p1j82R6n1j29j36M05J75r1k65Q5O7j53J75K1K3n5m1J16n7J36k38
$$ -46 14 116 45 -137 -41 -92 -221 -357 48 223 132 -133 -48 19 -134 41 62 85 30 -11 105 48 184 -54
1839e4K80m0k28J06K0j31L86m39J22J47m9k76K84r6J31k80J55l7J2j09Q9j09K0
$$ -54 226 186 -42 64 84 -47 339 -100 22 169 120 -156 128 32 163 -117 38 1 13 -96 -7 -116 -96
1862i6J16j97K11j04J8K20l18K78j68Q3Q1O3j47q8k71L45k28J35J96r1k69L59
$$ -96 20 -177 34 -70 -52 168 -150 128 -40 43 124 187 40 -48 -319 26 -202 -67 129 38 -231 128
1884A28j89m9J08l70M10k26L36n4j15l41L26o8P6P2q5O8j5L1k09P2%J11j22K23
$$ 128 -61 -110 -2 -372 38 -188 148 94 -21 -362 -36 -104 -28 44 -41 27 12 43 -166 -94 -94 17 -105 118
1908A18j33q2M3K08k5R5k78J4j3j88J19m8K32Rj49j02J49J9k1J78Ql06K83N0j35
$$ 118 -15 -97 -54 154 129 224 -54 -40 -53 -241 -122 -170 62 71 -78 -180 -31 -12 -33 145 153 -153 130 180 45
1933D5m6K51j53j42m7J03j38J49k61J40N2M8l0k7J64l02L54j15m1L5J39q6k11
$$ 45 -1 250 97 -45 -92 11 -127 22 -239 -99 -47 1 -29 -56 108 -194 160 45 4 39 178 92 -119
1956a19J13j10M2Q0l1K6J9k2p2J74Q8j6j45N8K3Q7k9j49j9r2K6o1J03j73J02J1
$$ -119 -6 -116 -74 6 -25 1 20 -2 -74 100 188 172 27 85 108 195 166 17 -2 -94 -68 -129 -26 -199 -97 -86
1982h6r4K92j86J17Q1l31K50j23k92J60K92p7K04k99J65M1k11l0J94Q3j27J08
$$ -86 -180 112 -74 43 124 -207 43 -80 -372 -212 80 3 207 -92 73 114 -97 -127 67 150 23 131
2004A31j36p5j08l5L03j25j21J80k05K72k03j11L46J17j44Ko2M4j75jo2L77j0
$$ 131 -5 -80 -188 -223 80 -45 -166 14 -191 81 -122 -233 113 230 86 88 26 70 -105 -106 -168 209 199
2027A99j21k37K49K0l28K12q2P8j26J23n8K18j75J76k25K69Q4M2k12M7l12L10
$$ 199 78 -159 90 110 -218 -6 -88 -10 -136 -13 -71 147 -28 148 -77 192 276 318 106 153 -159 151
2049A51p8J07j76O6n9J21R5m60K4Q8L63k25J06j51Q5n6m8Kk6k44L26o2j28O8l4
$$ 151 73 180 4 70 11 132 227 -233 -209 -121 242 17 123 -28 57 1 -47 -45 -71 -315 11 -51 -179 -111 -145
2074a45k2K2L2L04j7j24j04p4K55J09m55K8L22J86n05K41O6k05J42k75M34l36
$$ -145 -167 -145 -113 191 174 50 -54 -128 127 236 -219 -191 131 317 -188 53 119 -86 56 -219 215 -121
2096a21r9L77r3r8M2o4j74K04k42K85J16l54M81o7%J70l07j12k2j8q7K37L4k85
$$ -121 -220 157 64 -34 8 -56 -230 -26 -268 17 133 -221 260 193 193 363 56 -56 -78 -96 -183 54 88 -197
2120a97J02L85j90j07k4q3n2J49l6J83j81J00o3m1M34j05j86k07L80l28P9j38
$$ -197 -95 290 100 -7 -31 -114 -166 -17 -53 130 -51 49 -14 -55 379 274 88 -119 261 -67 12 -126
2142a26l8N1J86p0J6m41L10j13J31J50j26k35L23K19k7l7L4j95n3l6K7P9J70l5
$$ -126 -164 -113 73 3 19 -422 -112 -225 -94 56 -70 -305 18 237 210 173 207 12 -41 -77 -50 29 199 164
2166A64l42K66J07l58J54r3J92p2J2k5L37k14q0K48k11l83K45L57l23m8L3K05
$$ 164 -178 88 195 -163 -9 -102 90 18 30 5 342 128 48 296 85 -298 -53 304 -19 -67 -34 171
2188A71j66j86M22l42J58J06j23j44J74K47k89p5r2l6J42k11L79k98J79l32L31
$$ 171 5 -181 241 -101 57 163 40 -104 70 317 28 -47 -139 -175 -33 -244 135 -163 16 -316 15
2209A5qk1n1O2pj28N36o28K31J8j12J58k31K38j40K50j18k57qQ4j9K07n0N3n3
$$ 15 7 -14 -65 -3 -10 -138 398 -230 1 19 -93 65 -166 72 -68 182 64 -193 -201 -117 -136 71 21 74 21
2234B1j56%J71O5P5j74L20l46j80L21l31J89R6j97J27ON8m6N5j32M7j34K30j13
$$ 21 -135 -135 36 101 176 2 322 -24 -204 117 -214 -25 71 -126 1 7 65 19 74 -58 -11 -145 85 -28
2258b8j43K96po6l06R4k0L7j04K42q5M07m17J8k4k8q7K06J00k21L32o4J0p1j57
$$ -28 -171 125 118 52 -254 -160 -180 -143 -247 -5 -90 317 -100 -82 -106 -134 -221 -15 85 -136 196 132 142 71 -86
2283h6R3q5j09K17M3k65L57j22k4k6Jj1j87J92J54n3K01l63Q0J29l17J94L2j79
$$ -86 7 -78 -187 30 73 -192 165 43 19 -7 -6 -17 -204 -12 142 89 290 -73 7 136 -181 13 45 -134
2307a34J45P5k30K21m5n1J44p6J42j49r1k0P0j29M7K37j65n6j08L44J6m19J27
$$ -134 11 86 -144 77 32 -19 125 49 191 42 -49 -69 1 -128 -81 156 -9 -65 -173 171 187 -232 -105
2330a05L21l00K83l49P0J39k68k7M87m27K86%q1M0r3m3k42Q4K85j8N2Mj67J42
$$ -105 216 -84 199 -150 -80 59 -209 -236 251 -176 110 110 29 69 -24 -67 -309 -225 60 42 94 98 -69 73
2354G3j52k94K29JJ50O6j27J14P5k68K64j90K81l30O4J03n2J26k79l9K70o9R1
$$ 73 -79 -373 -144 -143 7 73 -54 60 135 -133 131 -59 222 -108 -44 59 7 133 -146 -185 85 16 107
2377A07j54K0K60n69L75JJ22j04oR0j61m5J37k53J04k06J74J99J65m41J35K2j48
$$ 107 -47 -27 233 -336 39 40 162 58 52 142 -19 -64 73 -180 -76 -282 -108 91 256 -185 -50 -28 -176
2400a76L37j89J78l40K39K0j67k5j25R6J02R9j81J89K7j1J21k56j1J64j03Q0r6
$$ -176 161 -28 150 -190 49 69 -98 -123 -248 -152 -50 49 -132 57 84 73 194 -62 -73 91 -12 68 -28
2423b8O3J8K56r5j95j09q1L64k03J62k34K83j37k45L34j41j51K9K37Kk43J35q4
$$ -28 35 53 309 214 19 -90 -171 193 -10 152 -82 201 64 -181 153 12 -139 -110 127 129 -114 21 -63
2446f3lJ74P4k73R2k1J25p0j08J80k1J29j6j77p0J30k11J6K26j43k41L29k13J15
$$ -63 -66 108 182 -91 1 -20 105 35 -73 107 86 215 199 22 -48 82 -129 -113 113 -30 -271 58 -155 -40
2470d0J94j60J52P2Q0l00J4OK8J0j33m5J6J55kj09K33l49N0J30j08K29p7k7o6
$$ -40 154 -6 146 218 298 -2 12 18 46 56 -77 -122 -106 49 47 -62 171 -178 -128 2 -106 123 46 19 -47
2495d7m0j67L50M2j03N0M7k52J74j52K28n6j52J23l99K93L3mJ74k59K67k38j0
$$ -47 -87 -254 96 138 35 85 132 -120 54 -98 130 74 -78 45 -354 -61 -28 -32 142 -117 150 -88 -98
2518i8K84k19j91L47l29L27r8mr2MK67l59K37k31r0M03l4j40j28p4J13K5Q3J75
$$ -98 186 -33 -224 123 -206 121 23 19 -73 -69 198 -161 76 -155 -245 158 124 -16 -144 -218 -105 -80 3 178
2542A78r6q3q6J12J39Mk09o5m1O9j48J73K23l02j06J10J29K56k04k10J88M7n6
$$ 178 82 -1 -87 25 164 168 -41 -106 -147 -78 -226 -53 170 -132 -238 -128 1 257 53 -157 31 78 22
2565B2J32R9Jj53j18J31k42j22M07j14J45j99k24K50K99P4m34J9rr7R6l9L0J64
$$ 22 154 253 254 101 -17 114 -128 -250 157 43 188 -11 -235 15 314 388 -46 -27 -36 -133 -37 -76 -46 118
2589A18k90K95j10k30M41j88j7L6j57K18j47K41l65Q9P4K43k64j55K87k20Q6K6
$$ 118 -172 123 13 -217 224 36 19 55 -102 116 -31 210 -155 -66 8 251 -13 -168 119 -101 -15 11
2611A1n5J34j61n3J80j35j2J59Q1K04n23J48j51O0J63j36J16j19P1j97P9k19L78
$$ 11 -44 90 -71 -124 56 -79 -91 68 149 353 -170 -22 -173 -113 50 -86 30 -89 -18 -215 -136 -355 23
2634B3l26K48N5J64k17J36j78j27M2P5r0L18lM3j86j94J67J7K55k80L1K59l77
$$ 23 -303 -55 0 164 -53 83 -95 -222 -180 -105 -195 123 120 163 -23 -217 -50 -33 222 -58 -27 232 -145
2657a45R5j12M96l43J70l43J62JJ30j57J43J53n18K56n1K7K3j87k5M18k67j6K61
$$ -145 -50 -162 334 -9 161 -182 -20 -19 111 -46 97 250 -268 -12 -63 -36 -13 -200 -225 193 -74 -90 171
2680A71k60j29L35P6k19K03l71K50n1l82L19P3l4M7o2K09m20J79J66k88J8K97
$$ 171 -89 -218 117 193 -26 177 -194 56 5 -377 -58 15 -19 28 -34 175 -245 -66 100 -188 -170 127
2702A27k77k04L94L4k4k6K4j11P9k3j0pQ4J96j30%j40p1K4K35k15K61r0l2k28
$$ 127 -150 -354 40 74 50 24 48 -63 16 -7 -17 -24 60 256 126 126 -14 -85 -61 174 -41 220 130 98 -130
2727a30L03j49j14J86k06J33P8k02J72m0o7K02l19J47p7p2M37p3j50K6j67K75
$$ -130 173 24 -90 96 -110 23 101 -101 71 31 -36 166 -153 -6 -83 -155 282 209 59 85 -82 193
2749A93n17M00l56O8J49J45K7L3k97J26N9k01K28q8Q0j4K02k93m0L0J8m3J80J00
$$ 193 -324 76 -280 -212 -63 82 109 142 -155 -29 30 -171 57 -31 49 35 237 -56 -96 -66 -48 -91 89 189
2773A89l87K37O2P1k3k93p5J9K50j15oJ45l9O5P1l09K19m1p4j5p4N3k05L49qq8
$$ 189 -198 39 101 172 149 -144 -219 -200 50 -65 -71 74 35 100 171 -138 81 40 -34 -49 -123 -70 -275 74 66 -22
2799b2K96k44K8Mo7l8p3r3P1J1J15n5N8n1j08J23N9q7r8J17M8r2Q7J26l05P4j01
$$ -22 274 30 58 62 -5 -43 -116 -209 -138 -127 -12 -67 -9 -60 -168 -45 14 -73 -171 -54 -6 -98 -11 115 -190 -116 -217
2826b17MK30m5P5K28l24j03L35j18q9j47K15k13L03R4j93j80M6J60K8j81R8n3
$$ -217 -213 17 -28 47 275 -49 -152 183 65 -24 -171 44 -169 134 228 35 -145 -99 61 89 -92 6 -47
2849d7p9K21k30N8K3J17L2k99L32l35L44j14r9L57m10M29k85M3J72k62J99k93
$$ -47 -126 95 -135 -77 -54 63 95 -204 128 -207 137 23 -76 281 -129 300 15 58 230 -32 167 -126
2871a26J9j66K84J67p1j54j60J87j18J90N1j21n3L09l71J30J73j92M8J81k14r
$$ -126 -107 -273 11 178 107 -47 -207 -20 -138 52 103 -18 -71 238 -133 -3 170 -22 26 207 -7 -16
2893a6J18m8k50L13k33L31n72L82O4j73L0K43l98P3K18L5R7j97L0O7j65N6K4M6
$$ -16 102 54 -196 117 -116 215 -357 25 89 -84 -54 189 -209 -136 82 117 214 17 47 114 -51 5 29 75
2917G5j13p5j2K57o9J9k89J48J16o5J65l67Q9M19k80j84K46l76M14l10K78j77
$$ 75 -38 -113 -125 132 63 82 -207 -59 57 -8 157 -210 -121 298 18 -166 80 -296 118 -192 86 -91
2939i1M6J19l1NJ16K1j40q4L9k7q1j1O9M2nj12K09j4j83k2L03l85K29q0k19L51
$$ -91 -45 74 43 48 164 185 45 -39 0 -27 -108 -119 -50 -8 -13 -125 84 70 -113 -135 168 -217 12 -68 -287 64
2965F4j22M9K11o3j06J8N3o8q8L50k99j69J74K89m62K9J41R5m7M0j03k01M7J69
$$ 64 -58 -9 202 139 33 51 104 36 -52 298 -1 -170 4 293 -169 -140 1 96 49 89 -14 -215 -168 1
2989AM8J49j43p8n7R5O0k07K59j27K50k35M5j11K19l14K29j12l3p2K19M6k50L13
$$ 1 49 198 55 -23 -80 15 75 -132 127 0 250 15 60 -51 168 -146 83 -29 -62 -134 85 131 -119 194
3013A94n9k8j51OJ41j50o6k61K35p8r7R2J59J89J6l07K74m1k62L48k18J46j23
$$ 194 135 107 -44 -38 103 -47 -113 -374 -139 -217 -314 -222 -63 126 142 -165 109 68 -194 154 -64 82 -41
3036d1J32K3k82K40r7K90m6l36K4L05m6j92J83Q7k24l04K93J46k52Q7J62j14N9
$$ -41 91 114 -168 72 -25 265 219 -117 -93 212 166 -26 157 244 20 -284 9 155 -97 -10 152 38 97
3059I7j88J64l5o0J93k68J47N4k00J06o0M2J17k61K16kQ8k20J58l40L75k9r4J06
$$ 97 -91 73 38 -22 171 -97 50 104 -96 10 -50 -8 109 -152 64 62 150 -70 88 -252 123 94 0 106
3083A06q9J52k5r4K1j18J03j61R7p7j16L84p6O7k17L1J33j04PJ88r2k68jP7k37
$$ 106 17 169 144 50 71 -47 56 -105 -8 -85 -201 183 107 174 -43 -12 121 17 24 212 120 -148 -149 -72 -309
3108c09N04M4J20n57L09k38J4L8j21O7K65k08J55j16L19j44j73K74j3j46p5j06
$$ -309 195 239 359 -198 111 -127 -113 -75 -196 -129 136 -72 83 -33 286 142 -31 243 230 84 9 -97
3130i7J34o9Q3K45k78j20J55J2k17J03q9K03m15M09qj30p9J86J24l03J40N7Mj1
$$ -97 37 -32 51 296 18 -102 53 65 -152 -49 -138 65 -350 59 51 -79 -158 28 152 -151 -11 46 50 39
3154C9j00m8R2n2lK12n31L39k8M3L33l08m7l5j76K23J75j41J41j32j0r4L3J12
$$ 39 -61 -109 -17 -69 -72 140 -391 -52 -80 -37 296 -12 -59 -94 -270 -47 128 -13 128 -4 -14 -108 -75 37
3178C7L9k30J34J20O9j32k81J38K99k82j2J05J28j57J24r4K83k16J83l02P9j68
$$ 37 76 -154 -20 100 169 37 -244 -106 193 -89 -101 4 132 -25 99 5 288 72 255 -47 32 -136
3200a36J3J03J99j79j35J79j48J50N7k31j4R2L9K12k71n5J70j22L59q6k71m3J45
$$ -136 -123 -20 179 0 -135 44 -104 46 103 -128 -142 -50 -11 201 -70 -125 45 -77 282 196 -75 -118 27
3223B7J25j06k53J58J61m4k01J91K5%n5J89j07q1Q2j07l9k26K71jR5k0j09j06
$$ 27 152 46 -207 -49 112 68 -133 58 83 83 28 217 110 29 111 4 -35 -261 10 9 104 84 -25 -131
3247a31O3J16p5j34L87n40K89K40j48r0J56k63J21j18J67k65J50K16l28N8L04
$$ -131 -68 48 -27 -161 226 -314 -25 215 67 -23 133 -130 -9 -127 40 -225 -75 141 -187 -129 175
3268A75m7k47J24Q2j11J5J60j10l08K17j7K98q0j01O3l4j95M4k76K19n1J54p7
$$ 175 128 -119 5 87 -24 -9 151 41 -267 -50 -67 231 151 50 113 79 -116 -72 -348 -129 -180 -26 -103
3291a03L02j45j48J26N5k38J73J76j89L3j11j28J19j05K21M0j50K00m6j92Q3o3
$$ -103 199 54 -94 32 87 -151 22 198 9 42 -69 -197 -78 -183 38 78 -72 128 82 -110 -27 -90
3313i0J0nK90j66J16l0m7m9J12k42J56j30J27l28R5K37j92O7J16k3n53N68jK37
$$ -90 -80 -85 205 39 155 125 78 29 141 -101 55 -75 52 -276 -181 56 -136 -69 47 24 -529 39 38 275
3337B75l57Q2j49L36m1j15RO1l06L27q4K1j5J4J23q7m2m5J02N3M1k76J89j55k5
$$ 275 -82 0 -149 187 146 31 40 101 -205 122 38 59 44 58 181 94 52 7 109 162 203 -73 116 -39 -64
3362f4M06l08j27J57n1L3J1k9J46n8j38J76j34R4l33J32J0k0L37k34o6L1J12j46
$$ -64 342 34 -93 64 13 46 57 28 174 116 -22 154 20 114 -219 -87 -77 -97 240 6 -60 -29 83 -63
3386f3J41K4K16m92J36r8R5L43j06k23p5O9L9j0q9q3K29J24l40J58j03Q9K03k24
$$ -63 78 102 318 -174 -38 -136 -41 302 196 -27 -102 -33 6 -4 -93 -176 53 177 -163 -5 -108 -19 184 -40
3410d0K14k95J68j11J37j95K54j32Lj17K59k01l7J39%j84J41J89q2P8R7k44j44
$$ -40 174 -121 47 -64 73 -122 132 0 3 -114 145 -56 -93 46 46 -138 3 192 110 188 285 41 -103
3433a03O0j62L89M9l10J1j42L02k71K4j29M20k39K14m9j61K11m17M20l18K53j83
$$ -103 -43 -205 184 233 -77 -66 -208 94 -177 -153 -282 138 -101 113 64 -97 114 -303 117 -201 52 -131
3455a31L91j53k06JJ72j60L47k74K28o6k25J11K71l43j04P8M6n1J59qk39K00o7
$$ -131 260 107 -99 -98 74 -86 261 -13 215 149 -76 35 306 -37 -141 -63 -17 -68 91 83 -156 44 -23
3478b3K17k60o9K05l13L93r6qj16J72j05n1r7K10q7j67K5J41J88l7j29o7o1J10
$$ -23 194 -66 -135 70 -243 150 54 46 -70 102 -3 -54 -151 59 -28 -195 -170 -29 159 122 -7 -74 -135 -25
3502b5J70M5l49K00Mj59J46Qk03K93q4k03K0J6L7J72oj68K30J16J11k49r4P0k8
$$ -25 145 190 -159 41 45 -114 32 40 -163 130 46 -157 -137 -121 -84 88 82 -86 144 260 371 122 28 98 70
3527G0m10O34m32P8L11l48N0j11K55l35R3J4J16J97J7l49L47j91k10l3J88J17
$$ 70 -340 294 -138 -60 251 -97 -47 -158 97 -238 -145 -131 -15 182 199 -150 197 6 -204 -237 -49 68
3549F8k87K14m2Q9k8j39J74j70J49j0k73L99j71m0N9rq8K61j23L7L1j69J03n3
$$ 68 -219 -5 -47 42 14 -125 49 -121 28 18 -255 144 -27 -67 -8 -17 -105 156 33 70 101 -68 35 -18
3573a8N8k44K89k6j68J07r5K36m6j87j9j16L37N3k4j67N5j2J67p6k75L49j87R7
$$ -18 40 -204 85 59 -109 -2 -97 139 93 -94 -113 -229 108 161 137 -30 25 13 180 104 -171 178 -9 88
3597H8L3L4l93K97k9j5K32l83Q0r9J95j28m9J94j24K32m50M60l7j57k04N54j92
$$ 88 121 155 -238 59 30 15 247 -136 -56 -155 40 -88 -137 57 -67 165 -285 175 138 -19 -223 331 139
3620A39j79j90R4R5N4j61K5K64k95K27l13K92j28J9M2J57j69q5J82q0k12K35k8
$$ 139 -40 -230 -136 -41 13 -148 -123 141 -154 73 -240 52 -76 -57 -15 142 -27 -112 70 -10 -222 13 -15
3643a5P9j2R5M3r0m9J11j41j62J83j83N6J64J09m21J86K74j92j46p4K79m50K40
$$ -15 64 52 147 190 100 51 162 21 -141 42 -141 -85 79 188 -233 -47 227 35 -111 -185 94 -356 -116
3666a16J60n7J4k91L48llL6k57K88k47L73j22m3l18N28l93K1o4j56N88l9l32O3
$$ -116 44 -13 1 -290 58 55 52 88 -169 119 -128 245 123 80 -238 290 -103 -82 -146 -302 286 247 -85 -22
3690b2J5p2%Q8l1J17O8k73K62o3l20J31J01J6k37K70O5p2K01j75l50J44K63K1
$$ -22 -7 -79 -79 9 -22 95 163 -110 152 89 -231 -100 1 17 -220 50 115 43 244 69 -281 -137 126 147
3714A47k75L33k28M5k61J79N4J82j81J23r3l46Q8K01L7PN2R7K9j77m1r2K23J37
$$ 147 -128 205 -23 22 -239 -60 -6 176 -5 118 25 -321 -233 -32 5 12 64 161 190 13 -28 -120 103 240
3738B40l03j9J85l89K8Q0K50k36J50J63p9l1M5R4j78J37k89K91l14J24J35j51
$$ 240 -63 -82 103 -286 -258 -178 72 -164 -14 149 70 39 84 178 0 137 -152 139 -175 -51 84 -67
3760f7k40K16Q8jp2Q5K74k05k32L26J04l91L04p5j65Q8j77K19j14J37p1l9o1j
$$ -67 -307 -91 -3 -4 -76 9 283 78 -154 172 276 -115 189 114 -51 37 -140 79 -35 102 31 -8 -69 -70
3784g0K91l73K55J74n05L16l3N6k23K34K3m75N66k90l6K3Q2J68J40k97j05J19
$$ -70 221 -152 103 277 -228 88 55 111 -112 122 145 -330 236 -54 -90 -67 15 183 323 26 -79 40
3806D0j5k45M08j58j76O3L43k65j7j35m3J50k44M21k29M50m87O2J95j41J34k30
$$ 40 25 -220 188 30 -146 -83 260 -5 -22 -157 -200 -50 -294 127 -102 348 -139 -77 118 -23 111 -119
3828a19J04K21k29J39j71O2j75L8J66q0k8J16m6K5l29K7M17k06rl8L22j32j9L5
$$ -119 -15 206 -23 116 -55 7 -168 -130 36 -44 -72 44 -2 23 -306 -279 138 -68 -77 -115 207 75 56 91
3852I1m7k07N0P7M3J9k55J25o2K53j02K1o1R9Q9l35J81K15j80j50O2M9qj33P3
$$ 91 44 -163 -113 -36 7 26 -229 -104 -166 87 -15 6 -55 44 133 -202 -21 194 14 -136 -74 -25 -33 -166 -93
3877i3M57l87M5k47M70l47R2n9%J15J4K53l39k2R3j17j83J55m2J62n1L1j85M19
$$ -93 364 -23 22 -225 245 -102 -10 -69 -69 46 60 313 -26 -48 45 -72 -255 -100 -142 20 -31 0 -185 234
3901B34J66m44q1j09L3L5j46L66J0L5j7J9j30k33M47l96K24J69m26L64k73K05
$$ 234 400 -44 -125 -234 -201 -166 -312 54 64 99 82 101 -29 -262 185 -211 13 182 -244 120 -153 52
3923E2q9q0J60j41K69m54K35k1p0n6L2K22J12m73J85j60N54k27j05r1J0J21M6
$$ 52 -37 -117 43 -98 171 -283 -48 -69 -139 -195 -163 59 171 -302 -117 -277 277 50 -55 -146 -136 -15 31
3946C1j24K44l00L34l59K23n1r9R5M8j28J54j97K0m5L48j90O3J19k69J51l34K57
$$ 31 -93 151 -149 185 -174 49 -2 -101 -6 42 -86 68 -129 -109 -154 194 4 67 186 -83 68 -266 -9
3969im9q1K84j00J0q2n5Q0j72J04J09p5J70%j03N3J53l01J53p1L6J57l12M6J23
$$ -9 -58 -139 145 45 55 -27 -82 -2 -174 -70 39 -36 134 134 31 84 237 -64 89 18 54 211 -101 -55 68
3994F8j01K08j62m2L9LO9k46K22k31K76j1j30n4j45K10j44J98j26J91j14k1r2
$$ 68 -33 175 13 -29 10 13 82 -164 58 -173 103 92 -38 -92 -237 -27 -171 27 -99 92 -22 -43 -135
4017a35L86k92N0J16p4J3j25q1J01k27J56J01j87J14j14J86L31j69j71mO4k17
$$ -135 251 -41 9 125 51 64 -61 -142 -41 -268 -112 -11 -198 -84 -198 -12 319 150 -21 -25 39 -178
4039a78J88MJ00o8r2L60j14k0k04J06r2k36J02N6o7N3O0L16k77N1j04J99p9j92
$$ -178 10 14 114 46 -46 314 200 180 -24 82 -10 -246 -144 -88 -155 -102 -42 274 -3 48 -56 143 64 -128
4063a28o1J97K33k26j6k08K06o2K3K45l78K7K20k94K14N2R7k32K51l04J98k1K8
$$ -128 -189 8 241 15 -1 -209 -3 -65 -42 203 -175 -148 72 -222 -8 44 141 -91 160 -144 54 33 61
4086F1q0j34J73L2j29jJ23L7j70j20J60MJ05k06K80l2J15j77P4j61n9K6K40l40
$$ 61 -19 -153 20 52 -77 -78 45 82 -88 -208 -48 -44 61 -145 135 103 218 41 115 -46 -105 -79 161 -179
4110a79K6J6m1J20o2P0P3J31l72Q1K54n9r9J11k3q4P8j91n3J53J17l9o4J06j84
$$ -179 -153 -137 -178 -58 -120 -50 23 154 -218 -137 117 58 -41 70 47 -37 41 -150 -203 -50 67 28 -36 70 -114
4135a14p4P3P4L09r2k38k03L98j62J1j39R1J10l5l64N58j14P5J41l26J48j47J27
$$ -114 -188 -115 -41 268 176 -62 -265 133 -29 -18 -157 -66 44 9 -355 203 89 164 305 -21 127 -20 107
4158A07pkk84P4k1j3J27L7j17R5R5p4m3J01P4j09l3j01m0K39p3J9n7n6O1l9Q3
$$ 107 100 98 -186 -112 -133 -146 -19 18 -99 -4 91 17 -26 75 149 40 7 -94 -134 105 32 51 -6 -62 -1 -40 43
4185D3j57J90j30k29M79j09k8j30N7j14J23q0l5J18m6M3r3N2J81j57K25j63p9
$$ 43 -114 76 -54 -283 196 87 59 -71 -14 -128 -5 -85 -120 -2 -48 -5 -98 -46 135 -22 203 40 -39
4208c9J70j50J37j75J20j34l6L85k80k17K67j34P3J42n6o1m8J1o6r4J6m6j59M96
$$ -39 131 -19 118 -57 63 -71 -107 278 -2 -219 48 -86 -13 129 73 12 -36 -25 -91 -185 -169 -215 -374 122
4232A22m2l36J23J86N3M1k94R1J83j62M8Q3j56J8M00k95k16M5J30j73K40R5k43
$$ 122 80 -256 -133 53 106 147 -147 -56 127 -35 13 96 -60 -42 358 63 -153 -108 22 -151 89 184 -59
4255e9j31k8J95q9K15J3r1j49L28n06N06j80j23J21R2m20N06k28j42J97J32k10
$$ -59 -190 -218 -23 -112 103 116 25 -124 204 -302 204 24 -99 22 114 -306 200 -28 -170 27 159 -51
4277e1J90j74j58J89K01j80kj2P8K5r8K78k95l49K11J88k92L42Q3l14J56r4J57
$$ -51 139 -35 -193 -4 197 17 15 3 81 106 8 286 -9 -358 -147 41 -251 91 174 -140 16 -78 79
4300G9j33J28r1q4K09k03M6k8j84J89J13k8j56K09J22k95J36j19m9o9J97M9p9
$$ 79 -54 74 -17 -101 108 -95 -49 -77 -261 -72 41 13 -143 66 188 -107 29 -90 -139 -208 -11 38 -41
4323d1Q7J8lj15K26l99qJ15L24R5m65M71k98j22J07nM5J89k46j49K61q9Rk91M94
$$ -41 46 64 61 -54 172 -227 -235 -120 204 299 -166 305 7 -115 -8 -13 32 221 -25 -174 87 -2 7 -284 210
4348B10j95j06m7K92k05j42L20k43o2J40J02j40J0o1K06N6l92J59K06n5j63K09
$$ 210 15 -91 -138 154 -51 -193 127 -116 -178 -38 64 -76 -66 -127 79 135 -257 -98 108 53 -110 99
4370I9J0N3j00j19K47m34K3L06J76j67j77l2O9P2N8j78k8L49j47N8j80J95p9m5
$$ 99 109 162 62 -57 190 -244 -221 85 261 94 -83 -115 -46 26 84 -94 -122 227 80 138 -42 153 74 29
4394B9p4J7L46n60J21m6K83q5kK76l40o1J26k50L75j93k3J70j85j9j27K42j22
$$ 29 -45 -28 318 -242 -121 -167 116 31 29 305 -35 -96 30 -220 155 -38 -61 109 -76 -95 -222 20 -102
4417a02K21m02L34L2L2o5l19O00l69k03K99K5J26J0l62J80j19R3j74L10l8j35
$$ -102 119 -283 51 83 115 50 -269 331 -38 -241 58 83 209 219 -143 37 -82 11 -163 147 109 -26
4439b6J02PJ02k07p7R4Oj80n8J26n5J21J27k7j0j13M6J37l08J83J14k59J04J42
$$ -26 76 83 185 -22 -99 -5 1 -179 -237 -111 -166 -45 82 55 45 -68 -22 115 -193 -10 104 -155 -51 91
4463I1j89O5j07K30l64K81P5j11L13j56r9l6J77l1p9R1q4K5L3l39K27R4k52N1
$$ 91 -98 -33 -140 90 -274 7 82 -29 284 128 29 -7 170 139 60 151 67 92 125 -214 13 107 -145 -94
4487i4pQ0j53J80L11l03K65l66Q5K13k04k6O9p9J35k78K71J16k68J55l17K72l95
$$ -94 -101 -21 -174 6 317 14 279 -87 -2 211 7 -19 50 -29 106 -172 99 215 -53 102 -215 57 -338
4510c38O84l51L52j03l16J70j00R8j16L24l97J68p3n4Q0R1j87O0q4L78l14J06
$$ -338 346 -5 347 244 -72 98 -2 96 -20 304 -93 75 2 -52 28 119 -68 -8 -92 286 -28 78
4532G8R7j5j08n1J11k54jK15J06k22J39k00J5j86K21R4k49K81q4k67L60J44k49
$$ 78 175 160 52 1 112 -142 -143 72 178 -44 95 -105 -90 -276 -55 39 -210 71 -13 -280 80 224 -25
4555b5l2n5n4M48m87Q6K17p8Q3l20N31m51J45p6N3j02J89r9J17M8k85N9QK1J61
$$ -25 -57 -112 -166 282 -205 -119 98 20 103 -217 314 -137 8 -68 -15 -117 72 -27 90 138 -147 -88 -80 -59 102
4580A02K2k06Q1Mk22L09k38MK30j17k42K46k05L63n7k13K6K0K83j16n2n4K10l65
$$ 102 124 -82 -1 3 -219 90 -148 -144 86 -31 -273 -27 -232 131 74 -139 -113 -93 190 74 22 -32 178 -187
4604a87K8J05j16Q9J64p5K62j89r4J17k29J40r7ok36K91no8J63j24J95k22J94
$$ -187 -159 -54 -170 -81 83 8 270 81 -13 104 -125 15 -82 -88 -324 -33 -38 -106 57 -67 128 -94 100
4627A00j67j13J72M9k76L1R3j50K60j04J32J27j73j6J85k82J56J56m6l7j16J48
$$ 100 -67 -180 -8 41 -235 -204 -111 -261 -1 -105 27 154 -19 -35 150 -132 24 180 134 97 -19 129
4649A29r7k07L03k76RR7j76L05j17o4K18l06L32l27J03J1l03P9K41J43Q9L5j52
$$ 129 32 -175 128 -148 -139 -42 -218 87 -30 -94 124 -182 150 -177 -74 -63 -366 -287 -46 97 186 221 69
4672F9J49k91N4J8K5k89P7K63k60J87LO6J2n5N9J6k59P5j27J95m5Q8P5k46K91
$$ 69 218 -73 -19 -1 24 -265 -188 75 -185 2 5 71 83 28 87 103 -156 -81 -208 -13 -58 30 105 -141 150
4697A50l29J9J22j00J50r6R3lJ42l28L66j63k23L92m26J22K81k37K08j05j79K48
$$ 150 -179 -160 -38 -138 12 -84 9 6 148 -180 186 23 -200 192 -234 -112 169 -68 140 35 -144 104
4719A04j90O6K17r3p0n9K01r4j17J56P6jn7n2N0J04n19J43K19k4p0OM5j01p9K5
$$ 104 -86 -20 197 104 34 -25 176 82 -35 121 197 196 139 87 137 241 -278 -135 84 60 -10 -4 41 -60 -139 -114
4745a14K34j9k58m1M02m44L45j3N7j5k20J1n1r1K62m6k72M8K33J15l08R7K32k00
$$ -114 120 101 -157 -198 204 -240 105 92 149 134 -86 -75 -126 -217 45 -1 -273 -225 8 123 -185 -88 144 -56
4769e6J88k38J64M1L6j82j51N34k53l50M85ll35L89l60r6l1J11j16M58l78J08
$$ -56 132 -106 58 99 135 -47 -198 336 83 -267 218 215 -120 269 -91 -187 -218 -107 -223 235 -143 -35
4791c5jjJ12j18k82K03J46j87K11l58M01j13O3j43j7J16O5O7j32p9K72l56N7L3
$$ -35 -36 -37 75 -43 -325 -122 24 -163 48 -310 91 -22 41 -102 -119 -3 62 129 -3 -82 190 -166 -109 -76
4815g6j22K17J59o4j60J9l3M6J43j25J03o7l6O3p4p5J56oJ09j78k10K29J10j90
$$ -76 -198 19 178 114 -46 -27 -60 -14 129 4 107 40 4 67 -7 -82 74 68 177 -1 -211 18 128 -62
4839f2K1l3J68K4J01l40j01Q6p0J99l36L26l5J20j37j5p4N4O1j18K00p5J4m4l9
$$ -62 -41 -74 94 118 219 -121 -222 -136 -206 -7 -343 -17 -52 68 -69 -84 -158 -104 -43 -161 39 -36 -22 -66 -105
4864a05N6J09J01l11L76k84J53r4j07K39p4k6J15l15J05K87n9m9j17O1j65j1j8
$$ -105 -49 60 161 -150 226 -58 95 1 -106 133 59 33 148 -167 -62 225 166 117 0 61 -104 -115 -133
4887a33J25j01J59K12j93n4P6l58J70j58L07l38K10Q2j3k21J73p8Q8J47K5k3k1
$$ -133 -8 -109 50 262 69 15 91 -267 -97 -255 52 -286 -76 6 -7 -228 -55 -133 -45 102 127 104 83
4910H3J92l05j2M8J38j14K12l51J75r6J16n7j03Oj6J48j28m6P0k53L29Q7k25r8
$$ 83 275 -30 -42 6 144 30 242 -109 66 -30 86 29 -74 -68 -84 64 -64 -110 -40 -293 36 123 -102 -200
4934b00J54j44J30q7l4k2Q5L02k89J94l4j61J64lj96j9J1p8L43Kj14k29L56j00
$$ -200 -46 -190 -60 -147 -181 -203 -118 184 -105 89 55 -106 58 55 -141 -160 -149 -227 116 118 4 -225 131 31
4958C1o1J49J9j63j47MK40k23J96K87m11J46j85k0M1K07O3R1k01k85K28k6J10
$$ 31 -30 119 138 -25 -172 -168 72 -151 45 332 -79 67 -118 -138 -97 110 173 264 63 -222 6 -20 90
4981I0l0J35q7k6j53j64K51J12j2n3k37P8J31J43j72o8Q8r2O5r5N9j75M81L6k52
$$ 90 60 195 108 82 -71 -235 16 128 116 63 -174 -96 35 178 6 -62 26 -66 -1 -96 -37 -212 269 305 53
5006E3J70l73K37k18J21l24J73p2M11j56p0L84n08K07J08k55N7JK96n1j56Nm39
$$ 53 223 -150 87 -131 -10 -334 -161 -233 178 22 -48 336 -172 35 143 -112 -55 -54 242 191 35 40 -399
5029c99K87o2J02nJ60l59O9M1J10j0pJ65j41J98J6m7j95K49m8k44L15k57qJ12
$$ -399 -112 -174 -72 -77 83 -276 -207 -166 -56 -66 -73 92 -49 149 165 118 -77 172 124 -120 195 -62 -70 42
5053D2j74J62P1l2k62J92L7k48K36j64K50J18p6j55k25J13K64m14J83J87k31o
$$ 42 -132 30 101 69 -193 -1 36 -212 24 -140 110 228 152 -3 -228 -115 149 -265 -82 105 -126 -132
5075a32J23r2j7Q5k1R8j28J45j36K3l57K86M5P2J09J92n07L08Qk33Rp2K83j39
$$ -132 -9 -101 -118 -33 -54 44 -84 61 -75 -52 -409 -123 -78 -6 103 295 -212 96 104 -129 -120 -192 91 -48
5099d8o2J23n6M5N8r8l1J5p0PL69k07k67J94j25n2K52j15j07K58n2J22m6p7j80
$$ -48 -110 13 -43 2 60 -38 -69 -54 -124 -117 252 45 -222 -28 -153 -205 47 -68 -175 83 31 153 107 30 -150
5124a50L01j08J9L16n19p1M8J11J14j52n4JJ2j4j31K18j0J17m3k3k00K46j73p
$$ -150 151 43 62 378 -141 -212 -164 -53 61 -91 -145 -144 -132 -146 -277 -59 -69 48 5 -18 -218 28 -145 -152
5148a52K17j36J01j07j6M8J08k41K70P7k77K44j22q2R2j50J03k5K09j90L2J23
$$ -152 65 -71 30 -77 -93 -45 63 -178 92 169 -108 136 14 -68 24 -126 -23 -48 161 -29 3 126
5170A26J4k80L6P3m4K82L3j25oj12L2J02l22K18k7K75k21j94Q1J20k04J13%mJ2
$$ 126 140 -140 -104 -31 -75 207 240 115 109 -3 29 131 -191 27 0 275 54 -140 -59 61 -143 -30 -30 -34 -22
5195b2J03N4l39J42m2J64O5j90K34k19p6M96l43J20k61K78j7k3J55m27o4m5M15
$$ -22 81 135 -204 -62 -104 60 125 -65 169 -50 -126 370 27 147 -114 164 147 124 279 -148 -212 -257 158
5218A58n61L16L4L7o3n8J34j3p3J25k16J65o3J25L1Nk41K04L2L2k17j42K72K7
$$ 158 -403 -87 -53 -16 -79 -137 -3 -16 -89 36 -180 -15 -78 47 78 83 -158 46 78 110 -107 -249 23 50
5242E0R0K4j18j88J29L29l13J64j11q4j8J13Nq4J4K97l54P1J66p6m9n3k07K04
$$ 50 140 164 46 -142 -13 316 3 167 56 -28 -46 67 72 -12 2 299 -55 16 182 106 57 4 -203 1
5266AL6k48K52j84M45k4j63j38p2K32k96J91R9j17K4m6J31j12n8j63J81j03LJ78
$$ 1 37 -211 41 -143 302 278 115 -23 -95 137 -159 32 131 14 38 -8 123 11 -47 -210 -29 -132 -129 49
5290D9l6k30K64L6j66lO0l2J44n2r8k5K33j3M9l50J89J19J1j35M3L4j25O1J23
$$ 49 13 -217 47 83 -83 -86 -26 -58 86 34 -64 -89 144 131 180 -170 19 138 149 14 57 91 -34 27 150
5315A50k15L4j44K82k8j62J54j27M7J67q8p1k02J06J87k83K92k22P7j41QL80j54
$$ 150 -65 -31 -175 107 79 -83 71 -56 -9 158 70 -1 -203 -97 90 -193 99 -123 -46 -187 -179 201 47
5338D7J36k18J77k98N9J72j30K57R0k96M7k14J28J37k30J64j7j85L0K08k7j70
$$ 47 183 -35 142 -156 -97 75 -55 202 292 -4 43 -171 -43 94 -136 28 11 -174 -144 64 37 -133
5360a33N05k29l04J73j53K85j85m3jk7P8Mj2J11j33J1L08j27Q4k55q6l9J21M7
$$ -133 372 143 -161 12 -141 144 -41 -84 -85 -112 -34 -30 -42 69 -64 -53 255 128 212 -43 -129 -168 -47 0
5384@J0M8K96k41k03R3Q3p3K04l03K8q0K80j69j19L25m3j74NN5K67k37K26k03
$$ 0 10 58 354 113 -90 3 86 13 217 -86 -58 -138 142 -27 -146 179 136 -38 -33 22 289 52 278 75
5408G5n4k22J38K56k23M4J75l70K61j29J09J22l49K67P5N6l20j00K65j01q0N1
$$ 75 21 -201 -63 193 -30 14 189 -181 80 -49 60 182 -167 100 175 231 -89 -189 76 -25 -105 -54
5430e4J36p4p2q1l48N48j14l9K7J14j03J33n0k33K58j79L10l77jQ8L35k97j12
$$ -54 82 8 -64 -145 -493 55 -59 -98 -71 43 -60 73 23 -210 48 -131 179 -198 -199 -111 224 -73 -185
5453a85J39j3J80j67j92K81j07Q8J58j48j66L3M60n14K52N1j33k70M14N5P8k29
$$ -185 -46 -59 121 -46 -238 43 -64 24 182 34 -132 -99 361 -153 99 150 17 -253 161 216 294 65
5475F5Q7J3j52J06l26P8N33k75j26k12M77m93K61j77K65J60j56j1k36K0j01K79
$$ 65 152 165 13 119 -207 -129 404 129 3 -209 268 -225 36 -141 124 284 128 117 -119 -99 -200 79
5497G9l10J08j3K52k5l64K94J23q5k10J5J36r5j54L91j50N0j91J67J62kj05L7
$$ 79 -231 -123 -136 116 91 -273 21 144 59 -151 -136 0 -95 -249 142 -8 42 -149 18 180 178 73 110
5520A10j14J26k12j7K7r5K25Rj73L4r6Q9K52l09PN9J36j41K12n1K21k34J3J48
$$ 110 -4 122 -90 -107 -80 -175 50 59 -114 -80 -176 -87 165 -144 -137 -78 58 -83 129 78 299 65 78 226
5544B26q8o9o6j59J57J3K3J84m35K51p2k37K73p9J75q9q2o4rJ91K56k49l0n7l44
$$ 226 138 69 3 -156 1 14 37 221 -214 37 -35 -272 1 -78 97 8 -74 -138 -147 44 300 51 21 -36 -380
5569c80O05j17j23O3J4j20O8J4m5O0K19k20N4p2J70k50JJ53j50K52N2j05j09k83
$$ -380 225 108 -15 48 62 -58 10 24 -21 39 258 38 92 20 190 -60 -59 94 -56 196 248 143 34 -249
5593b49L97l8K4j42j47K77j05j39N9K2J31j21J35N4l06J78kM8j69J16j6K3l7K6
$$ -249 148 110 134 -8 -155 122 17 -122 -63 -41 90 -31 104 158 -148 30 28 76 -93 23 7 30 -7 19
5617A9k01M27k63J02N2k61K13j60K61j44j02L9r3J35J7M4k83K26l5m8L2j10J01
$$ 19 -182 245 -18 84 136 -125 88 -72 189 45 -57 -18 -111 24 41 85 -198 28 -7 -55 -23 -133 -32
5640c2K18j99J65n4j71Q0L20j76j83p1j00K85O9n2J3j0k6J32m10J85m0J50k8M9
$$ -32 186 -13 152 98 -73 7 327 151 -32 -103 -203 82 151 99 112 102 76 208 -202 -17 -57 93 65 114
5664A14j85O4J03n0K57m23K1r8J02J73N2J62j52j21J33k46j21K10K9%n6j09J71
$$ 114 -71 -7 96 46 303 -120 -99 -197 -95 78 130 292 140 19 152 -94 -215 -5 24 24 -32 -141 30
5687C0J11j86OJ99k74L58l05K21j4j51j8J42r9R8l8j84J49n3N8k31M57n94K53
$$ 30 141 -45 -39 160 -114 244 -61 160 146 -5 -23 119 20 118 80 -104 45 -8 50 -181 276 -318 -65
5710f5J18J37k04r4J37o5Q2j23O8j68K3R8L9J73mP0k69J89k80J66qn7j9j35J44
$$ -65 53 190 -14 -108 29 -36 46 -77 -9 -177 -154 -56 -17 156 152 222 -47 142 -138 28 20 -37 -56 -191 -47
5735d7L1j7r2P0J57L0J40j77k08O9K90J21l20O5j80J58q9M1q7J55j89M15k37K7
$$ -47 -16 -33 -125 -55 102 132 272 95 -113 -44 246 367 47 112 -68 90 1 42 -45 110 -79 336 99 126
5759A26j99K29j15q1NQ9O3j4k70J48r5J3L3L15l05K65m9p7k9K70r5j12j20K3O1
$$ 126 -73 156 41 -40 -35 54 117 103 -167 -19 -114 -101 -68 247 -58 207 158 81 52 322 227 115 -5 18 79
5784G9J8j44l2j56K22J91j54k48L49J65l51P8J30j90J44j0j87J48m7K05l48K44
$$ 79 97 -47 -79 -235 -13 178 24 -224 125 290 -61 17 147 -43 101 91 -96 52 5 210 -138 106
5806A06l23L78p5k75M52n6j71m6j9n6p5J65Q1j52K06L9j65K14j23j93J92j28n8
$$ 106 -217 161 86 -189 263 207 36 -10 -29 -85 -160 5 86 -66 140 179 14 228 105 -88 104 -24 -82
5829h2K4R6N6m3J27j24P6k08K97k57O3O8r6n8k51l4M00k20L46k39l2k79L56J4
$$ -82 -58 38 94 51 178 54 130 -78 219 -38 25 93 -3 -61 -312 -346 54 -166 180 -59 -91 -370 -14 0
5853@J79l21J06R2m37L86l0J19j99J02J01j88L33l43P5K65p0j34o0o6n2M7J75
$$ 0 179 -142 -36 56 -381 5 -25 94 -105 -3 98 -90 243 -100 -25 240 170 36 -24 -90 -142 -95 80
5876H0j08J69j41L6K7p3K22k97J46k82K46j71P6k8K7j7O2J46m0k17J94j43J5o2
$$ 80 -28 141 0 36 63 -10 212 -85 61 -221 25 -146 -70 -98 -71 -88 -26 120 80 -137 57 -86 -71 -133
5900a33K20j37Q6J4O1k68L45r5j67k17L22J79j10j63n9N3L01O5l82j74J22J66
$$ -133 87 -50 36 50 111 -157 188 93 -74 -291 31 210 100 -63 -122 -69 232 297 -85 -259 -137 29
5922B9o2j26L00r6j71K75J12j67j32j01J80j0Q6j14J15j85L8J74j99j45J78J83
$$ 29 -33 -159 141 45 -126 149 261 94 -38 -139 41 31 117 3 118 -67 -29 145 -54 -199 -21 162
5944A62k04j45K33Q4j89m1J16j28j44L54o2K23n2q4l41J34N31n95r2L43r4N0m1
$$ 162 -42 -187 46 130 -59 -100 16 -112 -256 98 36 259 207 123 -218 -84 447 -148 -240 103 9 59 18
5967A8j6O1J20j52j47M12k23J86m33L71j77q5M1o9K29j48m3J48m50J15N0J48R1
$$ 18 2 63 183 31 -116 296 73 259 -174 197 20 -65 -24 -93 136 -12 -55 93 -357 -242 -192 -44 47
5990D7k38K51m2j06K05M3l33n4K73N7j19J60P5j55m08J57J30j13K07M7j38N50
$$ 47 -191 60 18 -88 117 160 -173 -227 46 103 -16 144 219 64 -344 -187 -57 -170 37 84 -54 496
6012D96l00j30k05Q7O8l1k05L74k09J26n7j12J14J68k89j11K50M4O4k77N9q3j8
$$ 496 196 66 -139 -52 16 -15 -220 154 -55 71 14 -98 16 184 -105 -216 34 78 142 -135 -76 -159 -177
6035a77K21j13k44M29j36N4J99j17j40k13K74J52k17q2K70k06J32j03j32L9L03
$$ -177 44 -69 -313 116 -20 34 233 116 -24 -237 37 189 -28 -110 160 -46 86 -17 -149 -110 193
6056A93j90j61N0J9l1p3J17q6j3M69m09K64k06Q0O7j61r0J47M5J48l31J15j39
$$ 193 3 -158 -108 -89 -120 -193 -76 -162 -175 294 -115 149 -57 23 90 -71 -161 -14 31 179 -152 -37 -176
6079a76K32k32J03K59k81K87k17J61l84K50l0J19l19M37j4j60q7J53r8m1K45l31
$$ -176 56 -176 -73 186 -95 192 -25 136 -248 2 -28 91 -228 209 195 35 -52 101 3 -38 207 -124
6101a24j23J58L6K10j64k25K52J37k69l10L73J51k93J69l8L09k66P7j1L1O3j71
$$ -124 -247 -89 -53 157 -7 -232 20 157 -112 -422 -49 102 -191 -22 -60 249 -17 60 49 80 143 -28
6123b8J54r7o1n1%K04l54K86k4l35K04j09O5J57O8n51K77J32J28o6K81k22O3J88
$$ -28 126 29 -32 -83 -83 121 -233 53 29 -306 -102 -211 -146 11 79 -472 -195 -63 65 -1 280 58 121 309
6147C09n27K32N7J77j93L7j11j94K39J70J66l99K71n15K14R5J96l44P3J72L1j13
$$ 309 -218 14 71 248 55 92 -19 -213 26 196 362 -37 234 -281 -67 28 224 -120 -47 125 156 43
6169D3l0R2m16M65m21J23r1L03j40q8K19j18J99j92R1l27J26J11j56K50L9m6J95
$$ 43 13 105 -311 154 -267 -144 -235 68 -72 -160 59 -59 140 -52 39 -288 -162 -51 -207 43 82 36 231
6192B31l54R8n7L26l46J77k15J04mJ28k03L46k51J52oj40j43K46J13k37K0K72
$$ 231 -123 -25 -82 244 -102 75 -140 -36 -40 88 -115 231 -20 132 126 -14 -157 89 202 -35 -15 257
6214B57k38N6J25l27J57LL4k11nJ00R5J9j41J62J47m7k64R3J52m1k68nL9L2J39
$$ 257 19 75 200 -127 30 33 67 -144 -149 -49 46 65 -76 86 233 186 -78 15 167 126 -142 -147 -108 -76 63
6239F3j52L5pj74L20m0p8K4J21J00J44n16K31J87m22L28q1j08j74J20P0j34J91
$$ 63 -89 -54 -61 -235 85 45 -33 -9 112 212 356 -160 71 258 -164 164 83 -25 -199 -79 -9 -143 48
6262D8R0k24rQ0n9J2j29J75j8k45M69l01p4K62J08k48k62J94J49j10J50j97K51
$$ 48 138 -86 -95 -15 -74 -62 -191 -16 -34 -279 190 -111 -185 77 185 -63 -325 -131 18 -92 58 -139 112
6285A12j10p4J47k7N9k64P1p1J98K24k29j63J05J46j81o3J38K8K02l79m7q3J0
$$ 112 2 -72 75 48 107 -157 -86 -157 41 265 36 -127 -22 124 -57 -120 18 46 248 -131 -178 -261 -251
6308b51N71l92k2j44J42K59P8m63J32J48p6K91k28L7q2k80L79k09Q4k01L08j97
$$ -251 320 -72 -94 -238 -96 163 241 -222 -90 58 -18 273 45 82 0 -280 99 -110 -26 -227 81 -116
6330a16J01k1K10l66R8J46J0L8j31M6j34J52K4O0k24K88Q9j26J77k91l54P08k17
$$ -116 -15 -36 174 -192 -94 52 62 100 -31 15 -119 33 57 117 -107 181 270 144 321 30 -324 384 167
6353A67j55o4P5N8j86L95k39j40j23K86l1Pr8J4K05k21K50J31m07J25q6j88L19
$$ 167 12 -52 23 81 -105 290 51 -89 -212 74 43 50 -48 -34 171 -50 200 331 -76 49 -37 -225 94
6376I4n5n1k4k0J85m8j17m1N9K01Kk66j30K65K72k23q2J80j31n0P6k82K18P7n9
$$ 94 39 -12 -36 -56 129 81 -36 -77 -18 183 185 -81 -211 54 326 103 21 201 70 20 96 -186 32 109 50
6401E0j05R0J3p4K44l30nK85m4J00j0m66J57L2k17K93j55l4M23p5k34J3N3k4J08
$$ 50 -55 35 48 -26 218 -112 -117 168 124 224 214 -252 -95 -63 -280 13 -142 -176 247 172 -62 -49 4 -20 88
6426H8p9r9J31o8k45J61J75q2k74R8J55J01o3r4rm3J15q8j0J54k7K18k38k2J32
$$ 88 9 -90 41 -27 -272 -111 64 -18 -292 -194 -39 62 -1 -95 -104 -147 -32 -120 -130 24 -3 215 -23 -45 87
6451H7m7m5K6K67k71J27l5P1j83o6J85k0j07P7L12k80K8Lj10n7j53K02K63m55
$$ 87 40 -5 21 288 17 144 109 180 -3 -69 116 96 -11 66 378 98 126 129 19 -38 -191 11 274 -181
6475a81K96O2j97Q0k27L13rR9j26q5J6N4P5l65p6M73l57M42l24J35p0l86M43K51
$$ -181 115 177 -20 60 -167 146 137 236 110 25 41 95 170 -195 -271 202 -155 287 -37 98 28 -358 85 336
6499C36k15N2k74p8j7L75k97J93J67n85M32n9j8j65J2L99n51R5K7M58k94k78M11
$$ 336 121 173 -101 -179 -196 179 -118 75 242 -343 89 30 12 -153 -141 258 -293 -198 -171 287 -7 -285 126
6522A26n4j11K5j61J16J86O7k37r8L64m2l61K68J11r8R0q9j74P8j27L07L4k19
$$ 126 72 -39 -14 -175 -59 127 194 -43 -141 223 181 -180 88 199 101 191 102 -72 6 -121 186 220 1
6545AJ04j52J33l27J91P1R1j14J44l14P0N6J03j32O5k40J68pN6K79k96L5k77K62
$$ 1 105 -47 86 -241 -50 21 112 -2 142 -172 -102 -46 57 -75 -10 -250 -82 -89 -33 246 -50 -15 -292 -30
6569c0j1k32O23m58K5Nj02K27n9J10J17m11N43n24J32J50k06j50K3K52R6q0j79
$$ -30 -41 -273 350 -108 -83 -78 -180 47 -12 98 215 -196 347 -177 -45 105 -101 -251 -228 24 120 40 -139
6592a39k31M24j02J32k56K36k24K51J41k09Ok08JJ83J79j14L1j25J47j38k67K45
$$ -139 -370 54 -48 84 -172 64 -160 91 232 23 29 -179 -178 5 184 70 101 -24 123 -15 -282 -37
6614c7N5M8j0j27Q6J54k83R2j69L9M40n39J19N3q9J18K37k13j33K96k87J86J7
$$ -37 18 66 56 -71 15 169 -114 -22 -191 -152 288 -251 -132 -79 -168 -50 187 -26 -159 137 -150 36 53
6637E3l47M56j73k9J37l2k49N6K07J94l03q1q4L49k22k42M50p4J77L6k12J01j26
$$ 53 -294 162 -11 -40 97 65 -184 -128 79 273 -30 -111 -195 154 -68 -310 140 66 243 279 67 168 42
6660D2k40Q7L83m15j66K69o8K02Qj84%K76r6K2K6k16J54J1o9n3O9j07M15l83J26
$$ 42 -198 -111 272 -143 -309 -40 -108 94 102 -82 -82 194 98 120 146 -70 84 95 26 -27 42 -65 350 -33 93
6685I3q8J88l08K93k4O2l09J30N2R2j44j27L00l65QJ78J48l00K60k96K91q6o5
$$ 93 5 193 -115 178 154 216 -93 37 89 181 37 -90 210 -155 -147 31 179 -121 139 -157 134 48 -17
6708a7J99l89O5J22J7l0q7J5j3r1L69j67RK06k55K27L3k57O7k0n4J8J69j98K4
$$ -17 182 -207 -142 -20 -3 -33 -120 -105 -118 -209 160 -7 2 208 -47 180 213 -44 23 3 -51 -33 136 -62 -38
6733c8J34k34P1J5K2K3K46J30o07K89l26J63K34m8q3l36J94K37k20N8j7J99k8
$$ -38 96 -138 -67 -52 -30 -7 239 369 -238 51 -275 -112 122 74 -9 -345 -151 86 -134 -76 -93 106 78
6756G8O7k43K23j45J25j38J36m5k13J27R3k25k13J04k7J26l7L16j91R3J16Mk12
$$ 78 145 -98 125 -20 105 -33 103 58 -155 -28 65 -160 -373 -269 -296 -170 -207 109 -82 11 127 131 -81
6779h1J17k59K12ON7J52j12l93N01j74j9j02K01N4q9j11K15k67J11Oj20R2n3M2
$$ -81 36 -223 -11 -5 52 204 92 -301 200 26 7 -95 106 160 71 -40 175 -92 19 25 -95 -3 -56 -14
6803a4j10J54j05O8j33L08k30K09j18j34J26o4N5j58J43R6j07Q0J28J5k67J95
$$ -14 -124 30 -75 -7 -140 168 -62 147 29 -105 21 -43 12 -146 -3 93 -14 66 194 209 -58 137
6825A37j39j38j6O3q0K40L7q6J21J12l8r6k65L81l53J44O1o9o3k45L50k82L05
$$ 137 -2 -140 -156 -93 -173 67 104 18 139 251 213 117 -148 233 -120 24 85 16 -47 -292 58 -224 81
6848H1m02J20L36j80k97L27K2q2R6R3j81J24K9j51Q8J65k53p4J27k34L15j68P0
$$ 81 -321 -201 135 -45 -342 -15 7 -75 21 114 -67 57 86 -65 23 188 -65 -139 -12 -246 69 -99 -29
6871b9Q3j9K25l01j42J77k44J59J18j03J83j61k2J61r4p5j0r4K41j25J47J21j63
$$ -29 54 35 260 -41 -183 -6 -250 -91 27 -76 107 -54 -76 85 -9 -84 -94 -188 53 -72 75 196 33
6894C3j31J54k59J38K22j37k8K3O1j15q1O1M18k99p6Q3J37k57J89k06J28N7K0
$$ 33 -98 56 -203 -65 157 20 -8 15 76 -39 -120 -59 359 60 -16 67 204 -53 136 -70 58 115 135
6917A35p5j32J48J4J09k15L9p9J60j26j97J51r9M13l38n0j7K46l02K34J80j83
$$ 135 60 -72 76 90 199 -16 23 -56 104 -22 -219 -68 -167 246 -92 -142 -159 87 -215 19 199 16
6939A6o4p8O1J81n27N54k24%J69r9j64k2M44m98N23l42R1k27J58J56k90J23k25
$$ 16 -48 -126 -65 116 -411 143 -81 -81 88 -11 -175 -197 247 -251 272 -70 21 -206 -48 108 -182 -59 -284
6962b84J07n5J90M1j14J64j7j28J61l8J11j27O8K20n80N50l81K20r5L0j56Q6R6
$$ -284 -177 -232 -42 -1 -115 49 32 -96 65 27 138 11 79 299 -281 269 -112 108 13 43 -113 -27 69
6985F9o3P0J79J20j76k89J72q6J10J22j85p7j02m0J89Q7p8n7J07q9j3K49k37o3
$$ 69 6 76 255 375 199 -90 82 -4 106 228 43 -34 -136 -176 13 100 22 -35 72 -17 -30 219 -18 -81
7009h1J61j63P4M9j84K75j05K08p1rj08P4j35RJ26k48n7J02K95k22j57J83KK34
$$ -81 80 -83 -9 40 -144 131 26 234 163 154 46 120 -15 -6 120 -128 -185 -83 212 -10 -167 16 18 252
7033B52m3j1l87m6p3K93P2o7J27l15J3K62n08N24j22j15K05q2OK1j87L66j32j47
$$ 252 209 198 -189 -235 -308 -15 57 -10 117 -198 -185 77 -431 93 -29 -144 61 -21 -15 6 -181 185 53 -94
7057i4J30j93K14k73J35j36K15J84l06n1J84p7j78J35j02L03R0j72j67J6M13m57
$$ -94 36 -157 57 -216 -81 -217 -2 182 -124 -175 9 -68 -246 -111 -213 90 180 8 -159 -143 270 -187
7079a87L34j63m0j47M7K82j37j9r1M9K68k28j45K71k83J79k46K48J10o6n3n0J47
$$ -187 147 -16 -56 -203 -156 126 -11 -30 -121 -72 196 -32 -177 94 -189 -10 -256 -8 102 36 -17 -67 80
7102H0j3k5k08M7K17J29l9k35J6n0J35K3l1k42j32L69l18J59J4M0K26j76R1q4
$$ 80 67 42 -166 -119 98 227 188 -47 -31 -81 54 77 46 -196 -328 41 -277 -118 -104 -64 162 -14 77 -7
7126gJ08K4L0q9K5J87k24j04o9K14n3K11j92N9l0n4j27K07p0qM4l08K92J58k11
$$ -7 101 125 155 66 91 278 54 -50 -119 95 42 253 61 120 90 36 -91 116 46 38 82 -226 66 224 13
7151A3j99o5K2L10k68kM34k17q5L30l65L43l92J59j28J61K39l49J02o8L8N7J73
$$ 13 -186 -251 -229 81 -187 -189 245 28 -57 273 -92 251 -141 18 -110 51 290 -59 43 -25 13 70 243
7174B43m58L56j81L2j44L3K95m06K93J70j95k37J64O6k39L11k08O9l9j4K63j60
$$ 243 -215 141 -40 -8 -152 -119 176 -230 63 233 38 -199 -35 31 -208 103 -105 -36 -75 -89 174 14
7196A4r9K42j02k12J40p4l1RJ8K27j23j92J67p2J24P6J00k58n2K45k57L20l32
$$ 14 -85 157 55 -157 -17 -91 -122 -113 -95 132 9 -183 -16 -88 36 112 212 -46 -98 147 -110 210 -122
7219a22J05L92l37L8J75m53M8K11l2O9P8%l52N6J03K71k18J9j92P0J21m00M19
$$ -122 -17 375 38 76 251 -202 -154 57 25 94 172 172 -180 -124 -21 250 32 51 -141 -71 50 -350 69
7242F9r3j64K92l68R0L83q8j51m2j6mJ22K24J02m50k31L76M6k71L4K14j91K13
$$ 69 -24 -188 104 -264 -174 209 121 -30 -72 -88 -92 30 254 356 -94 -325 51 97 -174 -140 74 -117 96
7265I6l6Q6q4j24K6j73L31L0O2m79P2L24j23K30q2l22J43K7lJ08K8m4l1k07J84
$$ 96 60 146 62 -62 -36 -209 122 152 214 -265 -193 131 8 238 156 -166 -23 4 1 109 137 93 62 -145 39
7290C9q6N1k68K58J37p7n09N29j4Q5l40J12L47l20j1K48k61K6k0K12r1M4j75J06
$$ 39 -47 4 -264 -6 131 54 -455 74 60 145 -195 -83 264 -56 -67 181 -80 -54 -74 138 47 91 -84 22
7314B2j43J59q5N3J23K6L3j90J17r5M3p8Q5K6j46K03j39m6j12K80m28O07l44k2
$$ 22 -121 38 -47 6 129 155 188 -2 115 20 63 -15 70 96 -50 153 14 -32 -144 136 -292 315 -29 -51
7338e1J8J16L4j51l2rJ8K9j11k78L32Jj74L18j59j06Q1N1j64K80m0r6L3J89j69
$$ -51 -33 83 117 -34 -66 -75 -57 -28 -139 -417 -85 -84 -258 60 -99 -205 -124 -73 -237 43 3 -93 -60 129 -40
7363d0o0j9K14j55K47k68k8j2K98l8Q0j13k87L32J32k55J01O3oj60j01o1K78j38
$$ -40 -100 -119 95 -60 187 -81 -109 -121 177 139 219 106 -181 151 283 28 129 192 186 26 -75 -136 142 4
7387DR8k50J8L7l8L91k15k4j32J71J87r8k82Q6J04r3m5j49L79j61K45k12j03K27
$$ 4 102 -148 -130 -93 -131 260 45 21 -111 60 247 149 -133 -47 57 -36 -81 -230 149 -12 233 21 -82 145
7411A45k71K89k71J93O0l19J01K33O4l6j87J59j55J29p3n1j03l09O04l81J95j84
$$ 145 -126 163 -108 85 145 -174 -73 160 224 188 1 160 5 134 61 10 -93 -402 202 -179 16 -168
7433a68J02P2J20j5J7k00k4k14R6K81p7m3K2l5O9o8K6p9q2O0O0j55J04J03R4j14
$$ -168 -66 6 126 111 128 -72 -96 -310 -214 67 -10 -53 -31 -66 3 -65 -39 -118 -200 -140 -80 -235 -131 -28 66 -48
7459d8j0J83p9j60J26k7L4K65k92J28m7k00Om1K9L1K09l34L2L15N9ol31N9L5N4
$$ -48 -58 125 46 -114 12 -15 19 284 -8 120 73 -127 -121 -162 -133 -102 107 -227 -195 120 179 173 -158 -99 -64 -10
7485a0q0j22K84l28n3K53j18K00Q1k07K52k54J08P0K34m92L32j3k28J20l8J48
$$ -10 -90 -212 72 -256 -309 -56 -174 26 107 -100 152 -102 6 76 310 -182 150 137 -91 29 -9 139
7507A39r6K39l92K55j6J8p5O9M8J8n9k73J91k53K07J7J40k28j93L87j37k34J41
$$ 139 43 282 -110 145 129 147 72 141 189 207 148 -125 66 -187 20 37 177 -51 -244 143 6 -228 -87
7530h7q0M8J15J65k11J50j48L87n65L88k3j59r2l0P1J27j00J85l58k2L25k7R9
$$ -87 -167 -119 -4 161 -50 100 -48 339 -226 162 139 -20 -112 -142 -71 56 -44 141 -217 -239 86 59 158
7553A58l32m1J51K15K8j44l06P6R0J13l33N98l34J43j68R1j21J82k76L75j85L6
$$ 158 -174 -215 -64 151 179 35 -271 -195 -105 8 -325 273 -61 82 -86 5 -116 66 -210 165 -20 16
7575A6%J4j01L5l2K2k6q3J68po7O5P8r9J4p6J08M9K6l39J7J26L08j98K6j57m3
$$ 16 16 30 -71 -36 -68 -46 -72 -155 13 6 -61 4 82 -17 -3 -79 29 78 104 -235 -218 -92 216 18 44 -113 -156
7602a56L07j27M6m7j36R7j5Q8OJ47N3J02m86n5L01Lj58P7N2J29m06Q8n7o2K81
$$ -156 151 24 70 23 -113 -16 -31 57 63 210 263 365 -121 -176 125 128 -30 47 99 228 -178 -90 -147 -209 72
7627G2k05P1J4K41l08J22j22m6L35k07k11M18r5j08K25j78k5J27p1o0J24j73j
$$ 72 -133 -62 -48 193 -115 7 -115 -161 174 -33 -244 174 79 -29 196 18 -7 120 49 -11 113 -60 -61
7650f1J93p1K48k81k66K52J36k57K27q7r0j50J30J2r8P3l3j5J78L67l86q7o3J9
$$ -61 132 61 309 28 -238 14 150 -107 120 33 -57 -207 -77 -65 -163 -90 -123 -138 40 407 21 -66 -129 -110
7674a10R4P7R6j76J38N5k32J72m2j44L4j67J12MK08j66k20M67j2j91j75J81N5
$$ -110 -16 61 157 -19 119 174 -58 114 72 -72 -38 -205 -93 -89 119 -47 -267 200 188 -3 -178 3 58
7697E8j58J94p6L05j69k78Q7K1o0J23k38M08k38M0M5o6r2n3R5R0L5R5j41k2Q0
$$ 58 -100 94 18 323 154 -124 -37 -16 -76 47 -191 217 -21 19 64 -2 -94 -147 -52 38 73 168 27 5 85
7722H5l43J35lm8K68r2J19M6k12p1N32m80L19j77j21J73p7J07p0j56j08K38P5
$$ 85 -258 -123 -126 -174 94 2 121 167 -45 -116 416 -64 255 78 -43 130 53 160 90 -66 -174 64 139
7745A39j7k23J84K00m05J81k18K73k28NK88k49J26j07j17K54q7l0n0l17M03R0
$$ 139 122 -101 83 283 -122 59 -159 114 -114 -109 179 -70 56 -51 -168 86 -1 -31 -81 -398 5 95
7767I5j63J87j37J01k42J92j29m2J57M4J97m6l10K07l13K66j51k2L8Q8J98q6p4
$$ 95 -68 119 -18 83 -159 33 -96 -138 19 63 260 214 -96 111 -202 64 -87 -109 -71 17 215 129 55
7790E5k21K39l0l4oJ19j8j41J89k11K7k36K39K13j55J9j38j57k18M43K15l66J53
$$ 55 -166 73 43 9 3 122 104 -37 152 -59 -32 -268 -29 184 29 48 -90 -247 -465 -22 193 -173 -20
7813b0RO5Po0k9k34K43P6k69K61J00j96k26J61Q9K13l25N1K84j4q7k25ll1K26
$$ -20 -11 54 61 1 -28 -262 -19 57 -212 49 149 -47 -273 -112 -23 190 -135 -84 200 186 99 -126 -129 -160 66
7838F6j64K41m8k61J26J13k54K58l03M37j66j53O5J03NM4j10M7k7J33r2J8l85
$$ 66 -98 143 95 -166 -40 73 -181 77 -226 211 45 -108 -43 60 65 109 -1 46 19 152 60 78 -307
7861c07M28k6k63K89m44J98L7r3L04j27m6J1J02l18K54J48j41J60l1O8m29L00
$$ -307 121 95 -168 121 -323 -125 -88 -181 123 -4 -50 -39 63 -255 -1 147 6 166 135 203 -226 74
7883G4l44K81K5j86n6M40j04M3j16j8nK0j77J19P1k89L6L19l57J60k7L36J51m83
$$ 74 -270 11 36 -150 -206 234 130 173 57 39 34 54 -123 -4 67 -222 -186 133 -224 -64 -91 245 396 -87
7907h7K86k43j6K36r1O8n09N16k17R8p7K8j68N17m77l6j02J73O4j9K04k66J76
$$ -87 199 -44 -60 176 85 153 -356 160 -57 41 -36 -8 -176 341 -136 -172 -274 -101 -37 -56 148 -118 58
7930E8l28J43Q7K45n1K43m56N8l3P8K61k49n5K10j88N1j26OM2J56l6J46m20J41
$$ 58 -270 -127 -40 205 154 397 -59 -1 -34 44 305 56 1 211 23 74 -52 -46 -4 152 116 262 -158 -17
7954a7j5J18Op6N5j61P5Q4m7QJ26k90J07o7M04l26R6k78J32J01k52L58L0l35K22
$$ -17 -32 86 92 16 71 -90 -15 69 22 30 156 -134 -27 -94 310 -16 80 -198 -66 35 -217 141 171 -164 58
7979E8O1l41N6J84R5J12j57j53R2o5J42N6p7J50k76R5k3N6K6k66R9P9j63K55m56
$$ 58 119 -222 -166 18 113 225 68 -85 7 -58 84 140 63 213 -63 32 9 65 91 -175 -76 3 -160 95 -361
8004c61L72k6L6P8j98O6N4R6J49k18J35j11L0n21M60K87j99j34j7J59k73j73K10
$$ -361 11 -15 21 99 -99 -33 21 117 266 48 183 72 102 -419 41 328 129 -5 -22 137 -136 -309 -99
8027i9j31K26N7j89J85p1J66r8m9K2j49K44j89L3J22n5k78L59k18M9K56k01k20
$$ -99 -230 -4 53 -136 49 -22 144 46 -3 19 -130 114 -75 -42 80 25 -253 106 -112 -63 193 -8 -228
8050b28K33J37j14M1q8J80j1k19K16l29J33K51k63R4Rj34m9L63k02J06l5L9j13
$$ -228 5 142 28 69 -19 161 150 -69 147 -182 -49 202 -61 33 42 -92 -141 222 20 126 91 130 17
8073A7L79l86o7n9Op2J76K72j62r6J93k13K92m04J0J70j91M05l31J2J11J47j61
$$ 17 396 10 -57 -116 -110 -182 -6 266 104 8 201 -12 280 -124 -114 56 -135 270 -61 -49 62 209 48
8096D8O5P1J81n82O4J88P8r9k8J21R2k06n9j69Q0k7K40K15m65J26K98r9k48M7
$$ 48 113 184 365 -217 -153 35 113 14 -14 107 199 -7 -66 -235 -155 -182 58 273 -192 -66 232 133 -115 -68
8120f8n1J30o5R3N4J68j76l5n3R1k96J74L84m54J64lk46L08k04N6K01l24J63k08
$$ -68 -119 11 -54 39 93 261 85 50 -3 88 -208 -34 350 -104 60 57 -189 119 -85 -29 172 -152 11 -197
8144a97J08j31J54j17M49l21LJ44Rm5o7n5m09K19M72k03j8J7k00J00K8J07o8L45
$$ -197 -89 -220 -66 -183 266 -55 -52 92 101 56 -11 -66 -475 -256 216 13 -5 12 -188 -88 -60 47 -21 324
8168C24k36j79J0K64M5l67J58%j55J45P3l8J79k19K4n6L01n90M60K34m65j68L48
$$ 324 88 -91 -81 183 228 -139 19 19 -136 9 82 44 223 4 28 -28 273 -317 143 377 -88 -256 92
8191I2
$$ Imaginary data points
##PAGE= N=2
##DATA TABLE= (X++(I..I)), XYDATA
0@%%%%%%%%%%Qj6J6j6K4l2L6m4N6o4P2q8J07j29J51j77K08k40K77l19L66m17M74
$$ 0 0 0 0 0 0 0 0 0 0 0 8 -8 8 -8 16 -16 20 -24 32 -32 40 -48 59 -70 81 -96 112 -128 149 -170 196 -221 253
33B53n38O07o85P70q62R66j079J201j336J484j645J820k013K223k451K702k976
$$ 253 -285 322 -363 407 -455 511 -568 633 -703 781 -864 956 -1057 1166 -1285 1417 -1559
50a559L277l610L979m390M848n362N946o613P383q288R365j0671J2301j4404J7224
$$ -1559 1718 -1892 2087 -2303 2545 -2817 3129 -3484 3899 -4389 4976 -5695 6606 -7798 9426
65I426k1235K7457l8514O4243k40759j59941J98347J6897L6967n6896l1070l7476
$$ 9426 -11809 15648 -22866 41377 -199382 -359323 -160976 -144079 -107112 -164008 -195078 -232554
77b32554L006l7216j6879j1658K6464L2461N8837L0727P180j9211p729n730J0006
$$ -232554 -229548 -266764 -283643 -295301 -268837 -236376 -177539 -146812 -139632 -158843 -166572 -172302 -162296
90a62296J417j0059k8494j7991l881K0731K7642K3441K973j817R26J2882J8263
$$ -162296 -160879 -170938 -199432 -217423 -221304 -200573 -172931 -149490 -146517 -148334 -147408 -134526 -116263
103a16263J6261l862j7924j7419o173M512J2971R412j789j897J0291J9576K2470
$$ -116263 -100002 -103864 -121788 -139207 -145380 -140868 -127897 -118485 -120274 -122171 -111880 -92304 -69834
116f9834J8340L903j0918r340N37P585R311P296j249n107K410J1124J2280R205
$$ -69834 -51494 -47591 -58509 -67849 -67312 -59727 -50416 -43120 -44369 -49476 -47066 -35942 -23662 -14457
130a4457M154k187m00Q954J4690J1377L723l114q368m482M533R942Q677P814O549
$$ -14457 -10303 -12490 -12890 -3936 10754 22131 25854 22740 14372 9890 14423 24365 33042 40856 47405
145D7405P038J1550J3065O014m298j1594j5138j1319l475J176K026L013K559L522
$$ 47405 54443 65993 79058 85072 80774 69180 54042 42723 39248 40424 42450 45463 48022 51544
159E1544N679O180N20n891j0744j2092q978k573J392R44l22m63K01J722L358J155
$$ 51544 57223 63403 63923 58032 47288 35196 26218 23645 25037 25981 25659 25196 25397 27119 30477 31632
175C1632l745o695o048m315j680P60q32k882k904j173J148K875K468n75k843k600
$$ 31632 27887 21192 15144 10829 9149 9909 9077 6195 3291 2118 3266 6141 8609 8034 5191 2591
191B591j789j115p65k047l881l317j032J000K649K271O58j115r55k03M77N24r3
$$ 2591 802 -313 -1078 -3125 -7006 -10323 -11355 -10355 -7706 -5435 -4777 -5892 -6847 -7050 -6573 -6049 -6142
208f142r35j143LJ694J903J433k76j179j022j15O95J268N92K6p95J07R05K46l7
$$ -6142 -7077 -8220 -8217 -6523 -4620 -3187 -3463 -4642 -5664 -5779 -5084 -3816 -3224 -3198 -3993 -3886 -2981 -2735 -2772
227b772p63j254r13K91J795J763J236L92m72l31L50k65q79r58q87m06O06J536
$$ -2772 -3535 -4789 -5702 -5411 -3616 -1853 -617 -225 -697 -1028 -678 -943 -1822 -2780 -3667 -4073 -3467 -1931
245a931J623R30Q46l58k3k08J85l04o70l48QJ16J117O51O37k80j34k55Q6L91k17
$$ -1931 -308 622 1468 1110 1087 879 1064 760 90 -258 -250 -134 983 1634 2271 1991 1857 1602 1688 2079 1862
266A862o43l17l15m61N32M13K75l07J8M32K04M09N3M7o97q5n57K11K67k37j57
$$ 1862 1219 902 587 126 658 1071 1346 1039 1057 1489 1693 2102 2155 2202 1505 1420 863 1074 1341 1104 947
287I47K10K87L3J89J60l23o26k40l43K40j09L50l33K09k46K12K35J54m64n11J37
$$ 947 1157 1444 1477 1666 1826 1503 877 637 294 534 425 775 442 651 405 617 852 1006 542 31 168
308A68k05L01j42J67L2k26m10M17l53K35k8q0r7M77l69Q0J72l02J11k6k57o1J75
$$ 168 -37 264 122 289 321 95 -315 102 -251 -16 -44 -124 -221 256 -113 -33 139 -163 -52 -78 -335 -396 -221
331b21J00j15k32m4N47l45L07P4l76m9J85j71J63m2j70O4J87L39p8j20J06j03
$$ -221 -121 -236 -468 -512 35 -310 -3 71 -305 -354 -169 -340 -177 -219 -389 -325 -138 201 123 3 109 6
353Fj77Q0m4J74k60L41k48j34J3J75L96l46K08l65K72J95k67j46J18J27k77K26
$$ 6 -171 -91 -135 39 -221 120 -128 -262 -249 -74 322 -24 184 -181 91 286 19 -127 -9 118 -159 67
375F7K58l31p8K70j90J27J89k74O7q9P0j53j13J33L59k07j51j00LJ71M9M9j75
$$ 67 325 -6 -84 186 -4 123 312 38 105 16 86 -67 -180 -47 312 105 -46 -146 -143 28 77 126 -49
398d9o2J21k11k7L91j34q6K22l41L03m58K95j28R9J03k99K97R0k31k13L85k97
$$ -49 -111 10 -201 -228 163 29 -57 165 -176 127 -331 -36 -164 -65 38 -261 36 126 -105 -318 67 -230
420b30L18k44L10k52k05L30k05j2K24k49K41J37n41L75k66J94Q8k48J69j3J13
$$ -230 88 -156 154 -98 -303 27 -178 -190 34 -215 26 163 -378 -3 -269 -75 13 -235 -66 -79 34
441C4q2k01K62J49q5k54J99J37n43O47k45o4r6J71K27j46QO6P5l81J97q9J5j19
$$ 34 -48 -249 13 162 77 -177 22 159 -384 263 18 -46 -142 29 256 110 118 184 259 -122 75 -14 1 -118
465a18J56nQ5j73J62r2j1J01M7l79K2J47J44j48j3lJ28k29K49K2j38P1j01j60
$$ -118 38 33 118 -55 107 15 4 105 152 -227 -205 -58 86 -62 -75 -78 50 -179 70 92 -46 25 -76 -236
489b36K94j33K17l16J87K16l48M3m7j26K64K15j74k32K92Rk6L1j8r5j19k6K4q7
$$ -236 58 -75 142 -174 13 229 -119 -76 -123 -249 15 230 56 -176 116 125 99 130 112 17 -102 -128 -104 -191
513a91J38J04J07J9k67J24k94O1L19r3k44L40k13j09K75r7j61J65J30j10L6J34
$$ -191 -53 51 158 177 -90 34 -260 -199 120 27 -217 123 -90 -199 76 -21 -182 -17 113 3 39 173
535A73J2j84l32J73o8K59o2ok20L68J36k35K33l75P6k45L16j46J44J58k99J16
$$ 173 185 1 -331 -158 -226 33 -29 -35 -255 113 249 14 247 -128 -52 -297 19 -127 17 175 -124 -8
557hJ56k09P0J04j30J22j96j4K50j81Q4l5n0Pk38M16k03J60k30Q3J14P7k37L6
$$ -8 148 -61 9 113 -17 105 -91 -105 145 -36 48 13 -37 -30 -268 148 -55 105 -125 -42 72 149 -88 -52
581e2L9q0j8J70j5o0K51l1k68L48m56M00j10j48J61k74K8N5K04m98L59Lr9J15
$$ -52 -13 -93 -111 59 44 -16 235 204 -64 284 -172 228 118 -30 131 -143 -115 -60 144 -354 5 8 -91 24
605B4k39L96k14M3L33l42l1L6K20j83j20j45K90L3N7j12Q1l05J32q7K37q5m13
$$ 24 -215 181 -33 10 343 1 -30 6 226 43 -77 -222 68 101 158 46 127 -178 -46 -133 104 19 -394
628c94L46M1nO8q2j49J6K78j86L59l02J61Mk70K18r9o7L82l91J96k7J6K04l18
$$ -394 -48 -7 -12 56 -26 -175 -159 119 -67 292 -10 151 155 -115 103 4 -63 319 -72 124 97 113 317 -1
652aO9j95J69J6q3m7J75j62Q4M2o7j39J73J88j88rj25J69l33J96j77L23j79j56
$$ -1 68 -127 42 58 -25 -72 103 -59 25 67 0 -139 34 222 34 25 -100 69 -264 -68 -245 78 -101 -257
676b57R7mjK00l1o5K94j12P1j60l2J12l35M52j50l8M5j7l28K28L5k89L15K6j71
$$ -257 -160 -164 -165 35 4 -61 233 121 192 32 0 112 -223 229 79 41 86 69 -259 -31 4 -285 30 56 -115
701a15L30k74K9K10l34K05j11O5o2J57m19J62L25j7r6J26l02j44Q7L06m25K88
$$ -115 215 -59 -30 180 -154 51 -60 5 -57 100 -319 -157 168 151 55 181 -121 -265 -178 128 -297 -9
723iJ02j79J38j87P5J00k52q3K73J26k03J60k17L41k34J67k82L15j59J18k70M50
$$ -9 93 -86 52 -135 -60 40 -212 -295 -22 104 -99 61 -156 185 -49 118 -164 151 -8 110 -160 290
745B90l74K4J51K58j73j78l9N2o1Q8K3j7j54k57O34j9l62P9p0m9L03j37L8l9j34
$$ 290 -84 -60 91 349 176 -2 -41 11 -50 38 61 44 -110 -367 267 248 -114 -35 -105 -154 149 12 50 11 -123
770a23kK59M1j21K0p6P2n7k48L19k44K01o1O8pp4L8J28k68j61L79K7k73K75j56
$$ -123 -125 134 175 54 74 -2 70 13 -235 84 -160 41 -20 48 41 -33 5 133 -135 -296 83 110 -163 112 -44
795d4j2m0J96m2J11j90jj65K01k6Q2o0n2M1k33j9K51J34o3PPP1j6j22P2J47j56
$$ -44 -56 -96 100 58 169 -21 -22 -187 14 -12 70 10 -42 -1 -234 -253 -2 132 69 76 83 154 138 16 88 235 79
822G9j1J30k42J73K4j89M7M9j15J17j59q4K48m3K8j16Q9p8J2J08j84l6L6J90j60
$$ 79 68 198 -44 129 153 -36 11 60 -55 62 -97 -181 67 24 52 -64 25 -53 -41 67 -117 -153 -117 73 -87
847h7L33j58J84m77J93N1L6K9r5pj68m0M21m02J0J37j17L55j26K0j73K67j4q0
$$ -87 246 88 272 -205 -12 39 75 104 9 2 -166 -206 215 -187 -177 -40 -157 198 72 92 -81 186 172 92
871I2k89J04J37m4L03j56j14J20r5R9J24l58K09j77r4Q5K15l08O2m5J58j62J95
$$ 92 -197 -93 44 0 303 147 33 153 58 157 281 -77 132 -45 -139 -54 161 -147 -85 -130 28 -134 61
894F1L8k08J59m2J64k66J78j39r0L27P2k18L0L6j30p0J44J42N0l88J04N0k7o1
$$ 61 99 -109 50 8 172 -94 84 -55 -145 182 254 36 66 102 -28 -98 46 188 238 -150 -46 4 -23 -84
918h4l8N6Q2J2j12m9J48k00K03q0K31J6l56L61q0j22K97k81J99k92O3l5j79K61
$$ -84 -122 -66 16 28 -84 -133 15 -185 18 -62 169 185 -171 190 110 -12 285 4 203 -89 -26 -61 -240 21
942B1J5J22o5L4j4j27R1l76N7KM65j38k37K92k70J88l8q8K0K13k02L25m54k9K70
$$ 21 36 158 93 127 113 -14 77 -299 -242 -240 225 87 -150 142 -128 60 22 -66 -46 167 -35 290 -164 -193 77
967G7k61p7L07k16M25p9k87L16j8j13N3M8j91N2k46M55l52P2j4j16M7o1J42J55
$$ 77 -184 -261 46 -170 255 176 -111 205 187 74 127 175 -16 36 -210 245 -107 -35 -49 -165 -118 -179 -37 118
991A18j41K2K9j43L06j50O7j07JJ14m22K94l7M9K57l15P5j76M02j90j21M18l94
$$ 118 -23 -1 28 -115 191 41 108 1 2 116 -306 -12 -49 0 257 -58 17 -159 243 53 -68 350 -44
1014d4N1J79p5Q3m75L82j38o3R2q2n0M6l8K8N8L13k56J1K58l43J35J28k74OJ46
$$ -44 7 186 111 194 -281 101 -37 -100 -8 -90 -140 -94 -132 -104 -46 267 11 22 280 -63 72 200 -74 -68 78
1039G8o8L52l44j22r9J77j50K88J0r3L5j3o0K2k17J93j56J03K65m02K55m57L97
$$ 78 10 362 18 -104 -203 -26 -176 112 122 29 64 51 -9 13 -204 -11 -167 -64 201 -201 54 -403 -6
1062fq1J64j8P3j04l8O2l6j25J82p4M6k90M03m8j62J64l2O7l54L57j52k12K36
$$ -6 -87 77 59 132 28 -10 52 16 -109 73 -1 45 -245 158 110 -52 112 80 147 -207 150 -2 -214 22
1086B2O6Llkj51K1K40l49K69k34K05K1k05o9J61n7L75j60l81R3K11j20m9P3PJ44
$$ 22 88 91 88 86 -65 -44 196 -153 116 -118 87 108 -97 -166 -5 -62 313 153 -228 -135 76 -44 -93 -20 -13 131
1112A31l27K72J63r5K7k31j71J80O8J43p1l8P2K62m22N8r8L8M32l89j3J82m4j78
$$ 131 -196 76 239 144 171 -60 -231 -51 17 160 89 51 123 385 -37 21 -77 -39 393 4 -9 173 129 -49
1136d9J59k73M11k09J16q9l0m6J95l68K38L8j05k79J91K89j03l3j19j78L55j8
$$ -49 110 -163 248 39 155 66 36 -10 185 -183 55 93 -12 -291 -100 189 86 53 -66 -244 111 93
1158I3l4P9j03j18J15q4r1j04J75K6J98Pj66j44k7P5J06j23L05K7m86K30q1j1
$$ 93 59 138 35 -83 32 -52 -143 -247 -72 -46 152 159 -7 -151 -178 -103 3 -120 185 212 -274 -44 -125 -136
1182a36J81J54j07K4p1l8K30l37J89j74M2K2K07l68J00J76p0PO6j25j37K47j84
$$ -136 45 199 92 116 45 7 237 -100 89 -85 -43 -21 186 -182 -82 94 24 31 97 -28 -165 82 -102
1205a02J2L4j45J63L11k90J52k72rJ50J66k40J98j08K16r4l2q9J10j29J1k3j53
$$ -102 -90 -56 -201 -38 273 -17 135 -137 -146 4 170 -70 128 20 236 142 110 21 131 2 13 -10 -163
1228a63L25q3j91K83n99M09J14J09k58J29k25L38k64M44j89k97K07r0J20O5l50
$$ -163 162 79 -112 171 -428 -19 95 204 -54 75 -150 188 -76 368 179 -118 89 -1 119 184 -166
1249a66K44L8k63k8J54J54o2K12k21J97k20N1j82j36M83l16l3L87l46p4J71m3
$$ -166 78 116 -147 -175 -21 133 71 283 62 259 39 90 -92 -228 255 -61 -94 293 -53 -127 44 1
1271Al51L30J04j89j94M32r1j74K59j03j66J72j51r5L21r1J5j96J94o4K17k27
$$ 1 -350 -20 84 -105 -299 133 42 -132 127 24 -142 30 -121 -216 105 14 29 -167 27 -37 180 -47
1293d7l2p2J22j08p8n5K60P1O6Jq5k18L00N5j39m5n0L49m74K83K18q6j78j45J03
$$ -47 -79 -151 -29 -137 -215 -270 -10 61 127 128 43 -175 125 180 41 -4 -54 295 -179 104 322 236 58 -87 16
1318A6Q5j10k87K91qN2J80Nl25M33n7l56K44j59k05K8L3J04n1K3J86j91K34q9
$$ 16 101 -9 -296 -5 -13 39 219 224 -101 332 275 -81 163 4 -201 -173 -140 -36 -87 -64 122 -69 165 76
1342G6k84L41j90j02K3R3K27q9j02j5M9L1j54K84k77Q0K88k33K24j89o9K81j71
$$ 76 -208 133 -57 -159 -136 -43 184 95 -7 -22 27 58 -96 188 -89 -9 279 46 270 81 12 293 122
1365A22K4k56N40m44P4N0j42K1j30o7K03n5K58k02M2q2J38N6j77Qk27K68M2K37
$$ 122 146 -110 430 -14 60 110 -32 -11 -141 -208 -5 -60 198 -4 38 -44 94 150 -27 -19 -246 22 64 301
1389C01n5m42K2%L65k09j50R8L24j78k58L28j48j75J19P1j55M3L0J19l37L85k43
$$ 301 246 -196 -174 -174 191 -18 -168 -70 254 76 -182 146 -2 -177 -58 13 -142 -99 -69 50 -287 98 -145
1412a45P2L00l69R8l3j25M48o7o2Q8l01J56m0r5j44J98K09k08m4Q7K7k41J39L08
$$ -145 -73 227 -142 -44 -77 -202 246 179 117 205 -96 60 20 -75 -219 -21 188 -20 -64 23 50 -191 -52 256
1436B56k13pj40M9j97J70K5N0P7J4j04J26r2O3q7q9M4J67p4Q0n1j68J29n9K95
$$ 256 43 36 -104 -55 -252 -82 -57 -7 70 84 -20 106 14 77 -10 -99 -55 112 38 118 67 -101 28 -31 264
1461B64l89K56J97l05l36M61j34N1J2j37J0l5J33r9j42L7J15O7j85J56j51N6M0
$$ 264 -125 131 328 23 -313 148 14 65 77 -60 -50 -85 48 -51 -193 -156 -41 26 -159 -3 -154 -98 -58
1484e8R7K6J94k18m3l01M22J98n55K43N2K50l18O6k64K0K06J8m4J3O3o3qL8N5
$$ -58 39 65 259 41 -2 -303 119 317 -238 5 57 307 -11 55 -209 -189 17 35 -9 4 67 4 -4 34 89
1509H9L3j23p3j9j10K38j49L41k04j21k5M20m2j94j41J43M9q3l52M67ol06O5R3
$$ 89 122 -1 -74 -93 -203 35 -114 227 23 -98 -123 297 255 61 -80 63 112 29 -323 144 138 -168 -103 -10
1533a0k2j37j20K41K60J2j31J77m20J63J77k69J31q6J57p3j63ok1L74l92J13O4
$$ -10 -32 -169 -289 -48 212 224 93 270 -150 13 190 -79 52 -34 123 50 -113 -119 -140 234 -158 -45 19
1556A9j12K13j95p4J97J13m6Q1m06N5L0L23j68l60K09K00M0j08N7q7pO0m2m5m9
$$ 19 -93 120 -75 -149 48 161 115 196 -210 -155 -125 198 30 -330 -121 79 119 11 68 -19 -26 34 -8 -53 -102
1581a02O8J15j11J1J40j74J88j83K47l1k26N9k24K16j7K68l20J0Jj0R6j02j98
$$ -102 -34 81 -30 -19 121 -53 135 -48 199 168 -58 1 -223 -7 -24 244 -76 -66 -65 -75 21 -81 -279
1604b79M71r0q4l9LO5K2k18K83K7q2%L04m82J06k33LJ03K27j17J42k7Jll35J78
$$ -279 192 102 18 -21 -18 47 69 -149 134 161 79 79 383 -99 7 -226 -223 -120 107 -10 132 105 106 103 -232 -54
1630e4l7k8K47J20m30J08K77k92NM3K16j0k67M1J26r3J03n9j31N6J31k72K10L3
$$ -54 -91 -119 128 248 -182 -74 203 -89 -84 -41 175 165 -102 -61 65 -28 75 16 -115 -59 72 -200 10 43
1654D3j28J21J88j86k36J29Q0j90j75K98J14k3r2l9J90j72L21m7j42M4l80J52
$$ 43 -85 36 224 38 -198 -69 11 -179 -354 -56 58 35 -57 -96 94 -78 243 196 54 98 -282 -130
1676a30M4j64N99k74o0j76J95q8J71N3k63L02m19J81J50n1M4N1k27j9L86k84N3
$$ -130 -86 -250 349 75 15 -161 34 -54 117 170 -93 209 -210 -29 121 70 114 165 -62 -81 305 21 74
1699G4J25J29j21m33J76Q0J85o4q0j5J24r0k28J46j12K10m3jj16R1R5k47K45l51
$$ 74 199 328 207 -226 -50 30 215 151 71 56 180 90 -138 8 -104 106 63 62 -54 37 132 -115 130 -221
1723b21K52Q7k56j34M26j48j15J20n1j02O7L2j10J15j1k50L2m1L54K60m69K43
$$ -221 31 118 -138 -272 154 6 -109 11 -40 -142 -75 -43 -153 -38 -49 -299 -267 -308 46 306 -163 80
1745H0k02K54k55J95k75J74J60k30Q8M80l64l3M1m7j36l7O8K9m24L92j16j14N06
$$ 80 -122 132 -123 72 -203 -29 131 -99 -11 469 105 72 113 66 -70 -107 -39 -10 -434 -42 -158 -272 234
1768B34k62m3J45l6L3Lk31K35n6J32k68j25R3J38r3L4q2K16k47J85K18k78J04
$$ 234 -28 -71 74 38 71 74 -157 78 22 154 -114 -239 -146 -8 -101 -67 -149 67 -180 5 223 -55 49
1791D9j39K45k19l8Q9K17q1l67K35N5k14K38j20k2r2J75L39o37mK71J1r2Q7J11
$$ 49 -90 155 -64 -102 -13 204 123 -244 -9 46 -168 70 -50 -72 -164 11 350 -287 -291 -20 -9 -101 -14 97
1815I7Kj44j70P8J23m5j36M39J2j72k9P6l14K74o5jn6J23l8o1O4k7k23J75L4J
$$ 97 99 -45 -215 -137 -14 -59 -195 244 256 84 55 131 -183 91 26 25 -31 92 54 -7 57 30 -193 -18 16 17
1841A7P8j43P7j73L23j49L0m37M74J41k77J2l92N01r1kj9M6N9k8j13J55n3j8p
$$ 17 95 -48 29 -144 179 30 60 -377 97 238 -39 -27 -419 82 -9 -11 -30 16 75 47 -66 89 36 18 11
1866A1K06k35J23P9r4O6k00l74L53n2J13q6J78J08j75R6R2k07J38j96QR7k13L97
$$ 11 217 -18 105 184 90 156 -44 -418 -65 -117 -4 -90 88 196 21 117 209 2 140 -56 -48 49 -164 233
1890B33k63J80j23K06k07r2P9Pk2P2r3r0J78k92K12M5j10P8j06K74p4k16L8j19
$$ 233 -30 150 27 233 26 -66 13 20 -2 70 -23 -113 65 -227 -15 30 -80 -2 -108 166 92 -124 -86 -205
1914b05J53J24l53M38k8l00K55p8J94m09K53K5J39j17k08K44j28J33J34l40J32
$$ -205 -52 72 -281 157 129 -171 84 6 200 -209 44 69 208 91 -117 127 -1 132 266 -74 58
1935E8j78j28J67J18oJ23j5l64j33M17k5J61k34J21l92L66p8J03j64J8J95j04
$$ 58 -120 -248 -81 37 31 154 139 -225 -358 59 34 195 -39 82 -310 56 -22 81 -83 -65 130 26
1957B6l1J84j51l25K55k03j5L60j13L3m5L13j09l2p7j60J03J27p6j88q3l2L85
$$ 26 -5 179 28 -297 -42 -245 -260 100 -13 20 -25 288 179 147 70 -90 13 140 64 -124 -207 -239 146
1980A46k79rJ5q7L52j70RJ18j07l2m4J11j27J65k52J23J18L49m41j36J56j78L70
$$ 146 -133 -142 -127 -214 138 -32 -23 95 -12 -44 -88 23 -104 61 -191 -68 50 399 -42 -178 -22 -200 170
2003A70j47k07K71l9m8J21j86K41k89m2J58k6l1j52K27j7j40R9J14n1n9J36k27
$$ 170 23 -184 87 48 0 121 -65 176 -113 -155 3 -23 -54 -206 21 4 -136 -37 77 26 -33 103 -124
2026a24K97j20K26m36P0M3n8j12K49j12N9J46n0p4P6K5j45L20l38L0M9KJ9K8j50
$$ -124 173 53 279 -157 -87 -44 -102 -214 35 -77 -18 128 78 4 80 105 -40 280 -58 -28 21 23 42 70 -80
2051h0Q0j16M1K5K79j08l19O6l5L55k10r0M53n38M06k10j17O9Q6m6j64J55J99
$$ -80 0 -116 -75 -50 229 121 -198 -132 -167 188 -22 -112 341 -197 209 -1 -118 -49 37 -9 -173 -18 181
2074A81J6p2n6l01N0K90o6L4k92J16L7Q7K54k73Jk40J38j6Q9M3o0P1R8N0p1k6
$$ 181 197 125 69 -232 -182 108 42 76 -216 -100 -63 24 278 5 6 -234 -96 -112 -23 20 -40 31 129 179 108 82
2100H2k59j05K36J71r4o1r3L33j50j03J85j14j83J02m0J86q4R6j69L08l85K30
$$ 82 -177 -282 -46 125 31 -30 -123 210 60 -43 142 28 -155 -53 -93 93 9 105 -64 244 -141 89
2122H9Rn5r4J34k04O8mJ10j24q9K03j48L25k71oJ25R6k13J27l2J04k3K2j19l06
$$ 89 98 43 -51 83 -121 -53 -57 53 -71 -160 43 -105 220 -51 -57 68 164 -49 78 46 150 127 149 30 -276
2147b76L11j56j8q5J58N6j38l7K7L23J5l74K06j69L0L60k47J50j24L5j1r4J54
$$ -276 35 -121 -139 -224 -66 -10 -148 -185 -158 165 180 -194 12 -157 -127 233 -14 136 12 47 36 -58 96
2170I6Q3k03J04K08k0m40K21J37l02J96P3j35MK4J31k08j09J90l06mK18j4L1p1
$$ 96 179 -24 80 288 268 -172 49 186 -116 80 153 18 22 46 177 -31 -140 50 -256 -260 -42 -56 -25 -96
2194i6kK7m1O9j84K86j15R3J21j33J44j86j24M22m94K31j26J10J27j26j14J13
$$ -96 -98 -71 -112 -43 -227 59 -56 37 158 25 169 -17 -141 281 -213 18 -108 2 129 3 -111 2
2216Bn9L02k70R8M5o9L9j05j04J79j63Q4K42n6n00K94m3M6Lj9J75q4J2Kk46L0
$$ 2 -57 245 -25 73 118 49 88 -17 -121 58 -105 -21 221 165 -335 -41 -84 -38 -35 -54 121 37 49 51 -195 -165
2242a65J90K28L9l65J56j5m5oR3j19O2k4p2J6j83J41m7OnK59k34m8K52k05J84
$$ -165 25 253 292 -73 83 68 23 17 110 -9 53 29 -43 -27 -210 -69 -116 -110 -115 144 -90 -138 114 -91 93
2267I3k10L2L12k95q6J19P7m2P1j29J09k58J04M2J80j55mJ4K25l76J10n5Q6m0
$$ 93 -117 -85 227 -68 -154 -35 42 0 71 -58 51 -207 -103 -61 119 -36 -40 -26 199 -177 -67 -122 -36 -76
2291g6q5M09l12M4L78k66j21K84l70P7j54K50J45m61K19k50J98J02Q8k05J27l
$$ -76 -161 248 -64 -20 358 92 -29 255 -115 -38 -192 58 203 -258 -39 -289 -91 11 99 -106 21 18
2313A8q9jJ71m9m3q2R4l3j42K99j30j20K27k41L74j00k28K1o0J53M9j91j30K63
$$ 18 -71 -72 99 50 7 -75 19 -14 -156 143 13 -107 120 -121 253 153 -75 -54 -114 39 88 -103 -233 30
2337C0R9M7j85n6P6J0k1j85K26j4k17L72k88K48j48k04N4L40k56r5L34l11n2K95
$$ 30 129 176 -9 -65 11 21 0 -185 41 27 -190 182 -106 142 -6 -210 -156 184 -72 -167 167 -144 -196 99
2361I9L5q5j11K06k06j58M24n52J84k2K59M6l14J45o0M0J17J71j56oJ67k37K10
$$ 99 134 49 -62 144 -62 -220 204 -348 -164 -186 73 119 -195 -50 -110 -70 47 218 62 56 223 -14 196
2384A96Kk66KR7jp4k02M34P0m69K64k22M4M1J97K0l75K01J86n3l31M12m0k56K31
$$ 196 198 -68 -66 31 30 -44 -246 188 258 -211 53 -169 -125 -84 113 133 -242 -41 145 92 -239 173 133 -123 108
2409A08J07m26L45j61K58l16K88k62J42P2j24l06K95K66k03k59L10l86J71o9J06
$$ 108 215 -211 134 -27 231 -85 203 -59 83 155 31 -275 20 286 83 -176 134 -252 -81 -150 -44
2430d4P9J22l41K15l4k09M93n29J51m2J24J4k53K19P6L3R7j76Q4k44K60j64j03
$$ -44 35 157 -184 31 -3 -212 281 -248 -97 -139 -15 -1 -254 -35 41 74 171 -5 79 -165 95 -69 -172
2453a72L12l5k62O5k41N43k33K46k28k53O5J52j1k80N54k15J39n2j86Q9j19J23
$$ -172 140 105 -157 -92 -333 210 -23 223 -5 -258 -193 -41 -52 -332 222 7 146 94 -92 -3 -122 1
2475AK01p6j79J83l56L06p2k06j46L10P9J23k18K03l73K25j42L19q2j67L71k99
$$ 1 202 126 -53 130 -226 80 8 -198 -344 -34 45 168 -50 153 -220 5 -137 182 100 -67 304 5
2497Ek22K00K88n29M45k06j61M13n26L66J21l03M0K1K13j67j60P2K19j74J49j51
$$ 5 -217 -17 271 -258 187 -19 -180 233 -293 73 194 -109 -69 -48 165 -2 -162 -90 129 -45 104 -47
2519d7K7k4N9K19j12k81K77K3m11R0J76K09k45m3k34K29M9J22r9j05o2M30m21
$$ -47 -20 -44 15 234 122 -159 118 141 -270 -180 -4 205 -40 -83 -317 -88 -39 83 -16 -121 -183 247 -174
2542a74K84l08K08J59j97J77l1j63j60K24m9j36R9r4K45qK49n36J02L22m7m02
$$ -174 110 -198 10 169 -28 149 118 -45 -205 19 -30 -166 -67 -161 84 76 325 -211 -109 213 166 -236
2564b36K75J8k57J5N7P2K47j40r0Q1J07n1M7r6p6j57o0Q5K25j96L7k5J71qjK05
$$ -236 39 57 -200 -185 -128 -56 191 51 -39 42 149 98 145 49 -27 -184 -244 -159 66 -130 -93 -118 53 45 44 249
2590B49k88Q2m0Mj40O5J8J31p8R9k90K94N2k61K20j55m1K56q8l47K88l2j98J06
$$ 249 -39 43 3 7 -133 -68 -50 81 3 102 -188 106 158 -103 117 -38 -79 177 89 -258 30 -2 -200 -94
2614i4J96k36J91l02J50J44j0lJ1O9j6o7j16p7J97K3J1l42L29q7lp3J47J46j79
$$ -94 102 -134 57 -245 -95 49 39 36 47 116 100 33 -83 -160 37 60 71 -271 58 -29 -32 -105 42 188 9
2639Ij16p2q8J48k2K15l51P8K47j49R7j77L40k77l3o6K48q8O9K52k24Jj50j8K74
$$ 9 -107 -179 -267 -119 -141 74 -277 -199 48 -101 -4 -181 159 -118 -151 -217 31 -57 12 264 40 41 -109 -127 147
2664A47p9J04r5k20pL05j05k11J08oJ36L0k50J90q5M7k35J31J70o7j71J62n7J13
$$ 147 68 172 77 -143 -150 155 50 -161 -53 -59 77 107 -143 47 -38 9 -226 -95 75 8 -163 -1 -58 55
2688E5j47J10j35J94j77k6J75l1N4oP9j22r4J10J20j30J32k00K07q6j26QK16L8
$$ 55 -92 18 -117 77 -100 -126 49 18 72 66 145 23 -71 39 159 29 161 -39 168 82 -44 -36 180 218
2712B18k00O0j99j9j22M6L73R3j28k85K88k03K52j45K51j30j15K25j86N1O4j81
$$ 218 18 78 -121 -140 -262 -216 157 250 122 -163 125 -78 174 29 280 150 35 260 74 125 189 8
2734HJ60k20K2J02L2j51P6J68k76L34k14k09K13O0o1j29K01r2M2J50J4j97j77
$$ 8 168 -52 -30 72 104 -47 29 197 -79 255 41 -168 45 105 44 -85 116 24 66 216 230 33 -144
2757a44k6L22j10J02j46j83J49p3k80L03K75j04k78J64M0k57J44pJ47k87P1M04
$$ -144 -170 152 42 144 -2 -185 -36 -109 -389 -86 189 85 -193 -29 11 -246 -102 -109 38 -249 -178 226
2779B26k67J70k02J4o2O5Qk2k06K04L1N3J99k82L0j07o8M07n2j72J7r2O8J4N6
$$ 226 -41 129 -73 -59 -121 -56 -48 -70 -276 -72 -41 12 211 -71 -41 -148 -216 191 139 -33 -16 -108 -40 -26 30
2804C0m8J55Rj42o3N0O5mk15L12l95K44m8K65j30l1j83J11j77J07L4o7K46R0j39
$$ 30 -18 137 146 4 -59 -9 56 52 -163 149 -246 -2 -50 215 85 54 -129 -18 -195 -88 -54 -121 125 215 76
2829G6n10L10K71J5k35J06R9l5j98L3oK97q1k89J46p3k35K50L41k36j59J21r3
$$ 76 -434 -124 147 162 -73 33 132 97 -101 -68 -74 223 142 -147 -1 -74 -309 -59 282 46 -113 8 -85
2852h5J19q3n4l6N36m59Q2o4k7P9p9j57K60J44k31j24K76k06L48p8j11L9J4l99
$$ -85 34 -49 -103 -139 397 -62 20 -44 -71 8 -71 -228 32 176 -55 -179 97 -109 239 161 50 89 103 -296
2876b96L67M2k44K04l36J72J69Q0mk15j35K90Q7l35J99r7K39O3k40J80j43L6k42
$$ -296 71 113 -131 73 -263 -91 78 158 154 -61 -196 94 181 -154 45 -52 187 250 10 190 47 83 -159
2899a59L06J18k48K8j70J92m00L12o5K30k52o4K11j21j19K10m3Q2O7j29j27O6
$$ -159 147 265 17 45 -125 67 -333 -21 -86 144 -108 -172 39 -82 -201 9 -34 48 115 -14 -141 -75
2921g5K7L08k1j23j15j73K5J95Q3k93J44o9R7j40P5j2K85k26r4K46O5n52L82j10
$$ -75 -48 260 239 116 1 -172 -147 48 131 -162 -18 -87 10 -130 -55 -67 218 -8 -102 144 209 -343 39 -71
2945g1R5m7j49K78L5j95n7J88o2o1p7O0L6n3K79j41J65k29j22k3L8R0m9J08k34
$$ -71 24 -23 -172 106 141 -54 -111 77 15 -46 -123 -63 -27 -80 199 58 223 -6 -128 -151 -113 -23 -72 36 -198
2970a98J24J06j08N2Q0j5r5o4P8o3J90l7n9P7M1j82p5oJ23J25J17j59m7p2j1j55
$$ -198 -74 32 -76 -24 56 41 -54 -118 -40 -103 87 50 -9 68 109 -73 -148 -154 -31 94 211 52 5 -67 -78 -233
2996b33L92m01J59n7j00M1M7J84j06j37K61J2Jn2K42j56N1l5l42K96k68M13k17
$$ -233 159 -242 -83 -140 -240 -199 -152 32 -74 -211 50 62 63 11 253 97 148 113 -229 67 -201 212 -5
3019eo8M2N1j71P6L5m9R5J60l19K88k86K39k53K41l64K03K71m9N7k23r8L02R5
$$ -5 -73 -31 20 -151 -75 -40 -89 6 166 -153 135 -151 88 -165 76 -288 -85 186 137 194 -29 -127 175 270
3043B70k76n5J37j42n2K2j65K06l8K63l66M42n9k14k47L25r2P4l6j59K57j46q5
$$ 270 -6 -61 76 -66 -118 -96 -261 -55 -93 170 -196 246 187 -27 -274 51 -41 33 -3 -162 95 -51 -136
3066a36m15O03l1o8J34j70L3J39k55K84j13J62j18nj03K60j82J3J66j94NK17l11
$$ -136 -551 52 21 -47 87 -83 -50 89 -166 118 5 167 49 44 -59 201 19 32 198 4 9 226 -85
3089h5j8L7J83l7j46J04j94K4L02j39N3L2m6L7n8j72N0p6Q1N0j4J15O3q4j65J48
$$ -85 -103 -66 117 80 -66 38 -156 -132 170 31 84 116 70 107 49 -123 -73 -149 -68 -18 -32 83 146 62 -103 45
3115D5j17r3J75J1j09J17k70J76k56K50K17k99J80j45J60m9j12j76PK12J38o6
$$ 45 -72 -165 10 21 -88 29 -241 -65 -321 -71 146 -153 27 -118 42 -7 -119 -295 -288 -76 62 -4
3137dk57L19L0r8m3J19l1K3k43Q6Q2N8n2J13N1k10J86j37j54R2J42K1k13K28J01
$$ -4 -261 58 88 -10 -53 66 35 58 -185 -99 -17 41 -11 102 153 -57 129 -8 -162 -70 72 93 -120 108 209
3162B09k24RJ59k78j24M14j27R3j95M1j12R9J79j50k0k3K13j53j16K48n4j34n3
$$ 209 -15 -6 153 -125 -249 165 38 131 -64 -23 -135 -36 143 -7 -27 -50 163 10 -106 142 88 -46 -99
3185i9J48o0p1J14J73o9j63k37K29K2j38K72K6Jp2l0j07n7K21L9m2m8P8j29M28
$$ -99 49 -11 -82 32 205 136 -27 -264 -35 -13 -151 121 147 148 76 46 -61 -118 103 142 100 52 130 1 429
3210D29m59p8R0k03o9M64m24J63j6j51K98k1p7n8j1k6m4J78O8Kl0j81r5M46l49
$$ 429 -30 -108 -18 -221 -290 174 -250 -87 -103 -254 44 23 -54 -112 -123 -149 -193 -15 53 55 25 -156 -251 195 -154
3235a54R2J25j52J73jj97k9L70l25m4K10M2j20M3j40K72k58k15L99k44M22l15
$$ -154 -62 63 -89 84 83 -114 -143 227 -98 -142 68 110 -10 33 -107 165 -93 -308 91 -153 269 -46
3257d6P6m9R0n6n4J32j02j76J69K07j17J05j54P3j18jq6O6M10k27j46m4p2j2J02
$$ -46 30 -19 71 15 -39 93 -9 -185 -16 191 74 179 25 98 -20 -21 -107 -41 369 142 -4 -48 -120 -132 -30
3282c0j17j20L68P5l8j98L58m63J57j03J04k82N30m4j8l99K47K06m68L38j96j08
$$ -30 -147 -267 101 176 138 -60 298 -165 -8 -111 -7 -289 241 197 179 -220 27 233 -235 103 -93 -201
3304b01J49m2J44m7N7l70M88n1k71M38j60m8k74K69N9J09l34K59j97l34J89M9
$$ -201 -52 -94 50 3 60 -310 178 127 -144 294 134 86 -188 81 140 249 -85 174 -23 -357 -168 -119
3326a19M16m64O3R9rP0J61j63J8p7K5k37M07k90J6m6J63J40k54p9J32m5J40o2
$$ -119 297 -167 -104 -5 -14 56 217 54 72 -5 20 -217 190 -100 -84 -130 33 173 -81 -160 -28 -73 67 5
3350EJ12j34K8l00M3L68p2J60j69J66j13l3lk30q0J33K72j19k2m0J4q8n3K49j30
$$ 5 117 -17 11 -289 -246 122 50 210 41 207 94 61 58 -172 -252 -119 153 34 12 -28 -14 -102 -155 94 -36
3375c6O6n3N0P2r3K49l07Q4J13j09J07m7j27J6k03L35k48J20J65N6k16r0L19l36
$$ -36 30 -23 27 99 6 255 -52 32 145 36 143 96 -31 -15 -218 117 -131 -11 154 210 -6 -96 223 -113
3399a13K59j25k89K35J77l7j35N9R9pm16M15l1kk1j84q7P5K52j54J62o1j07R1
$$ -113 146 21 -268 -33 144 107 -28 31 130 123 -293 122 91 89 68 -116 -203 -128 124 -30 132 71 -36 55
3423E5J80o5O9l59J27J56j74K97l97o5o9N31p7k83j37J77L04k56l2jk06J46J97
$$ 55 235 170 239 -120 7 163 -11 286 -111 -176 -245 286 209 -74 -211 -34 270 14 -18 -19 -225 -79 118
3446A18k96J80q5J01P6J5kj53K85j21l3p4j24K01j82kP5k11O40m14Jj38L7j28
$$ 118 -178 2 -83 18 94 109 107 -46 239 118 85 11 -113 88 -94 -96 -21 -232 408 -6 -5 -143 -106 -234
3470b34L69j98K7J18j2j96q6L62o9l52P5J08K22l40L1K03l3K87p1o8J61m52L51
$$ -234 135 -63 -36 82 70 -126 -212 150 81 -271 -196 -88 134 -206 -175 28 -5 282 211 143 304 -148 203
3493B03N5l08J32j27O1j96K88j69J26PM09m10k02L48k22j34N4m6j65L12j70K49
$$ 203 258 -50 82 -45 16 -180 108 -61 65 72 481 71 -131 217 -5 -139 -85 -131 -296 16 -154 95
3515I5J54k48rL6L7J44j57k4p6q9J86j44j3L53p4n6j92r7K25m5j12R5nk79o4N37
$$ 95 249 1 -8 28 65 209 52 28 -48 -137 49 -95 -108 245 171 115 -77 -174 51 6 -106 -11 -16 -295 -359 178
3541A78k04k11K86m1k4j56K40l54L04j04L28l42j9J35m31K98J1k05L67k20K85
$$ 178 -26 -237 49 8 -16 -172 68 -286 18 -86 242 -100 -119 16 -415 -117 -106 -311 56 -164 121
3562A21k75O7P5J16Q3k71L53j07j8k88L60k66p3K04L2p6j10n0jK14R9j07P2n9
$$ 121 -154 -87 -12 104 187 -84 269 162 144 -144 216 -50 -123 81 113 37 -73 -123 -124 90 189 82 154 95
3586I5k83J29l1R7q2M8M38j62l37L97n70M66j91k1n5J26j92N2J07j50K8K20k10
$$ 95 -188 -59 -90 7 -75 -27 411 249 -88 309 -261 205 14 -7 -62 64 -128 -76 31 -119 -91 129 -81
3609h1L9J79j66k1J37k98K65j29l9P1k26L38j52J68OO1K3l77L22r6j10K73m46
$$ -81 -42 137 -29 -50 87 -211 54 -75 -114 -43 -269 69 -83 85 91 152 175 -202 120 24 -86 187 -259
3632b59L26N4k17p1J95j9J09k84L7K8J62o0j68J28j35L16j39k4n5m2O5J16r0Q4
$$ -259 67 121 -96 -167 28 9 118 -166 -129 -101 61 1 -167 -39 -174 142 3 -21 -76 -118 -53 63 -27 57
3656E7J40k44J88q4n0j34J8M03n05J72j75L11J2k02o2J34Rj77j43K11J26K3O3
$$ 57 197 -47 141 57 7 -127 -109 294 -211 -39 -214 97 109 -93 -155 -21 -12 -189 -332 -121 5 28 91
3679I1k38L69J2n02L79Qk50M0q1K35O9l80mK63k69L30k85K90j4J79j94J04J6j96
$$ 91 -147 222 234 -268 111 119 -131 -91 -172 63 132 -248 -252 11 -258 72 -213 77 63 242 48 152 168 -28
3703b8O5J33k42K83m04J2K44j09J46k1q4r3L04j27J00o9j62m0O1j5J68l19J91
$$ -28 37 170 -72 211 -193 -181 63 -46 100 79 -5 -98 206 79 179 110 -52 -92 -31 -46 122 -197 -6
3726fk1K2R0j81J67l50K83n6p7J15j87l9L09P8j06k8j01O1K29N3j61l94L14O4
$$ -6 -27 -5 85 -96 71 -279 4 -52 -129 -14 -201 -240 69 147 41 13 -88 -27 202 255 94 -300 14 78
3750G8k13J47pR7j62o1m6L95k20k5L73l06J68m54R5M46k60qMJ12o9k59K72l1k58
$$ 78 -135 12 5 102 -60 -121 -167 228 8 -17 356 50 218 -236 -141 305 45 37 41 153 84 -175 97 66 -192
3775a92K78j40J25j11K47l4l62K34k81J11L44k63K17l90J99K13j16l43M62k21
$$ -192 86 -54 71 -40 207 173 -189 45 -236 -125 219 -44 173 -217 -18 195 79 -264 198 -23
3795b3l58P49l95J36K53j69l75L18j86K11j32k39M52j57j46M8j17j99M79j99n5
$$ -23 -381 368 -27 109 362 193 -182 136 -50 161 29 -210 242 85 -61 -13 -130 -329 150 -49 -104
3816a04L9j03J07rj4J18L6N7k0k7k55J04j99K65j61L87k00M58p24J09K81l74K59
$$ -104 -65 -168 -61 -70 -84 34 70 127 107 80 -175 -71 -270 -5 -166 221 21 479 -245 -136 145 -229 30
3839C0J08l41P2J46k49J28K39k9k8j30J87k14L3N4k0L05l65J45k41qK85o38M99
$$ 30 138 -203 -131 15 -234 -106 133 104 76 -54 133 -81 -48 6 -14 291 -74 71 -170 -178 107 -531 -32
3862c2O6k57K75k30J64OJ82j74KJ8j7J8K0j02O8k8M3Rk07J64O6j5j2N6j09O9l9
$$ -32 34 -223 52 -178 -14 -8 174 0 2 20 3 21 41 -61 7 -21 22 31 -176 -12 54 39 27 83 -26 43 4
3889Dl68L11M4J33r2j23N1r1M1K95j37kL06k86J87j66%j56k09M3L72k71M95n78
$$ 4 -364 -53 -9 124 32 -91 -40 -131 -90 205 68 66 372 86 273 107 107 -49 -258 -215 157 -114 381 -197
3913a97M5R9o8K35r7R0m6q9j60Q7J89p2L9m19L27n3qpO4R6k13M8L44l99J08J04
$$ -197 -152 -53 -121 114 17 107 61 -28 -188 -101 88 16 55 -364 -37 -90 -98 -105 -41 55 -158 -110 234 -165 -57 47
3939D7Q9Rj51j38L48j83k71Q7Q5p3K59J5m4L2k73L03Nj68O2K58m56K5N5J78O9
$$ 47 136 145 -6 -144 204 21 -250 -163 -78 -151 108 123 79 111 -162 141 146 -22 40 298 -158 -133 -78 100 169
3964A69K4k11J23l4jj9k22J42n0K01J23j82O5l70J28J49m0L57l60k10N3K07N3
$$ 169 193 -18 105 71 70 51 -171 -29 -79 122 245 63 128 -242 -114 35 -5 352 -8 -218 -165 42 95
3987I5q5k9PJ39j99J99j5l07K50K7m0k3m0j45R4J33j48j83L40l4j40K61l22J18
$$ 95 10 -19 -12 127 -72 127 112 -195 55 82 42 19 -21 -166 -72 61 -87 -270 70 36 -104 157 -165 -47
4011d7K33j12j65K22k88K99j88j13N1K68l50K35l3R3k94P1n4J73j59J77M9k40
$$ -47 186 74 -91 131 -157 142 -46 -159 -108 160 -190 45 12 105 -189 -118 -172 1 -158 19 68 -172
4033a72J43M6K69l48Qo1O0K62k66l3N5r1J54J39l05J37R6j66JJ54l08K80k55L22
$$ -172 -29 17 286 -62 -54 -115 -55 207 -59 -92 -37 -128 26 165 -140 -3 93 -73 -72 82 -226 54 -201 121
4057A21j20j22K38J68k6l36J32K52m18K53j98O7J82l22J36P0N7L6q6r3l8P4J07
$$ 121 1 -121 117 285 259 -77 55 307 -111 142 -56 11 193 -129 7 77 134 170 84 -9 -47 27 134
4080A34l17K32n3j61K81p4l10K49j51J63J11o0j14%Q3J7j51J27J4K4pM6m2r5L
$$ 134 -183 49 -4 -165 116 42 -268 -19 -170 -7 104 44 -70 -70 13 30 -121 6 20 44 37 83 41 -54 -51
4105e1K61K7l27j56M35l61L29N3l46N8k7J76j26jL0N9j01o3R1j54J24J40J08l03
$$ -51 210 237 -90 -246 189 -172 157 210 -136 -78 -105 71 -55 -56 -26 33 -68 -131 -40 -194 -70 70 178 -125
4129a25J24j83K50K40k12J36m23M33j97J95j85L3l08L14j68j94K69l7K06J15j78
$$ -125 -1 -184 66 306 94 230 -193 240 43 238 53 86 -222 92 -76 -270 -1 -38 168 283 105
4150A05j74r9J43j3M8R4j48qj85M07l30J40J19L0p4m9k81L25P4J04j19k37J52
$$ 105 -69 -168 -25 -38 10 104 -44 -52 -237 170 -160 -20 99 129 55 6 -275 50 124 228 109 -128 24
4173B4p5J01n0J6R0j97J51j92L9J32J54n9l9j28O8r5PJ13k4Rj45J49j59j9J24
$$ 24 -51 50 0 16 106 -91 60 -132 -93 39 193 134 95 -33 35 -60 -53 60 36 45 -100 49 -110 -129 -5
4198eJ50p8N4j73O5j25r7K19Q1p9NJ56r2r5N5K7R8J09m00k29J78LJ9J44j08O0
$$ -5 145 67 121 -52 13 -112 -209 10 91 12 17 173 81 -14 41 68 166 275 -125 -354 -176 -173 -154 -10 -118 -58
4224e8j17L70j30q2j7j55L07J30l09N2M1J78J2j41j68L09j34k68P5O3J15Q9q6
$$ -58 -175 195 65 -17 -34 -189 118 248 -61 -9 32 210 222 81 -87 222 88 -180 -105 -42 73 162 76
4247G6J23j13j11K79k51m4K23j04q0j53J50R5l1j96J22L20m29Q8N1k30%lK39K02
$$ 76 199 86 -25 254 3 -41 182 78 -2 -155 -5 90 59 -137 -15 305 -124 -36 15 -215 -215 -218 21 223
4271B23n34M05p4j21l1J14m6K03m0j22J2J4k3RJ07k9k0j61J40j90K54j05J48n
$$ 223 -311 94 20 -101 -132 -18 -64 139 99 -23 -11 3 -20 -11 96 67 47 -114 26 -164 90 -15 133 128
4295A28j71q6M5k0J53j8q4J17l2L3j22K13o5oJ2N5k6r1J29m77M75j80K78m14J77
$$ 128 -43 -129 -84 -104 49 31 -53 64 32 65 -57 156 91 85 97 152 126 35 164 -313 162 -18 260 -154 23
4320B3K11k09L9l08R8J75j84N7L97k61n0o0R0n1J08J67l40j7l4L09p3J40m47O6
$$ 23 234 25 64 -244 -146 29 -155 -98 299 38 -12 -72 18 -33 75 242 -98 -115 -149 160 87 227 -220 -154
4344a54o5J64K41n23M70j39R0L7k12L64l58o6oJ50p5q8K76q0k1j33K26q9p1M9
$$ -154 -219 -55 186 -337 133 -6 84 121 -91 273 -85 -151 -157 -7 -82 -170 106 26 5 -128 98 9 -62 -13
4368a3o6j55R5N0j21NJ35J80l5p1J17j48o4J92m14J93K83k74L6L19J12n20K14
$$ -13 -79 -234 -139 -89 -210 -205 -70 110 75 4 121 -27 -91 101 -313 -120 163 -111 -75 244 356 -164 50
4391E0n7j98L50k37j8O1J10r8J0J4K1l3J9o2K16j20J6k53J52K13j94j25O1J93
$$ 50 -7 -205 145 -92 -110 -49 61 -37 -27 -13 8 -25 -6 -68 148 28 44 -209 -57 156 -38 -163 -102 91
4415I1R8l51M94o13M75j48j9p1nq4J53r2K14l29K84J9j94R1J9N8j81N4oQ1J07
$$ 91 189 -162 332 -281 194 46 27 -44 -49 -133 20 -72 142 -187 97 116 -78 13 32 90 -91 -37 -43 38 145
4440A45Q4k42q7K46l11N2K58Kk32o2K81k74J32p4J73l9k35J30J56m1j52J96J32
$$ 145 229 -13 -100 146 -165 -113 145 147 -85 -147 134 -140 -8 -82 91 52 -183 -53 103 62 -90 106 238
4463B38l48L31k04k88M5K81m1L2j3J44m06M40k5K4k16L5j89K48p6J23n3J86k28
$$ 238 -110 221 17 -271 -226 55 14 46 33 177 -229 211 186 210 -6 29 -160 88 12 135 82 268 40
4486D0j82P7j02M76l01M04m07n5k96L45j87K22k9q7q3L09k42m2R5L5Q3j83R3K91
$$ 40 -142 -65 -167 309 8 412 5 -50 -346 -1 -188 34 5 -82 -165 144 -98 -140 -45 -10 73 -110 -17 274
4510B74k68J22pj96P9J88m14r1J05K40N3j47J5O2P4L2j25r3J82R4j48J6l5R3k06
$$ 274 6 128 121 -75 4 192 -222 -313 -208 32 85 -62 -47 15 89 121 -4 -97 85 179 31 47 12 105 -101
4535a01J24Rj33L82k13J64j73j02O3k09J53j23K10R8k22o6L33j62J14M0k12Mn7
$$ -101 23 32 -101 281 68 232 59 -43 20 -189 -36 -159 51 149 -73 -139 194 32 146 186 -26 -22 -79
4558g9K4o4J00j73l7J12J91k10L72j93K49j19j34m6k2J92o0lj24j9M34m47k7K2
$$ -79 -55 -119 -19 -192 -229 -117 74 -136 236 43 292 173 39 -7 -29 163 103 100 -24 -43 391 -56 -83 -61
4582f1k45J45L23l33Q0J36r0J43l4Kk30Q0J53k38M27k41J3j58K45l5j90O5L0j1
$$ -61 -306 -161 162 -171 -91 45 -45 98 64 66 -164 -84 69 -169 258 17 30 -128 117 82 -108 -43 -13 -24
4606b4j05L55k37O8pr0K05l36K95k26J22j56p6J60L1K0O6K07m90J81r8m4K83l3
$$ -24 -129 226 -11 57 50 -40 165 -171 124 -102 20 -136 -212 -52 -21 -1 65 272 -218 -37 -135 -179 104 71
4630G1j01J18l4l8j51L65l48J08q3P5L07k37nJ19l58J31J36Jk42k2K51l38L38
$$ 71 -30 88 54 16 -135 230 -118 -10 -93 -18 289 52 47 166 -192 -61 75 76 -166 -188 63 -275 63
$$ [...]
8191b57
##END NTUPLES=NMR FID
##END=
