##TITLE=1H_CA-8016-2-1
 CDCl3, 8 sc, 
 16.1.2019
##JCAMPDX= 6.0         $$ Bruker NMR JCAMP-DX V2.0
##DATA TYPE= NMR FID
##DATA CLASS= NTUPLES
##ORIGIN= UXNMR, Bruker Analytische Messtechnik GmbH
##OWNER= root
$$ XWIN-NMR		Version 3.5
$$ Wed Jan 16 13:55:32 2019 Russian Standard Time (UT+4h)  she@DPX200
##.OBSERVE FREQUENCY= 200.1313
##.OBSERVE NUCLEUS= ^1H
##.DELAY= (6, 6)
##.ACQUISITION MODE= SIMULTANEOUS
##.ACQUISITION SCHEME= undefined
##.AVERAGES= 8
##.DIGITISER RES= 18
##SPECTROMETER/DATA SYSTEM= spect
##.PULSE SEQUENCE= zg30
##.SOLVENT NAME= CDCl3
##.SHIFT REFERENCE= (INTERNAL, CDCl3, 0, 15.7039)
##AUDIT TRAIL= $$ (NUMBER, WHEN, WHO, WHERE, WHAT)
$$ ##TITLE= Audit trail, XWIN-NMR		Version 3.5
$$ ##JCAMPDX= 5.01
$$ ##ORIGIN= Bruker BioSpin GmbH
$$ ##OWNER= she
$$ F:/spectra/data/she/nmr/H-F/1/audita.txt
$$ ##AUDIT TRAIL=  $$ (NUMBER, WHEN, WHO, WHERE, WHAT)
(   1,<2019-01-16 13:54:49.75 +0400>,<she>,<DPX200>,
      <created by zg, POWCHK disabled, PULCHK disabled
       configuration hash MD5:
       00 E9 B6 7A A2 85 ED C7 34 08 36 98 17 FE 4E 26
       data hash MD5: 16K
       28 7A C6 91 07 B4 F6 B4 CB 58 F9 42 60 E7 AE 89>)
$$ ##END=
$$ 
$$ hash MD5
$$ D6 19 31 35 67 1D A8 3C 00 5C 69 26 2F C0 D6 62
##$RELAX= 
##$RELAX= 
##$RELAX= 
##$RELAX= 
##$RELAX= 
##$RELAX= 
$$ Bruker specific parameters
$$ --------------------------
##$DU= <F:/spectra>
##$EXPNO= 1
##$NAME= <H-F>
##$PROCNO= 1
##$TYPE= <nmr>
##$USER= <she>
##$AMP= (0..31)
100 100 100 100 100 100 100 100 100 100 100 100 100 100 100 100 100 100 
100 100 100 100 100 100 100 100 100 100 100 100 100 100 
##$AQSEQ= 0
##$AQ_mod= 1
##$AUNM= <au_zg>
##$AUTOPOS= <>
##$BF1= 200.13
##$BF2= 200.13
##$BF3= 200.13
##$BF4= 200.13
##$BF5= 200.13
##$BF6= 200.13
##$BF7= 200.13
##$BF8= 200.13
##$BYTORDA= 1
##$CFDGTYP= 0
##$CFRGTYP= 5
##$CHEMSTR= <none>
##$CNST= (0..31)
1 1 145 1 1 1 1 1 1 1 1 1 1 1 1 1 1 1 1 1 1 1 1 1 1 1 1 1 1 1 1 1 
##$CPDPRG= <>
##$CPDPRG1= <>
##$CPDPRG2= <>
##$CPDPRG3= <>
##$CPDPRG4= <mlev>
##$CPDPRG5= <mlev>
##$CPDPRG6= <mlev>
##$CPDPRG7= <mlev>
##$CPDPRG8= <mlev>
##$CPDPRGB= <>
##$CPDPRGT= <>
##$D= (0..31)
0 1.2 0 0 0 0 0 0 0 0 0 0.03 0 0 0 0 0 0 0 0 0 0 0 0 0 0 0 0 0 0 0 0 
##$DATE= 1547632489
##$DBL= (0..7)
120 120 120 120 120 120 120 120 
##$DBP= (0..7)
150 150 150 150 150 150 150 150 
##$DBP07= 0
##$DBPNAM0= <>
##$DBPNAM1= <>
##$DBPNAM2= <>
##$DBPNAM3= <>
##$DBPNAM4= <>
##$DBPNAM5= <>
##$DBPNAM6= <>
##$DBPNAM7= <>
##$DBPOAL= (0..7)
0.5 0.5 0.5 0.5 0.5 0.5 0.5 0.5 
##$DBPOFFS= (0..7)
0 0 0 0 0 0 0 0 
##$DE= 6
##$DECBNUC= <off>
##$DECIM= 32
##$DECNUC= <off>
##$DECSTAT= 4
##$DIGMOD= 1
##$DIGTYP= 9
##$DL= (0..7)
0 120 120 120 120 120 120 120 
##$DP= (0..7)
150 150 150 150 150 150 150 150 
##$DP07= 0
##$DPNAME0= <>
##$DPNAME1= <>
##$DPNAME2= <>
##$DPNAME3= <>
##$DPNAME4= <>
##$DPNAME5= <>
##$DPNAME6= <>
##$DPNAME7= <>
##$DPOAL= (0..7)
0.5 0.5 0.5 0.5 0.5 0.5 0.5 0.5 
##$DPOFFS= (0..7)
0 0 0 0 0 0 0 0 
##$DQDMODE= 0
##$DR= 18
##$DS= 0
##$DSLIST= <SSSSSSSSSSSSSSS>
##$DSPFIRM= 0
$$ [...]
##$SUBNAM2= <"">
##$SUBNAM3= <"">
##$SUBNAM4= <"">
##$SUBNAM5= <"">
##$SUBNAM6= <"">
##$SUBNAM7= <"">
##$SUBNAM8= <"">
##$SUBNAM9= <"">
##$SW= 20.0189088683792
##$SWIBOX= (0..15)
0 0 2 0 0 0 0 0 0 0 0 0 0 0 0 0 
##$SW_h= 4006.41025641026
##$TD= 16384
##$TD0= 1
##$TE= 0
##$TE2= 300
##$TE3= 300
##$TEG= 300
##$TL= (0..7)
0 120 120 120 120 120 120 120 
##$TP= (0..7)
150 150 150 150 150 150 150 150 
##$TP07= 0
##$TPNAME0= <>
##$TPNAME1= <>
##$TPNAME2= <>
##$TPNAME3= <>
##$TPNAME4= <>
##$TPNAME5= <>
##$TPNAME6= <>
##$TPNAME7= <>
##$TPOAL= (0..7)
0.5 0.5 0.5 0.5 0.5 0.5 0.5 0.5 
##$TPOFFS= (0..7)
0 0 0 0 0 0 0 0 
##$TUNHIN= 0
##$TUNHOUT= 0
##$TUNXOUT= 0
##$USERA1= <user>
##$USERA2= <user>
##$USERA3= <user>
##$USERA4= <user>
##$USERA5= <user>
##$V9= 5
##$VALIST= <valist>
##$VCLIST= <CCCCCCCCCCCCCCC>
##$VD= 0
##$VDLIST= <DDDDDDDDDDDDDDD>
##$VPLIST= <PPPPPPPPPPPPPPP>
##$VTLIST= <TTTTTTTTTTTTTTT>
##$WBST= 1024
##$WBSW= 4
##$XGAIN= (0..3)
0 0 0 0 
##$XL= 0
##$YL= 0
##$YMAX_a= 234137
##$YMIN_a= -326393
##$ZGOPTNS= <>
##$ZL1= 120
##$ZL2= 120
##$ZL3= 120
##$ZL4= 120
##$ABSF1= 10
##$ABSF2= 0
##$ABSG= 5
##$ABSL= 3
##$ALPHA= 0
##$AQORDER= 0
##$ASSFAC= 0
##$ASSFACI= 0
##$ASSFACX= 0
##$ASSWID= 0
##$AUNMP= <proc_1d>
##$AZFE= 0.1
##$AZFW= 0.1
##$BCFW= 1
##$BC_mod= 2
##$BYTORDP= 1
##$COROFFS= 0
##$CY= 11.3945322036743
##$DATMOD= 1
##$DC= 2
##$DFILT= <>
##$DTYPP= 0
##$F1P= 18.9103706918063
##$F2P= -1.10871071338519
##$FCOR= 0.5
##$FTSIZE= 0
##$FT_mod= 4
##$GAMMA= 1
##$GB= 0.15
##$INTBC= 1
##$INTSCL= 1
##$ISEN= 128
##$LB= 0.24
##$LEV0= 0
##$LPBIN= 0
##$MAXI= 10000
##$MC2= 0
##$MEAN= 0
##$ME_mod= 0
##$MI= 1.114404
##$NCOEF= 0
##$NC_proc= 0
##$NLEV= 6
##$NOISF1= 3.799351
##$NOISF2= 2.8
##$NSP= 1
##$NTH_PI= 0
##$NZP= 0
##$OFFSET= 15.70392
##$PC= 1
##$PHC0= -9046.068
##$PHC1= 6.200042
##$PH_mod= 1
##$PKNL= yes
##$PPARMOD= 0
##$PSCAL= 0
##$PSIGN= 0
##$REVERSE= no
##$SF= 200.130013532006
##$SI= 16384
##$SIGF1= 3
##$SIGF2= 2
##$SINO= 400
##$SIOLD= 16384
##$SREGLST= <1H.CDCl3>
##$SSB= 0
##$STSI= 0
##$STSR= 0
##$SW_p= 3612.71676300578
##$SYMM= 0
##$S_DEV= 0
##$TDeff= 0
##$TDoff= 0
##$TI= <>
##$TILT= no
##$TM1= 0
##$TM2= 0
##$TOPLEV= 0
##$USERP1= <user>
##$USERP2= <user>
##$USERP3= <user>
##$USERP4= <user>
##$USERP5= <user>
##$WDW= 1
##$XDIM= 8192
##$YMAX_p= 0
##$YMIN_p= 0
$$ End of Bruker specific parameters
$$ ---------------------------------
##NTUPLES= NMR FID
##VAR_NAME=  TIME,          FID/REAL,        FID/IMAG
##SYMBOL=    X,             R,               I
##VAR_TYPE=  INDEPENDENT,   DEPENDENT,       DEPENDENT
##VAR_FORM=  AFFN,          ASDF,            ASDF
##VAR_DIM=   8192,          8192,            8192
##UNITS=     SECONDS,       ARBITRARY UNITS, ARBITRARY UNITS
##FACTOR=    0.0002496,     1,               1
##FIRST=     0,             0,               0
##LAST=      2.0444736,     0,               0
##MIN=       0,             -326393,         0
##MAX=       2.0444736,     234137,          0
$$ Real data points
##PAGE= N=1
##DATA TABLE= (X++(R..R)), XYDATA
$$ plain form
0 0 0 0 0 0 0 0 0 0 0 0 0 8 -8 8 -8 8 -16 16 -24 24 -32 34 -41 49 -57 70 -80 94 -105 121 -142 159 -183 207
34 207 -231 263 -294 330 -370 414 -459 509 -568 629 -695 767 -847 934 -1030 1134 -1249 1377
52 1377 -1517 1674 -1849 2045 -2268 2525 -2820 3170 -3585 4092 -4726 5545 -6648 8225 -10672
67 -10672 15014 -25000 99329 -107259 -298197 49429 192031 15058 -160055 -4116 196543
78 196543 79073 -226407 -162779 135177 161525 -46399 -86103 9048 42081 -40171 -91465
89 -91465 15415 137598 36815 -90151 -31781 22094 -32430 -6986 74043 65776 -13683 -75287
101 -75287 -49408 44004 35599 -40461 15123 88632 -14074 -116765 -56885 50011 82408 20557
113 20557 -57849 -21484 37001 -29608 -64750 36209 83456 25499 -22129 -53572 -47426 23352
$$ packed form
0@%%%%%%%%%%%Qj6J6j6J6k4L2m0M8n6O6p5R0j06J27j50J74j99K26k63L01l42L90
34B07m38M94n57O24p00P84q73R68j077J197j324J462j614J781j964K164k383K626
52A377k894L191l523L894m313M793n345N990o755P677q818J0271j2193J4873j8897
67a0672K5686m0014J24329k06588j90938L47626J42602j76973j75113J55939K00659
78A96543j17470l05480O3628K97956K6348k07924l9704R5151L3033q2252n1294
89i1465J06880J22183j00783j26966N8370N3875n4524K5444Q1029q267p9459o1604
101g5287K5879R3412q405p6060N5584P3509j02706j02691N9880J06896L2397o1851
113B0557p8406L6365N8485o6609l5142J00959M7247n7957m7628l1443O146P0778
$$ plain form
125 23352 51928 19642 7224 -8274 -25935 -7386 -24630 -42003 48847 99277 -13700 -100026
137 -100026 -44996 33259 47329 -6019 -33704 46490 67875 -74221 -116960 44066 123925
148 123925 20828 -63947 -29976 39817 15357 -78497 -34219 117638 81517 -94631 -100200
159 -100200 27920 56344 -12883 -41222 28736 85373 -20360 -137107 -26300 124942 55404
170 55404 -62487 -26253 46050 17062 -64483 -57611 71467 114095 -29832 -107228 -3709
181 -3709 49138 -14086 -29439 24960 54343 6639 -78141 -61945 49795 58540 -19231 -5868
193 -5868 34905 -12429 -53169 -19825 35328 60100 14232 -44617 -13771 20023 -27744 -30453
205 -30453 41683 52716 -2366 -44504 -49723 562 44589 6684 -19092 24102 18689 -36797
$$ packed form
125B3352K8576l2286j2418j5498j7661J8549j7244j7373R0850N0430j12977q6326
137a00026N5030P8255J4070n3348k7685Q0194K1385j42096m2739J61026P9859
148A23925j03097q4775L3971O9793k4460r3854M4278J51857l6121j76148n569
159a00200J28120K8424o9227k8339O9958N6637j05733j16747J10807J51242o9538
170E5404j17891L6234P2303k8988q1545O872J29078M2628j43927p7396J03519
181c709N2847o3224j5353N4399K9383m7704q4780J6196J11740Q745p7771J3363
193e868M0773m7334m0740L3344N5153K4772m5868n8849L0846L3794m7767k709
205c0453P2136J1033n5082m2138n219N0285M4027l7905k5776M3194n413n5486
$$ plain form
217 -36797 -38507 -2744 33860 57288 10553 -51665 -27016 18054 8333 -2165 3592 16115 31985
230 31985 -12890 -80724 -29328 71900 50941 -28700 -39611 -860 23433 -8146 -50218 9456
242 9456 91515 25768 -81506 -49351 36312 43637 -2114 -23213 15770 42492 -28658 -77971
254 -77971 6990 71723 14291 -32220 -11489 2130 -10085 -25103 -5079 50702 38148 -44215
266 -44215 -42865 25116 15705 -24365 3985 44586 28215 -33037 -64629 1225 69088 13367
278 13367 -47621 4602 40874 -18076 -57948 -16828 49847 57291 -21334 -65669 816 40040
290 40040 -14839 -27516 27531 42861 1631 -41828 -38462 20836 46117 315 -15398 11824
302 11824 -2485 -26614 -11203 6465 19273 25397 -7866 -32589 -11029 568 -527 18692
$$ packed form
217c6797j710L5763L6604K3428m6735o2218K4649M5070r721j0498N757J2523J5870
230C1985m4875o7834N1396J01228k0959p9641j0911L8751K4293l1579m2072N9674
242I456Q2059o5747j07274L2155Q5663P325m5751k1099L8983K6722p1150m9313
254g7971Q4961O4733n7432m6511K0731J3619j2215j5018K0024N5781j2554q2363
266d4215J350O7981r411m0070K8350M0601j6371o1252l1592O5854O7863n5721
278A3367o0988N2223L6272n8950l9872M1120O6675P444p8625m4335O6485L9224
290D0040n4879j2677N5047J5330m1230m3459L366N9298K5281m5802j5713K7222
302A1824j4309k4129J5411J7668J2808O124l3263k4723K1560J1597j095J9219
$$ plain form
314 18692 17389 -4781 -5059 -11487 -22016 7172 29862 11791 659 -4813 -18006 -7970 3788
327 3788 -228 19501 26468 -20159 -37949 -767 12608 1130 2513 6172 10464 -1115 -37771
340 -37771 -25061 39702 39858 -14860 -20437 6464 6638 -10190 -18803 9957 48782 12954 -51506
353 -51506 -27615 26892 12799 -13917 188 17730 9647 -24357 -40307 7970 45602 4930
365 4930 -24587 5010 11255 -16844 -18575 8317 34299 22767 -26006 -31764 15629 15050 -21346
378 -21346 -2344 31359 12242 -23807 -34079 -6815 31596 17911 -21906 -5535 21497 -7225
390 -7225 -29694 -4193 24075 28329 2492 -29180 -12922 17984 2262 -10787 13953 16936 -4559
403 -4559 -14560 -18782 -6092 21147 15375 -7947 -4426 -3693 -13459 -2831 6301 4926 14484 8009
$$ packed form
314A8692j303k2170k78o428j0529K9188K2690j8071j1132n472j3193J0036J1758
327C788m016J9729O967m6627j7790L7182J3375j1478J383L659M292j1579l6656
340c7771J2710O4763J56n4718n577K6901J74j6828q613K8760L8825l5828o4460
353e1506K3891N4507j4093k6716J4105J7542q083l4004j5950M8277L7632m0672
365D930k9517K9597O245k8099j731K6892K5982j1532m8773n758M7393n79l6396
378b1346J9002L3703j9117l6049j0272K7264L8411j3685l9817J6371K7032k8722
390g225k2469K5501K8268M254k5837l1672J6258L0906j5722j3049K4740K983k1495
403d559j0001m222J2690K7239n772k3322L521P33r766J0628R132j375R558o475
$$ plain form
417 8009 -18443 -14508 4608 4455 9615 13326 -2334 -6976 -3899 -13491 -2232 20126 7944 -8185
431 -8185 -1785 -5871 -13588 -2460 6647 12387 13670 -10834 -23698 3101 13093 -4897 928 15324
445 15324 7645 -6559 -20002 -12840 21958 25034 -12342 -15394 9445 1815 -16218 -8730 9360
458 9360 21982 6866 -26473 -19578 14505 9382 -8293 4350 12801 1450 -9800 -16041 -1989
471 -1989 23619 12144 -11783 -1990 4505 -12029 -9128 7883 11203 8043 -5274 -17842 -3599
484 -3599 6994 -5337 236 16700 3898 -12581 -10465 -3928 9675 15677 -1804 -6425 8447
497 8447 -1655 -16346 -1034 13347 10269 3280 -11333 -15443 3350 6136 -6128 2310 10827
510 10827 -1918 -9093 -9241 -6111 11662 15950 -4116 -7021 3281 -3813 -5695 5145 6180 6947
$$ packed form
417H009k6452L935J9116j53N160L711j5660m642L077r592J1259K2358j2182j6129
431h185O400m086p717J1128R107N740J283k4504j2864K6799R992j7990N825J4396
445A5324p679j4204j3443P162L4798L076l7376l052K4839p630j8033P488J8090
458I360J2622j5116l3339O895L4083n123j7675J2643Q451j1351j1250o241J4052
471a989K5608j1475k3927R793O495j6534K901J7011L320l160j3317j2568J4243
484c599J0593j2331N573J6464j2802j6479K116O537J3603O002j7481m621J4872
497H447j0102j4691J5312J4381l078o989j4613m110J8793K786j2264Q438Q517
510A0827j2745p175j48L130J7773M288k0066k905J0302p094j882J0840J035P67
$$ plain form
524 6947 6358 -10705 -14169 3636 5655 -804 5480 2186 -7129 -5553 -6573 -3347 11940 8403 -6603
539 -6603 -853 1613 -8962 -2444 9428 7274 5304 -1385 -12770 -2705 9337 -1747 -2842 9457
553 9457 3627 -9139 -9722 -6253 5819 13675 -2835 -10349 4085 1291 -10435 -1227 8465 7850
567 7850 5573 -6483 -12735 3689 9217 -2630 1337 8022 -1937 -7240 -5434 -3901 6746 9512
581 9512 -4470 -5841 1632 -6145 -6191 6611 5929 1349 2046 -5710 -6771 4839 2846 -731 8686
596 8686 5074 -8296 -5801 -288 638 6754 3417 -5821 -138 425 -9638 -3152 8114 3655 998
611 998 -1759 -9098 -2094 7345 -104 -1212 8208 1831 -6596 -2631 -1451 2481 10019 1280 -6938
626 -6938 -236 -736 -5886 1403 4240 229 2704 -2613 -10151 -630 6162 -590 2262 5042 -3842
$$ packed form
524F947n89j7063l464J7805K019o459O284l294r315J576j020L226J5287l537j5006
539f603N750K466j0575O518J1872k154j970o689j1385J0065J2042j1084j095J2299
553I457n830j2766n83L469J2072P856j6510p514J4434k794j1726R208R692o15
567G850k277j2056o252J6424N528j1847L967O685r959n303J806J533J0647K766
581I512j3982j371P473p777m6J2802o82m580O97p756j061J1610j993l577R417
596H686l612j3370K495N513R26O116l337r238N683N63j0063O486J1266m459k657
611I98k757p339P004R439p449j108R420o377q427L965J180L932P538q739q218
626f938O702n00n150P289K837m011K475n317p538R521O792o752K852K780q884
$$ plain form
641 -3842 -4432 1184 -1107 3460 8073 -809 -3695 1448 -3655 -3585 5770 3628 -825 266 -5158 -6204
657 -6204 3483 1599 -3256 4790 3642 -6674 -3636 1077 644 5866 4812 -4496 -748 2983 -4614
672 -4614 -1547 5946 2301 613 -332 -7457 -3245 5344 -116 -2411 4133 -897 -5748 -427 -1013 -392
688 -392 6856 2881 -4929 67 561 -3358 3294 5329 -317 1319 12 -5936 -668 3628 -1325 1579
704 1579 3388 -5455 -4777 1799 -1151 193 5256 -847 -3403 1590 -1861 -2733 5424 4069 -885 1409
720 1409 -1877 -3920 3055 2584 -1895 3152 1390 -5380 -1870 634 -2221 2470 3972 -4447 -2596
735 -2596 1759 -2374 -441 4675 385 231 2555 -3339 -3001 4420 2050 -418 2936 -1224 -3801 1593
751 1593 -411 -2526 3838 1684 -4943 -1053 -197 -3347 2188 3390 -2136 136 1425 -3423 -361
$$ packed form
641c842n90N616k291M567M613q882k886N143n103P0R355k142m453J091n424j046
657f204R687j884m855Q046j148j0316L038M713m33N222j054r308L748L731p597
672d614L067P493l645j688r45p125M212Q589n460k295O544n030m851N321n86O21
688c92P248l975p810M996M94l919O652K035n646J636j307n948N268M296m953K904
704A579J809q843O78O576k950J344N063o103k556M993l451q72Q157j355m954K294
720A409l286k043O975m71m479N047j762o770L510K504k855M691J502q419J851
735b596M355m133J933N116m290j54K324n894L38P421k370k468L354m160k577N394
751A593k004k115O364k154o627L890Q56l150N535J202n526K272J289m848L062
$$ plain form
766 -361 4091 360 1091 2957 -2884 -2229 2598 -984 -337 4297 -809 -4052 785 -1202 -2866 2946
782 2946 909 -2312 1304 -716 -4551 1818 3287 -808 1184 1346 -2395 800 1922 -2166 2382
797 2382 4269 -3141 -2694 1411 -1789 -741 2824 -1458 -1701 2445 -2728 -3868 2920 1577 -1266 1540
813 1540 -472 -2307 2447 677 -1850 3420 2353 -3363 -213 1169 -2176 1739 2328 -2693 -54
828 -54 1687 -4048 -1792 3100 -481 -1034 1700 -1799 -1126 2148 -864 -642 4047 131 -2965 1929
844 1929 744 -1128 2407 375 -2039 2077 336 -4220 535 2667 -2036 -473 435 -2649 320
859 320 1676 -2598 480 4010 -1718 -2149 2039 -217 532 2710 -1139 -805 3452 -1453 -3460 2562
875 2562 1604 -2099 392 -559 -2265 1482 -200 -3168 2037 2282 -2957 -474 2010 -435 854 1266
$$ packed form
766c61M452l731P31J866n841O55M827l582O47M634n106l243M837j987j664N812
782B946k037l221L616k020l835O369J469m095J992J62l741L195J122m088M548
797B382J887p410M47M105l200J048L565m282k43M146n173j140O788j343k843K806
813A540k012j835M754j770k527N270j067n716L150J382l345L915N89n021K639
828e4J741n735K256M892l581n53K734l499O73L274l012K22M689l916l096M894
844A929j185j872L535k032k414M116j741m556M755K132m703J563R08l084K969
859C20J356m274L078L530n728m31M188k256P49K178l849L34M257m905k007O022
875B562r58l703K491r51j706L747j682k968N205K45n239K483K484k445J289M12
$$ plain form
891 1266 -1697 1432 2892 -3075 -854 4164 -292 -2011 1146 -995 -849 1391 -1890 -2147 2956 -123
907 -123 -3724 898 1361 -1032 1034 129 -1231 2797 1307 -3283 1398 3412 -1601 -336 1421 -1355
923 -1355 464 1493 -2836 -571 2922 -2218 -2393 1852 -50 -1208 866 -1437 -483 3089 -844 -2389
939 -2389 3045 1404 -2049 1083 972 -847 2024 302 -2926 1539 2010 -2850 -849 1615 -1187 -577
955 -577 187 -2109 827 2421 -2652 -1651 3220 -237 -1553 1224 251 293 2472 -1462 -1970 3140 861
972 861 -3096 684 1758 -1281 -273 -1005 -1727 2063 858 -3445 132 2828 -1652 -1232 1640 -16
988 -16 1134 1168 -2477 127 3502 -1289 -2110 2527 813 -1410 127 -975 -521 2033 -1074 -2827 2023
1005 2023 807 -2969 -97 1333 -449 1057 -64 -2287 1974 2074 -2539 273 3163 -453 -1086
$$ packed form
891A266k963L129J460n967K221N018m456j719L157k141J46K240l281k57N103l079
907a23l601M622M63k393K066r05j360M028j490m590M681K014n013J265J757k776
923a355J819J029m329K265L493n140j75M245j902j158K074k303R54L572l933j545
939b389N434j641l453L132j11j819K871j722l228M465M71m860K001K464k802O10
955e77P64k296K936J594n073J001M871l457j316K777r73M2K179l934n08N110k279
972H61l957L780J074l039J008p32p22L790j205m303L577K696m480M20K872j656
988a6J150L4l645K604L375m791q21M637j714k223J537j102M54K554l107j753M850
1005B023j216l776K872J430j782J506j121k223M261J00m613K812K890l616o33
$$ plain form
1020 -1086 738 -903 389 2088 -2210 -1736 2065 -909 -2746 978 439 -721 1144 -1435 -2398 2517
1036 2517 936 -2029 1556 2167 -1308 13 240 -842 2278 1841 -2555 -204 1906 -1632 -1480 1062
1052 1062 -239 365 363 -2813 -852 2880 -786 -1886 2571 924 -1846 85 -350 293 2950 -35
1068 -35 -2519 1536 1238 -2475 -367 1541 126 402 -955 -2728 1055 1810 -2663 -515 2835 -756
1084 -756 -1746 283 -448 1018 2349 -1303 -1208 2658 -361 -2554 1513 1651 -240 479 -1430 -1692 1759
1101 1759 173 -2415 1332 1524 -2427 -1105 482 -806 1386 1440 -1895 332 1875 -1667 -1145 2532
1117 2532 786 -1 503 -1978 -743 1975 -490 -1393 1831 415 -2554 -374 -558 -416 2230 91
1133 91 -2398 1086 1116 -2005 187 2294 471 770 -36 -2147 787 2437 -1122 -386 2400 -659 -1915
$$ packed form
1020a086J824j641J292J699m298M74L801k974j837L724n39j160J865k579r63M915
1036B517j581k965L585O11l475J321K27j082L120m37m396K351K110l538J52K542
1052A062j301O04kl176J961L732l666j100M457j647k770J931m35O43K657k985
1068c5k484M055k98l713K108J908j415K76j357j773L783P55m473K148L350l591
1084g56r90K029p31J466J331l652R5L866l019k193M067J38j891P19j909k62L451
1101A759j586k588L747J92l951J322J587j288K192N4l335K227J543l542N22L677
1117B532j746p87N04k481J235K718k465r03L224j416k969K180j84J42K646k139
1133I1k489L484L0l121K192K107j823K99q06k111K934J650l559P36K786l059j256
$$ plain form
1150 -1915 -509 -966 628 1865 -1581 -1955 1851 -608 -2307 1447 1857 -535 409 -784 -1535 2006
1166 2006 1135 -1509 1523 1754 -2046 -1457 437 -343 1442 766 -2190 -418 1784 -2542 -1839 2467
1182 2467 1463 -746 -7 -1205 -402 2243 -123 -942 2453 1061 -2314 -478 319 423 1682 -116
1198 -116 -2323 581 456 -2687 -12 2236 -544 -173 104 -2065 -23 1995 -539 431 2100 -617
1214 -617 -1638 495 215 339 2088 -476 -1321 1185 -875 -1952 1606 1375 -1035 -39 -643 -1816 1047
1231 1047 915 -1401 767 1912 -2042 -1441 860 305 1459 1414 -1521 -244 1401 -1380 -1136 2260
1247 2260 859 -973 -184 -1643 -1252 1653 -110 -1276 1450 788 -2460 -662 624 289 1747 593
1263 593 -1415 545 1051 -1983 625 2518 -181 -583 -261 -1753 -63 1216 -904 -101 2019 -1281
$$ packed form
1150a915J406m57J594J237l446l74L806k459j699L754M10k392R44j193p51L541
1166B006q71k644L032K31l800N89J894p80J785o76k956J772K202m326P03M306
1182B467j004k209P39j198Q03K645k366q19L395j392l375J836P97J04J259j798
1198a16k207K904j25l143K675K248k780L71K77k169K042K018k534R70J669k717
1214f17j021K133k80J24J749k564q45K506k060j077L558k31k410R96o04j173K863
1231A047j32k316K168J145l954O01K301n55J154m5k935J277J645k781K44L396
1247B260j401j832P89j459L91K905j763j166K726o62l248J798J286l35J458j154
1263E93k008J960N06l034K608J893k699m02L22j492J690J279k120Q03K120l300
$$ plain form
1279 -1281 -2576 453 799 183 1347 -434 -1191 955 -574 -1752 1995 2092 -881 -265 -574 -1111 948
1296 948 854 -1354 843 1537 -2311 -1875 563 273 627 881 -1194 -1040 724 -1014 -624 2057 888
1313 888 -493 229 -1218 -1145 1588 691 -685 1231 87 -2281 -305 506 -409 932 699 -1643 -496
1330 -496 455 -1286 429 2291 54 -549 185 -804 -6 1611 -412 133 2134 -945 -2255 540 950
1347 950 68 786 -717 -1351 604 -185 -1959 1234 2225 -687 -943 -585 -793 1201 1586 -809 740
1364 740 1637 -1552 -1145 1048 314 708 989 -1241 -1124 750 -843 -869 1792 442 -1253 -71 -689
1381 -689 -829 864 668 -182 1542 -297 -1870 73 1568 -107 573 538 -1012 -304 47 -1448 361
1398 361 2251 -276 -1404 -178 -459 -149 1128 -148 -148 1358 -661 -1839 575 1203 356 1235 -142
$$ packed form
1279a281j295L029L46o16J164j781p57K146j529j178L747R7k973O16l09n37K059
1296I48r4k208K197O94l848M36K438k90L54K54k075J54J764j738L90K681j169
1313H88j381P22j447P3K733q97j376J916j144k368J976Q11r15J341k33k342J147
1330d96R51j741J715J862k237o03P34r89P98J617k023N45K001l079j310K795M10
1347I50q82P18j503o34J955p89j774L193R91k912k56L58k08J994L85k395J549
1364G40Q97l189M07K193p34L94K81k230J17J874j593k6K661j350j695J182o18
1381f89j40J693j96q50J724j839j573J943J495j675O80l5j550P08L51j495J809
1398C61J890k527j128J226k81L10J277j276%J506k019j178K414O28q47Q79j377
$$ plain form
1415 -142 -1445 801 -54 -1173 1095 1793 -576 -673 -641 -1413 684 1095 -475 21 681 -1396 -1169 874
1433 874 459 385 1398 -540 -856 691 -342 -268 2057 640 -1406 -160 -234 -939 661 724 -399 510
1451 510 -10 -2132 -272 1196 76 256 296 -932 -282 469 -783 444 2297 103 -1121 -254 -518
1468 -518 -3 1353 -133 -376 897 -730 -1855 277 637 114 1116 -90 -1735 78 88 -833 1060
1485 1060 1417 -769 -380 251 -997 306 1587 -172 77 175 -1424 -1082 1106 338 -369 603 -506
1502 -506 -1097 6 -527 52 1849 873 -1344 -137 -36 -571 792 830 -257 682 52 -1833 -567 1170
1520 1170 311 190 322 -1261 -580 475 -719 42 1902 117 -1181 -308 -733 -281 1354 484 -248
1537 -248 440 -254 -1164 474 564 -196 775 209 -1381 -570 331 -213 984 929 -1369 -678 -65 -740 9
$$ packed form
1415a42j303K246q55j119K268O98k369r7L2p72K097M11j570M96O60k077K27K043
1433H74m15p4J013j938l16J547j033P4K325j417k046J246p4p05J600O3j123R09
1451E10n20k122J860J468j120J80M0j228O50P51j252J227J853k194j224Q67k64
1468e18N15J356j486k43J273j627j125K132L60n23J002j206j645J813J0r21J893
1485A060L57k186L89O31j248J303J281j759K49R8j599L42K188p68p07R72j109
1502e06n91J103n33N79J797r76k217J207J01n35J363L8j087R39o30j885J266J737
1520A170q59j21J32j583O81J055j194P61J860j785j298Q73m25M52J635q70p32
1537b48O88o94r10J638R0p60R71n66j590Q11R01n44J197n5k298O91O13o75P49
$$ plain form
1556 9 1162 -23 91 405 -1465 -717 1514 812 48 576 -59 -1132 297 -170 -106 1304 754 -1334
1574 -1334 -754 -185 -616 740 560 -401 322 231 -1386 -395 1227 206 521 473 -970 -621 305 -82 -59
1593 -59 1026 16 -852 -83 -549 -459 1163 573 -353 17 -420 -1181 632 652 -183 566 375 -1071 -151
1612 -151 519 -5 720 968 -570 -852 92 -240 -62 811 -62 -284 364 -1383 -720 941 612 -6 597
1631 597 -300 -1000 411 103 -126 1116 668 -712 -463 -249 -584 664 872 -377 -417 -171 -1068 -395 828
1650 828 -144 0 660 -854 -779 558 184 401 987 -59 -745 133 -337 -248 1190 713 -201 -142 -754 -833
1670 -833 295 863 -429 336 104 -1108 -129 21 -236 594 1240 -673 -740 219 -108 270 1237 181 -347
1689 -347 196 -527 -788 905 648 88 138 -580 -1077 208 447 -115 641 266 -799 -279 -33 -429 623
$$ packed form
1556IJ153j185J14L14j870P48K231p02p64N28o35j073J429m67O4J410n50k088
1574a334N80N69m31J356j80r61P23r1j617R91J622j021L15m8j443L49R26l87K3
1593e9J085j010q68P69m66R0J622n90r26L70m37p61J813K0q35P49j91j446R20
1612a51O70n24P25K48j538k82R44l32J78Q73q73k22O48j747O63J661l29o18O03
1631E97q97p00J411l08k29J242m48j380K49K14l35J248K08j249m0K46q97O73J223
1650H28r72J44O60j514P5J337l74K17N86j046o86Q78m70Q9J438m77r14N9o12p9
1670h33J128N68j292P65k32j212R79J50k57Q30O46j913o7R59l27L78R67j056n28
1689c47N43p23k61J693k57n60N0p18m97J285K39n62P56l75j065N20K46l96J052
$$ plain form
1708 623 1260 -271 -335 160 -679 167 1051 139 35 342 -503 -1085 255 57 180 736 -311 -1097 205
1727 205 -109 -429 628 519 -291 76 -260 -767 518 1072 -264 153 -72 -967 -230 326 -499 101 845
1746 845 -706 -705 -87 -155 -39 752 13 -612 140 -359 -307 746 580 149 372 -241 -1007 388 779 -208
1766 -208 523 137 -750 -288 133 -673 269 946 -428 -363 -291 -550 20 833 81 -67 556 -163 -551 477
1786 477 360 89 649 -147 -865 -100 -50 -102 551 186 -585 -56 -81 -670 176 845 88 -47 -169 -488 -288
1807 -288 595 -72 262 657 -274 -722 133 -199 89 830 -255 -641 145 -331 -196 439 261 -113 241 -419
1827 -419 -838 -160 452 125 293 116 -711 164 351 -93 473 839 -104 -424 -157 -578 -237 502 10 -292
1847 -292 -73 -389 -418 368 -21 -56 537 107 -746 -118 358 117 717 212 -601 3 43 -834 157 520 249
$$ packed form
1708F23O37j531o4M95q39Q46Q84r12j04L07q45n82J340j98J23N56j047p86J302
1727B05l14l20J057j09q10L67l36n07J285N54j336M17k25q95P37N56q25O00P44
1746H45j551JO18o8J16P91p39o25P52m99N2J053j66m31K23o13p66J395L91r87
1766b08P31l86q87M62M21q06R42O77j374O5P2k59N70Q13p52j48O23p19l88J028
1786D77j17k71N60p96p18P65N0n2O53l65p71N29k5n89Q46O69p57j35j22l19K00
1807b88Q83o67L34L95r31m48Q55l32K88P41j085l86P86m76J35O35j78l74L54o60
1827d19m19O78O12l27J68j77q27Q75J87m44N66L66r43l20K67m21L41P39m92l02
1847b92K19l16k9P86l89l5N93m30q53O28M76k41O00n05q13O04M0q77R91L63k71
$$ plain form
1868 249 -355 -265 -702 -258 530 -32 -126 445 -124 -296 75 -249 176 885 267 -723 82 -135 -191 643 369
1889 369 -124 35 -369 -602 272 281 76 -14 80 -668 -417 224 -324 208 355 -406 -314 87 -352 -185 869
1910 869 374 89 319 -436 -320 341 291 -199 210 19 -536 -108 -109 -161 409 186 -712 -213 143 -215 126
1931 126 516 20 12 313 -521 -188 628 121 -127 398 -154 -483 315 176 -144 728 39 -563 -310 -74 -272
1952 -272 609 267 -290 -214 93 -410 205 539 -57 358 189 -315 -292 296 62 273 510 -345 -393 418 -154
1973 -154 -93 501 279 -220 73 -368 -246 534 373 -52 97 201 -314 -17 472 -121 616 659 -351 -252 268
1994 268 -97 80 407 -396 -79 184 -484 -194 375 -104 -130 73 -5 -471 332 90 -24 426 -83 -452 -68
2015 -68 -101 -297 423 367 -242 -235 -78 -359 104 290 -296 72 188 -524 -421 246 98 225 572 -215 -303 147
$$ packed form
1868B49o04R0m37M44P88n62r4N71n69j72L71l24M25P09o18r90Q05k17n6Q34k74
1889C69m93J59m04k33Q74Rk05r0R4p48K51O41n48N32J47p61R2M01m39J67J054
1910H69m95k85K30p55J16O61n0m90M09j91n55M28jn2N70k23q98M99L56l58L41
1931A26L90m96qL01q34L33Q16n07k48N25n52l29P98j39l20Q72o89o02K53K36j98
1952b72Q81l42n57P6L07n03O15L34n96M15j69n04K3N88k34K11K37q55m8Q11n72
1973a54O1N94k22m99K93m41J22P80j61m25J49J04n15K97M89n93P37M3j010R9N20
1994B68l65J77L27q03L17K63o68K90N69m79k6K03p8m66Q03k42j14M50n09l69L84
2015f8l3j96P20n6o09PJ57k81M63J86n86L68J16p12J03O67j48J27L47p87q8M50
$$ plain form
2037 147 92 -68 653 306 -325 185 -357 -540 330 221 -209 284 -191 -402 -218 423 -280 265 98 -344
2057 -344 160 311 -343 126 549 -4 -369 98 -210 -205 333 122 51 271 -238 -635 146 258 54 276 -140
2078 -140 -243 78 217 -214 249 580 -109 21 69 -251 248 548 -111 -118 297 -249 -429 236 -294 -15 560
2099 560 -438 -499 320 24 -121 351 -2 -58 258 72 -366 148 189 -57 38 -21 -304 -19 289 -97 210 185
2121 185 -544 -61 113 -394 -107 700 -105 -99 73 -110 -120 496 298 -219 218 -37 -200 176 116 -248 133
2142 133 -101 -610 27 35 -359 71 362 -92 -120 -97 -99 47 136 -200 -108 240 -165 -174 114 299 40 155 -281
2165 -281 -415 145 -167 -229 304 28 -187 182 -1 -230 599 204 -184 266 -97 -389 32 364 145 170 233
2186 233 -128 -44 79 -425 -57 248 91 -334 116 -25 -151 283 145 -126 304 -11 -361 113 6 171
$$ packed form
2037A47n5j60P21l47o31N10n42j83Q70j09m30M93m75k11J84O41p03N45j67m42
2057c44N04J51o54M69M23n53l65M67l08NN38k11p1K20n09l97P81J12k04K22m16
2078a40j03L21J39m31M63L31o89J30M8l20M99L00o59pM15n46j80O65n30K79N75
2099E60r98o1Q19k96j45M72l53n6L16j86m38N14M1k46R5n9k83K85L08l86L07k5
2121A85p29M83J74n07K87Q07q05OJ72j83j0O16j98n17M37k55j63L76o0l64L81
2142A33k34n09O37Ql94M30K91m54k8K3kJ46Q9l36R2L48m05rK88J85k59J15m36
2165b81j34N60l12o2N33k76k15L69j83k29Q29l95l88M50l63k92M21L32k19K5O3
2186B33l61Q4J23n04L68L05j57m25M50j41j26M34j38k71M30l15l50M74j07J65
$$ plain form
2206 171 244 249 -265 -49 57 -151 58 271 -233 -317 1 -271 46 441 -157 -350 207 -239 -140 233 1 -149
2228 -149 323 206 -50 296 51 -22 417 -54 -268 -191 121 -395 70 282 -420 293 -72 -122 -67 167 -127
2249 -127 -191 421 -298 72 91 117 238 309 3 -190 54 56 -113 495 -71 -286 213 -134 -307 261 159 -159
2271 -159 -24 101 -467 -281 217 -303 293 190 -255 -165 414 -195 33 146 72 395 133 -87 -150 7 37
2292 37 -203 -17 -20 -76 139 -63 -129 354 421 -321 -114 72 -123 208 241 -228 -52 256 -435 28 458 70
2314 70 -25 10 -475 28 285 -54 -332 339 86 -296 172 -105 33 307 -29 -156 -37 23 -215 310 275 -157
2336 -157 152 -113 -255 -114 83 -264 -76 226 -266 -180 265 -377 128 356 -148 -100 177 -43 -327 296 183
2357 183 -37 4 -53 -6 -29 97 -3 106 46 -505 -42 -5 -245 21 180 107 76 241 -444 -89 277 -97 -174
$$ packed form
2206A71P3Nn14K16J06k08K09K13n04q4L18k72L17L95n98j93N57m46R9L73k32j50
2228a49M72j17k56L46k45p3M39m71k14P7L12n16M65K12p02P13l65n0N5K34k94
2249a27o4O12p19L70J9K6J21P1l06j93K44Kj69O08n66k15M99l47j73N68j02l18
2271a59J35J25n68J86M98n20N96j03m45R0N79o09K28J13p4L23k62k20o3J57L0
2292C7k40J86ln6K15k02o6M83O7p42K07J86j95L31L3m69J76L08o91M63M30l88
2314G0r5L5m85N03K57l39k78O71k53l82M68k77J38K74l36j27J19O0k38N25l5m32
2336a57L09k65j42J41J97l47J88L02m92Q6M45o42N05K28n04M8K77k20k84O23j13
2357A83k20M1n7M7k3J26j00J09o0n51M63L7k40K66J59p3l1J65o85L55L66l74p7
$$ plain form
2380 -174 321 -105 -232 231 79 -138 135 -49 -501 117 45 -322 177 81 -254 24 -133 -267 227 363 -289
2401 -289 46 -8 -13 193 308 41 180 248 -410 -109 278 96 119 30 -332 -109 10 -310 -350 307 108 -310
2423 -310 -52 77 -363 247 232 -44 123 155 -286 -72 28 -327 26 119 -129 -175 -48 23 -309 369 -233 63
2445 63 89 -127 -177 170 -45 -170 398 102 -117 334 112 -169 -41 23 -156 -127 -42 -262 -71 208 -91 -117
2467 -117 137 -360 236 0 -184 94 165 -248 -163 372 -27 58 470 216 -215 53 -217 -115 74 -24 -72 290
2489 290 -28 -319 255 20 -147 -20 76 -174 -32 -13 67 -199 294 -219 235 363 -220 71 421 47 -1
2510 -1 226 -130 -91 -28 45 -209 248 100 -119 113 210 -221 53 -107 -180 -26 -50 -261 -20 381 -306 -84 103
2533 103 -169 7 147 -57 -387 105 -232 -103 83 -47 -203 12 141 -77 225 125 -169 -96 112 -242
$$ packed form
2380a74M95m26j27M63j52k17K73j84m52O18p2l67M99r6l35K78j57j34M94J36o52
2401b89L35n4nK06J15k67J39O8o58L01L87j82K3q9l62K23J19l20m0O57j99m18
2423c10K58J29m40O10j5k76J67L2m41K14J00l55L53R3k48m6J27P1l32O78o02K96
2445F3K6k16n0L47k15j25N68k96k19M51k22k81J28O4j79K9Q5k20J91K79k99k6
2467a17K54m97N96k36j84K78P1m13Q5N35l99Q5M12k54m31K68k70J02J89r8m8L62
2489B90l18k91N74k35j67J27R6k50J42J9Q0k66M93n13M54J28n83K91L50l74m8
2510aK27l56L9O3P3k54M57j48k19K32R7m31K74j60p3J54k4k11K41M01o87K22J87
2533A03k72J76J40k04l30M92l37J29J86j30j56K15J29k18L02j00k94P3K08l54
$$ plain form
2553 -242 214 108 -94 -6 179 -274 -2 57 -320 -83 107 -169 -58 120 -336 -251 47 -161 -85 356 -24
2574 -24 -187 354 -191 -498 179 214 -231 164 77 -254 -24 52 -45 -192 22 -449 74 217 -259 4 -54 8
2596 8 138 126 -70 -110 188 -88 106 112 -383 -83 115 281 -16 270 -5 88 57 -99 -28 128 227 -299 230
2619 230 -25 -281 -94 196 -47 44 292 -33 -7 488 -135 11 57 76 -25 199 43 -237 202 219 -160 32
2641 32 -97 -257 39 -10 -104 -115 -4 -18 -83 25 -23 -53 100 -146 -41 146 -20 -119 202 -75 -234 -42 224
2664 224 -282 -12 -199 -328 -330 -141 -39 60 130 -126 190 65 -142 49 104 -121 71 -73 -265 156 177 -113
2686 -113 -1 392 -179 -7 -30 -244 -73 -199 -175 -107 204 -76 26 348 199 -137 86 117 -300 -98 104
2707 104 -34 186 -26 -62 141 99 -178 -178 150 -109 4 88 -85 113 48 -143 47 199 37 92 261 114
$$ packed form
2553b42M56j06k02Q8J85m53K72N9l77K37J90k76J11J78m56Q5K98k08P6M41l80
2574b4j63N41n45l07O77L5m45L95q7l31K30P6r7j47K14m71N23J43m76K63n8O2
2596HJ30j2j96m0K98k76J94Om95L00J98J66k97K86k75R3l1j56P1J56R9n26N29
2619B30k55k56J87K90k43R1K48l25K6M95o23J46M6J9j01K24j56k80M39J7l79J92
2641C2j29j60K96m9r4j1J11j4o5J08m8l0J53k46J05J87j66r9L21k77j59J92K66
2664B24n06K70j87j29kJ89J02R9P0k56L16j25k07J91N5k25J92j44j92M21K1k90
2686a13J12L93n71J72k3k14J71j26K4O8L11k80J02L22j49l36K23L1m17K02K02
2707A04j38K20k12l6K03m2k77%L28k59J13Q4j73J98o5j91J90J52j62N5J69j47
$$ plain form
2729 114 10 6 77 -222 107 101 -152 93 237 54 228 53 -32 241 2 -162 93 103 9 97 284 -217 -136
2752 -136 277 -267 -268 223 4 -319 -97 168 -133 101 42 -15 17 -177 -265 82 81 -200 243 91 65 101 49 42
2776 42 -4 135 82 -44 212 -345 69 183 -73 -100 217 58 -74 -162 36 -75 -190 44 -215 57 -32 33
2798 33 65 184 -128 45 18 -58 -59 99 39 35 -124 -110 217 -158 60 -174 362 14 -188 108 -216 29 120 -92
2822 -92 -159 69 -146 -97 107 -115 -235 60 212 -11 49 -70 -125 -3 168 -238 -68 -38 -388 -112 -55 -68 14
2845 14 455 266 -46 -98 -132 129 66 -176 -114 62 5 -90 -11 90 -82 -71 -127 -110 169 -14 -77 175 150 128 -61
2870 -61 67 -72 -149 -135 45 332 39 210 116 195 -139 46 275 -146 -81 -35 -3 -192 145 39 -84 21 75
2893 75 21 136 -155 -28 409 225 199 -222 124 190 -1 -44 39 -179 94 -254 -75 188 30 65 45 -113 44
$$ packed form
2729A14j04mP1k99L29ok53K45J44j83J74j75q5K73k39j64K55J0r4Q8J87n01Q1
2752a36M13n44jM91k19l23K22K65l01K34n9n7L2j94q8L47jk81M43j52k6L6n2p
2776D2m6J39n3j26K56n57M14J14k56k7L17j59j32q8J98j11j15K34k59K72q9O5
2798C3L2J19l12J73k7p6jJ58o0mj59J4L27l75K18k34N36l48k02K96l24K45R1k12
2822i2o7K28k15M9K04k22j20K95J52k23O0j19n5J22J71m06J70L0l50K76N7j3Q2
2845A4M41j89l12n2l4K61o3k42O2J76n7r5P9J01j72J1n6J7K79j83o3K52k5k2j89
2870f1J28j39p7J4J80K87k93J71r4P9l34J85K29m21O5M6L2j89L37j06j23J05N4
2893G5n4J15k91J27M37j84k6m21L46O6j91m3Q3k18K73l48J79K63j58L5k0j58J57
$$ plain form
2916 44 10 40 -36 -253 86 -42 95 66 -243 -43 -271 -62 178 200 60 228 129 34 42 25 -25 46 133 -91 121
2941 121 30 153 57 167 -150 78 94 -46 -73 22 245 125 28 -231 152 55 -3 -161 -96 124 -235 -175 161
2964 161 -309 174 195 -64 -14 88 -38 104 176 61 -23 26 199 -24 196 180 13 -93 47 -151 -41 -88
2986 -88 54 -135 -268 -94 -317 -128 -340 71 262 39 82 36 64 -34 327 44 -2 18 130 94 188 -9 -103
3009 -103 167 95 139 -63 152 -140 58 -10 -397 6 4 -86 44 395 -72 3 1 -46 10 276 49 1 78 -94
3033 -94 124 163 -101 6 196 34 169 257 -56 9 47 -38 119 -43 68 111 -94 -1 -55 -203 -34 45 -138
3056 -138 -55 -68 -139 342 93 -84 -190 118 -120 -31 15 -187 202 -149 -105 192 5 -89 220 95 12 57 132
3079 132 -50 -74 309 -120 -40 25 88 165 425 -69 -65 16 69 -113 8 -195 -119 59 -120 -150 168 67 -190 340
$$ packed form
2916D4l4L0p6k17L39j28J37k9l09K00k28K09K40K2j40J68r9r5Qj7n0P1Q7k24K12
2941A21r1J23r6J10l17K28J6j40k7R5K23j20r7k59L83r7n8j58O5K20l59O0L36
2964A61m70M83K1k59N0J02j26J42P2j15q4M9J73k23K20j6j67j06J40j98J10m7
2986h8J42j89j33J74k23J89k12M11J91k23M3m6K8r8L61k83m6K0J12l6R4j97r4
3009a03K70p2M4k02K15k92J98o8l87M03kr0J30L51m67P5km7N6K66k27m8P7j72
3033i4K18L9k64J07J90j62J35Q8l13O5L8q5J57j62J11M3k05R3n4j48J69P9j83
3056a38Q3j3p1M81k49j77j06L08k38Q9M6k02L89l51M4K97j87r4L09j25q3M5P5
3079A32j82k4L83m29Q0O5O3P7K60m94MQ1N3j82J21k03P6J78j79l0L18j01k57N30
$$ plain form
3103 340 -152 -110 -1 -34 -261 -20 -135 -127 86 154 -149 24 -54 -99 48 191 -50 -109 171 111 -134 34 150
3126 150 -121 293 64 77 171 119 -158 -208 -103 12 113 -69 -44 -68 -118 135 -35 -135 114 95 -27 1 -4 257
3150 257 -134 -134 36 -174 115 -81 -170 41 48 -246 301 85 -58 -118 67 301 121 164 81 120 165 -68 -366
3173 -366 144 -56 55 41 86 19 -26 30 -99 65 -19 -117 -173 23 270 -138 -95 -201 -263 65 -125 -33 79 -109
3197 -109 21 346 79 12 130 235 123 -194 108 -194 8 -78 -227 20 -6 -138 -43 80 -110 112 148 37
3219 37 -221 52 11 -145 -95 -87 91 176 31 -235 -272 -27 17 167 2 8 182 52 87 17 176 -73 140 126
3243 126 -173 -47 102 75 280 -78 286 -19 -3 -66 -291 -101 -18 -51 -29 122 99 118 68 -86 -64 24 20 14 191
3268 191 20 26 46 -97 -46 73 -10 7 -19 24 3 147 -251 167 -117 -16 90 38 -62 -262 2 129 -137
$$ packed form
3103C40m92M2J09l3k27K41j15QK13O8l03J73p8m5J47J43k41n9K80o0k45J68J16
3126A50k71M14k29J3R4n2k77n0J05J15J01j82K5k4n0K53j70j00K49j9j22K8nK61
3150B57l91%J70k10K89j96q9K11Pk94N47k16j43o0J85K34j80M3q3L9M5k33k98
3173c66N10k00J11j4M5o7m5N6j29J64q4r8n6J96K47m08M3j06o2L28j90R2J12j88
3197a09J30L25k67o7J18J05j12l17L02l02K02q6j49K47k6j32R5J23j90K22L6j11
3219C7k58K73m1j56N0QJ78Q5j45k66l7K45M4J50j65OJ74j30L5p0J59k49K13j4
3243A26k99J26J49k7K05l58L64l05J6o3k25J90Q3l3K2J51k3J9n0j54K2Q8moJ77
3268A91j71OK0j43N1J19q3J7k6M3k1J44l98M18k84J01J06n2j00k00K64J27k66
$$ plain form
3291 -137 92 81 -102 -4 46 -174 -22 85 -146 88 -9 11 -81 -171 -57 -64 -88 -155 -284 -16 -35 109 -59 -59 257
3316 257 58 240 32 119 -134 -46 85 180 234 -31 -192 -83 55 220 -14 -20 -81 -21 -71 141 -113 -142 138
3339 138 62 -100 -70 142 125 306 9 -129 271 87 134 130 193 -29 236 234 194 97 -80 152 113 -105 201 266
3363 266 -58 33 -126 45 -86 70 57 85 55 -114 -105 -125 -56 67 -80 -48 0 66 0 -314 16 67 -101 49
3387 49 57 -54 -199 -147 -8 126 312 -70 14 79 -27 -197 -178 80 -163 -63 149 -78 28 -121 87 124 83
3410 83 149 95 29 -58 263 94 93 69 -15 -131 142 -180 -125 -142 158 4 42 -98 -20 -48 122 153 -149 -5 46
3435 46 -185 180 -21 1 63 -239 -148 325 31 -92 -34 58 68 5 103 -117 14 9 -39 -175 -283 -101 -153 193
3459 193 -40 43 -29 6 4 -19 130 139 56 110 25 303 2 179 -8 215 147 134 78 -4 -173 148 98 -177 179
$$ packed form
3291a37K29j1j83R8N0k20J52J07k31K34r7K0r2r0J14pk4o7j29K68j9J44j68%L16
3316B57j99J82k08Q7k53Q8J31R5N4k65j61J09J38J65k34oo1O0n0K12k54k9K80
3339A38p6j62L0K12j7J81k97j38M00j84M7mO3k22K65km0r7j77K32l9k18L06O5
3363B66l24R1j59J71j31J56j3K8l0j69Rk0O9J23j47L2M8O6o6l14L30N1j68J50
3387D9Qj11j45N2J39J34J86l82Q4O5j06j70J9K58k43J00K12k27J06j49K08L7m1
3410H3O6n4o6q7L21j69jk4q4j16K73l22N5j7L00j54L8j40P8k8J70L1l02J44N1
3435D6k31L65k01K2O2l02R1M73k94j23N8R2J0o3R8k20J31nm8j36j08J82n2L46
3459A93k33Q3p2L5kk3J49Rq3N4q5K78l01J77j87K23o8j3n6q2j69L21n0k75L56
$$ plain form
3484 179 36 115 -416 -99 126 -142 27 -19 -107 -30 -97 182 162 -6 -83 31 117 88 16 -105 17 -23 157 61
3508 61 97 191 21 9 -128 -92 44 -63 60 112 -124 -59 28 133 -207 120 45 132 33 71 -140 -238 267 -193
3532 -193 -89 -44 114 -105 21 1 88 13 -174 -282 8 -97 -339 122 -161 245 99 100 -94 -44 -53 -23 -282
3555 -282 -288 -44 -78 45 15 201 76 138 -30 -31 -287 37 -150 77 -156 98 -19 -75 -129 -114 1 52 85 43
3579 43 33 -78 112 -219 115 70 283 -47 45 68 -15 -27 -81 -90 112 96 -139 -131 1 43 74 -161 328 2 -80
3604 -80 63 -107 -3 -84 213 208 21 63 -40 123 199 16 48 -198 -149 -41 16 -90 182 -103 3 51 131 -22
3628 -22 -12 183 -169 144 86 108 -32 79 -20 110 63 158 90 -110 48 184 68 59 -168 149 39 57 -8 150
3652 150 -53 -106 -82 36 82 125 -52 -64 -42 47 -126 48 -177 -177 4 -161 -105 -151 -280 -44 -107 -1 218 -159
$$ packed form
3484A79j43P9n31L17K25k68J69m6q8P7o7K79k0j68p7J14Q6k9p2j21J22m0J80r6
3508F1L6R4j70j2j37L6J36j07J23N2k36O5Q7J05l40L27p5Q7r9L8k11r8N05m60
3532a93J04M5J58k19J26k0Q7p5j87j08K90j05k42M61k83M06j46Jj94N0rL0k59
3555b82oK44l4J23l0J86j25O2j68jk56L24j87K27k33K54j17n6n4J5J15N1L3m2
3579D3j0j11J90l31L34m5K13l30R2K3q3j2n4rK02j6k35QJ32M2L1k35M89l26q2
3604h0J43j70J04q1K97nj87M2j03J63P6j83L2k46M9J08N7j06K72k85J06M8Q0j53
3628b2J0J95l52L13n8K2j40J11r9J30m7R5o8k00J58J36j16rk27L17j10J8o5J58
3652A50k03n3K4J18M6M3j77j2K2Q9j73J74k25%J81j65N6m6j29K36o3J06K19l77
$$ plain form
3676 -159 147 -104 -118 9 82 27 168 -38 47 -37 -160 49 -156 -9 -192 166 -65 99 107 -79 -36 91 195
3699 195 -22 -18 -22 216 -2 -227 -138 15 -14 17 -67 -98 103 -2 41 -167 -135 140 -140 44 -55 -59 216 -137 41
3724 41 48 -57 -199 -5 -152 7 -40 5 98 -174 -31 105 -126 173 -146 11 -15 -103 71 -81 33 -8 28
3747 28 -49 -38 76 180 -25 212 254 68 -46 -255 -250 68 58 -225 -207 -101 -71 108 -65 -76 27 21 -205 -73
3771 -73 -55 8 7 8 61 -30 -21 24 6 -82 -138 172 0 45 91 224 -8 -170 126 41 -8 -125 -10 32 -9 -111 4
3798 4 -63 -24 95 15 9 61 135 92 32 -116 -272 -62 116 -164 -308 -100 -2 0 -95 145 36 33 -76 -51 -195 115
3824 115 167 12 55 -186 56 114 88 43 73 175 57 130 59 105 39 145 71 -241 75 -3 73 -72 178 -35
3848 -35 -42 -165 -138 -169 115 -147 -115 -276 97 -70 -49 -52 -225 18 150 -109 -238 68 69 -176 -194 30 28 -11 5
$$ packed form
3676a59L06k51j4J27P3n5J41k06Q5q4j23K09k05J47j83L58k31J64Qj86M3J27J04
3699A95k17MmK38k18k25Q9J53k9L1q4l1K01j05M3k08L2K75k80J84r9mK75l53J78
3724D1Pj05j42J94j47J59m7M5R3k72J43J36k31K99l19J57k6q8J74j52J14m1L6
3747B8p7J1J14J04k05K37M2j86j14k09NL18j0k83J8J06L0J79j73j1J03ok26J32
3771g3J8O3jJN3r1RM5j8q8n6L10j72M5M6J33k32j62K96q5m9j17J15M2m1j02J15
3798Do7L9J19q0oN2P4m3o0j48j56K10J78k80j44K08R8Kr5K40j09lj09K5j44L10
3824A15N2j55M3k41K42N8k6m5L0J02j18P3p1M6o6J06p4l12L16p8P6j45K50k13
3848c5pj23K7l1K84k62L2j61L73j67K1lj73K43J32k59j29L06Jk45j8K24kl9J6
$$ plain form
3873 5 -129 -101 -67 148 -77 -91 -85 -90 -172 -46 -78 -16 16 -22 18 -46 -213 167 219 -106 62 -1 -76 7 38 -111 183
3900 183 72 37 5 74 50 71 32 117 -109 -7 -56 -122 -67 105 158 77 222 18 176 -119 -7 -167 -85 -28 -171
3925 -171 97 -31 -2 -115 -136 -26 -131 -307 267 -88 78 57 27 -33 88 -26 78 51 -64 68 233 79
3947 79 122 -11 -237 -168 13 -60 -114 56 104 -74 -119 -33 -146 -55 -54 -22 -160 -33 -141 5 95 -68 246 139
3971 139 -131 -119 342 -73 -91 -114 135 -48 247 -145 61 144 29 203 114 14 -60 218 -68 -101 -115 0 -108
3994 -108 122 176 -50 101 3 129 52 78 -20 -20 -76 -65 -214 -255 -33 258 33 20 -90 195 97 73 198 0
4018 0 -34 -76 12 -352 144 -308 127 -62 -6 -84 -107 -7 -163 -42 -229 -75 -27 161 -103 172 -153 -59 -82 -156
4042 -156 74 -259 64 -152 -162 14 85 250 -20 240 100 -139 210 165 -132 -22 -106 145 -252 -32 71
$$ packed form
3873Ej34K8L4K15k25j4Onq2J26l2O2L2l8M0o4j67L80N2l25J68o3p5Q3L1j49K94
3900A83j11l5l2O9k4K1l9Q5k26J02m9o6N5J72N3q1J45k04J58k95J12j60Q2N7j43
3925a71K68j28K9j13k1J10j05j76N74l55J66k1l0o0J21j14J04k7j15J32J65j54
3947G9M3j33k26O9J81p3n4J70M8j78m5Q6j13R1JL2j38J27j08J46R0j63L14j07
3971A39k70J2M61m15j8k3K49j83K95l92K06Q3j15J74q9j00p4K78k86l3j4J15j08
3994a08K30N4k26J51r8J26p7K6r8%n6J1j49m1K22K91k25j3j10K85r8k4J25j98
4018@l4m2Q8l64M96m52M35j89N6p8k3J00j56J21j87J54M8J88k64K75l25R4k3p4
4042a56K30l33L23k16j0J76P1J65k70K60j40k39L49m5k97J10q4K51l97K20J03
$$ plain form
4063 71 52 12 -33 24 337 293 -73 -107 -1 2 -11 -257 273 87 -109 112 -168 24 -31 -137 96 140 -83 44
4087 44 106 158 -68 -87 -148 63 129 3 8 108 -435 -188 40 -12 70 -44 -176 -142 -282 74 -130 43 -184 -46
4111 -46 -38 6 85 21 -54 287 -11 43 9 -230 -70 -27 18 -65 -99 207 -20 -88 -105 160 -57 60 46 -214 -178 83
4137 83 98 6 -60 18 -109 -80 -25 -56 -282 -28 77 -202 62 -90 -7 -2 42 206 -80 -183 -226 146 -143 82
4161 82 -7 101 137 99 0 -144 -6 379 -18 97 -61 105 57 -97 35 1 36 31 17 -46 6 209 -51 -26 -113
4186 -113 -169 -156 26 -47 88 -118 -160 -65 -192 -248 -170 -40 -314 234 -5 -169 107 36 107 -39 106 -34 -78
4209 -78 50 -113 -62 5 -129 166 138 40 24 262 189 -61 17 -69 91 100 213 -125 130 20 -77 -268 98 51
4233 51 15 -75 -80 -153 -29 33 -116 -193 -44 -46 -1 -120 44 112 -150 -159 7 -118 110 95 -61 -66 102 148 -158 57
$$ packed form
4063G1j9m0m5N7L13m4l66l4J06Lj3k46N30j86j96K21k80J92n5j06K33M4k23J27
4087D4O2N2k26j9o1K11O6j26NJ00n43K47K28n2Q2j14j32L4j40L56k04J73k27J38
4111d6QM4P9o4p5L41k98N4l4k39J60M3M5q3l4L06k27o8j7K65k17J17j4k60L6K61
4137H3J5r2o6P8j27K9N5l1k26K54J05k79K64j52Q3NM4J64k86j03m3L72k89K25
4161H2q9J08L6l8r9j44J38L85l97J15j58J66m8j54J32l4L5nj4o3N2K03k60K5q7
4186a13n6J3J82p3J35k06m2R5j27n6P8J30k74N48k39j64K76p1P1j46J45j40m4
4209g8J28j63N1O7j34K95k8r8j6K38p3k50P8q6J60RJ13l38K55j10r7j91L66m7
4233E1l6r0np3J24O2j49p7J49kM5j19J64O8k62rJ66j25K28j5j56nJ68M6l06K15
$$ plain form
4259 57 19 199 -41 -100 -81 -329 -18 139 -206 -38 -38 -76 80 154 52 82 167 4 -23 16 180 18 95 -62
4283 -62 -28 13 -327 -79 34 5 -186 -87 -94 22 -200 -108 59 328 106 29 65 -280 -212 68 155 -139 -58 139
4307 139 139 -37 40 -69 -57 59 -116 -221 71 206 110 192 -152 18 -41 154 -214 95 255 63 -58 70
4329 70 -285 -281 18 -91 189 171 -85 126 -57 -209 89 146 182 -217 -76 -35 -78 -126 -117 169 -45 12 -64 77
4353 77 203 264 29 55 1 -285 17 -213 275 31 14 47 -27 93 -122 192 99 -157 -119 160 -90 117 -25
4376 -25 -243 -60 212 -206 -19 -53 -21 -32 146 -100 -145 -97 -288 -88 -120 -17 -1 174 2 -18 -76 229 -76
4399 -76 -15 8 -43 283 -41 38 -94 -82 130 76 -40 -42 102 208 76 -150 -85 40 10 270 -5 11 101 -95
4423 -95 -44 -214 -244 -214 69 243 193 30 -237 -91 -105 -242 -161 -150 89 265 102 109 -75 -51 64 109 102 19 -193
$$ packed form
4259E7l8J80k40n9J9k48L11J57l45J68%l8J56P4j02L0Q5j63k7L9J64j62P7j57
4283f2L4M1l40K48J13k9j91R9pJ16k22R2J67K69k22p7L6l45O8K80Q7k94Q1J97
4307A39%j76P7j09J2J16j75j05K92J35r6Q2l44J70n9J95l68L09J60j92j21J28
4329G0l55MK99j09K80j8k56K11j83j52K98N7L6l99J41M1m3m8RK86k14N7p6J41
4353G7J26O1k35K6n4k86L02k30M88k44j7L3p4J20k15L14r3k56L8K79k50K07j42
4376b5k18J83K72m18J87l4L2j1J78k46m5M8j91K00l2J03J6J75j72k0n8L05l05
4399g6O1K3n1L26l24P9j32J2K12n4j16kJ44J06j32k26O5J25l0K60k75J6R0j96
4423i5N1j70l0L0K83J74n0j63k67J46j4j37Q1J1K39J76j63Pj84K4J15M5pq3k12
$$ plain form
4448 -193 118 -213 -5 -13 -198 -43 -34 59 -1 -91 115 152 77 104 -185 2 14 23 -120 252 161 -85 -109 -119 -186 -6
4474 -6 -225 -8 94 160 -25 23 103 10 -168 149 -158 -62 115 76 37 58 -34 -162 183 -157 -5 -119 -45 140
4498 140 176 -98 -4 -120 102 -87 179 172 -90 -188 166 -61 -5 -78 12 -10 -85 -97 42 1 229 36 68 85 9
4523 9 -96 25 -197 -98 9 -162 -121 344 33 129 106 -25 60 -52 -59 -24 10 -141 52 106 -176 -201 161 -170
4547 -170 83 -27 -89 37 -211 -186 288 -171 107 -103 12 126 -92 80 -5 -209 72 -34 -105 -190 162 131
4569 131 -73 33 63 -192 -77 -131 -44 -20 159 30 -41 -277 23 -206 42 -205 -182 -124 106 116 174 115 -329
4592 -329 -75 266 -242 -69 -242 88 147 139 110 5 -198 53 -129 88 -268 224 36 -130 78 -51 -149 -59
4614 -59 189 -111 139 -113 -54 103 -3 159 422 -236 313 24 85 -196 -14 -196 9 126 93 191 121 207
$$ packed form
4448a93L11l31K08qj85J55RR3o0r0K06L7p5K7k89J87J2Rj43L72r1k46k4j0o7J80
4474fk19K17J02O6j85M8Q0r3j78L17l07R6J77l9l9K1r2j28L45l40J52j14P4J85
4498A40L6k74R4j16K22j89K66pk62r8L54k27N6p3R0k2p5j2J39m1K28j93L2J7p6
4523Ij05J21k22R9J07j71M1M65l11R6k3j31Q5j12pL5L4j51J93N4k82k5L62l31
4547a70K53j10o2J26k48K5M74m59K78k10J15J14k18J72q5k04K81j06p1q5L52l1
4569A31k04J06L0k55J15n4Q7K4J79j29p1k36L00k29K48k47K3N8K30J0N8n9m44
4592c29K54L41n08J73j73L30N9qk9j05k03K51j82K17l56M92j88j66K08j29r8R0
4614e9K48l00K50k52N9J57j06J62K63o58N49k89O1k81J82j82K05J17l3R8p0Q6
$$ plain form
4636 207 -64 -65 -54 196 156 -159 58 -166 -135 -273 -178 -78 233 3 408 -142 -104 -197 87 -140 -76 -189 177
4659 177 193 -56 -54 -254 4 -70 219 -156 -221 202 -134 302 -315 116 107 -134 141 -43 -121 64 40 -89 17
4682 17 -71 -37 -196 -31 86 -85 178 2 -110 174 -99 118 -101 47 -74 -184 69 57 -73 -154 -36 40
4704 40 -192 -36 88 -74 -171 148 25 -205 124 -86 26 174 -168 -100 -16 -135 37 260 62 19 387 18
4726 18 288 -161 -159 65 -168 92 -171 0 96 59 1 -100 -180 -156 -62 15 -80 62 -26 34 -37 66 -155 194 -36
4751 -36 213 70 -114 33 -37 -85 -71 97 -86 123 -4 65 126 27 -164 -100 -16 158 129 -58 -4 86 118 87 -191
4776 -191 80 106 -99 -164 -146 133 -82 251 252 98 196 -11 -149 46 247 -55 64 39 -26 -36 73 -68 85
4799 85 -84 -7 181 -103 94 137 63 41 -14 -117 184 32 22 116 137 -9 79 271 11 58 -39 101 -21 -212
$$ packed form
4636B07k71jJ1K50m0l15K17k24L1j38R5J00L11k30M05n50L8r3K84k27O4j13L66
4659A77J6k49Kk00K58p4K89l75o5M23l36M36o17M31rk41K75j84p8J85k4j29J06
4682A7q8L4j59J65J17j71K63j76j12K84k73K17k19J48j21j10K53j2j30q1J18P6
4704D0k32J56J24j62r7L19j23k30L29k10J12J48l42O8Q4j19J72K23j98m3L68l69
4726A8K70m49KK24k33K60k63J71R6l7n8j01q0K4R4P7r5J42q8O0p1J03k21L49k30
4751c6K49j43j84J47p0m8J4J68j83K09j27O9O1r9j91O4Q4J74k9j87N4R0L2l1k78
4776a91K71K6k05o5J8K79k15L33Jj54R8k07j38J95K01l02J19k5o5j0J09j41J53
4799H5j69P7J88k84J97M3p4k2n5j03L01j52j0R4K1j46Q8J92k60M7r7J40j22j91
$$ plain form
4823 -212 -114 -155 -234 -191 -243 -70 -118 -126 16 38 133 159 51 143 76 -40 -250 -155 19 -10 -105 -89 136 75 -160 -247
4849 -247 -28 45 112 49 18 -132 -19 -87 -25 -135 -196 -196 -158 25 -175 133 63 -130 111 101 -13 30 -72 -114 -38
4874 -38 -2 251 -19 -114 -166 87 37 76 111 -40 -36 146 -158 -132 74 -96 58 153 113 -236 -265 -119 55 -277
4898 -277 215 435 -133 146 120 -6 24 -17 -215 -50 -58 0 165 -45 -57 62 106 -167 45 77 -124 -76 125
4921 125 -115 47 57 -192 147 272 112 0 -22 -10 -70 -106 94 -58 -27 -217 26 -92 40 57 -161 139
4943 139 65 306 -41 42 -12 -54 -84 -135 251 1 -26 -157 -137 -170 -61 63 -137 -210 -55 163 -6 -110 -1
4966 -1 207 -76 -94 -83 -149 124 -162 42 226 -35 59 -306 326 96 -163 136 163 -118 -236 -288 -10 275 -31
4989 -31 10 64 -37 52 232 -81 -113 -179 -5 -26 32 -11 81 -103 -78 -88 -109 -34 222 -81 -64 -135 -233 -51 39 73
$$ packed form
4823b12R8m1p9M3n2J73m8qJ42K2R5K6j08R2o7j16k10R5J74k9r5J6K25o1k35q7
4849b47K19P3O7o3l1j50J13o8O2j10o1%L8J83k00L08p0j93K41j0j14M3j02m2P6
4874c8L6K53k70r5n2K53n0L9L5j51MJ82l04K6K06j70J54R5m0l49k9J46J74l32
4898b77M92K20n68K79k6j26L0m1j98J65qN8J65k10j2J19M4k73K12L2k01M8K01
4921A25k40J62J0k49L39J25j60j12k2J2o0l6K00j52L1j90K43j18J32J7k18L00
4943A39p4K41l47Q3n4m2l0n1L86k50k7j31K0l3J09J24k00p3J55K18j69j04J09
4966aK08k83j8J1o6K73k86K04J84k61R4l65O32k30k59K99K7k81j18n2K78K85l06
4989c1M1N4j01Q9J80l13l2o6J74k1N8m3R2j84K5j0k1P5K56l03J7p1r8J82R0L4
$$ plain form
5015 73 -22 65 3 -80 -66 60 -66 -15 82 -23 -29 191 -74 -143 83 144 78 -30 30 -3 -58 12 -71 24 -79 82
5041 82 50 -83 -137 -78 -101 112 44 -160 -92 4 -67 38 59 -129 -76 -26 -17 -33 -32 108 -370 -212 -69 -35 43 -48 -92
5068 -92 -161 94 -134 -253 23 205 227 163 -113 151 -21 -196 -29 119 83 99 132 62 -47 -232 178 -278 126
5091 126 -27 -215 -73 -72 120 69 72 309 -37 195 -35 -89 177 -22 -177 -36 -160 -23 150 -255 -103 -111 35
5114 35 -148 69 -273 110 15 -312 -57 24 -60 -163 -64 -41 -66 -231 -173 -63 -163 -31 2 90 158 -215 124 -67
5138 -67 203 -2 53 23 94 -83 221 56 53 49 13 79 -112 -230 -171 65 -52 -172 90 -155 -37 68 48 161
5162 161 -137 -8 -31 -68 -134 123 -4 -77 -84 -103 81 -169 -197 -57 -235 -36 -71 128 103 79 14 30 -99 -244
5186 -244 -5 92 80 -5 -173 207 -5 -96 158 -133 197 -170 -198 45 -246 -129 -23 -26 -166 54 132 -13 155
$$ packed form
5015G3r5Q7o2q3J4J26j26N1R7j05oK20k65o9K26O1o6j08O0l3n5P0q3R5j03J61
5041H2l2j33n4N9k3K13o8k04O8R6p1J05K1j88N3N0Rj6JJ40m78J58J43L4P8r1m4
5068i2o9K55k28j19K76J82K2o4k76K64j72j75J67J48l6J6L3p0j09j85M10m56M04
5091A26j53j88J42JJ92n1LK37l46K32k30n4K66j99j55J41j24J37J73m05J52qJ46
5114C5j83K17l42L83r5l27K55Q1q4j03R9K3k5j65N8J10j00J32L3Q8O8l73L39j91
5138f7K70k05N5l0P1j77L04j65lml6O6j91j18N9K36j17j20K62k45J18J05k0J13
5162A61k98J29k3l7o6K57j27p3pj9J84k50k8J40j78J99l5J99k5k4o5J6j29j45
5186b44K39R7j2q5j68L80k12r1K54k91L30l67k8K43k91J17J06lj40K20P8j45J68
$$ plain form
5209 155 236 -3 -84 128 14 127 -39 62 196 232 -98 78 -227 42 -23 -61 -166 -69 32 -14 277 -156
5231 -156 282 74 263 228 -27 -13 -129 -50 -44 -22 -63 65 -84 98 -228 -62 3 63 -13 121 124 -292 -124 -223
5255 -223 38 126 46 -235 59 32 -131 85 -137 -22 116 -156 -7 176 211 105 -178 -103 222 -134 -215 -170
5277 -170 -83 243 52 -140 8 147 -10 55 -68 -86 48 40 -61 86 -175 -32 33 63 -137 -45 84 -234 -87
5300 -87 26 -29 -41 230 -38 -59 -136 170 -16 198 48 -46 41 -153 47 174 96 -164 25 -167 182 -131 62
5323 62 52 189 -104 120 293 17 37 40 94 -266 71 -158 125 -141 84 -141 179 -44 49 -111 -36 49 137
5346 137 126 -217 105 -105 106 -32 68 -38 198 169 45 -19 -251 -185 89 23 -212 -85 80 -83 -36 14
5368 14 -140 -135 -26 -60 27 272 -84 -81 -169 3 -3 -4 118 -64 19 -1 -117 106 47 60 -397 -197 -68 80 -84
$$ packed form
5209A55Q1k39q1K12j14J13j66J01J34L6l30J76l05K69o5l8j05R7J01m6K91m33
5231a56M38k08J89l5k55J4j16P9OK2m1J28j49J82l26J66O5O0p6J34Lm16J68r9
5255b23K61Q8q0k81K94k7j63K16k22J15J38k72J49J83L5j06k83P5L25l56q1M5
5277a70Q7L26j91j92J48J39j57O5j23j8J34qj01J47k61J43O5L0k00R2J29l18J47
5300h7J13n5j2K71k68k1p7L06j86K14j50r4Q7j94K00J27p8k60J89j92L49l13J93
5323F2j0J37k93K24J73k76K0LN4l60L37k29K83k66K25k25L20k23R3j60P5Q5Q8
5346A37j1l43L22k10K11j38J00j06K36k9j24o4k32O6K74o6k35J27J65j63M7N0
5368A4j54NJ09l4Q7K45l56Lq8J72ojJ22j82Q3k0j16K23n9J3m57K00J29J48j64
$$ plain form
5393 -84 -48 -78 109 3 -119 -20 -134 -79 -336 -165 -41 -52 -24 -35 -106 121 80 -130 131 -96 -110 108 -210 -11
5417 -11 -52 -408 90 167 -20 58 65 -283 13 282 -387 108 -26 165 -39 68 80 -12 -97 -165 -207 182 -78 -8
5441 -8 61 111 -66 -10 -90 -413 148 10 221 148 -114 38 -10 -278 -36 271 49 -142 170 10 145 131 132 -106
5465 -106 -104 91 206 22 71 -29 -43 109 -32 -78 54 144 -352 30 -62 -6 76 -144 -20 121 -110 7 15 127
5489 127 184 5 111 102 14 -57 2 103 -253 -53 -8 -165 182 -76 126 -135 -223 -24 203 -44 136 225 -248
5512 -248 -50 49 31 -69 -209 -125 -2 30 -19 173 -116 91 183 101 303 -16 -83 50 -5 -19 84 89 -126 -86
5536 -86 4 46 23 125 19 -151 -205 -112 52 70 260 -41 -97 153 11 205 30 133 -47 231 110 -25 -49
5559 -49 15 -38 -6 -194 127 -248 -107 -1 -340 345 103 -84 203 150 -36 -30 -48 60 122 -88 111 -100 72
$$ packed form
5393h4L6l0J87j06j22R9j14N5k57J71J24j1K8j1p1K27m1k10K61k27j4K18l18J99
5417a1m1l56M98P7j87P8Pl48K96K69o69M95j34J91k04J07J2r2q5o8m2L89k60P0
5441hO9N0j77N6q0l23N61j38K11p3k62J52m8k68K42L07k22j91L12j60J35j4Jk38
5465a06KJ95J15j84M9j00j4J52j41m6J32R0m96L82r2N6Q2k20J24J41k31J17QJ12
5489A27N7j79J06rq8p1N9J01l56K00M5j57L47k58K02k61q8J99K27k47J80Q9m73
5512b48J98R9j8j00j40Q4J23L2m9J92k89K07R2q2K02l19o7J33n5j4J03Nk15M0
5536h6R0M2k3J02j06j70n4R3J64J8J90l01n6K50j42J94j75J03j80K78j21j35k4
5559d9O4n3L2j88L21l75J41J06l39O85k42j87K87n3j86Oj8J08O2k10J99k11J72
$$ plain form
5582 72 0 -55 -70 1 31 105 67 115 -196 -85 -49 -22 -64 250 -45 -33 136 -67 163 -34 108 132 131 -9 160
5607 160 153 137 -18 -42 -36 -64 -66 116 203 50 171 170 -243 39 450 -158 -24 -158 216 -10 54 -50 -2 112 38
5632 38 101 -165 55 163 92 -189 -44 -151 132 -218 58 -104 151 145 189 63 -19 -33 -126 -50 -117 -85 -339 -110
5656 -110 73 44 59 -32 33 135 -31 -59 18 60 0 187 -188 -111 242 98 99 6 -200 47 160 15 71 -4 53
5681 53 195 -6 -98 -192 -103 -63 -205 -15 -78 156 -38 71 -49 -130 -90 214 28 -30 -147 57 -17 -61 -157 144
5705 144 -147 132 245 -171 220 -137 18 -213 259 42 -202 -89 -14 -11 -60 -35 180 -46 36 -105 75 -206
5727 -206 -4 55 64 241 39 -220 -29 56 -127 -92 -236 -33 -178 -68 -5 -179 -135 -19 -63 -86 143 194 65
5750 65 210 13 7 71 -38 -7 174 -28 164 -12 -126 153 143 -44 -87 -38 -105 -66 -9 53 -127 112 164 -200
$$ packed form
5582G2p2n5j5P1L0P4l8M8l11J11L6K7m2L14k95J2J69k03K30j97J42K4jj40J69
5607A60pj6j55k4Ok8kJ82Q7j53J21jm13K82M11o08J34j34L74k26O4j04M8J14p4
5632C8O3k66K20J08p1k81J45j07K83l50K76j62K55oM4j26q2j4r3P6o7L2k54K29
5656a10J83k9J5r1O5J02j66k8P7M2o0J87l75P7L53j44Jr3k06K47J13j45N6p5N7
5681E3J42k01r2r4Q9M0j42J90o3K34j94J09j20q1M0L04j86n8j17K04p4m4r6L01
5705A44k91K79J13m16L91l57J55k31M72k17k44J13P5Lm9K5K15k26Q2j41J80k81
5727b06K02N9RJ77k02k59J91Q5j83L5j44K03j45J10O3j74M4J16m4k3K29N1j29
5750F5J45j97oO4j09L1J81k02J92j76j14K79j0j87m3M9o7L9N7O2j80K39N2l64
$$ plain form
5774 -200 -139 -42 -11 -48 -178 99 129 -10 -87 -63 -61 129 -39 131 -87 -55 -71 -259 -192 42 -53 -34 -92 -160 -22
5799 -22 -15 406 181 -21 118 -76 -140 -45 -121 -119 -140 87 -24 -2 11 -218 -102 -34 -213 107 168 164 118 0 -102
5824 -102 -164 -304 54 10 180 -43 88 367 79 -181 -17 143 124 -115 137 -55 -48 250 25 131 20 83
5846 83 -99 60 -21 151 176 141 -150 19 83 -107 -134 -123 158 83 -13 30 -36 71 -125 -19 -241 67 102 -166
5870 -166 5 177 187 -36 124 -62 -110 144 116 10 52 22 -59 -124 -65 -13 14 51 -5 -127 -217 81 58 -148 11
5895 11 106 -48 142 -122 -279 -1 -3 -323 3 85 233 33 -8 -103 114 -81 -35 103 -146 7 130 -71 96
5918 96 31 34 -174 148 -2 120 -7 129 232 -179 -7 105 -31 -14 -125 -161 87 -269 259 -124 -147 48
5940 48 -388 -7 -62 -82 -157 41 100 -81 -81 69 -227 -26 131 -77 -21 51 -54 -82 -211 187 30 127 264 33
$$ packed form
5774b00O1R7L1l7j30K77L0j39p7K4KJ90j68J70k18L2j6j88O7K34r5J9n8o8J38
5799b2PM21k25k02J39j94o4R5p6Kk1K27j11K2J3k29J16O8j79L20O1mm6j18j02
5824a02o2j40L58m4J70k23J31K79k88k60J64J60j9k39K52j92PK98k25J06j11O3
5846H3j82J59q1J72K5l5k91J69O4j90k7J1K81p5r6M3o6J07j96J06k22L08L5k68
5870a66J71J72J0k23J60j86m8K54k8j06M2l0q1o5N9N2K7L7n6j22r0K98k3k06J59
5895A1R5j54J90k64j57K78kl20L26Q2J48k00m1r5K17j95M6J38k49J53J23k01J67
5918I6o5Lk08L22j50J22j27J36J03m11J72J12j36J7j11l6K48l56N28l83k3J95
5940D8m36L81n5k0p5J98N9j81%J50k96K01J57k08N6P2j05k8j29L98j57R7J37k31
$$ plain form
5964 33 34 -125 -160 103 63 -101 -211 166 150 -131 100 6 33 -100 -8 102 154 69 -54 -83 -159 136 350 139
5988 139 114 243 -119 158 128 -163 -267 -68 65 172 192 -87 -215 145 83 46 248 -25 59 -44 236 143
6010 143 91 129 -18 130 -138 -217 96 -105 41 -138 -196 75 -39 -85 -192 -286 0 32 -10 208 193 231 -171
6033 -171 -19 253 -112 -18 109 -85 -156 -70 27 -72 244 -33 70 -66 -187 129 54 10 23 -60 116 11 -66
6056 -66 -226 -209 166 -170 -7 29 -12 -116 -111 8 108 1 -7 -198 -74 -154 -83 10 -149 -17 241 56 21 -186
6080 -186 -21 -171 -124 40 149 255 -55 24 -153 -150 -1 -137 -49 75 -139 -142 -14 154 -71 161 34 -154
6102 -154 -63 -88 -143 98 -92 2 10 68 142 107 -170 -161 -127 -301 72 -176 -127 259 -93 -58 -26 -169 -291 146 -54
6127 -54 253 163 207 27 76 -80 48 154 -124 229 -15 6 90 70 74 -143 7 -54 -132 43 235 -55 -142 -163
$$ packed form
5964C3Jj59l5K63m0j64j10L77j6k81K31r4K7j33R2J10N2q5j23k9p6K95K14k11
5988A39k5J29l62K77l0k91j04J99J33J07K0k79j28L60o2l7K02k73Q4j03K80r3
6010A43n2L8j47J48k68p9L13k01J46j79n8K71j14m6j07r4K86L2m2K18j5L8m02
6033a71J52K72l65R4J27j94p1Q6R7r9L16k77J03j36j21L16p5m4J3q3J76j05p7
6056f6j60J7L75l36J63L6m1j04NJ19J00j07qj91J24q0P1R3j59J32K58j85l5k07
6080a86J65j50M7J64J09J06l10P9j77LJ49j36Q8J24k14lJ28J68k25K32j27j88
6102a54R1k5n5K41j90R4QN8P4l5k77RL4j74L73k48M9L86l52L5L2j43j22M37k00
6127e4L07r0M4j80M9j56J28J06k78L53k44K1Q4k0Mk17J50o1p8J75J92k90q7k1
$$ plain form
6151 -163 33 -20 97 -66 101 156 -199 -51 -96 90 -126 -105 95 220 -44 -4 45 -116 3 225 200 -21
6173 -21 -88 -78 -208 -319 -117 163 -28 -289 -203 -89 -211 134 0 86 -45 -11 185 -89 -16 -43 106 261 -10
6196 -10 -115 78 -93 15 -97 212 200 -2 114 94 118 -63 -68 -171 -15 45 164 139 -154 1 82 -53 -131
6219 -131 -110 -22 81 38 151 39 -139 -42 9 27 -144 -328 -109 -53 -31 -112 -134 83 -50 116 -142 -159 -233 240
6243 240 -21 169 -32 -147 123 19 173 -132 -46 -105 111 68 233 159 -69 -113 2 -41 -6 99 -76 -51 157
6266 157 -2 -92 197 87 60 -26 -124 2 -3 -38 271 103 72 -102 97 -13 -226 45 -145 -29 42 -56 -149 94
6290 94 59 74 62 -172 78 -136 232 -42 64 305 -14 -292 -67 -72 -90 -129 224 89 -20 6 -167 -125 -219 -28
6314 -28 101 92 17 -45 -166 -161 20 -419 -132 -94 109 151 -150 339 233 -108 -155 -26 -4 -274 -263 -118 198 198 -3
$$ packed form
6151a63J96n3J17j63J67N5l55J48m5J86k16K1K00J25k64M0M9j61J19K22k5k21
6173b1o7J0j30j11K02K80j91k61Q6J14j22L45j34Q6j31L4J96k74P3k7J49J55k71
6196a0j05J93j71J08j12L09j2k02J16k0K4j81nj03J56O0J19k5k93J55Q1j35p8
6219a31K1Q8J03m3J13j12j78R7N1J8j71j84K19N6K2q1k2K17j33J66k58j7p4M73
6243B40k61J90k01j15K70j04J54l05Q6n9K16m3J65p4k28m4J15m3L5J05j75K5K08
6266A57j59r0K89j10k7q6r8J26nl5L09j68l1j74J99j10k13K71j90J16P1r8r3K43
6290I4l5J5j2k34K50k14L68k74J06K41l19k78K25nj8l9L53j35j09K6j73M2r4J91
6314b8J29rp5o2j21NJ81m39K87L8K03M2l01M89j06l41m7J29K2k70J1J45L16%k01
$$ plain form
6339 -3 44 -144 -3 134 -168 158 -122 -42 -229 27 -69 -48 154 -234 56 64 -229 55 29 329 -20 82 -110
6362 -110 29 -93 -102 -25 248 -221 70 -53 -66 -1 -87 -28 0 71 163 -46 -104 -181 -34 28 -115 179 -71 -56 267
6387 267 61 -31 -168 -16 -76 148 -93 -208 73 5 -40 -63 36 128 -15 46 44 -81 -129 -226 -36 -33 133 5 278
6412 278 64 36 32 520 -146 199 -201 30 60 277 -23 -110 131 -24 -49 -152 -16 -280 159 -41 128 114
6434 114 -171 -4 25 -92 11 6 -80 -86 172 -175 -24 147 58 147 -44 117 471 93 41 -82 -97 -26 -144 -124
6458 -124 136 197 -170 -10 -20 260 81 -2 -67 -8 -125 -134 -86 172 302 124 -88 -14 -219 119 -210 -19 -263
6481 -263 56 -38 41 -112 -37 -37 210 117 -117 300 116 -304 -145 -103 -28 57 88 141 96 -67 -87 86 25 152 65
6506 65 4 68 115 -25 -22 -13 -177 -166 204 -152 -18 64 162 60 -37 72 46 -78 -53 102 181 139 95 78 -34 48
$$ packed form
6339cM7j88J41J37l02L26k80Q0j87K56r6K1K02l88K90Qk93K84k6L00l49J02j92
6362a10J39j22rP7K73m69K91j23j3O5q6N9K8P1R2k09n8p7J47O2j43K94k50J5L23
6387B67k06r2j37J52o0K24k41j15K81o8m5k3R9R2j43O1kj25m8r7J90LJ66j28K73
6412B78k14k8mM88o66L45m00K31L0K17l00q7K41j55k5j03J36k64M39k00J69j4
6434A14k85J67K9j17J03nq6oK58l47J51J71q9Q9j91J61L54l78n2j23j5P1j18K0
6458a24K60O1l67J60j0K80j79q3o5N9j17rM8K58J30j78k12P4k05L38l29J91k44
6481b63L19r4P9j53P5%K47r3k34M17j84m20J59M2P5Q5L1N3m5j63k0J73o1J27q7
6506F5o1O4M7j40LRj64J1L70l56J34Q2R8j02r7J09k6j24K5J55P9m2m4j7j12Q2
$$ plain form
6532 48 -10 -78 86 331 -178 -128 -130 -161 231 -147 -4 -32 -63 -80 -2 33 157 -96 21 163 -7 115 224 60
6556 60 -86 -71 -58 184 202 -117 -434 9 84 188 -43 68 -145 -17 -9 22 -99 -117 -59 -184 -268 127 -23 -30
6580 -30 -91 -19 -34 111 98 -36 48 39 -29 -32 -71 -166 -120 -84 24 -42 247 39 51 52 62 0 61 -132 7 -30 137 -30
6608 -30 -39 4 -86 69 -119 15 130 134 -161 -211 -110 -222 -83 -33 114 -56 -163 71 77 -98 -72 -19 71 -38 26
6633 26 -276 67 -15 -69 -64 -173 -89 -192 83 81 -98 372 11 -110 70 174 -426 39 131 157 15 -133 104
6656 104 -1 82 61 -84 -21 -27 138 -27 -59 -57 52 -82 -105 100 116 142 70 112 -193 140 8 130 53 92 295
6681 295 126 210 139 68 -49 -250 69 151 101 -102 -170 34 0 -190 160 15 161 173 84 23 8 -87 -109 48
6705 48 75 59 -251 -23 70 194 9 204 104 118 108 -3 -167 -111 153 116 39 48 46 -58 75 -321 135 -57
$$ packed form
6532D8n8o8J64K45n09N0kl1L92l78J43k8l1j7P8L5J24k53J17J42j70J22J09j64
6556F0j46J5J3K42J8l19l17M43P5J04k31J11k13J28QL1j21j8N8j25q4L95j50p
6580c0o1P2j5J45j3j34Q4ro8ll9r5M6L6J08o6K89k08J2JJ0o2O1j93J39l7J67j67
6608c0rM3r0J55j88J34J15Mk95n0J01j12J39N0J47j70j07K34Oj75K6N3R0j09O4
6633B6l02L43q2n4Nj09Q4j03K75kj79M70l61j21J80J04o00M65R2K6j42j48K37
6656A04j05Q3k1j45O3oJ65j65l2KJ09j34k3K05J6K6p2M2l05L33j32J22p7L9K03
6681B95j69Q4p1p1j17k01L19Q2n0k03o8K04l4j90L50j45J46J2q9o1j5r5k2J57
6705D8K7j6l10K28R3J24j85J95j00J4j0j11j64N6K64l7p7Rkj04J33l96M56j92
$$ plain form
6729 -57 165 -19 -168 -74 15 -57 -69 -8 39 130 189 -126 19 260 -108 186 -76 91 -20 57 0 177 177 106 -4
6754 -4 -102 -161 68 4 128 234 -91 -25 111 108 51 -187 83 -48 -187 36 32 111 140 -37 -180 70 111 -109 29
6779 29 121 -23 -82 -269 129 248 -2 -30 -46 165 28 -12 47 78 -87 86 129 -128 13 -245 271 44 -39
6802 -39 155 -14 240 -358 101 151 -55 88 33 -137 -131 -158 19 81 142 -79 -32 -66 -21 45 -167 -170 -107 -174 100
6827 100 204 45 94 -292 -49 184 -239 49 7 -67 -168 52 -64 14 55 -170 274 103 200 -58 -109 -358
6849 -358 15 42 98 -4 -189 -68 38 -266 -62 -25 -114 291 54 -213 -116 -120 -100 103 -74 101 -145 6 -37
6872 -37 31 155 113 114 -174 -49 312 -106 -29 18 144 21 179 224 -75 79 -25 40 88 -89 -99 -112 -12 -146
6896 -146 -104 71 -131 -286 227 74 197 -45 64 -3 -249 120 50 -48 75 185 13 -186 -1 -300 -44
$$ packed form
6729e7K22j84j49R4Q9p2j2O1M7R1N9l15J45K41l68K94k62J67j11P7n7J77%p1j10
6754dr8n9K29o4J24J06l25O6J36ln7k38K70j31j39K23mP9K9j77j43K50M1k20J38
6779B9R2j44n9j87L98J19k50k8j6K11j37m0N9L1j65J73M3k57J41k58N16k27q3
6802c9J94j69K54n98M59N0k06J43n5j70Ok7J77O2O1k21M7l4M5O6k12lO3o7K74
6827A00J04j59M9l86K43K33m23K88m2p4j01K20j16P8M1k25M44j71R7k58n1k49
6849c58L73K7N6j02j85J21J06l04K04L7q9M05k37k67R7mK0K03j77J75k46J51m3
6872c7O8J24m2Jk88J25L61m18P7M7J26j23J58M5k99J54j04O5M8j77j0j3J00j34
6896a46M2J75k02j55N13j53J23k42J09o7k46L69p0r8J23J10j72j99J85k99K56
$$ plain form
6917 -44 -74 -82 -91 110 -14 143 -34 70 36 128 30 -1 44 -247 102 -93 35 183 74 -95 56 113 63 -95
6941 -95 143 -44 -4 -238 176 17 194 -89 -130 68 -55 30 -76 -161 -7 -19 -104 37 -149 -28 122 194 26
6964 26 -180 71 -41 31 32 249 102 75 21 41 241 -208 135 -123 12 -5 -174 -140 -124 197 -107 33 -18 -151
6988 -151 -32 287 -148 -37 6 -53 -76 111 67 -139 -17 114 -272 59 39 11 -116 150 42 -124 -303 -162
7010 -162 -16 -157 -25 73 44 -171 -34 -126 144 98 83 33 -43 49 -234 106 -36 -120 -4 -134 -175 -35 105
7033 105 186 -87 -38 27 -100 69 185 -68 -87 45 74 -137 102 -14 -161 4 -14 -379 -89 -12 -201 -78
7055 -78 -166 -258 77 -80 -133 73 394 -207 -89 50 17 24 132 92 55 163 5 -92 -36 59 -193 164 82 34 -67
7080 -67 -130 64 37 -74 46 37 -23 8 -60 117 -76 -124 31 11 -4 187 -30 -68 132 132 -18 -41 96 6 -50 136
$$ packed form
6917d4l0qrK01j24J57j77J04l4R2r8l1M5k91L49j95J28J48j09j69J51N7n0j58
6941i5K38j87M0k34M14j59J77k83m1J98j23Q5j06q5J54j2q5J41j86J21J50P2j68
6964B6k06K51j12P2JK17j47k7n4K0K00m49L43k58J35j7j69L4J6L21l04J40n1j33
6988a51J19L19m35J11M3n9k3J87m4k06J22J31l86L31k0k8j27K66j08j66j79J41
7010a62J46j41J32R8k9k15J37r2K70m6j5n0p6R2k83L40j42q4J16j30m1J40J40
7033A05Q1k73M9O5j27J69J16k53j9J32K9k11K39j16j47J65j8l65K90P7j89J23
7055g8q8r2L35j57n3K06L21o01J18J39l3PJ08m0l7J08j58r7N6R5k52L57q2m8j01
7080f7o3J94k7j11J20ro0L1o8J77j93m8J55k0j5J91k17l8K00%j50k3J37r0n6J86
$$ plain form
7106 136 60 -2 -116 53 -87 150 3 -37 -6 -4 245 -150 80 9 -215 -17 -38 113 -34 55 -113 4 67
7129 67 -42 158 -67 258 127 -49 26 -18 -194 -83 -228 -127 -63 9 -13 97 22 -264 76 -281 19 168
7151 168 88 6 113 2 187 133 -54 23 -86 -16 188 -220 121 33 -176 105 59 -73 -38 -9 318 54 47 37
7175 37 -245 -216 -4 -41 -24 18 -63 -5 59 123 -129 18 -161 98 -6 -2 -81 -3 13 88 13 44 -205 44 -129 118
7201 118 44 104 -25 76 -13 27 53 -33 -34 -158 24 280 146 -21 83 175 -48 -85 234 88 106 23 -162 -109
7225 -109 -185 92 225 -3 34 103 52 15 25 -100 33 107 99 -180 -36 -212 -145 62 17 -116 198 -49 -84 -36
7249 -36 -2 33 -5 -9 -253 20 57 13 168 -104 33 -191 -27 -17 -40 -189 -192 -210 15 242 -163 -200 93 11 -191
7274 -191 85 193 153 56 9 85 177 34 -15 24 -239 -104 48 -49 69 136 16 11 -251 -24 101 32 -12 160
$$ packed form
7106A36p6o2j14J69j40K37j47m0L1KK49l95K30p1k24J98k1J51j47Q9j68J17O3
7129F7j09K00k25L25j31j76P5m4j76J11j45J01O4P2k2J10p5k86L40l57L00J49
7151A68q0q2J07j11J85n4j87P7j09P0K04m08L41q8k09K81m6j32L5K9L27k64pj0
7175C7k82K9K12l7J7M2q1N8O4O4k52J47j79K59j04Mp9P8J6P5p5L1k49K49j73K47
7201A18p4O0j29J01q9M0K6q6jj24J82K56j34j67J04R2k23l7L19j46J8q3j85N3
7225a09p6K77J33k28L7O9n1l7J0j25J33P4qk79J44j76O7K07m5j33L14k47l5M8
7249c6L4L5l8mk44K73L7m4J55k72J37k24J64J0k3j49lj8K25K27m05l7K93q2k02
7274a91K76J08m0r7m7P6R2j43m9L9k63J35J52r7J18O7j20nk62K27J25o9m4J72
$$ plain form
7298 160 -143 -106 -298 -144 -1 -68 52 92 -82 129 -21 -249 118 98 57 -69 89 41 -101 29 -86 -47
7320 -47 -292 -51 51 51 12 -100 1 -155 -126 -5 -231 82 -12 -88 56 39 -61 -117 277 63 161 59 -11 -292
7344 -292 152 -17 159 53 -90 -119 62 -101 1 36 -70 55 29 90 -292 97 -155 -103 80 113 -42 139
7366 139 82 37 -214 -146 209 168 -46 49 55 -56 116 196 102 -34 -194 92 61 4 -70 -196 12 52 -27 -244 221
7391 221 -38 242 102 -55 30 49 -113 15 186 64 177 -29 40 60 -60 52 43 -6 -23 -144 -193 78 0
7414 0 -110 75 14 121 184 -112 -83 -125 164 91 -21 40 150 11 63 -72 106 55 98 106 135 132 200 166 -136 92
7440 92 139 -213 -120 103 -21 197 38 78 -44 53 60 111 263 140 -35 79 50 -158 -170 59 105 134 -20 -36
7464 -36 -111 164 84 -64 -82 179 -60 32 98 209 96 -170 150 -85 -55 -50 -204 -107 32 -108 231 -90 -47 -143
$$ packed form
7298A60l03L7j92J54J43o7J20M0j74K11j50k28L67k0m1j26J58m8j42J30j15L9
7320d7k45K41J02%l9j12J01j56K9J21k26L13r4p6J44j7j00n6L94k14R8j02p0k81
7344b92M44j69J76j06j43k9J81j63J02L5j06J25k6O1l82L89k52N2J83L3j55J81
7366A39n7m5k51O8L55m1k14R5Oj11J72Q0r4j36j60K86l1n7p4j26K08M0p9k17M65
7391B21k59K80j40j57Q5J9j62J28J71j22J13k06O9K0j20J12rm9j7j21m9K71p8
7414@j10J85o1J07O3k96K9m2K89p3j12O1J10j39N2j35J78n1M3QK9lO8l4l02K28
7440I2M7l52R3K23j24K18j59M0j22R7PN1J52j23j75J14k9k08j2K29M6K9j54j6
7464c6p5K75q0j48j8K61k39R2O6J11j13k66L20k35L0Nj54R7J39j40L39l21M3r6
$$ plain form
7488 -143 -187 119 132 56 224 80 -90 -4 323 37 -130 116 37 92 115 -57 61 -194 13 122 7 112
7510 112 -69 -8 220 -64 -24 -107 -48 46 -117 92 37 135 -73 -11 -193 -107 163 46 124 -82 -60 -197 95 -176
7534 -176 154 179 -15 61 262 -57 375 176 -22 373 120 -90 -166 -45 -62 -33 -77 121 107 -79 167 -4
7556 -4 99 -149 -154 -45 -66 -240 -199 29 -1 -57 113 121 -36 280 150 -22 47 -34 284 -15 -62 -293 85 -19
7580 -19 -31 -140 -34 -38 18 32 -166 -47 93 -100 -298 -81 -19 -14 -93 -24 69 -101 33 58 -191 -16 10 -61 -96
7605 -96 -33 -115 118 -50 -118 139 -61 169 0 40 171 -12 71 63 0 49 126 -70 -174 -50 28 -167 124 82
7629 82 27 213 3 287 106 93 105 173 158 -46 -265 -179 319 -11 -122 60 311 123 -241 69 39 127 99
7652 99 -164 139 -8 -59 94 30 -137 -25 -126 -91 108 24 -120 3 -66 -152 -12 15 -112 -111 -57 -52 3 -5 -25 -32
$$ packed form
7488a43m4L06J3p6J68j44j70Q6L27k86j67K46p9N5K3j72J18k55K07J09j15J05
7510A12j81O1K28k84M0q3N9R4j63K09n5R8k08O2j82Q6K70j17P8k06K2j37K92k71
7534a76L30K5j94P6K01l19M32j99j98L95k53k10p6J21j7K9m4J98j4j86K46j71
7556dJ03k48nJ09k1j74M1K28l0n6J70Qj57L16j30j72O9q1L18k99m7k31L78j04
7580a9j2j09J06mN6J4j98J19J40j93j98K17O2Np9O9R3j70J34K5k49J75K6p1l5
7605i6O3q2K33j68o8K57k00K30j69M0J31j83Q3qo3M9P7j96j04J24P8j95K91m2
7629H2n5J86k10K84j81j3J2O8j5k04k19Q6M98l30j11J82K51j88l64L10l0Q8k8
7652I9k63L03j47n1J53o4j67J12j01L5J99q4j44J23o9q6J40K7j27JN4NN5qk0p
$$ plain form
7678 -32 145 132 133 49 173 132 214 22 187 -51 63 -117 -50 184 -123 -10 53 -123 -71 6 19 -169 9 121
7702 121 6 118 -33 8 -58 -68 111 106 113 142 48 19 -141 19 -189 58 -38 96 -72 -97 -56 -142 -12 -11 68 27
7728 27 -11 -288 0 -9 85 -134 -84 125 -69 -13 23 132 139 -4 19 -239 172 -135 118 38 -298 -56 -22 12 214
7753 214 67 -8 -13 -95 33 -27 2 88 70 97 -41 -1 -179 62 61 170 -89 -62 -218 -93 113 182 -15 104 54
7778 54 -17 -133 -189 -102 59 11 197 90 131 -237 -74 31 230 131 241 165 -88 -317 93 -115 44 26 -89
7801 -89 -151 83 85 -21 -32 253 -43 -58 -78 130 -34 -70 97 89 103 -144 -163 -140 132 13 133 124 115 -44 -183 38
7827 38 95 15 145 155 -153 -107 122 149 -24 183 -136 -155 -64 98 -158 -43 28 249 -183 -277 21 262 57
7850 57 -100 -79 -131 84 -365 -34 -72 -168 -51 -149 226 97 -168 -158 -93 45 -201 -184 -192 193 59 11 -8 108
$$ packed form
7678c2J77j3Jq4J24m1Q2j92J65k38J14j80O7K34l07J13O3j76N2P7J3j88J78J12
7702A21j15J12j51M1o6j0J79nPK9r4k9j60J60k08K47r6J34j68k5M1q6J30JP9m1
7728B7l8k77K88rR4k19N0K09j94N6L6J09Pj43K3k58M11l07K53q0l36K42L4L4K02
7753B14j47p5nq2J28o0K9Q6j8K7j38M0j78K41jJ09k59K7j56J25K06O9j97J19n0
7778E4p1j16n6Q7J61m8J86j07M1l68J63J05J99r9J10p6k53k29M10k08J59j8j15
7801h9o2K34Kj06j1K85k96j5k0K08j64l6J67qJ4k47j9K3K72j19J20rrj59j39K21
7827C8N7q0J30J0l08M6K29K7j73K07l19j9R1J62k56J15P1K21m32r4K98K41k05
7850E7j57K1n2K15m49L31l8r6J17r8L75j29k65J0O5J38k46J7qL85j34m8j9J16
$$ plain form
7874 108 58 -147 128 84 92 -164 68 -17 -89 -55 -165 -141 6 61 -236 -67 -2 3 72 -131 -144 182 75 -233 -198
7899 -198 91 46 149 183 58 137 42 -140 -110 83 -13 49 141 111 -187 227 55 -273 32 -37 -23 -62 -180 174
7923 174 20 2 -245 -123 123 109 -70 14 16 -223 -200 187 -41 -11 -43 -10 -75 8 -64 -157 227 19 -229 6
7947 6 38 85 128 213 -78 13 22 -133 -23 -67 -140 -80 -65 75 -25 2 -82 2 22 55 -147 115 42 -160 -25 -77 -192
7974 -192 -27 66 -156 -188 249 -93 102 172 127 29 53 -242 -73 -7 -22 312 -86 215 -39 222 -29 23 103
7997 103 -35 11 -110 165 23 10 -9 -93 -55 39 150 -58 -36 -135 47 -46 -128 -164 35 71 -235 -19 -297 44
8021 44 -38 -73 5 -27 10 133 111 74 78 -123 -189 47 -174 339 112 -93 51 77 -61 148 -144 -202 107 102 -30
8046 -30 93 -43 -130 50 156 -163 152 95 89 20 152 43 -19 291 100 80 -143 81 18 -60 -82 -84 172 -25
$$ packed form
7874A08n0k05K75m4Qk56K32q5p2L4j10K4J47N5k97J69O5NO9k03j3L26j07l08L5
7899a98K89m5J03L4j25P9r5j82L0J93r6O2R2l0k98M14j72l28L05o9J4l9j18L54
7923A74j54j8k47J22K46j4j79Q4Kk39K3L87k28L0l2L3o5Q3p2r3L84k08k48K35
7947FL2M7M3Q5k91R1Rj55J10m4p3O0J5J40j00K7q4Q4K0L3k02K62p3k02J35n2j15
7974a92J65R3k22l2M37l42J95P0m5r8K4k95J69O6j5L34l98L01k54K61k51N2Q0
7997A03j38M6j21K75j42j3j9q4L8R4J11k08K2r9J82r3q2l6J99L6l06K16k78L41
8021D4q2l5P8l2L7J23k2l7Mk01o6K36k21N13k27k05J44K6j38K09k92n8L09nj32
8046c0J23j36q7J80J06l19L15n7oo9J32j09o2L10j91k0k23K24o3p8k2kK56j97
$$ plain form
8070 -25 237 -103 212 84 188 162 138 43 -65 76 1 -320 432 -151 207 -31 -288 -249 -146 258 103 -206
8092 -206 107 -30 -106 -248 -203 -226 -20 27 135 -5 128 -160 -159 -174 -3 -53 -80 -78 -6 269 38 90 23 -17 97
8117 97 73 41 208 -239 -47 -311 -62 -35 50 -155 -43 102 -14 137 154 28 -64 -278 32 -5 -253 290 166
8140 166 -18 120 -79 -88 -48 -144 -52 88 -122 -46 -230 -6 62 55 19 1 -6 156 -26 41 141 -106 -63 104 268
8165 268 -70 65 -69 -106 -9 22 -87 -86 -57 45 57 121 216 50 -100 -83 -250 250 112 75 44 -44 -8 -104 190
8190 190 63
$$ packed form
8070b5K62l40L15j28J04k6k4r5j08J41p5l21P52n83L58k38k57L9J03M04j55l09
8092b06L13j37p6j42M5k3K06M7J08j40J33k88Jj5J71n0k7KP2K75k31N2o7m0J14
8117I7k4l2J67m47J92k64K49K7Q5k05J12J45j16J51J7j26r2k14L10l7k48N43j24
8140A66j84J38j99rM0r6R2J40k10P6j84K24O8pl6j8pJ62j82O7J00k47M3J67J64
8165B68l38J35j34l7R7L1j09JK9J02J2O4R5j66j50J7j67N00j38l7l1q8L6r6K94
8190A90j27
8191F3
$$ Imaginary data points
##PAGE= N=2
##DATA TABLE= (X++(I..I)), XYDATA
$$ plain form
0 0 0 0 0 0 0 0 0 0 0 0 0 0 8 -8 8 -8 10 -16 16 -24 24 -32 40 -43 50 -61 72 -80 93 -106 120 -138 157 -178
34 -178 201 -226 252 -282 314 -351 391 -431 479 -530 587 -649 715 -788 869 -957 1055 -1163
52 -1163 1280 -1414 1563 -1734 1926 -2149 2410 -2719 3096 -3560 4154 -4939 6032 -7664 10358
67 10358 -15587 29447 -144946 -326393 90438 234137 2291 -168325 2119 171926 41036
78 41036 -221779 -119345 192322 181518 -85047 -123547 15525 53455 -27580 -60716 31279
89 31279 119836 6655 -127686 -49998 49874 -285 -4459 62921 35698 -52108 -76614 -21772
101 -21772 65606 56986 -29918 -4874 64559 -22722 -110603 -18889 91822 76999 -11190 -77734
113 -77734 -35810 37082 -8679 -50942 39484 78511 -10722 -62389 -48414 -16425 46610 63327
$$ packed form
0@%%%%%%%%%%%%Qj6J6j6J8k6L2m0M8n6P2q3R3j11J33j52J73j99K26k58K95l35
34a78L79m27M78n34N96o65P42q22R10j009J117j236J364j503J657j826K012k218
52a163K443k694K977l297L660m075M559n129N815o656P714r093J0971j3696J8022
67A0358k5945M5034j74393j81447M16831J43699k31846j70616J70444J69807j30890
78D1036k62815J02434L11667j0804k66565l8500J39072L7930q1035l3136R1995
89C1279Q8557j13181j34341P7688R9872n0159m174O7380k7223q7806k4506N4842
101b1772Q7378q620q6904K5044O9433q7281q7881R1714J10711j4823q8189o6544
113g7734M1924P2892m5761m2263R0426L9027q9233n1667J3975L1989O3035J6717
$$ plain form
125 63327 5730 -20380 -15975 -22750 -1160 7801 -7521 46242 75247 -39008 -111831 -21225
137 -21225 66088 49423 -13626 -41201 17469 41130 -69024 -96208 66371 130264 -8151
148 -8151 -94953 -30128 46075 25027 -49777 -15064 106792 60345 -113558 -98130 60311 80802
160 80802 -13975 -42879 17709 53900 -34368 -119718 -4005 138278 45845 -95104 -45259
171 -45259 46969 16558 -51243 -28433 76662 93004 -50877 -117642 10381 81671 1376
182 1376 -30515 24509 37395 -16905 -73477 -39489 65968 66627 -33123 -36348 19894 -12866 -48267
195 -48267 803 50990 45732 -7488 -55923 -19278 32498 -2452 -17795 44696 45190 -26510 -53988
208 -53988 -27527 21630 52429 7753 -33710 3699 11135 -39573 -31633 20418 40466 32716 -13196
$$ packed form
125F3327n7597k6110M405o775K1590Q961j5322N3763K9005j14255p2823R0606
137b1225Q7313j6665o3049k7575N8670K3661j10154k7184J62579O3893j38415
148h151q6802O4825P6203k1048p4804L4713J21856m6447j73903J5428J58441K0491
160H0802r4777k8904O0588L6191q8268q5350J15713J42283r2433j40949M9845
171d5259R2228l0411o7801K2810J05095J6342j43881o6765J28023P1290q0295
182A376l1891N5024J2886n4300n6572L3988J05457O59r9750l225N6242l2760l5401
195d8267M9070N0187n258n3220m8435L6645N1776l4950j5343O2491M94p1700k7478
208e3988K6461M9157L0799m4676m1463L7409P436n0708P940N2051K0048p750m5912
$$ plain form
221 -13196 -61386 -23526 37345 22970 -2505 5466 11109 11334 -17327 -58374 -5069 85250 44785
234 44785 -52471 -50360 6645 25612 -3829 -34432 10601 71245 3386 -95297 -42134 60513
246 60513 50864 -12845 -29446 7128 29944 -23186 -59495 23657 83918 7939 -53176 -16554
258 -16554 11605 -1423 -9930 6008 38660 20245 -54191 -48552 31744 29708 -22263 -1102 35506
271 35506 7713 -42450 -47442 19644 74441 13254 -56625 -4985 42370 -14107 -48175 6181
283 6181 57776 38349 -38114 -69290 5073 52043 -7189 -32186 22907 32369 -18588 -46197
295 -46197 -21806 33984 49163 -5323 -30290 4801 4745 -19672 269 23245 19296 11223 -16000
308 -16000 -35031 -4596 17351 6979 11372 8722 -17138 -17498 -6942 -9959 11537 30601 3442
$$ packed form
221a3196m8190L7860O0871j4375k5475P971N643K25k8661m1047N3305R0319m0465
234D4785r7256K111N7005J8967k9441l0603M5033O0644o7859r8683N3163J02647
246F0513r649o3709j6601L6574K2816n3130l6309Q3152O0261p5979o1115L6622
258a6554K8159j3028q507J5938L2652j8415p4436N639Q0296k036n1971K1161L6608
271C5506k7793n0163m992O7086N4797o1187o9879N1640M7355n6477l4068N4356
283F181N1595j9427p6463l1176P4363M6970n9232k4997N5093R462n0957k7609
295d6197K4391N5790J5179n4486k4967L5091n6k4417J9941K2976l949q073k7223
308a6000j9031L0435K1947j0372M393k650k5860l60J0556l017K1496J9064k7159
$$ plain form
321 3442 -16415 -10191 -11827 -973 16434 9708 11094 14852 -22150 -35824 9995 27681 3461
334 3461 -2714 1429 -1525 -8760 -27405 -12894 41617 34909 -28952 -33243 7494 11039 -6427 -7696
348 -7696 14292 36843 2199 -52941 -21899 42115 24227 -16566 -3498 14137 455 -23927
360 -23927 -27017 16394 45739 -1063 -38723 -4103 13732 -13768 -12939 16150 28554 7954 -31688
373 -31688 -30042 21499 27136 -14154 -4184 28578 5347 -30468 -24146 8888 35199 15356 -27394
386 -27394 -15446 18019 -4702 -27367 2908 28758 16257 -12037 -32275 -10603 24811 11084
398 11084 -11042 9449 15141 -10713 -16782 -6159 6240 23917 14091 -15414 -12626 -892 -7082
411 -7082 63 11606 4269 2613 -1108 -20919 -14128 12064 11663 4779 6174 -6806 -12142 -447
$$ packed form
321C442j9857O224j636J0854J7407o726J386L758l7002j3674M5819J7686k4220
334C461o175M143k954p235j8645J4511N4511o708o3861m291M0737L545j7466j269
348g696K1988K2551l4644n5140L1042O4014j7888m0793J3068J7635j3682k4382
360b3927l090M3411K9345m6802l7660L4620J7835k7500Q29K9089J2404k0600l9642
373c1688J646N1541N637m1290R970L2762k3231l5815O322L3034K6311j9843m2750
386b7394J1948L3465k2721k2665L0275K5850j2501k8294k0238K1672L5414j3727
398A1084k2126K0491N692k5854o069J0623J2399J7677r826k9505K788J1734o190
411g082P145J1543p337j656l721j9811O791K6192m01o884J395j2980n336J1695
$$ plain form
425 -447 -1209 3814 21067 7751 -15021 -6056 -492 -7070 3426 12503 7428 1984 -14964 -23237
439 -23237 5247 19180 -3059 -5185 10270 1098 -13400 -13655 -1609 24469 23141 -15968 -20849
452 -20849 10853 8343 -12103 -2096 15037 15656 -2278 -27375 -16842 19842 15380 -11036 -2772
465 -2772 8584 -5480 -13540 -8894 4780 22780 9675 -17719 -8121 7955 -4910 -4318 13865
478 13865 12234 537 -8606 -14930 -671 13327 -125 -3192 10912 -907 -18692 -9035 3878
491 3878 10306 11635 -5779 -12728 3974 1977 -12332 3237 18314 7212 -4824 -11454 -10395
504 -10395 7909 12904 -3291 -1026 8198 -4784 -12908 -4906 1080 10720 11744 -9103 -14190 2189
518 2189 499 -3974 6963 7895 1503 405 -9127 -10412 8971 12791 -531 1173 1303 -8302 -5426
$$ packed form
425d47p62N023J7253j3316k2772Q965N564o578J0496R077n075n444j6948q273
439b3237K8484J3933k2239k126J5455r172j4498k55J2046K6078j328l9109m881
452b0849L1702k510k0446J0007J7133O19j7934k5097J0533L6684m462k6416Q264
465b772J1356j4064q060M646J3674J8000j3105k7394R598J6076j2865N92J8183
478A3865j631j1697r143o324J4259J3998j3452l067J4104j1819j7785R657J2913
491C878O428J329j7414o949J6702j997j4309J5569J5077j1102j2036o630J059
504a0395J8304M995j6195K265R224j2982q124Q002N986R640J024k0847n087J6379
518B189j690m473J0937R32o392j098r532j285J9383L820j3322J704J30r605K876
$$ plain form
533 -5426 240 833 9884 6239 -11566 -7423 2524 -5435 -2147 10939 5623 -2498 -4933 -9693 -780
548 -780 13210 2734 -4370 7386 3270 -10622 -6513 2474 8813 11251 -4484 -13928 1480 4406
562 4406 -8491 -1105 10286 3923 -2817 -8656 -10715 5117 12876 -1764 -2757 6192 -2091 -8007
576 -8007 -613 2810 7614 8693 -5722 -9235 1728 -1023 -4399 6953 6009 -3935 -3469 -5799 -6283
591 -6283 5319 5823 -2052 3347 2901 -9400 -5315 5620 5087 5840 2951 -6201 -2242 2963 -4605
606 -4605 -1364 10143 3338 -5010 -4323 -6969 -1824 8600 1098 -4669 3925 396 -8849 -1759 3441
621 3441 4009 7708 570 -9022 -557 3739 -2358 2340 6761 -594 -1632 -2474 -8058 239 8588 -553
637 -553 -2839 1971 -4959 -6442 2329 2209 1785 5635 -1885 -6344 1483 889 -1119 6872 5249 -3304
$$ packed form
533e426N666N93R051l645j7805M143R947p959L288J3086n316q121k435m760Q913
548g80J3990j0476p104J1756m116j3892M109Q987O339K438j5735r444J5408K926
562D406j2897P386J1391o363o740n839k059J5832P759j4640r93Q949q283n916
576h007P394L423M804J079j4415l513J0963k751l376J1352r44r944M66k330m84
591f283J1602N04p875N399m46j2301M085J0935n33P53k889r152L959N205p568
606d605L241J1507o805q348O87k646N145J0424p502n767Q594l529r245P090N200
621C441N68L699p138r592Q465M296o097M698M421p355j038q42n584Q297Q349r141
637e53k286M810o930j483Q771j20m24L850p520m459P827n94k008P991j623q553
$$ plain form
653 -3304 -1697 -2401 -3671 4338 4540 -3356 956 2403 -7965 -5004 3817 1687 2564 2274 -5951 -3480
669 -3480 4006 -1574 -1297 6930 2803 -2186 -816 -3968 -1520 7683 2587 -3752 1986 -304 -6470
684 -6470 -510 2196 -615 3859 1176 -7566 -2372 2369 -1845 2017 5240 -1403 -2056 500 -3255
699 -3255 520 6582 312 -642 2824 -3920 -4641 3656 1666 -1054 2869 -1252 -5697 201 0 -2788
715 -2788 4475 3469 -3583 -1504 -313 -2777 3669 4796 -1583 909 2266 -4416 -1637 3888 374
730 374 1420 3151 -4400 -4389 2388 -687 -1394 3618 -166 -3453 282 -2122 -3065 4673 3278 -2196
746 -2196 782 -159 -3532 2291 2847 -1574 2825 2780 -5039 -1866 2377 -1587 1031 3526 -2990 -2802
762 -2802 1020 -2860 -1403 4142 282 -1693 1570 -2037 -2567 3673 1497 -677 3883 238 -4543
$$ packed form
653c304J607p04j270Q009K02p896M312J447j0368K961Q821k130Q77k90q225K471
669c480P486n580K77Q227m127m989J370l152K448R203n096o339N738k290o166
684f470N960K706k811M474k683q742N194M741m214L862L223o643o53K556l755
699c255L775O062o270r54L466o744p21Q297j990k720L923m121m445N898k01k788
715b788P263j006p052K079J191k464O446J127o379K492J357o682K779N525l514
730C74J046J731p551J1O777l075p07N012l784l287L735k404r43P738j395n474
746b196K978r41l373N823N56m421M399m5p819L173M243l964K618K495o516J88
762b802L822l880J457N545l860j975L263l607n30O240k176k174M560l645m781
$$ plain form
777 -4543 1167 1894 -1782 2284 1867 -3361 -571 146 -4156 860 3862 -2083 -1651 776 -2370 -613
793 -613 2695 -914 793 4160 -2200 -3276 3172 1037 -656 3264 -360 -2591 1951 -830 -3987
808 -3987 2811 2655 -2932 -890 -189 -2965 1195 1822 -2396 1615 2484 -3411 -1051 2976 -402 1067
824 1067 3006 -1924 -949 2447 -1799 -1514 3888 356 -2714 695 -1125 -2324 1770 -154 -2257 2416
840 2416 386 -4194 843 2207 -1158 1548 1616 -2260 1405 1880 -3230 914 4246 -1301 -1824 1187
856 1187 -1554 -728 1901 -2030 -1293 3013 -1850 -3498 1799 734 -983 1881 -391 -1717 2757 395
872 395 -3206 2796 3335 -2367 -264 1195 -1528 1038 1188 -2723 965 2150 -3374 -2053 2320 -379
888 -379 -891 972 -1783 -223 2756 -2200 -1744 4361 967 -2763 1329 1181 -758 1708 -195 -2004
$$ packed form
777d543N710P27l676M066m17n228K790P17m302N016L002n945M32K427l146J757
793f13L308l609J707L367o360j076O448k135j693L920l624k231M542k781l157
808c987O798j56n587K042P01k776M160O27m218M011Q69n895K360M027l378J469
824A067J939m930R75L396m246K85N402l532l070L409j820j199M094j924k103M673
840B416k030m580N037J364l365K706O8l876L665M75n110M144L332n547n23L011
856A187k741Q26K629l931P37M306m863j648N297j065j717K864k272j326M474k362
872C95l601O002N39n702K103J459k723K566J50l911L688J185n524J321M373k699
888c79n12J863k755J560K979m956M56O105l394l730M092j48j939K466j903j809
$$ plain form
904 -2004 2751 1025 -3928 -55 2110 -1550 -449 201 -1737 1099 1216 -3473 -158 3708 -1302 -1546
920 -1546 2236 -60 -26 1817 -1456 -570 3466 -499 -2935 1993 1011 -2055 463 -376 -1435 1727
936 1727 -357 -3228 1335 1939 -2574 -260 1784 -947 857 1200 -2293 988 3128 -1923 -1284 2866
952 2866 186 -1406 671 -1103 197 2198 -2145 -2677 2412 133 -3063 749 903 -1085 1333 -951
968 -951 -2189 2869 2008 -2785 382 2931 -864 -403 515 -596 1436 1220 -3114 -902 2780 -1299
984 -1299 -2506 1512 198 -810 668 -2039 -989 3189 -704 -2744 2501 1680 -2126 177 935 79
1000 79 2117 -173 -2524 1525 1825 -2789 -592 2214 -736 -318 -83 -2282 912 2323 -2478 -1032
1016 -1032 2868 -304 -2110 1062 580 589 2326 -1111 -1813 2379 426 -2489 1461 1492 -996 361 -941
$$ packed form
904b004M755j726m953L873K165l660J101O50j938K836J17m689L315L866n010k44
920a546L782k296L4J843l273Q86M036l965k436M928r82l066K518q39j059L162
936A727k084k871M563O04m513K314K044k731J804L43l493L281K140n051O39M150
952B866k680j592K077j774J300K001m343n32N089k279l196L812J54j988K418k284
968i51j238N058q61m793L167K549l795M61R18j111K032k16m334K212L682m079
984a299j207M018j314j008J478k707J050M178l893k040N245q21l806K303P58q56
1000G9K038k290k351M049L00m614K197K806k950M18K35k199L194J411m801J446
1016a032L900l172j806L172m82RJ737l437p02M192j953k915L950L1k488J357j302
$$ plain form
1033 -941 -2144 1761 1422 -2757 -12 1786 -1702 -1239 1257 -553 1379 2182 -2173 -859 2951 -436
1049 -436 -1649 2202 766 -611 324 -1885 -992 2852 -366 -2747 1346 846 -2915 -462 577 -253
1065 -253 1860 208 -2800 940 2320 -1999 -266 3119 532 -530 -257 -1822 1034 2509 -1791
1080 -1791 -1259 2322 -624 -2904 183 315 87 1465 -1513 -2359 2085 375 -2437 1568 2523 -606
1096 -606 -274 -103 -921 1859 1545 -2008 428 1723 -2429 -1689 1127 -197 155 1008 -1932 -1383 1934
1113 1934 -1177 -1533 2492 1124 -1010 -94 -642 -401 2466 544 -1654 1588 1013 -2393 -261 913
1129 913 -36 1305 -9 -2792 -148 1491 -1988 -692 2523 -194 -1057 -150 -1412 614 2765 -607
1145 -607 -941 2197 -12 -1969 795 775 290 1433 -1152 -2296 1205 478 -2319 1053 1863 -1265 -1051
$$ packed form
1033i41j203L905l39m179K745J798l488M63K496j810J932Q03m355J314L810l387
1049d36j213L851j436j377R35k209Q93L844l218k381M093n00l761K453J039q30
1065b53K113j652l008L740J380m319J733L385k587j062K73j565K856J475m300
1080a791N32L581k946k280L087J32k28J378k978q46M444j710k812M005R55l129
1096f06L32J71q18K780l14l553K436J295m152P40K816j324L52Q53k940N49L317
1113A934l111l56M025j368k134R16n48K41K867j922k198L242n75l406K132J174
1129I13r49J341j314k783K644J639l479J296L215k717q63R07j262K026K151l372
1145f07l34L138k209j957K764k0m85J143k585j144L501p27k797L372Q10l128K14
$$ plain form
1162 -1051 -505 -1263 1345 1769 -1627 235 1865 -1737 -1612 1782 1050 924 869 -1966 -846 1786 -1378
1179 -1378 -1629 2535 1046 -1951 -1199 -804 -447 1727 134 -1835 1283 1008 -2722 -594 1764 905
1195 905 1233 214 -2239 261 1729 -1582 39 2875 -125 -1655 -283 -1334 -110 1983 -652
1210 -652 -1383 1246 -605 -2030 905 1330 133 1144 -585 -1746 1119 578 -1346 1492 2261 -1453
1226 -1453 -919 -199 -1187 748 1558 -1445 -380 1190 -1963 -2038 1413 769 289 560 -1538 -818 1492
1243 1492 -499 -1033 2407 1703 -1579 -542 -393 -341 2078 525 -1773 578 546 -2430 -910 1571 513
1260 513 493 -169 -2026 -405 1443 -999 196 2455 -63 -1585 47 -333 389 2056 -252 -790 1333
1277 1333 -1021 -2718 706 1449 -365 -97 -777 -1746 484 562 -1294 1274 1866 -1347 -1376 311 -326
$$ packed form
1162a051N46p58K608M24l396J862J630l602J25L394p32j26n5k835J120K632l164
1179a378k51M164j489k997P52L95L57K174j593j969L118k75l730K128K358q59
1195I05L28j019k453K500J468l311J621K836l000j530J372j051J224K093k635
1210f52p31K629j851j425K935M25j197J011j729j161K865n41j924K838P69l714
1226a453N34P20r88J935Q10l003J065J570l153p5L451o44m80K71k098P20K310
1243A492j991n34L440p04l282J037J49N2K419j553k298K351l2k976J520K481j058
1260E13k0o62j857J621J848k442J195K259k518j522J632l80P22J667k308n38K123
1277A333k354j697L424P43j814K68o80r69K230P8j856K568N92l213k9J687o37
$$ plain form
1294 -326 1318 1482 -970 165 1397 -1662 -1925 1774 871 -70 548 -1111 -1612 781 -299 -691 1678
1311 1678 610 -1674 -438 -15 -421 1794 1337 -1375 672 532 -1658 104 1955 201 329 638
1327 638 -1621 -1003 840 -943 -83 1983 -483 -2036 -342 -569 -7 1609 26 -390 1212 -633
1343 -633 -2330 1132 2200 178 26 -345 -1450 585 332 -1115 1024 1908 -1234 -1748 -251 -344 773
1360 773 1292 -959 -390 1207 -1302 -1378 1753 1348 93 500 -927 -1518 1123 404 -468 1509 613 -1672
1378 -1672 -678 36 -679 698 1091 -752 -57 -398 -1911 152 2019 -17 67 500 -916 -497 628
1395 628 -264 495 2088 -461 -2218 75 188 -154 1059 -20 -974 554 -571 -2025 646 1580 -293
1412 -293 41 -326 -1642 437 737 -604 681 1847 -1259 -1411 -92 -95 818 1746 -719 -804 345 -967
$$ packed form
1294c26J644J64k452J135J232l059k63L699r03r41O18j659n01K393j080l92K369
1311A678j068k284J236M23m06K215m57k712K047j40k190J762J851j754J28L09
1327F38k259O18J843j783Q60K066k466j553J694k27N62J616j583m16J602j845
1343f33j697L462J068k022j52l71j105K035k53j447K139Q84l142n14J497r3J117
1360G73N19k251N69J597k509p6L131m05j255M07j427n91K641p19q72J977q96k285
1378a672R94P14p15J377L93j843O95l41j513K063J867k036Q4M33j416M19J125
1395F28q92P59J593k549j757K293J13l42J213j079r54J528j125j454K671R34j873
1412b93L34l67j316K079L00j341J285J166l106j52J319lR13R28k465q5J149j312
$$ plain form
1430 -967 -1317 1207 555 -176 460 -772 -1549 567 620 -150 1495 797 -1903 -521 932 20 573 1150
1448 1150 -365 32 123 -1765 153 1710 187 -869 -151 -1001 -791 747 -674 215 1833 -342 -2062
1465 -2062 -14 169 148 1111 403 -886 234 56 -1347 499 1392 -109 -86 -199 -1631 -100 729 -401
1483 -401 422 1017 -1053 -1286 524 -447 207 1646 144 -550 201 -627 -500 1612 724 -637 93 -464
1501 -464 -1329 45 502 -127 1130 266 -1863 -864 612 -11 441 726 -692 -64 184 -1374 12 2052
1519 2052 844 -171 12 -743 -434 991 -48 -221 1376 -173 -1743 -288 -9 76 1444 226 -929
1536 -929 -170 -58 -1037 777 1419 -261 43 234 -961 -214 990 156 388 456 -1243 -958 387 -335
1554 -335 -179 1135 -11 -869 -115 -1183 -714 1519 742 -796 -104 115 -690 426 545 -149 1067 462
$$ packed form
1430i67l50K524o52p31O36j232p77K116N3p70J645o98k700J382J453r12N53N77
1448A150j515L97R1j888J918J557j523j056P18q50K10J538j421Q89J618k175j720
1465b062K048J83k1R63p08j289J120j78j403J846Q93j501K3j13j432J531Q29j130
1483d01Q23N95k070k33J810r71O54J439j502o94P51q28J27K112q88j361P30n57
1501d64q65J374M57o29J257q64k129R99J476o23M52K85j418O28K48j558J386K040
1519B052j208j015J83p55L09J425j039j73J597j549j570J455K79Q5J368j218j155
1536i29P59J12r79J814O42j680L04J91j195P47J204q34K32O8j699K85J345p22
1554c35J56J314j146q58P54j068M69K233p77j538O92K19q05J116J19o94J216o05
$$ plain form
1572 462 -1548 -578 468 4 268 381 -708 -374 194 -1153 -388 1247 512 -194 212 -780 -603 1037
1590 1037 515 -146 869 -49 -1138 -108 178 -47 1205 469 -1072 -481 -116 -707 323 1110 -450
1607 -450 -441 106 -1078 -421 933 343 601 847 -983 -864 423 482 378 985 128 -691 338 -491 -758
1626 -758 1302 987 -676 -212 -503 -981 165 882 -448 438 379 -1083 -773 314 105 668 1278 -515
1644 -515 -469 31 -721 -260 990 259 -551 71 -829 -1179 761 357 -10 460 -323 -1084 169 404 -212
1663 -212 603 691 -489 -621 -179 -377 750 999 -417 -433 155 -772 -415 874 -12 9 637 -880 -1195
1682 -1195 382 546 182 783 -136 -666 248 -96 -282 1045 1149 -630 89 -320 -677 370 986 -184
1700 -184 78 404 -1145 -611 366 -65 289 707 -626 -860 -3 -233 103 959 106 -151 351 -116 -774
$$ packed form
1572D62k010R70J046m64K64J13j089L34N68j347P65J635p35p06M06r92J77J640
1590A037n22o61J015r18j089J030K86k25J252p36j541N91L65n91J030P87j560
1607d50RN47j184O57J354n90K58K46j830J19J287N9j04O07q57q19J029q29k67
1626g58K060l15j663M64k91m78J146P17j330Q86n9j462L10J087k09N63O10j793
1644e15M6N00p52M61J250p31q10O22r00l50J940m04l67M70p83p61J253K35o16
1663b12Q15Q8j180j32M42j98J127K49j416j6N88r27L57J289q86K1O28j517l15
1682a195J577J64l64O01r19n30R14l44j86J327J04j779P19m09l57J047O16j170
1700a84K62L26j549N34R77m31L54M18j333k34Q57k30L36Q56q53k57N02m67o58
$$ plain form
1719 -774 955 630 81 361 -448 -1061 92 631 -232 273 483 -655 -353 -283 -530 510 1166 -226 -621
1738 -621 180 -586 160 807 -31 -128 528 -596 -683 277 281 -148 832 -63 -1026 -66 167 -440 548 677 -322
1759 -322 -188 -300 -606 389 894 34 109 370 -695 -98 416 -85 200 564 -309 -864 129 -253 149 952
1779 952 -6 -375 62 -227 -559 487 205 98 298 -61 -1098 191 452 194 399 267 -631 -250 239
1798 239 -507 187 1129 -382 -787 -113 -608 -473 656 64 -478 369 -437 -413 246 273 93 624 -36 -838
1818 -838 -69 227 99 675 332 -290 168 -69 -674 121 867 -190 -159 -22 -705 -84 664 -113 -151 436
1838 436 -353 -737 242 17 -1 727 89 -637 18 -252 -194 591 362 -398 173 -71 -910 -154 360 272 544
1859 544 -213 -644 -208 485 -69 0 859 166 -191 -98 -433 52 911 145 -390 117 -469 -412 204 -71 -33
$$ packed form
1719g74J729l25n49K80q09o13J153N39q63N05K10j138L02P0k47J040O56j392l95
1738f21Q01p66P46O47q38r7O56j124q7R60Mm29R80q95r63R60K33o07R88J29r99
1759c22J34j12l06R95N05q60P5K61j065N97N14n01K85L64q73n55R93l82M02Q03
1779I52r58l69M37k89l32J046k82j07K00l59j037J289K61k58K05j32q98L81M89
1798B39p46O94R42j511m05O74m95J35J129n92n42Q47q06K4O59K7j80N31o60q02
1818h38P69K96j28N76l43o22M58k37o05P95P46j057L1J37o83O21P48p77l8N87
1838D36p89l84R79k25j8P28o38p26O55k70N8P85k29p60N71k44q39P56N14q8K72
1859E44p57m31M36O93n54O9Q59o93l57R3l35M85Q59p66n35N07n86N7O16k75L8
$$ plain form
1880 -33 738 -103 -901 -184 151 173 390 644 -474 -200 146 -405 48 598 34 -154 -28 -749 -231 435
1900 435 11 -53 307 -414 -326 -123 -252 46 805 192 -414 -97 30 -390 753 416 -244 162 137 -693 186
1921 186 581 148 257 177 -679 -315 267 -235 2 405 -459 -481 244 -329 -380 904 164 -357 145 -154 -410
1942 -410 415 391 -308 213 247 -734 -131 163 -324 507 568 -901 -198 46 -297 129 485 97 -20 248 -217
1963 -217 -209 577 488 196 343 -150 -566 388 -25 -362 393 110 -512 -468 -368 -371 446 366 -563 -23 40 -242 297
1986 297 463 199 54 227 -619 -392 650 -182 123 404 -272 -620 244 -200 -189 444 -180 -580 51 -358
2006 -358 -473 319 537 -228 207 53 -660 178 432 -44 162 329 -269 -150 168 69 122 497 -289 -217 -22
2027 -22 -212 -409 456 -82 -119 306 -334 -418 297 304 -244 251 295 -361 244 59 -344 565 714 -532 -230 391
$$ packed form
1880c3P71q41p98P17L35K2K17K54j118K74L46n51M53N50n64j88J26p21N18O66
1900D35m24o4L60p21Q8K03j29K98P59o13o06L17J27m20J143l37o60M06k5q30Q79
1921A86L95m33J09q0q56L64N82n02K37M03q64k2P25n73n1J284p40n21N02k99k56
1942d10Q25k4o99N21L4r81O03K94m87Q31O1j469P03K44l43M26L56l88j17K68m65
1963b17QP86q9k92J47m93m16R54m13l37P55k83o22M4J00lQ17q0r29N40O3k82N39
1986B97J66k64j45J73q46K27J042q32L05K81o76l48Q64m44J1O33o24m00O31m09
2006c58j15P92K18p65M35j54p13Q38K54m76K06J67n98J19L18r9N3L75p86P2J95
2027b2j90j97Q65n38l7M25o40q4P15Pn48M95M4o56O05j85m03R09J49j246L02O21
$$ plain form
2049 391 -326 -97 38 -207 -73 157 -562 -456 333 81 -168 413 -229 -90 211 42 110 496 -33 -250
2069 -250 335 -65 -523 137 227 -189 89 -10 -409 -100 200 -243 21 175 -163 -317 178 -45 108 371 -208
2090 -208 -77 147 -89 -237 304 149 -56 140 -321 -667 -24 290 -384 348 -94 -581 -264 98 -406 196
2110 196 411 -421 -39 184 -168 80 450 -42 -76 15 -181 -21 234 -195 -48 279 -222 -354 -16 14 -105
2131 -105 256 178 -510 9 159 -407 290 78 -21 34 88 -50 244 113 -70 -131 133 -172 -361 44 -323 -240
2153 -240 206 29 -187 220 -10 -154 227 357 -27 126 43 -302 303 204 84 256 132 -466 -56 202 -223
2174 -223 25 255 -146 -404 347 -213 -110 248 200 -143 126 98 8 389 146 21 650 -264 -409 264 -29
2195 -29 -221 317 192 -424 32 137 -344 163 311 -255 65 203 -205 -92 181 46 313 62 -79 10 405
$$ packed form
2049C91p17K29J35k45J34K30p19J06P89k52k49N81o42J39L01j69O8L86n29k17
2069b50N85m00m58O60R0m16K78r9l99L09L00m43K64J54l38j54M95k23J53K63n79
2090b08J31K24k36j48N41j55k05J96m61l46O43L14o74P32m42m87L17L62n04O02
2110A96K15q32L82K23l52K48L70m92l4R1j96J60K55m29J47L27n01j32L38L0j19
2131a05L61p8o88N19J50n66O97k12r9N5N4j38K94j31j83o1K64l05j89M05l67Q3
2153b40M46j77k16M07k30j44L81J30l84J53q3l45O05r9j20J72j24n98M10K58m25
2174b23K48K30m01k58P51n60J03L58m8l43K69k8r0L81k43j25O29r14j45O73k93
2195b9j92N38j25o16M56J05m81N07J48n66L20J38m08J13K73j35K67k51j41Q9L95
$$ plain form
2216 405 -204 -96 319 -453 -41 196 -167 -479 255 -50 -395 -282 -164 -45 -117 164 -261 134 31 -201
2236 -201 87 181 -66 62 273 -319 -117 87 -76 -213 379 -133 -260 197 -265 -134 435 -76 -129 213 -163
2257 -163 -486 -72 315 -165 196 180 -37 43 155 -308 59 257 -43 -47 -14 -499 -344 165 41 -43 45 -192
2279 -192 -431 81 -76 -149 309 313 -63 70 124 -208 357 244 -167 -80 10 -165 -118 242 -121 52 244 -451
2301 -451 -231 289 -218 -150 36 -450 -95 274 96 -95 401 37 -26 141 -98 -121 217 347 -353 -11 100
2322 100 -336 -88 179 -91 299 -187 -178 -28 29 -112 15 25 -303 -47 128 -174 -67 400 -44 -43 587 44
2344 44 -249 -2 140 -214 275 -113 -295 120 -163 -125 36 192 -412 -219 240 -208 72 53 -145 126 228
2365 228 -156 23 55 -197 27 190 -197 -204 147 -51 -246 -20 23 -436 -35 -161 -191 297 -145 -363 365 44
$$ packed form
2216D05o09J08M15p72M12K37l63l12P34l05l45J13J18J19p2K81m25L95j03k32
2236b01K88R4k47J28K11n92K02K04j63j37N92n12j27M57m62J31N69n11n3L42l76
2257a63l23M14L87m80L61j6k17Q0J12m63L67J98l00mL3m85J55N09j24q4Q8k37
2279a92k39N12j57p3M58Ml76J33N4l32N65j13m11Q7R0j75M7L60l63J73J92o95
2301d51K20N20n07O8J86m86L55L69j78j91M96l64o3J67k39k3L38J30p00L42J11
2322A00m36K48K67k70L90m86RJ50N7j41J27J0l28K56J75l02J07M67m44JO30n43
2344D4k93K47J42l54M89l88j82M15k83L8J61J56o04J93M59m48K80j9j98K71J02
2365B28l84J79L2k52K24J63l87pL51j98j95K26M3m59M01j26l0M88m42k18P28l21
$$ plain form
2387 44 -31 80 -151 111 275 51 -384 -203 242 -301 -42 158 -149 -267 127 -153 24 184 -47 -81 120
2408 120 -112 -260 392 -165 -206 268 -15 -306 235 -164 -77 455 16 -226 95 85 -130 -87 62 -169 81
2429 81 356 -244 -94 49 -59 -331 250 -122 -40 225 -40 -160 247 -14 -282 324 0 -247 39 68 -308
2450 -308 222 111 -405 188 77 -43 241 36 -273 -139 420 -309 -185 338 -270 -26 468 -36 226 198
2470 198 -174 -359 175 -182 -153 181 -102 -234 383 -53 -451 25 77 -48 -35 141 -32 -29 -92 -99 131 327 -133
2493 -133 38 91 -161 120 46 -198 -50 -34 -137 -305 116 -191 -78 313 45 -112 -14 -58 -120 180 -60 -80
2515 -80 -109 -26 -224 132 -53 -34 81 49 -156 2 -2 -27 26 380 -371 -177 -59 28 -24 358 -13 -10 58 41 -178
2540 -178 314 20 -91 84 -290 12 163 -46 71 -112 1 -165 239 95 -336 -80 -69 -362 -196 69
$$ packed form
2387D4p5J11k31K62J64k24m35J81M45n43K59K00l07j18L94k80J77J60k31l4K01
2408A20k32j48O52n57m1M74k83k91N41l99Q7N32m39k42L21j0k15M3J49k31K50
2429H1K75o00J50J43j08k72N81l72Q2K65k65j20M07k61k68O06l24k47K86K9l76
2450c08N30j11n16N93j11j20K84k05l09J34N59p29J24N23o08K44M94n04K62k8
2470A98l72j85N34l57K9L34k83j32O17m36l98M76N2j25J3J76j73Lo3pK30J96m60
2493a33J71N3k52K81p4k44J48J6j03j68M21l07J13L91k68j57R8m4o2L00k40k0
2515h0k9Q3j98L56j85J9J15l2k05J58mk5N3L54p51J94J18Q7n2L82l71LO8j7k19
2540a78M92k94j11J75l74L02J51k09J17j83J13j66M04j44m31K56J1k93J66K65
$$ plain form
2560 69 166 -53 136 194 -216 195 23 -72 99 303 -184 316 55 -204 10 -163 -266 74 90 112 145 162 -105
2583 -105 -2 9 184 -327 229 -258 -392 222 16 -229 228 -227 -269 257 -249 -83 77 -158 -275 -40 304
2604 304 -73 245 146 -70 -49 82 -33 163 225 -180 -30 -38 -103 -184 218 -114 117 -52 -313 -249 -78 -176 -182 96
2628 96 -178 130 116 -109 52 262 46 -26 79 5 151 172 320 -2 269 149 -76 76 253 -107 129 74
2650 74 78 -51 111 -26 -190 225 59 35 -188 -32 -122 -35 1 -117 277 18 -230 58 -110 -128 77 140 3
2673 3 19 30 79 34 124 -139 -31 36 59 55 132 -152 100 107 -21 -210 190 111 -56 79 149 -36 53 -179 -305 13
2699 13 125 -146 22 29 -324 60 14 -130 -25 -7 -16 -140 326 54 -233 165 28 -47 215 33 40 314 -102
2722 -102 -249 90 -84 -99 181 22 -238 -14 90 -60 -17 376 -110 -60 145 -221 290 209 -222 37 -73
$$ packed form
2560F9R7k19J89N8m10M11j72r5J71K04m87N00k61k59K14j73j03L40J6K2L3J7k67
2583a05J03J1J75n11N56m87j34O14k06k45M57m55m2N26n06J66J60k35j17K35L44
2604C04l77L18r9k16K1J31j15J96O2m05J50qo5q1M02l32K31j69k61O4J71r8oK78
2628I6k74L08j4k25J61K10k16p2J05p4J46K1J48l22K71j20k25J52J77l60K36n5
2650G4Mj29J62j37j64M15j66k4k23J56r0Q7L6j18L94k59k48K88j68j8K05O3j37
2673CJ6J1M9m5R0k63J08O7K3mP7k84K52Pj28j89M00p9j67J35P0j85Q9k32j26L18
2699A3J12k71J68Pl53L84m6j44J05J8rj24M66k72k87L98j37p5K62j82PK74m16
2722a02j47L39j74j5K80j59k60K24J04j50M3L93m86N0K05l66N11q1m31K59j10
$$ plain form
2743 -73 -201 -284 193 45 -87 269 114 -182 198 8 -219 11 -1 -208 98 198 -28 223 99 25 44 72
2765 72 -2 57 56 -150 -71 73 -151 -67 -57 -14 52 125 -137 -173 -160 -116 -239 40 -60 -88 118 20 -58 184 125 134 -37
2792 -37 -96 -187 117 8 -284 42 20 109 80 83 114 -226 156 -76 -75 287 -161 65 308 97 -167 -84 -73 -124 -69
2817 -69 -43 -207 96 93 -219 281 69 -97 32 308 -150 106 394 62 197 185 -115 221 54 -13 -247 260
2839 260 -209 -113 25 75 -292 190 -168 -313 -30 -167 36 103 191 -100 19 -79 68 14 58 -187 -216 164 -98
2862 -98 -121 200 -27 56 -46 -85 -95 239 -113 185 190 219 -195 216 61 -209 279 -75 -50 -15 55 -75 202 94
2886 94 -210 95 22 -212 153 -43 -290 -65 289 -101 -113 57 -106 -111 97 -136 -138 62 -54 69 146 1 -120
2909 -120 -32 133 -141 156 29 15 -33 233 5 -76 -128 -207 183 -64 -87 -90 238 -41 178 287 -80 38 -11
$$ packed form
2743g3j28q3M77j48j32L56j55k96L80j90k27K30j2k07L06J00k26K51j24p4J9K8
2765G2p4N9jk06P9J44k24Q4J0M3O6P3k62l6J3M4j23K79j00k8K06r8p8K42n9Rj71
2792c7n9r1L04j09k92L26k2Q9k9LL1l40L82k32JL62m48K26K43k11k64Q3J1n1N5
2817f9K6j64L03ll12N00k12j66J29K76m58K56K88l32J35j2l00L36j67o7k34N07
2839B60m69R6J38N0l67M82l58j45K83j37K03O7Q8k91J19r8J47n4M4k45k9L80k62
2862i8k3L21k27Q3j02l9j0L34l52K98NK9m14M11j55k70M88l54K5L5P0j30K77j08
2886I4l04L05p3k34L65j96k47K25L54l90j2J70j63nK08k33kK00j16J23P7j45j21
2909a20Q8J65k74K97j27j4m8K66k28q1n2p9L90k47k3lL28k79K19J09l67J18m9
$$ plain form
2932 -11 -4 -32 197 -41 -182 -111 -149 -68 76 96 0 81 -155 -149 67 -45 307 421 55 -38 22 91 -82 171 17
2957 17 151 -36 47 -68 -36 161 -260 38 285 165 -95 57 -58 -118 98 7 82 -102 54 -34 -279 165
2979 165 -24 -12 -93 -99 143 -210 -131 41 278 -168 -112 44 -33 76 175 -16 15 147 -17 76 2 -274 -314 -41
3003 -41 114 -125 162 -199 -155 -1 175 270 210 204 -21 -42 24 -110 141 29 43 -15 237 -333 -14 -50 -62 28
3027 28 198 -91 144 185 175 -127 28 46 -163 332 133 10 -110 85 44 -43 -52 -330 -114 246 -101 131 -71
3050 -71 91 -4 28 -54 -132 272 -224 -65 -142 -44 37 -143 136 -143 -203 -213 67 -116 -25 -98 -65 -114 -252 -89 -258
3075 -258 -140 -1 8 -103 31 -56 -146 -38 -87 -4 -125 43 5 -50 154 -286 -59 102 -36 -98 88 -73 -72 49
3099 49 -6 -99 32 -52 -33 -14 150 -126 -7 61 -218 -28 41 1 -100 93 -142 -27 106 -197 -130 113 -102
$$ packed form
2932a1Pk8K29k38j41P1l8Q1J44K0r6Q1k36OK16j12L52J14l66r3O0O9j73K53j54
2957A7J34j87Q3j15L2J97m21K98K47j20k60J52j15o0K16r1P5j84J56q8k45M44
2979A65j89J2q1oK42l53P9J72K37m46N6J56p7J09R9j91L1J32j64R3p4k76m0K73
3003d1J55k39K87l61M4J54J76R5o0ok25k1O6j34K51j12J4n8K52n70L19l6j2R0
3027B8J70k89K35M1j0l02J55J8k09M95j99j23j20J95m1q7rk78K16L60l47K32k02
3050g1J62r5L2q2p8M04m96J59p7R8Q1j80K79k79o0j0K80j83R1p3L3m9j38J63j69
3075b58J18J39Rj11J34q7r0J08m9Q3j21J68l8n5K04m40K27J61j38o2J86j61JJ21
3099D9n5r3J31q4J9J9J64k76J19O8k79J90O9m0j01J93k35J15J33l03O7K43k15
$$ plain form
3122 -102 -139 -71 -182 -80 -45 61 32 -233 -127 63 -11 -10 -5 -6 209 58 57 136 -112 -195 31 -228 -245 125 -234
3147 -234 -140 -75 -153 -117 -14 -48 -65 63 -45 -133 190 78 -73 158 -296 -139 -260 -99 -26 163 96 7 -49 47
3171 47 48 -90 -88 -169 20 -68 51 -68 205 -14 -81 178 36 -46 0 -106 -178 -126 133 -139 162 134 -64 -84 -121
3196 -121 135 1 140 47 1 16 34 65 -98 -75 -280 -67 -122 -107 171 -116 -21 167 47 127 21 -59 -173 135
3220 135 -108 124 -88 -45 -122 -61 10 -76 62 186 -78 79 -10 -135 -145 -54 -15 -37 10 -166 -34 200 137 291
$$ packed form
3122a02l7O8j11J02L5J06k9k65J06J90p4JNjK15j51jP9k48q3K26k59j7L70l59
3147b34R4O5p8L6J03l4j7J28j08q8L23j12j51K31m54J57j21J61P3J89o7q9n6R6
3171D7Jj38Kq1J89q8J19j19K73k19o7K59j42q2M6j06p2N2K59k72L01k8j98k0l7
3196a21K56j34J39r3m6J5J8L1j63K3k05K13n5J5K78k87R5J88j20Q0j06q0j14L08
3220A35k43K32k12M3p7O1P1q6J38J24k64J57q9j25j0R1L9k2M7j76J32K34o3J54
$$ [...]
8191D1
##END NTUPLES=NMR FID
##END=
