##TITLE=1H_CA-8012-2
 DMSO, 8 sc, 
 11.3.2019
##JCAMPDX= 6.0         $$ Bruker NMR JCAMP-DX V2.0
##DATA TYPE= NMR FID
##DATA CLASS= NTUPLES
##ORIGIN= UXNMR, Bruker Analytische Messtechnik GmbH
##OWNER= root
$$ XWIN-NMR		Version 3.5
$$ Mon Mar 11 14:37:44 2019 Russian Standard Time (UT+4h)  she@DPX200
##.OBSERVE FREQUENCY= 200.1314
##.OBSERVE NUCLEUS= ^1H
##.DELAY= (6, 6)
##.ACQUISITION MODE= SIMULTANEOUS
##.ACQUISITION SCHEME= undefined
##.AVERAGES= 8
##.DIGITISER RES= 18
##SPECTROMETER/DATA SYSTEM= spect
##.PULSE SEQUENCE= zg30
##.SOLVENT NAME= DMSO
##.SHIFT REFERENCE= (INTERNAL, DMSO, 0, 15.7039)
##AUDIT TRAIL= $$ (NUMBER, WHEN, WHO, WHERE, WHAT)
$$ ##TITLE= Audit trail, XWIN-NMR		Version 3.5
$$ ##JCAMPDX= 5.01
$$ ##ORIGIN= Bruker BioSpin GmbH
$$ ##OWNER= she
$$ F:/spectra/data/she/nmr/H-F/1/audita.txt
$$ ##AUDIT TRAIL=  $$ (NUMBER, WHEN, WHO, WHERE, WHAT)
(   1,<2019-03-11 14:36:32.43 +0400>,<she>,<DPX200>,
      <created by zg, POWCHK disabled, PULCHK disabled
       configuration hash MD5:
       00 E9 B6 7A A2 85 ED C7 34 08 36 98 17 FE 4E 26
       data hash MD5: 16K
       FE BE D3 03 51 EC A3 F6 10 88 C1 88 FB 8C 7E AB>)
$$ ##END=
$$ 
$$ hash MD5
$$ 50 FB 41 2D 80 49 32 3A 85 CE EE F1 19 D4 05 0E
##$RELAX= 
##$RELAX= 
##$RELAX= 
##$RELAX= 
##$RELAX= 
##$RELAX= 
$$ Bruker specific parameters
$$ --------------------------
##$DU= <F:/spectra>
##$EXPNO= 1
##$NAME= <H-F>
##$PROCNO= 1
##$TYPE= <nmr>
##$USER= <she>
##$AMP= (0..31)
100 100 100 100 100 100 100 100 100 100 100 100 100 100 100 100 100 100 
100 100 100 100 100 100 100 100 100 100 100 100 100 100 
##$AQSEQ= 0
##$AQ_mod= 1
##$AUNM= <au_zg>
##$AUTOPOS= <>
##$BF1= 200.13
##$BF2= 200.13
##$BF3= 200.13
##$BF4= 200.13
##$BF5= 200.13
##$BF6= 200.13
##$BF7= 200.13
##$BF8= 200.13
##$BYTORDA= 1
##$CFDGTYP= 0
##$CFRGTYP= 5
##$CHEMSTR= <none>
##$CNST= (0..31)
1 1 145 1 1 1 1 1 1 1 1 1 1 1 1 1 1 1 1 1 1 1 1 1 1 1 1 1 1 1 1 1 
##$CPDPRG= <>
##$CPDPRG1= <>
##$CPDPRG2= <>
##$CPDPRG3= <>
##$CPDPRG4= <mlev>
##$CPDPRG5= <mlev>
##$CPDPRG6= <mlev>
##$CPDPRG7= <mlev>
##$CPDPRG8= <mlev>
##$CPDPRGB= <>
##$CPDPRGT= <>
##$D= (0..31)
0 1.2 0 0 0 0 0 0 0 0 0 0.03 0 0 0 0 0 0 0 0 0 0 0 0 0 0 0 0 0 0 0 0 
##$DATE= 1552300591
##$DBL= (0..7)
120 120 120 120 120 120 120 120 
##$DBP= (0..7)
150 150 150 150 150 150 150 150 
##$DBP07= 0
##$DBPNAM0= <>
##$DBPNAM1= <>
##$DBPNAM2= <>
##$DBPNAM3= <>
##$DBPNAM4= <>
##$DBPNAM5= <>
##$DBPNAM6= <>
##$DBPNAM7= <>
##$DBPOAL= (0..7)
0.5 0.5 0.5 0.5 0.5 0.5 0.5 0.5 
##$DBPOFFS= (0..7)
0 0 0 0 0 0 0 0 
##$DE= 6
##$DECBNUC= <off>
##$DECIM= 24
##$DECNUC= <off>
##$DECSTAT= 4
##$DIGMOD= 1
##$DIGTYP= 9
##$DL= (0..7)
0 120 120 120 120 120 120 120 
##$DP= (0..7)
150 150 150 150 150 150 150 150 
##$DP07= 0
##$DPNAME0= <>
##$DPNAME1= <>
##$DPNAME2= <>
##$DPNAME3= <>
##$DPNAME4= <>
##$DPNAME5= <>
##$DPNAME6= <>
##$DPNAME7= <>
##$DPOAL= (0..7)
0.5 0.5 0.5 0.5 0.5 0.5 0.5 0.5 
##$DPOFFS= (0..7)
0 0 0 0 0 0 0 0 
##$DQDMODE= 0
##$DR= 18
##$DS= 0
##$DSLIST= <SSSSSSSSSSSSSSS>
##$DSPFIRM= 0
$$ [...]
##$SUBNAM2= <"">
##$SUBNAM3= <"">
##$SUBNAM4= <"">
##$SUBNAM5= <"">
##$SUBNAM6= <"">
##$SUBNAM7= <"">
##$SUBNAM8= <"">
##$SUBNAM9= <"">
##$SW= 24.9337183474449
##$SWIBOX= (0..15)
0 0 2 0 0 0 0 0 0 0 0 0 0 0 0 0 
##$SW_h= 4990.01996007984
##$TD= 16384
##$TD0= 1
##$TE= 0
##$TE2= 300
##$TE3= 300
##$TEG= 300
##$TL= (0..7)
0 120 120 120 120 120 120 120 
##$TP= (0..7)
150 150 150 150 150 150 150 150 
##$TP07= 0
##$TPNAME0= <>
##$TPNAME1= <>
##$TPNAME2= <>
##$TPNAME3= <>
##$TPNAME4= <>
##$TPNAME5= <>
##$TPNAME6= <>
##$TPNAME7= <>
##$TPOAL= (0..7)
0.5 0.5 0.5 0.5 0.5 0.5 0.5 0.5 
##$TPOFFS= (0..7)
0 0 0 0 0 0 0 0 
##$TUNHIN= 0
##$TUNHOUT= 0
##$TUNXOUT= 0
##$USERA1= <user>
##$USERA2= <user>
##$USERA3= <user>
##$USERA4= <user>
##$USERA5= <user>
##$V9= 5
##$VALIST= <valist>
##$VCLIST= <CCCCCCCCCCCCCCC>
##$VD= 0
##$VDLIST= <DDDDDDDDDDDDDDD>
##$VPLIST= <PPPPPPPPPPPPPPP>
##$VTLIST= <TTTTTTTTTTTTTTT>
##$WBST= 1024
##$WBSW= 4
##$XGAIN= (0..3)
0 0 0 0 
##$XL= 0
##$YL= 0
##$YMAX_a= 354933
##$YMIN_a= -376514
##$ZGOPTNS= <>
##$ZL1= 120
##$ZL2= 120
##$ZL3= 120
##$ZL4= 120
##$ABSF1= 10
##$ABSF2= 0
##$ABSG= 5
##$ABSL= 3
##$ALPHA= 0
##$AQORDER= 0
##$ASSFAC= 0
##$ASSFACI= 0
##$ASSFACX= 0
##$ASSWID= 0
##$AUNMP= <proc_1d>
##$AZFE= 0.1
##$AZFW= 0.1
##$BCFW= 1
##$BC_mod= 2
##$BYTORDP= 1
##$COROFFS= 0
##$CY= 11.3945322036743
##$DATMOD= 1
##$DC= 2
##$DFILT= <>
##$DTYPP= 0
##$F1P= 18.9103706918063
##$F2P= -1.10871071338519
##$FCOR= 0.5
##$FTSIZE= 0
##$FT_mod= 4
##$GAMMA= 1
##$GB= 0.15
##$INTBC= 1
##$INTSCL= 1
##$ISEN= 128
##$LB= 0.24
##$LEV0= 0
##$LPBIN= 0
##$MAXI= 10000
##$MC2= 0
##$MEAN= 0
##$ME_mod= 0
##$MI= 1.114404
##$NCOEF= 0
##$NC_proc= 0
##$NLEV= 6
##$NOISF1= 3.799351
##$NOISF2= 2.8
##$NSP= 1
##$NTH_PI= 0
##$NZP= 0
##$OFFSET= 15.70392
##$PC= 1
##$PHC0= -8853.221
##$PHC1= 17.60014
##$PH_mod= 1
##$PKNL= yes
##$PPARMOD= 0
##$PSCAL= 0
##$PSIGN= 0
##$REVERSE= no
##$SF= 200.130013532006
##$SI= 16384
##$SIGF1= 3
##$SIGF2= 2
##$SINO= 400
##$SIOLD= 16384
##$SREGLST= <1H.CDCl3>
##$SSB= 0
##$STSI= 0
##$STSR= 0
##$SW_p= 3612.71676300578
##$SYMM= 0
##$S_DEV= 0
##$TDeff= 0
##$TDoff= 0
##$TI= <>
##$TILT= no
##$TM1= 0
##$TM2= 0
##$TOPLEV= 0
##$USERP1= <user>
##$USERP2= <user>
##$USERP3= <user>
##$USERP4= <user>
##$USERP5= <user>
##$WDW= 1
##$XDIM= 8192
##$YMAX_p= 0
##$YMIN_p= 0
$$ End of Bruker specific parameters
$$ ---------------------------------
##NTUPLES= NMR FID
##VAR_NAME=  TIME,          FID/REAL,        FID/IMAG
##SYMBOL=    X,             R,               I
##VAR_TYPE=  INDEPENDENT,   DEPENDENT,       DEPENDENT
##VAR_FORM=  AFFN,          ASDF,            ASDF
##VAR_DIM=   8192,          8192,            8192
##UNITS=     SECONDS,       ARBITRARY UNITS, ARBITRARY UNITS
##FACTOR=    0.0002004,     1,               1
##FIRST=     0,             0,               0
##LAST=      1.6414764,     0,               0
##MIN=       0,             -376514,         0
##MAX=       1.6414764,     354933,          0
$$ Real data points
##PAGE= N=1
##DATA TABLE= (X++(R..R)), XYDATA
$$ [...]
$$ plain form
2229 4250 6753 2528 -2980 -3321 1635 5149 2104 -4047 -5093 -816 3052 967 -4245 -6139 -2826
2244 -2826 791 185 -3699 -6321 -4002 259 729 -2357 -5091 -3793 242 1773 -859 -3192 -1782
2259 -1782 1414 2440 604 -1515 -663 2056 2768 797 -741 381 2358 2488 496 -851 -362 1879
2275 1879 1619 -698 -2950 -2079 633 961 -1978 -4503 -3246 110 720 -2360 -5111 -3588 -264 1447
2291 1447 -1354 -4436 -3318 510 3000 1172 -2005 -2515 1511 4962 3871 -86 -1403 2116 6101
2306 6101 5310 1408 -614 2181 6338 6294 1668 -1120 891 4322 5038 861 -2202 -990 2811 3122
2322 3122 -313 -3705 -2849 616 2437 -605 -4521 -4338 -75 1922 -828 -4696 -4292 87 2606 488
2338 488 -3486 -3722 786 3890 2667 -1506 -3150 722 4841 4354 -300 -3138 254 5146 4925 523
$$ packed form
2229D250K503m225n508l41M956L514l045o151j046M277L868k085n212j894L313
2244b826L617o06l884k622K319M261M70l086k734J298M035J531k632k333J410
2259a782L196J026j836k119Q52K719P12j971j538J122J977J30j992j347M89K241
2275A879k60k317k252Q71K712L28k939k525J257L356O10l080k751J523L324J711
2291A447k801l082J118L828K490j828l177n10M026L451j091l957j317L519L985
2306F101p91l902k022K795M157m4m626k788K011L431P16m177l063J212L801L11
2322C122l435l392Q56L465J821l042l916J83M263J997k750l868M04M379K519k118
2338D88l974k36M508L104j223m173j644L872M119m87m654k838L392M892k21m402
$$ plain form
2354 523 -3829 -1516 3255 4260 218 -4252 -3749 741 2692 -346 -5113 -5439 -1872 1113 -524 -5032
2370 -5032 -6339 -3342 336 -25 -3700 -5930 -3409 77 854 -1916 -3599 -1739 898 1813 -37 -1216
2386 -1216 199 2203 3105 1474 352 1448 2948 3290 1686 320 1261 3386 2732 631 -857 828
2402 828 2533 2300 -1212 -2512 -520 1859 1440 -1986 -3707 -1887 941 1042 -1710 -4019 -2672 483
2418 483 2455 -278 -3228 -2443 1510 3829 2037 -1767 -1654 1943 4989 3716 -46 -797 1683 5165
2434 5165 4325 950 -639 1431 3795 3688 620 -1610 -371 1917 2269 -456 -3225 -2303 817 1038
2450 1038 -1844 -4423 -2951 -214 92 -2391 -4539 -3338 -384 490 -1579 -4167 -3351 36 2569 9
2466 9 -3411 -2833 1284 4099 2178 -2165 -2731 1539 4673 3163 -1511 -2763 569 4471 3722 -495
$$ packed form
2354E23m352K313M771J005m042m470N03M490J951l038m767l26L567K985j637m508
2370e032j307K997L678l61l675k230K521L486P77k770j683J860K637R15j850j179
2386a216J415K004R02j631j122J096J500L42j604j366R41K125o54k101j488J685
2402H28J705k33l512j300J992K379m19l426j721J820K828J01k752k309J347L155
2418D83J972k733k950P85L953K319j792l804J13L597L046j273l762p51K480L482
2434E165q40l375j589K070K364j07l068k230J239K288L52k725k769R22L120K21
2450A038k882k579J472K737L06k483k148J201K954Q74k069k588Q16L387K533k560
2466Il420N78M117K815j921m343n66M270L134j510m674j252L332L902p49m217
$$ plain form
2482 -495 -3634 -1254 2629 3262 -295 -4131 -3425 811 3078 -336 -4143 -4319 -833 1938 -89 -3544
2498 -3544 -4037 -1086 1404 788 -2136 -2911 -1086 1782 1594 46 -1325 96 1751 2528 919 280
2514 280 1258 2561 2698 1167 739 1989 2785 2052 -48 -4 1651 2566 1578 -905 -1100 70 2159 979
2532 979 -1638 -2718 -1092 1535 953 -1851 -4016 -1804 1375 1667 -1260 -4045 -2635 1379 2427 -177
2548 -177 -3228 -2244 1244 3222 1435 -1488 -2052 894 3319 2288 -597 -1791 511 3310 2490 -286
2564 -286 -2026 97 2198 1940 -464 -2011 -673 1266 841 -1167 -2491 -1059 384 397 -1594 -2566
2580 -2566 -1621 626 802 -1498 -3528 -1591 1119 1819 -1176 -3377 -1686 1975 2820 147 -2693 -1661
2596 -1661 2035 3685 1190 -1975 -1825 1197 3774 2456 -1541 -2526 239 3801 3525 -818 -2790 -910
$$ packed form
2482d95l139K380L883O33l557l836P06M236K267l414l807j76L486K771k027l455
2498c544m93K951K490o16k924p75J825K868j88j548j371J421J655P77j609o39
2514B80R78J303J37j531m28J250P96p33k100M4J655R15r88k483j95J170K089j180
2532I79k617j080J626K627n82k804k165K212L179K92k927k785J410M014J048k604
2548a77l051R84L488J978j787k923n64K946K425j031k885j194K302K799q20k776
2564b86j740K123K101k58k404j547J338J939m25k008j324J432J443J3j991r72
2580b566R45K247J76k300k030J937K710P00k995k201J691L661Q45k673k840J032
2596a661L696J650k495l165J50L022K577j318l997r85K765L562k76m343j972J880
$$ plain form
2612 -910 2675 2957 -193 -3343 -2108 1233 2428 598 -2826 -2747 -233 2085 819 -2062 -2174 -341
2628 -341 1819 1256 -1170 -2105 -608 1120 950 -884 -796 89 1153 638 -311 -357 972 1228 431 -723
2646 -723 -82 991 1888 497 -821 -1049 794 1793 555 -1507 -2047 607 1888 829 -2032 -2597 -260
2663 -260 2249 2147 -1533 -3074 -1084 1936 2218 -948 -2823 -1893 1339 2397 380 -2276 -2103 568
2679 568 2701 1030 -1831 -2078 290 2351 1449 -1077 -1782 130 1822 1524 -460 -1354 233 1345
2695 1345 873 -80 -1118 -227 1209 982 -562 -1470 142 1630 1106 -1053 -1834 137 1739 1207 -1118
2712 -1118 -1971 -59 1852 1488 -1241 -2484 -837 1680 2071 -473 -2880 -1655 1335 2632 248 -2648
2728 -2648 -2653 664 2955 1160 -1820 -2705 -85 2677 1882 -1152 -2721 -595 2085 2265 110 -1926
$$ packed form
2612i10L585K82l150l150J235L341J195j830l424P9K514K318j266k881j12J833
2628c41K160n63k426r35J497J728j70j834Q8Q85J064n15r49m6J329K56p97j154
2646g23O41J073Q97j391j318k28J843R99j238k062n40K654J281j059k861n65K337
2663b60K509j02l680j541J990L020K82l166j875R30L232J058k017k656J73K671
2679E68K133j671k861k47K368K061r02k526p05J912J692k98j984q94J587J112
2695A345m72r53j038Q91J436k27j544r08J612J488n24k159p81J971J602n32k325
2712a118q53J912J911l64k729j243J647K517L91k544k407J225K990J297k384k896
2728b648nL317K291j795k980q85K620K762p95l034j569K126K680J80k155k036
$$ plain form
2744 -1926 -1303 1453 2207 494 -1506 -1570 387 1955 206 -1389 -1507 310 1023 186 -1120 -1211 -20
2761 -20 483 -8 -1118 -1252 138 197 -500 -974 -924 153 740 -264 -1379 -519 979 1868 100 -1420
2779 -1420 -697 1415 2312 887 -1210 -1258 921 2737 1690 -949 -1610 420 2276 1970 -617 -1930
2795 -1930 -459 1942 2283 -156 -2289 -1656 1047 1672 90 -2262 -1817 213 1538 263 -1887 -2070
2811 -2070 -333 1373 617 -1004 -1268 -112 931 758 -448 -712 415 1628 705 -483 -505 608 1751
2828 1751 801 -509 -571 1008 2038 787 -808 -1182 796 1923 923 -1478 -1988 -520 1227 888
2844 888 -1574 -2928 -1064 1164 1366 -1251 -3180 -1805 673 1661 -60 -2520 -2179 520 2133 901
2860 901 -1740 -2054 -23 2290 1590 -637 -1601 9 2308 2209 304 -1154 -369 1515 1924 535 -828
$$ packed form
2744a926O23K756P54j713k000o4J957J568j749j595j18J817P13q37j306r1J191
2761b0N03m91j110j34J390N9o97m74N0J077N87j004j115Q60J498Q89j768j520
2779a420P23K112Q97j425k097m8K179J816j047k639o61K030J856l06k587j313
2795a930J471K401L41k439k133O33K703O25j582k352M45K030J325j275k150j83
2811b070J737J706p56j621k64J156J043j73j206k64J127J213r23j188k2J113J143
2828A751r50j310o2J579J030j251j595l74J978J127j000k401n10J468J747l39
2844H88k462j354J864K228K02k617j929J375K478R88j721k460L41K699J613j232
2860I01k641l14K031K313p00k227r64J610K299r9j905j458P85J884M09j389j363
$$ plain form
2877 -828 -566 794 1141 142 -875 -383 -58 617 -379 -999 -837 173 191 -705 -1683 -867 207 480 -639
2896 -639 -1587 -471 1206 1235 -754 -1427 -315 1554 1662 195 -1028 -345 1690 2560 870 -625 -702
2913 -702 1444 2599 1667 -431 -1127 430 2304 1946 -568 -1889 -1026 1404 1571 -391 -2253 -1482 434
2930 434 666 -756 -2243 -2208 -261 652 -278 -1723 -1643 -294 699 -66 -1063 -782 323 855 381 -513 -373
2949 -373 812 1575 571 -360 39 1048 1667 566 -355 -588 1345 2055 541 -1193 -1090 569 1109
2966 1109 419 -1492 -1972 -499 869 587 -1536 -2671 -1202 824 1117 -1210 -2490 -1415 638 1681
2982 1681 -447 -1928 -1524 617 1960 1021 -1190 -839 792 2159 1616 -424 -824 270 1714 1840
2998 1840 370 -510 232 1533 1475 286 -711 -526 921 646 -289 -1113 -256 -98 297 -603 -1535 -781 130
$$ packed form
2877h28K62J360L47r99j017M92L25O75r96o20J62J010J8q96r78Q16J074K73j119
2896f39r48J116J677K9j989o73J112J869J08j467j223O83K035Q70j690j495p7
2913g02K146J155r32k098o96J557J874l58k514j321Q63K430J67j962j862P71J916
2930D34K32j422j487L5J947R13r30j445Q0J349R93p65r97K81J105N32m74q94J40
2949c73J185P63j004r31L99J009O19j101r21k33J933P10j514j734J03J659N40
2966A109o90j911m80J473J368k82k123j135J469K026K93k327j280J075K053J043
2982A681k128j481M04K141J343r39k211L51J631J367n43k040m00J094J444J26
2998A840j470q80P42J301n8j189r97J85J447k75r35q24Q57J58L95r00r32P54R11
$$ plain form
3017 130 -161 -821 -1478 -631 624 270 -959 -1549 -416 1116 1067 -312 -816 -332 1369 1705 292 -891
3035 -891 -323 1150 2118 531 -705 -576 734 1827 1133 -701 -1084 258 1567 941 -832 -1916 -932
3052 -932 919 778 -924 -1839 -913 459 405 -781 -1893 -1343 2 803 -107 -1248 -1100 28 725 -107
3070 -107 -605 -593 843 1271 62 -325 105 1539 1359 561 -449 -208 1138 1435 265 -1130 -368 979
3088 979 1764 522 -1383 -1248 108 1516 200 -1170 -2072 -569 1166 335 -1584 -2020 -582 620
3104 620 382 -458 -1840 -1140 683 1484 105 -1104 -922 607 1848 599 -883 -832 445 2012 1022
3121 1022 -566 -310 466 1675 1041 -79 -354 37 636 605 -494 -859 -299 620 -34 -727 -1239 -167
3139 -167 549 -168 -1089 -1359 -274 547 -18 -737 -1184 -96 879 340 -680 -1310 302 943 937 42 -1149
$$ packed form
3017A30k91o60o57Q47J255l54j229n90J133J532m9j379n04M84J701L36j413j183
3035h91N68J473R68j587j236J29J310J093o94j834l83J342J309o26j773j084R84
3052i32J851j41j702r15R26J372n4j186j112N50J345Q01r10j141J48J128O97q32
3070a07m98J2J436M28j209l87M30J434j80p98j010K41J346K97j170j395P62J347
3088I79P85j242j905J35J356J408j316j370r02J503J735q31j919m36J438J202
3104F20k38q40j382P00J823Q01j379j209J82J529J241j249j482N1J277J567r90
3121A022j588K56P76J209o34j120k75L91N99l1j099l65N60R19o54o93n12J072
3139a67P16p17r21k70J085Q21n65p19m47J088R75n39j020o30J612O41oq95j191
$$ plain form
3158 -1149 -43 915 1773 415 -640 -452 1104 1293 815 -1059 -529 412 1324 637 -1011 -977 -40 1011
3176 1011 249 -753 -1111 -401 518 340 -790 -1353 -555 515 281 -554 -1449 -669 548 744 -114 -867
3194 -867 -137 568 558 210 -548 -101 748 975 109 -433 115 987 1189 176 -693 -312 928 1574 154
3213 154 -1162 -897 366 935 140 -1054 -814 433 1155 4 -932 -1276 -271 753 441 -741 -1387
3230 -1387 -390 979 689 -445 -1249 -550 926 1187 -285 -1030 -268 554 1065 543 -604 -720 648 858
3248 858 142 -518 -633 438 986 261 -490 -1095 -132 801 216 -881 -637 16 895 152 -779 -605 -338
3267 -338 943 117 -623 -998 210 713 361 -245 -613 -269 456 601 -296 -1015 -338 878 825 -183 -812
3286 -812 -358 1025 1083 145 -906 -689 991 889 172 -797 -604 585 969 392 -964 -1216 89 1012
$$ packed form
3158a149J106R58Q58j358j055J88J556J89m78j874N30R41R12o87j648L4R37J051
3176A011p62j002l58P10R19j78j130n63P98J070k34q35q95P80J217J96q58p53
3194h67P30P05j0l48p58M47Q49K27q66n42N48Q72K02j013q69L81J240O46j420
3213A54j316K65J263N69p95j194K40J247P22j151r36l44J005J024l12j182o46
3230a387R97J369k90j134q04O99J476K61j472p45P62Q22N11n22j147j16J368K10
3248H58p16o60j15J071N48p25p51o05R63R33n85j097K44O53Q79p43r31J74K67
3267c38J281q26p40l75J208N03l52o06l68L44P25J45q97p19O77J216n3j008o29
3286h12M54J383N8r38j051K17J680j02p17r69J93J189L84n77j356k52J305R23
$$ plain form
3304 1012 463 -790 -1032 155 771 437 -662 -773 -53 643 230 -305 -557 -143 371 218 -545 -845 -57
3323 -57 469 796 -304 -609 87 882 522 -115 -778 30 448 372 -104 -726 -252 718 691 102 -665 -428 264
3344 264 881 21 -611 -631 49 893 293 -450 -863 376 876 618 -424 -952 -82 524 482 -389 -725 -409
3364 -409 546 704 -87 -723 -299 615 380 -197 -558 -556 183 737 -53 -574 -323 512 376 97 -411 -272 40
3385 40 657 98 -506 -160 290 469 243 -57 -231 67 774 373 -746 -716 95 597 -181 -502 -812 45
3405 45 743 288 -886 -981 -116 571 248 -359 -414 -323 603 615 1 -691 -515 408 768 214 -634 -210 434
3426 434 776 196 -378 -194 286 964 407 -508 -520 237 545 226 -396 -634 476 727 433 -381 -549 -151
3446 -151 555 378 -722 -619 -317 359 176 -534 -815 -133 523 173 -422 -855 -113 619 531 -131 -551 -92
$$ packed form
3304A012n49j253k42J187O16l34j099j11P20O96m13n35k52M14N14j53p63l00P88
3323e7N26L27j100l05O96P95l60o37o63Q08M18p6m76o22M74R70k7n89p67K37O92
3344B64O17q60o32k0O80Q44o00p43m13J239N00k58j042n28Q70O06m2q71l36L16
3364d09R55J58p91o36M24R14k35n77l61KP39N54p90n21K51Q35j36k79n08J39L12
3385D0O17n59o04L46M50J79k26l00j74K98P07m01j119L0Q11N02p78l21l10Q57
3405D5O98m55j174r5Q65O87l23o07n5R1R26J2o14o92J76R23L60n54q48M24O44
3426D34L42n80n74J84M80O78n57r15j2P57L08l19o22k38J110K51k94q14j68L98
3446a51P06j77j100J03L02O76j83p10k81O82O56l50n95m33P42P32q8o62m20M59
$$ plain form
3466 -92 573 992 185 -588 -231 607 1264 130 -449 -528 613 809 396 -377 -407 292 516 293 -152 -528
3486 -528 -142 570 448 -653 -763 -328 222 386 -252 -703 -448 204 -21 -318 -813 88 237 54 -141 -617
3506 -617 -135 561 501 14 -273 -16 474 934 375 -455 -596 649 720 479 -599 -403 437 777 226 -639
3526 -639 -693 461 486 249 -530 -773 198 229 283 -358 -580 -178 291 109 -407 -799 -217 477 392 -315 -671
3547 -671 -129 591 284 51 -701 -97 624 622 455 -328 -28 376 813 327 -634 23 539 596 182 -355 -602
3568 -602 538 441 110 -522 -627 -81 287 -32 -530 -603 -159 186 -210 -541 -684 -448 420 39 -68 -427
3588 -427 -102 513 168 -69 -245 -85 532 537 213 -292 -100 621 709 126 -518 -391 476 756 145 -543 -528
3609 -528 252 185 124 -760 -604 113 375 -29 -746 -249 -44 42 -188 -568 -542 18 181 300 -136 -654 232
$$ packed form
3466i2O65M19q07p73L57Q38O57j134n79p9J141J96m13p73l0O99K24k23m45l76
3486e28L86P12j22j101j10M35N50J64o38m51K55O52k25k97m95R01J49j83j95m76
3506f17M82O96o0m87k87K57M90M60n59q30j41J245P1k41j078J96Q40L40n51q65
3526f39n4J154K5k37p79k43R71L1N4o41k22M02M69j82n16l92N82O94q5p07l56
3547f71N42P20l07k33p52O04P21kj67p83L00M04M37m86r61O57N16N7m14n37k47
3568f02J140r7l31o32j05N46L68l19m98p3M44L45l96l31j43K36Q68l81j07l59
3588d27L25O15l45k37j76J60O17Nl24n05J92P21Q8n83o44J27Q67K80o11o88J5
3609e28P80o7o1q84J56P17K62m04p17M97K05Q6k30l80K6N60J63J19m36n18Q86
$$ plain form
3630 232 275 444 -374 -323 190 732 680 146 103 -170 637 631 253 -101 61 326 762 -87 -134 10 73 627 -37
3653 -37 -412 -263 467 464 231 -492 -805 -543 388 101 -533 -684 -136 316 97 -576 -656 -85 304 248 34 -94
3675 -94 -3 821 400 -196 -811 50 379 762 61 -252 10 272 817 378 -361 -162 315 87 318 -468 -543
3696 -543 201 349 336 -448 -475 -324 257 -238 -470 -495 43 129 -109 -436 -432 93 285 190 -101 -709 38 180
3718 180 395 -254 -339 46 209 583 -159 -338 142 196 562 5 -480 -86 293 520 -69 -115 -126 4 308
3739 308 -140 -279 -481 258 510 -209 -702 -488 83 37 201 -257 -291 47 123 299 -155 -303 -10 410 367
3760 367 146 -163 91 286 775 -85 -499 -308 522 386 -164 -208 -117 351 294 -39 -201 -326 442 285 -51
3781 -51 -226 -319 227 396 -155 -552 -378 57 304 27 -545 -580 -56 59 59 -405 -555 -101 333 265 -232 -570
$$ packed form
3630B32M3J69q18N1N13N42n2n34m3k73Q07ol78l54J62K65M36q49m7J44O3N54o64
3653c7l75J49P30lk33p23l13K62R31k87o34j51N48M52k19o73q0N71L89n6k14j28
3675i4R1Q24m21n96o15Q61L29L83p01l13K62K62N45m39p39J99M77k28K31p86p5
3696e43P44J48j3p84k7J51N81m95k32k5N38Q6k38l27MN25J92r5k91o08P47J42
3718A80K15o49q5L85J63L74p42j79M80N4L66n57m85L94L79K27n89m6j1J30L04
3739C08m48j39k02P39K52p19m93K14N71m6J64m58l4L38P6J76m54j48K93M20m3
3760C67k21l09K54J95M89q60m14J91Q30j36n50m4R1M68n7l33j62j25P68j57l36
3781e1j75r3N46J69n51l97J74M35K47k77n72l5N24J15%m64j50M54M34o8m97l38
$$ plain form
3803 -570 155 177 559 -91 -275 -2 398 219 -198 -261 -291 110 177 -246 -337 -212 409 203 -161 -349 8 75
3825 75 390 -15 -221 -314 77 356 -137 -438 -339 293 282 253 -56 -326 -64 322 197 -203 -130 -45 493 104
3847 104 -260 -484 -25 570 96 -61 -381 -91 58 28 -156 -379 -186 154 161 -226 -276 -219 169 340 -259 -375
3869 -375 -7 230 309 340 -150 -135 -164 457 11 -255 -439 88 305 -28 37 -358 -164 -108 182 29 -142 -230
3891 -230 574 37 -375 -116 101 182 -22 -285 -125 -74 181 -157 -219 -111 175 277 288 168 -337 192 84
3912 84 101 -38 48 -212 490 282 -103 -78 -306 50 174 -24 -174 -478 63 465 31 -440 -377 230 205 276
3934 276 -311 -301 179 459 380 26 -204 126 124 137 -40 -71 125 69 372 61 44 89 265 474 -293 -191 -286
3957 -286 437 225 -5 -126 -197 -10 102 -232 -333 -520 -137 -14 -51 -570 -559 -131 12 100 -158 -384 -347 -10
$$ packed form
3803e70P25K2L82o50j84K73M00j79m17o3l0M01O7m23r1J25O21k06l64j88L57O7
3825G5L15m05k06r3L91K79m93l01R9O32j1k9l09k70K62L86j25m00P3Q5N38l89
3847A04l64k24M59N95m74j57l20K90J49l0j84k23J93L40Pl87n0N7L88J71n99j16
3869c75L68K37P9L1m90J5k9O21m46k66j84N27K17l33O5l95J94N6K90j53j71q8
3891b30Q04n37m12K59K17Q1k04k63J60N1K55l38o2J08K86J02J1j20n05N29j08
3912H4J7j39Q6k60P02k08l85K5k28L56J24j98j50l04N41M02m34m71O3O07k5P1
3934B76n87J0M80K80p9l54k30L30kJ3j77l1J96n6L03l11j7M5J76K09p67J02r5
3957b86P23k12k30j21p1J87J12l34j01j87L83J23l7n19J1M28J43Q8k58k26L7L37
$$ plain form
3979 -10 133 -423 -133 -105 -150 163 -18 -68 68 202 238 -123 -97 -112 209 114 77 -399 114 240 201 52 -457
4002 -457 2 92 343 -67 -251 -32 125 316 -107 -160 -138 98 -170 44 -55 -384 -88 224 509 -430 -2
4023 -2 124 333 69 -187 -268 89 -33 125 -35 215 12 329 655 109 -72 74 219 385 47 -194 14
4044 14 120 279 -254 -172 -251 318 -40 166 -232 -350 24 245 -79 -163 -282 -126 80 150 -251 -366 14 3
4066 3 428 -185 -35 141 -6 -28 -15 -206 395 289 331 311 -103 -184 7 15 13 6 -184 79 250 -134 -229 -117 264
4091 264 219 -221 -357 -123 -16 223 18 -547 -350 294 216 -186 -154 -211 109 23 168 -95 53 215 17 108
4113 108 35 -112 406 313 397 -188 42 67 201 329 -264 165 32 278 31 130 -81 -103 337 69 -138 -285
4135 -285 -268 307 -72 320 -208 -108 99 254 -58 -142 49 267 140 69 -287 -372 192 359 90 -263 122
$$ packed form
3979a0J43n56K90K8m5L13j81n0J36J34L6l61K6j5L21r5l7m76N13J26l9j49n09
4002d57M59R0K51m10j84K19J57J91m23n3K2K36k68K14r9l29K96L12K85r39M28
4023bJ26K09k64k56q1L57j22J58j60K50k03L17L26n46j81J46J45J66l38k41K08
4044A4J06J59n33Q2p9N69l58K06l98j18L74K21l24q4j19J56K06P0m01j15L80j1
4066CM25o13J50J76j47k2J3j91O01j06M2k0m14q1J91Qkpj90K63J71l84r5J12L81
4091B64m5m40j36K34J07K39k05n65J97O44p8m02L2n7L20q6J45k63J48J62j98R1
4113A08p3j47N18r3Q4n85K30K5J34J28n93M29j33K46k47R9k11k2M40k68k07j47
4135b85J7N75l79L92n28J00K07J55l12q4J91K18j27p1l56q5N64J67k69l53L85
$$ plain form
4156 122 110 327 72 -3 -290 240 267 190 299 -247 125 94 430 -295 -308 39 285 393 -202 -576 106 225
4178 225 -41 72 -356 -419 61 92 -241 -293 -191 203 89 -230 -99 -153 -240 189 249 -18 -104 355 441 94 -68
4201 -68 -213 36 -57 -45 -59 -229 -66 190 52 -133 -233 -229 131 9 -25 -248 160 104 92 -155 21 -129 -63
4224 -63 -52 -350 -97 -140 6 168 106 -220 -171 82 144 30 -236 -192 144 54 360 63 281 93 279 184 -148
4247 -148 39 212 14 441 42 -308 -14 31 242 -160 116 -378 360 369 -10 40 -72 102 14 -172 -1 110
4269 110 -255 -98 211 -121 -133 220 -78 -121 -292 -199 -157 250 80 -132 9 104 72 -24 6 33 265 -114 50
4292 50 -209 -17 11 -64 11 -74 -112 -12 375 267 29 266 -11 313 199 26 -495 -194 74 -60 162 -74
4314 -74 -144 -18 101 18 -94 -92 55 -62 362 47 139 -10 611 18 -188 -326 187 73 -35 -207 -96 -146
$$ packed form
4156A22j2K17k55p5k87N30K7p7J09n46L72l1L36p25j3L47K46J08n95l74O82J19
4178B25k66J13m28o3M80L1l33n2J02L94j14l19J31n4q7M29O0k67q6M59Q6l47j62
4201f8j45K49r3J2j4j70J63K56j38j85j00ML60j22l4k23M08n6j2k47J76j50O6
4224f3J1k98K53m3J46J62o2l26M9K53O2j14k66M4L36r0L06k97K18j88J86r5l32
4247a48J87J73j98M27l99l50K94M5K11m02K76m94P38Rl79N0j12J74q8j86J71J11
4269A10l65J57L09l32j2L53k98m3j71R3M2M07j70k12J41R5l2r6L0K7K32l79J64
4292E0k59J92K8p5P5q5l8J00L87j08k38K37k77L24j14j73n21L01K68j34K22k36
4314g4p0J26J19q3j12KJ47j17M24l15R2j49O21n93k06j38N13j14j08j72J11n0
$$ plain form
4336 -146 17 33 -492 -78 -421 477 -22 -50 -245 -161 110 152 165 -310 -65 255 411 95 -40 -6 166 -34
4358 -34 -86 -137 11 -61 50 81 -449 -86 41 -65 -23 -281 -177 214 2 162 -196 -155 -12 221 -71 60
4380 60 -310 -134 208 4 -7 395 207 41 -179 -137 120 -124 185 113 21 -352 -198 143 16 -181 -194 -168
4402 -168 165 102 -112 -49 -58 -11 127 -175 23 -149 65 68 -317 62 -98 -82 435 10 11 -8 328 254 68 100
4426 100 115 -106 326 269 -103 -80 8 -171 252 189 30 95 137 -202 67 -563 24 -11 -126 149 -152 -10 -283
4449 -283 -14 -359 38 -209 143 -73 53 125 -124 -181 10 -6 -218 -192 27 4 99 151 84 -214 4 75 -46
4472 -46 -195 46 60 -51 13 -4 -81 329 190 231 -318 -258 202 -41 -333 -283 -337 -310 -110 88 43 -105 286 247
4496 247 161 -137 -114 -22 225 -106 166 -193 102 348 30 -274 -324 -243 89 255 414 273 147 395 89 193
$$ packed form
4336a46J63J6n25M14l43Q98m99k8j95Q4K71M2J3m75K45L20J56l16j35L4J72k00
4358c4n2n1J48p2J11L1n30L63J27j06M2k58J04L91k12J60l58M1J43K33k92J31
4380F0l70J76L42k04j1M02j88j66k20M2K57k44L09p2r2l73J54L41j27j97j3K6
4402a68L33o3k14O3rM7J38l02J98j72K14Ll85L79j60J6N17m25Jj9L36p4j86L2
4426A00J5k21M32n7l72K3Q8j79M23o3j59O5M2l39K69o30N87l5j15K75l01J42k73
4449b83K69l45L97k47L52k16J26P2k49n7J91j6k12K6K19k3R5N2o7k98K18P1j21
4472d6j49K41J4j11O4j7p7M10j39M1n49O0M60k43k92N0n4K7K00J98m5j48L91l9
4496B47q6k98K3R2K47l31K72l59K95K46l18l04n0Q1L32J66J59j41j26K48l06J04
$$ plain form
4518 193 -106 -167 187 88 28 126 -254 267 -98 -181 -133 -138 -67 51 184 -345 -127 -216 175 -16 -164 -347 -66
4541 -66 -30 -145 223 89 216 -120 56 242 -23 93 -8 77 -27 98 218 135 174 121 -323 266 -59 243
4563 243 33 -123 -260 128 6 116 -248 153 121 102 55 -226 16 6 231 -354 -326 39 -241 29 152 -19
4585 -19 -147 -273 60 -131 402 55 -41 -74 -134 33 -265 -18 162 94 -118 71 3 21 197 -196 -22 -63 305
4608 305 -157 -24 442 -65 -38 -320 70 198 45 -52 -243 -22 -24 -296 14 49 -65 129 -218 -23 266 -64
4630 -64 37 -48 -8 -215 94 390 -299 263 246 -87 -12 -228 385 130 -5 332 -31 108 65 20 -228 -37
4652 -37 -280 -117 -128 213 -506 -220 -120 -33 105 -374 -329 -248 -212 -35 128 -265 136 201 -31 73 -158 -37
4674 -37 90 -184 -64 -52 16 166 70 -67 109 -69 -142 47 -51 195 129 92 52 -94 -47 165 246 -47 -315 -134
$$ packed form
4518A93k99o1L54r9o0R8l80N21l65q3M8nP1J18J33n29K18q9L91j91j48j83K81
4541f6L6j15L68j34J27l36J76J86k65J16j01Q5j04J25J20q3L9n3m44N89l25L02
4563B43k10j56j37L88j22J10l64M01l2j9m7k81K42j0K25n85K8L65k80K70J23j71
4585a9j28j26L33j91N33l47r6l3o0J67k98K47J80o8k12J89o8J8J76l93J74m1L68
4608C05m62J33M66n07K7k82L90J28j53r7j91K21kk72L10L5j14J94l47J95K89l30
4630f4J01q5M0k07L09K96o89N62j7l33P5k16O13k55j35L37l63J39m3m5k48J91
4652c7k43J63j1L41p19K86J00Q7J38m79M5Q1L6J77J63l93M01O5k32J04k31J21
4674c7J27k74J20J2O8J50r6j37J76j78p3J89r8K46o6l7m0j46M7K12Q1k93k68J81
$$ plain form
4698 -134 -209 188 -12 78 -148 18 282 -1 -97 162 -87 42 201 -272 -46 47 7 303 -227 194 227 267
4720 267 -105 -74 -57 -357 94 6 52 219 52 -39 -14 -65 27 215 2 -10 117 381 -81 -52 4 186 -164 -49
4744 -49 97 -182 47 94 206 10 93 127 -80 135 -75 -125 147 130 -53 -93 155 26 11 -192 -18 80 -104
4767 -104 107 -220 231 -70 90 -204 12 77 283 53 -3 -433 -221 28 -57 115 -118 47 -344 229 22
4788 22 70 64 -128 -147 68 82 -98 -81 109 -38 -187 -106 -191 -45 -57 -117 294 52 104 223 185 163 104 -150 76
4813 76 -1 -11 252 153 -28 -21 -67 -47 85 -457 -41 -364 93 142 -210 -39 0 -64 275 -21 102 90 39 64 -40
4838 -40 -162 -366 -144 35 -104 -116 194 157 244 -101 -162 20 50 115 183 -48 -25 -48 -25 -141 -137 -7 158 41
4862 41 -88 40 195 -214 -374 138 110 158 -198 -51 -138 -101 -126 210 -122 -47 -59 -15 101 34 -37 -23 -19 -135 -48
$$ packed form
4698a34p5L97k00R0k26J66K64k83r6K59k49J29J59m73K26R3m0K96n30M21L3M0
4720B67l72L1J7l00M51q8M6J67j67r1K5n1R2J88k13j2J27K64m62K9N6J82l50J15
4744d9J46k79K29M7J12j96Q3L4k07K15k10n0K72j7j83m0K48j29j5k03J74R8j84
4767a04K11l27M51l01J60k94K16O5K06k30n6m30K12K49q5J72k33J65l91N73k07
4788B2M8oj92j9K15J4j80J7J90j47j49Q1q5J46j2o0M11k42N2J19l8k2n9k54K26
4813G6p7j0K63r9j81Pm6K0J32n42M16l23M57M9l52J71L9o4L39k96J23j2n1K5j04
4838d0j22k04K22J79j39j2L10l7Q7l45o1J82L0O5O8k31K3k3K3j16MJ30J65j17
4862D1j29J28J55m09j60N12k8M8l56J47q7L7k5L36l32P5j2M4J16o7p1J4Mj16Q7
$$ plain form
4887 -48 176 149 -111 -263 10 143 360 96 -24 -18 -98 -196 35 -48 -8 237 391 208 -91 40 -81 233 49
4910 49 85 -49 -114 104 -47 140 -5 -96 182 -242 351 -394 -317 305 -3 85 249 -86 -196 -147 -29 -174
4932 -174 -168 -281 -44 40 7 267 128 93 -129 42 22 245 142 -189 -225 -160 -150 297 308 75 -114 -352 -41
4955 -41 -378 82 -83 241 -133 -69 123 -57 204 -171 219 -250 -116 -183 -23 -27 71 -32 197 193 121 36 222
4978 222 9 -267 -192 56 -60 3 90 -172 -181 -48 47 212 14 3 9 36 -158 91 108 -166 19 -10 418 -14
5002 -14 -94 -219 53 127 -254 -40 -12 93 216 43 121 167 331 57 -22 -70 206 -64 204 128 188 374 -216
5025 -216 -80 -233 -101 -80 138 -285 157 -160 -195 332 49 123 -189 -159 46 -10 6 41 210 393 -17 121
5047 121 -8 251 -218 -11 108 -224 -116 283 -167 147 93 119 -78 40 -27 -56 162 -181 179 -31 -19 271
$$ packed form
4887d8K24k7k60j52K73J33K17k64j20Oq0r8K31q3M0K45J54j83k99J31j21L14j84
4910D9L6j34o5K18j51J87j45r1K78m24N93p45P7O22l08Q8J64l35j10M9J18j45
4932a74Oj13K37Q4l3K60j39l5k22J71k0K23j03l31l6O5J0M47J1k33j89k38L11
4955d1l37M60j65L24l74O4J92j80K61l75L90m69J34o7J60mR8j03K29mp2q5J86
4978B22k13k76P5K48j16O3Q7k62rJ33R5J65j98j1OK7j94K49J7k74J85k9M28m32
5002a4q0j25K72P4l81K14K8J05J23j73P8M6J64k74p9m8K76k70K68p6O0J86n90
5025b16J36j53J32K1K18m23M42l17l5N27k83P4l12L0K05n6J6L5J69J83m10J38
5047A21j29K59m69K07J19l32J08L99m50L14n4K6j97J18o7k9K18l43L60k10J2K90
$$ plain form
5069 271 -209 22 168 -173 149 -361 90 -290 -181 105 -31 338 12 -102 -70 127 130 28 211 34 101
5090 101 -153 -108 -153 -236 -48 32 -237 -113 -198 -25 -66 -386 239 -67 235 94 15 175 -440 7 68 3 -136
5113 -136 -33 -239 5 67 54 68 224 11 -307 8 -11 -285 -57 -54 340 171 -64 -91 -128 267 -63 -109 -232
5136 -232 -72 -168 63 -168 166 -71 69 75 120 79 -223 -219 -66 61 133 -105 -2 51 99 63 28 -139 -32 122
5160 122 69 -91 -195 159 108 -196 31 -143 -42 215 52 -52 236 112 154 305 -345 140 -51 -37 -129 294
5182 294 65 126 -160 -389 -295 64 -237 201 -65 93 -13 222 176 259 -91 -82 124 -161 -134 150 144 154 -183
5205 -183 -86 69 44 -198 46 -88 -205 51 -100 290 87 87 -103 -11 50 132 44 337 173 149 -31 180 -16
5228 -16 -248 -14 127 -22 150 -9 -143 56 -53 -137 115 103 62 146 117 -50 -149 -123 46 -300 -61 29 131
$$ packed form
5069B71m80K31J46l41L22n10M51l80J09K86j36L69l26j14L2J97Lj02J83j77O7
5090A01k54M5m5q3J88Q0k69J24q5J73m1l20O25l06L02j41p9J60o15M47O1o5j39
5113a36J03k06K44O2j3J4J56k13l18L15j9k74K28LL94j69k35k7l7L95l30m6j23
5136b32J60r6K31k31L34k37J40OM5m1l02MJ53J27P2k38J03N3M8l6l5j67J07J54
5160A22n3j60j04L54n1l04K27j74J01K57j63j04K88j24M2J51o50M85j91J4r2M23
5182B94k29O1k86k29R4L59l01M38k66J58j06K35m6Q3l50RK06k85K7K84oJ0l37
5205a83R7J55k5k42K44j34j17K56j51L90k03%j90R2O1Q2q8K93j64k4j80K11j96
5228a6k32K34J41j49J72j59j34J99j09q4K52j2m1Q4k9j67r9K6J69l46K39R0J02
$$ plain form
5251 131 -496 -117 -338 -114 -133 -398 -56 185 59 -66 -242 26 182 58 92 89 -34 -283 -11 -293 -33
5272 -33 -34 -284 27 212 -133 -368 227 40 247 -128 22 14 18 168 126 76 120 278 100 24 68 23 -473 -55
5296 -55 76 -19 -98 211 -145 193 -143 -17 -257 -251 -69 -329 92 -182 -71 3 -61 -330 244 -169 -97 -54 -20
5319 -20 30 -12 -239 59 -58 -186 -154 -142 41 0 -40 -123 74 -97 -254 -124 -216 -202 58 0 362 -40 235 40
5343 40 182 -62 -5 -86 -47 326 -55 -355 153 -216 8 102 133 46 -300 164 -49 -161 -254 125 -78 280 -53
5366 -53 161 64 -2 125 -191 -223 -16 135 41 79 -79 101 -42 79 -226 -12 31 -22 133 -144 -59 -388 170
5389 170 -23 -21 176 -109 -4 -134 19 -201 226 143 -203 -168 -72 -143 321 -64 -201 242 -36 109 109 90 -53
5412 -53 92 -221 31 105 64 14 72 100 -120 -294 -21 27 98 127 -108 -122 227 73 -148 -220 9 -47 85 92 -207
$$ packed form
5251A31o27L79k21K24j9k65L42K41j26j25j76K68J56j24L4lj23k49K72k82K60
5272c3jk50L11J85l45k35N95j87K07l75J50qMJ50m2n0M4J58j78p6M4m5m96M18
5296e5J31r5p9L09l56L38l36J26k40OJ82k60M21k74J11P4o4k69N74m13P2M3L4
5319b0N0m2k27K98j17j28L2J2J83m1m0q3J97j71j57J30r2J4K60n8L62m02K75j95
5343D0J42k44N7q1L9L73l81l00N08l69K24R4L1q7l46M64k13j12r3L79k03L58l33
5366e3K14r7o6J27l16l2K07J51r4L8j58J80j43J21l05K14M3n3J55k77Q5l29N58
5389A70j93KJ97k85J05j30J53k20M27q3l46L5R6p1M64l85j37M43k78J45%j9j43
5412e3J45l13K52P4m1n0N8K8k20j74K73M8P1K9k35j4L49j54k21p2K29n6J32Pk99
$$ plain form
5437 -207 -98 142 -131 -210 -173 -87 94 -31 -7 66 -22 34 265 -288 -115 104 136 119 -110 -263 206 339 -230
5460 -230 -32 -57 -73 -113 130 -339 148 -8 202 89 -289 -299 -133 240 -83 -157 -134 167 -317 -196 -33 242
5482 242 121 53 154 -138 -68 -27 134 30 221 -25 -83 -9 180 31 -272 -160 -209 257 -89 72 -215 75
5504 75 143 -184 -359 164 18 114 -170 -132 23 -66 -177 -75 -123 -47 -134 275 -24 -95 -23 143 -91 -23 96 260
5528 260 214 -188 186 57 -75 51 -67 234 -19 58 -3 -339 -55 -171 -158 -42 -296 190 -43 -483 -439 -124
5550 -124 106 -75 4 311 -125 -346 -156 -237 333 40 -72 -69 136 -250 40 23 304 -50 92 15 25 -17 -199
5573 -199 141 -263 -84 51 92 114 -178 87 -279 147 -7 -92 -96 -278 29 -164 -58 35 173 260 141 -155
5595 -155 184 -171 129 339 266 122 156 87 61 86 -147 -14 88 -143 124 -42 -37 328 194 248 188 -112 -90
$$ packed form
5437b07J09K40k73p9L7Q6J81j25K4P3q8N6K31n53J73K19L2j7k29j53M69J33n69
5460b30J98k5j6m0K43m69M87j56K10j13l78j0J66L73l23p4K3L01m84J21J63K75
5482B42j21o8J01k92P0M1J61j04J91k46n8P4J89j49l03J12m9M66l46J61k87K90
5504G5O8l27j75N23j46R6k84L8J55q9j11J02m8P6q7M09k99p1P2J66k34O8J19J64
5528B60m6m02L74j29j32J26j18L01k53P7o1l36K84j16J3J16k54M86k33m40M4L15
5550a24K30j81P9L07m36k21J90q1N70k93j12LK05l86K90j7K81l54J42p7J0m2j82
5573a99L40m04J79J35M1K2k92K65l66M26j54q5mj82L07j93J06R3J38Q7j19k96
5595a55L39l55L00K10p3j44L4o9k6K5k33J33J02k31K67j66NL65j34N4o0l00K2
$$ plain form
5618 -90 -97 -64 199 104 132 146 -233 -29 79 36 169 -290 23 -27 100 290 -152 55 132 -140 385 93 85 38
5642 38 105 75 -356 -205 111 164 224 -60 -172 447 155 84 -73 -61 199 73 70 3 294 149 132 270 85 -53
5666 -53 -13 -129 368 149 -162 161 -114 237 -254 -60 -2 24 -26 113 236 -263 298 -200 -99 51 -404 322
5688 322 -73 140 116 -114 -96 94 123 -89 -162 78 520 -78 4 -152 -34 -139 -174 -111 -12 240 62 -183 8
5711 8 188 -12 -33 -118 31 -19 -55 150 99 -142 -35 62 12 113 -149 -2 -94 -189 45 -47 -20 94 236 20
5735 20 -49 -221 238 71 14 -204 176 -113 -112 -14 123 -252 106 104 -74 86 -68 43 -180 -97 94 -67 -198
5758 -198 -92 187 -160 -206 34 63 -82 -42 -268 309 -7 -256 -311 -138 28 245 144 -40 -235 -137 -30 -302
5780 -302 204 16 -402 22 -173 85 184 -118 -84 129 -81 -62 -50 -93 207 54 -90 -206 153 115 -80 1
$$ packed form
5618i0pL3K63r5K8J4l79K04J08m3J33m59L13n0J27J90m42K07P7k72N25k92qm7
5642C8O7l0m31J51L16N3O0k84j12O19k92p1j57J2K60j26lo7K91j45j7J38j85j38
5666e3M0j16M97k19l11L23k75L51m91J94N8K6n0J39J23m99N61m98J01J50m55P26
5688C22l95K13k4k30J8J90K9k12p3K40M42n98Q2j56J18j05l5O3R9K52j78k45J91
5711HJ80k00k1q5J49n0l6K05n1k41J07R7n0J01k62J47r2r5K34r2K7J14J42k16
5735B0o9j72M59j67n7k18L80k89JR8J37l75L58kj78J60j54J11k23Q3J91j61j31
5758a98J06K79l47m6K40K9j45M0k26N77l16k49n5J73J66K17j01j84j95R8J07k72
5780c02N06j88m18M24j95K58R9l02L4K13k10J9J2m3L00j53j44j16L59l8j95Q1
$$ plain form
5802 1 15 -301 -298 -199 188 49 -172 -340 -235 -189 -56 -42 -1 33 195 -38 213 23 37 176 224 -136 113 386
5826 386 6 260 134 143 -286 202 -268 187 165 92 189 197 -46 165 114 18 80 63 101 -273 34 -149 326 -166
5850 -166 -61 8 -41 -282 -219 -194 -519 203 32 160 64 227 226 9 22 96 182 73 -114 273 101 168 -221 -6
5874 -6 -289 76 59 -97 44 -310 -129 -101 129 -48 -90 -216 167 198 61 -90 -85 -160 -81 52 -95 -70 93 -51
5898 -51 248 -295 187 -221 -151 -199 -33 -117 82 92 -178 71 94 2 -258 0 5 106 7 83 -196 -235 -121 107
5922 107 -173 143 42 -35 -22 -209 -150 49 74 -144 61 0 103 40 -268 6 172 -233 60 -106 -151 -254
5944 -254 -32 126 74 -150 122 0 -176 70 -207 4 114 213 -44 71 -34 137 67 -187 -78 32 -178
5965 -178 -12 -174 302 246 165 56 -137 307 160 191 103 108 -100 -98 152 58 -159 -242 -230 -285 -8 -85 -278 17
$$ packed form
5802AJ4l16LR9L87j39k21j68J05M6J33J4M1L4J62k33K51j90J4J39M8l60K49K73
5826C86l80K54j26Rm29M88m70M55k2p3R7Qk43K11n1r6O2j7L8l74L07j83M75m92
5850a66J05O9m9k41O3K5l25P22j71J28r6J63jk17J3P4Q6j09j87L87j72O7l89K15
5874fk83L65j7j56J41l54J81K8K30j77m2j26L83L1j37j51Np5P9J33j47K5J63j44
5898e1K99n43M82m08P0m8J66q4J99J0k70K49K3r2k60K58NJ01r9P6k79l9J14K28
5922A07k80L16j01p7J3j87N9J99K5k18K05o1J03o3l08K74J66m05K93j66m5j03
5944b54K22J58n2k24K72j22j76K46k77K11J10R9k57J15j05J71p0k54J09J10k10
5965a78J66j62M76n6q1j09j93M44j47L1q8Nk08KK50r4k17q3J2n5K77p7j93K95
$$ plain form
5989 17 -98 -135 67 117 -142 -215 -283 9 -175 35 -90 77 83 -29 -93 3 -44 -7 -290 -64 -47 -142 -59 -11 -210
6014 -210 116 53 37 -60 -41 -81 46 178 171 220 37 6 94 20 -110 -50 204 193 -205 42 166 278 121 5
6038 5 26 -23 -58 9 105 -85 416 80 -318 68 -56 -78 -38 126 46 -97 -219 -92 229 -260 -29 -48 21 -159
6062 -159 -31 -116 292 60 -27 -17 185 -16 -276 95 117 -29 -15 210 362 61 -15 193 113 177 116 -77 -142
6085 -142 100 203 -228 357 63 -8 -208 -21 -134 134 -183 -31 -1 81 -185 51 -53 359 -91 -229 -311
6106 -311 -183 125 78 54 109 263 93 7 -112 -264 -38 167 263 93 -75 -102 136 -342 -137 392 -14 219
6128 219 105 24 91 43 -64 106 -126 -28 160 16 83 120 98 -160 8 8 103 135 278 -152 248 214 -309 -87
6152 -87 65 70 35 29 -58 0 -144 -89 -153 -169 21 12 -18 -68 17 268 49 -118 -119 -157 -273 127 -15 -145 -190 19 -169
$$ packed form
5989A7j15l7K02N0k59p3o8K92j84K10j25J67Oj12o4R6m7L7k83K26J7r5Q3M8j99
6014b10L26o3j6r7J9m0J27J32pM9j83l1Q8p4j30O0K54j1l98K47J24J12j57j16
6038EK1m9l5O7R6j90N01l36l98L86j24k2M0J64q0j43j22J27L21m89K31j9O9j80
6062a59J28q5M08k32q7J0K02k01k60L71K2j46J4K25J52l01p6K08q0O4o1j93o5
6085a42K42J03m31N85k94p1k00J87j13K68l17J52L0Q2k66K36j04M12m50j38q2
6106c11J28L08m7k4N5J54j70q6j19j52K26K05R6j70j68k7K38m78K05N29m06K33
6128B19j14q1O7m8j07J70k32R8J88j44O7L7k2k58J68%R5L2J43m30M00l4n23K22
6152h7J52Nl5oq7N8j44N5o4j6J90rl0n0Q5K51k19j67jl8j16M00j42j30m5K09j88
$$ plain form
6179 -169 19 191 -136 -64 185 -199 86 132 69 -109 29 195 -152 351 -27 141 80 -239 199 -97 128
6200 128 -40 145 305 377 44 20 -14 227 149 63 211 -159 -98 271 -255 167 165 156 4 44 -14 372 167 -115
6224 -115 -283 -66 436 -219 143 16 -63 227 -228 -176 -267 -54 49 64 34 256 56 -144 88 -14 258 -112
6246 -112 -24 -147 108 -127 35 -203 102 14 127 -40 -21 -115 23 20 -281 112 -189 141 324 -127 -32 -86 76
6269 76 139 -131 -131 -96 -19 -35 23 -47 -102 -76 -180 -260 220 -335 -120 -122 -196 -44 -92 -182 3 -101 136 -97 84 -279
6295 -279 -110 87 28 71 -237 80 310 -96 48 280 -122 67 185 -79 341 54 -326 92 76 329 -126
6316 -126 -114 -50 126 -234 253 -31 112 -143 19 76 235 353 321 -81 -6 -227 -42 -21 -146 -192 -136 -109 47
6339 47 137 -41 -30 181 110 -108 -160 -45 -7 18 83 -2 -18 91 300 40 122 -40 -197 -127 178 -226 -278 -246 37
$$ packed form
6179a69J88J72l27P2K49l84K85M6o3j78J38J66l47N03l78J68o1l19M38k96K25
6200A28j68J85J60P2l33k4l4K41p8q6J48l70O1L69n26M22krj52M0n8L86k05k82
6224a15j68K17N02o55L62j27p9K90m55N2r1K13J03J5l0K22k00k00K32j02K72l70
6246a12Q8j23K55k35J62k38L05q8J13j67J9r4J38ll01L93l01L30J83m51R5n4J62
6269G6O3k70%L5P7j6N8p0n5K6j04q0M80n55K15kp4J52m8r0J85j04K37k33J81l63
6295b79J69J97n9M3l08L17K30m06J44K32m02J89J18k64M20k87l80M18j6K53m55
6316a26J2O4J76l60M87k84J43k55J62N7J59J18l2m02P5k21J85K1j25m6N6K7J56
6339D7R0j78J1K11p1k18n2J15L8K5O5q5j6J09K09k60Q2j62j57P0L05m04n2L2K83
$$ plain form
6364 37 -95 -135 -198 127 -179 -245 134 -7 -311 -183 172 -98 -23 -127 57 96 -38 -112 -54 -190 -4 -200 -2
6387 -2 -164 -382 -106 113 -101 160 -144 132 -3 -134 235 210 134 -84 169 -54 47 -57 167 -105 70
6408 70 -195 -39 -33 189 -310 71 -119 207 198 -10 339 133 71 58 107 -161 66 97 37 362 -180 -149 -148 7
6432 7 -156 118 -79 -58 69 370 -345 -300 20 -117 92 138 93 -76 88 152 -102 -19 336 -131 36 -182 39
6455 39 -116 -112 128 -100 226 -211 35 118 -40 190 -170 60 -121 -177 30 -221 349 11 21 92 -21 131
6477 131 -26 8 66 -299 -6 -66 65 14 -189 91 -181 -109 -183 263 -88 232 -213 69 -18 88 114 -17 64
6500 64 48 -21 127 51 56 -418 11 18 174 -211 -30 41 184 -393 128 19 204 270 -31 92 71 105 74 153 -288
6525 -288 -468 104 310 -81 -328 113 14 -174 1 56 -47 26 223 116 -82 -119 54 -46 56 28 299 -61
$$ packed form
6364C7j32m0o3L25l06o6L79j41l04J28L55k70P5j04J84L9j34p4N8j36J86j96J98
6387bj62k18K76K19k14K61l04K76j35j31L69k5p6k18K53k23J01j04K24k72J75
6408G0k65J56OK22m99L81j90L26rk08L49k06o2j3M9k68K27L1o0L25n42L1JJ55
6432Gj63K74j97K1J27L01p15M5L20j37K09M6m5j69J64O4k54Q3L55m67J67k18K21
6455C9j55MK40k28L26m37K46Q3j58K30l60K30j81n6K07k51N70l38J0P1j13J52
6477A31j57L4N8l65K93o0J31n1k03K80k72P2p4M46l51L20m45K82q7J06K6j31Q1
6500F4j6o9J48p6Nm74M29PJ56l85J81P1J43n77N21j09J85O6l01J23k1L4l1P9m41
6525b88j80N72K06l91k47M41r9j88J75N5j03P3J97j07j98l7J73j00J02k8K71l60
$$ plain form
6547 -61 -158 28 126 71 146 -398 45 141 -332 130 64 96 22 -45 -62 -79 122 114 109 -226 -200 130 -127 351 -83 -182
6573 -182 4 -103 99 164 62 262 432 -395 97 -177 59 215 111 -97 241 149 -121 -72 181 233 234 98
6595 98 115 -32 41 235 3 -311 126 60 275 135 181 -28 30 -57 122 168 -148 103 145 177 261 84 45 -288
6619 -288 109 236 -169 -179 -125 -27 -144 -1 -10 -79 291 -54 -16 427 302 -259 -238 112 128 95 -230 0 98 -143
6643 -143 23 -314 -204 -81 216 399 -48 73 174 46 41 -15 151 61 175 -217 -207 61 -97 -61 -14 -76 -69
6666 -69 188 -76 33 18 122 28 -127 151 -94 62 53 -248 54 -117 314 189 -102 -139 314 -26 131 162
6688 162 -68 359 103 79 140 -186 293 78 80 153 118 -89 -214 331 29 -282 -98 -111 -80 190 -16 179 -93
6711 -93 -329 -122 291 74 -6 -59 164 90 10 89 -102 20 -193 185 45 53 16 128 289 101 274 -271 126
$$ packed form
6547f1r7J86R8n5P5n44M43R6m73M62o6L2p4o7j7j7K01qnl35K6L30k57M78m34r9
6573a82J86j07K02O5j02K00J70q27M92k74K36J56j04k08L38r2k70M9K53N2Jj36
6595I8J7j47P3J94k32l14M37o6K15j40M6k09N8q7J79M6l16K51M2L2Q4j77l9l33
6619b88L97J27m05j0N4R8j17J43ro9L70l45L8M43j25n61K1L50J6l3l25K30R8k41
6643a43J66l37J10J23K97J83m47J21J01j28nn6J66r0J14l92J0K68j58L6M7o2P
6666f9K57k64J09j5J04r4j55K78k45J56rl01L02j71M31j25k91l7M53l40J57L1
6688A62k30M27k56k4O1l26M79k15KP3l5k07j25N45l02l11J84j3L1K70k06J95k72
6711i3k36K07M13k17q0n3K23p4q0P9j91J22k13L78j40Ql7J12J61j88J73n45L97
$$ plain form
6734 126 -57 -58 221 69 -484 182 181 153 177 -274 -203 -513 -216 108 -104 -198 -94 -4 -217 -143 -275 -507 -53
6757 -53 84 133 -54 233 -88 11 -230 -129 326 -21 19 -347 -62 158 3 107 -165 7 106 204 91 23
6779 23 -117 -200 171 6 44 192 -29 -173 238 282 16 -42 141 -261 316 -44 -75 239 -156 -126 -54 -163 17
6802 17 531 113 -19 111 -121 102 22 416 -2 -70 291 -119 -251 218 134 187 -122 -71 -91 207 -62 332
6824 332 88 -108 -199 -55 138 -86 -94 -174 -54 -296 -77 124 208 -74 71 -145 -17 31 -101 60 266 -116
6846 -116 -156 -123 -60 -114 1 -16 49 -101 -110 13 140 -111 -326 93 88 200 -253 46 -110 -50 -379 -540 -235 1
6870 1 -213 -176 -214 -125 -310 -98 49 -49 107 131 -251 -30 -72 68 209 275 -17 81 -87 -170 63 -40 -55 32
6894 32 -105 58 53 -151 -106 147 67 246 60 23 131 -130 -96 -75 318 210 -118 61 173 -190 -69 -19 240
$$ packed form
6734A26j83jK79j52n53O66jk8K4m51P1l10K97L24k12r4J04R0k13P4j32k32M54
6757e3J37M9j87K87l21R9k41J01M55l47M0l66K85K20j55J04k72J72R9R8j13o8
6779B3j40q3L71j65L8J48k21j44M11M4k66n8J83m02N77l60l1L14l95L0P2j09J80
6802A7N14m18j32J30k32K23q0L94m18o8L61m10j32M69q4N3l09N1k0K98k69L94
6824C32k44j96r1J44J93k24qq0J20k42K19K01Q4k82J45k16J28M8j32J61K06l82
6846a16m0L3O3n4J15j7O5j50rJ23J27k51k15M19nJ12m53K99j56O0l29j61L05K36
6870Ak14L7l8Q9j85K12J47r8J56K4l82K21m2J40J41O6k92R8j68q3K33j03j5Q7
6894C2j37J63nk04M5K53q0J79j86l7J08k61L4K1L93j08l28J79J12l63J21N0K59
$$ plain form
6917 240 124 -53 52 210 -177 -75 -73 12 33 -119 227 7 46 189 -17 -26 -199 -93 -59 -114 146 -351 -19
6940 -19 138 -51 -151 -301 279 -198 197 33 15 -198 144 224 222 -131 -285 50 -54 24 -130 -144 -24 -229
6962 -229 -322 -337 -325 35 215 92 -201 59 78 -242 98 -329 241 23 25 -182 -153 127 17 -148 -75 19 -140
6985 -140 -40 60 -95 -143 267 213 -152 34 -215 34 64 -138 -250 -86 -147 175 -90 -92 -51 -94 -65 34 -47 65
7009 65 192 -191 136 147 28 -167 207 -4 -169 91 29 136 -164 39 223 167 219 42 45 96 202 197 -97
7032 -97 9 109 254 -13 -78 77 161 130 -209 220 79 91 -63 -93 258 -315 126 -77 -74 -239 174 -85 40
7055 40 -113 -97 -191 71 47 -110 -466 90 17 -101 24 104 316 160 -54 149 39 -172 190 92 -19 -43 -87
7078 -87 -115 57 -207 86 353 154 -53 240 -154 131 -15 -39 -26 -40 -79 -139 -157 104 -178 64 -176 -124 82
$$ packed form
6917B40j16j77J05J58l87J02KQ5K1j52L46k20L9J43k06rj73J06L4n5K60m97L32
6940a9J57j89j00j50N80m77L95j64j8k13L42Q0kl53j54L35j04P8j54j4J20k05
6962b29r3j5J2L60J80j23k93K60J9l20L40m27N70k18Kk07K9K80j10j65P3R4j59
6985a40J00J00j55m8M10n4l65J86k49K49L0k02j12J64o1L22k65kM1m3K9R9q1J12
7009F5J27l83L27J1j19j95L74k11j65K60o2J07l00K03J84n6N2j77LN1J06nk94
7032i7J06J00J45k67o5J55Q4l1l39M29j41J2j54l0L51n73M41k03Lj65M13k59J25
7055D0j53J6r4K62k4j57l56N56p3j18J25Q0K12j56k14K03j10k11L62r8j11k4m4
7078h7k8J72k64K93K67j99k07K93l94K85j46k4J3j4l9o0j8K61k82K42k40N2K06
$$ plain form
7101 82 -165 -73 -298 247 15 -111 -31 -182 -79 312 165 28 -345 71 55 171 -265 -18 208 -187 -93 -57
7123 -57 -11 61 96 78 -299 159 260 -107 -1 -82 87 -241 90 -91 -6 -21 198 9 -226 74 86 88 336 83
7147 83 66 -177 -9 84 55 -165 211 45 -509 -76 -51 89 207 73 -42 54 -218 85 14 123 189 -100 -149
7170 -149 116 66 339 -28 -81 153 183 -93 6 222 38 96 165 31 109 198 -131 -21 70 -109 170 -139 -86
7193 -86 40 -226 48 50 -53 35 -98 67 89 24 204 -185 1 -38 93 -239 -230 -49 62 82 -253 21 168
7216 168 -44 -103 9 -164 -298 -158 -134 -113 -133 -210 -175 -27 96 153 -9 58 163 -8 -134 60 -316 -127 -100
7239 -100 -189 227 -115 1 100 287 -121 -135 193 26 -7 77 346 78 160 197 -42 34 107 -7 -135 67 -307
7262 -307 -19 1 -113 -280 -42 -12 -58 13 299 177 43 -25 237 -57 -62 -146 -60 -59 -24 -139 153 -74 -224 126
$$ packed form
7101H2k47R2k25N45k32j26Q0j51J03L91j47j37l73M16j6J16m36K47K26l95R4L6
7123e7M6P2L5j8l77M58J01l67J06q1J69l28L31j81Q5j5K19j89k35L00J2KK48k53
7147H3j7k43J68R3k9k20L76j66n54M33K5J40J18j34j15R6k72L03p1J09O6k89m9
7170a49K65n0K73l67n3K34L0k76R9K16j84N8O9j34P8Q9l29J10R1j79K79l09N3
7193h6J26k66K74Kj03Q8j33J65K2o5J80l89J86l9J31l32RJ81J11K0l35K74J47
7216A68k12n9J12j73j34J40K4K1k0p7L5J48J23N7j62O7J05j71j26J94l76J89K7
7239a00q9M16l42J16R9J87m08j4L28j67l3Q4K69k68Q2L7k39P6P3j14j28K02l74
7262c07K88K0j14j67K38L0m6P1K86j22j34o8K62k94nq4Q6JL5j15K92k27j50L50
$$ plain form
7286 126 233 130 -59 16 233 48 86 -53 133 -71 11 217 -15 -8 -47 48 -58 211 290 -83 135 144 -38
7309 -38 69 45 -89 -228 -142 76 -50 189 -184 -136 -76 129 24 27 -277 49 -94 -26 241 160 -133 -43 42 -47
7333 -47 44 73 71 -228 50 403 67 -262 142 76 -133 -118 112 -255 -44 27 119 -31 96 -143 37 -10 264
7356 264 -169 -46 170 52 -233 301 -249 9 84 -211 7 -37 46 -31 81 -335 -89 125 260 -104 18
7377 18 171 425 151 5 -49 138 14 -49 -34 37 20 -53 98 239 -77 289 -121 -65 259 -23 -48 135 134 -95
7401 -95 151 -10 108 184 -64 108 196 -32 -94 118 -125 -29 76 22 -26 -46 36 -55 -58 -150 -14 -224 -253 -173 -163
7426 -163 -26 -6 -7 118 42 -55 -175 -189 -225 -43 -123 -14 21 -140 44 235 60 139 203 -263 207 -107 -297 -249
7450 -249 -53 -18 -92 122 -11 283 -309 -1 239 127 -8 -144 272 -130 346 -147 -101 37 240 9 106
$$ packed form
7286A26J07j03j89P5K17j85L8j39J86k04Q2K06k32Pl9R5j06K69P9l73K18Rj82
7309c8J07k4j34j39Q6K18j26K39l73M8O0K05j05Ll04L26j43O8K67q1k93R0Q5q9
7333d7R1K9kk99K78L53l36l29M04o6k09J5K30l67K11P1R2j50J27k39J80m7K74
7356B64m33J23K16j18k85N34n50K58P5k95K18m4Q3p7J12m16K46K14J35l64J22
7377A8J53K54k74j46n4J87j24o3J5P1j7p3J51J41l16L66m10N6L24k82k5J83jk29
7401i5K46j61J18P6k48J72Q8k28o2K12k43R6J05n4m8k0Q2r1lr2J36k10k9Q0J0
7426a63J37K0jJ25p6r7j20j4l6J82q0J09L5j61J84J91j75P9O4m66M70l14j90M8
7450b49J96L5p4K14j33K94n92L08K40j12j35j36M16m02M76m93M6J38K03k31R7
$$ plain form
7471 106 20 -154 159 -58 -179 -326 316 247 -85 208 -84 55 -204 179 -41 -118 561 236 208 183 16 -55
7493 -55 101 200 210 -258 -54 -2 58 316 -372 -11 -195 139 190 27 12 -78 408 -31 74 -42 62 380 -200
7516 -200 -62 44 -236 -155 -35 42 -122 10 117 10 -59 4 -405 29 -117 -79 -89 -110 -5 98 183 -14 -62
7539 -62 58 80 264 -164 -98 -30 -23 6 -4 -44 164 -345 -101 -279 181 -71 155 -279 -198 -320 311 49 -271
7562 -271 -57 89 -185 -180 22 9 -87 -155 -53 -158 212 -87 -100 238 -29 -37 -167 4 -150 3 170 38 -52
7585 -52 427 -215 -74 -137 184 167 -104 -129 32 73 -19 -320 -220 -9 66 305 127 102 -214 159 173 177 52 -207
7609 -207 121 -77 176 -137 -35 -294 27 306 195 -301 -178 165 -158 -230 68 -9 -105 -27 29 -224 34 366
7631 366 -69 -2 -47 -17 -7 12 -71 31 48 10 44 38 -92 73 186 68 -200 26 -144 -204 41 44 -150 28 -207
$$ packed form
7471A06q6j74L13k17j21j47O42o9l32K93k92J39k59L83k20p7O79l25k8k5j67p1
7493e5J56R9J0m68K04N2O0K58o88L61j84L34N1j63j5r0M86m39J05j16J04L18n80
7516b00J38J06k80Q1J20P7j64J32J07j07o9O3m09M34j46L8j0k1J05J03Q5j97m8
7539f2J20K2J84m28O6O8PK9j0m0K08n09K44j78M60k52K26m34Q1j22O31k62l20
7562b71K14J46k74NK02j3r6o8J02j05L70k99j3L38k67qj30J71j54J53J67j32r0
7585e2M79o42J41o3L21j7k71k5J61M1r2l01J00K11P5K39j78k5l16L73J4Mj25k59
7609b07L28j98K53l13J02k59L21K79j11m96J23L43l23p2K98p7r6P8N6k53K58L32
7631C66m35O7m5L0J0J9q3J02J7l8L4oj30J65J13j18k68K26j70o0K45Lj94J78k35
$$ plain form
7656 -207 -35 247 -93 -180 28 127 -19 -236 213 128 289 133 -120 287 -203 236 -208 -92 256 11 92
7677 92 5 164 -166 -318 -167 111 86 199 118 35 90 -66 324 131 -339 67 53 -176 104 84 -30 255 -126
7700 -126 -66 -169 107 -190 1 160 -130 167 113 146 -68 -45 90 -151 82 57 161 86 274 27 -42 84
7722 84 231 -104 133 40 80 152 257 -164 -249 -151 29 12 -120 138 75 89 -187 228 -202 13 -54 120 207 -106
7746 -106 -127 -64 113 -169 -112 60 -206 -41 -209 4 -28 -166 -70 460 -130 -86 -78 24 -185 -179 203 20 -5 261
7770 261 195 98 37 115 -85 -120 -99 -157 132 201 -128 94 206 52 150 214 154 308 13 81 -31 -198 -245 -300 -86
7795 -86 34 108 -232 -19 16 118 -51 274 -6 -248 -55 26 51 -258 -298 -85 93 77 -186 194 -86 -97 -52
7818 -52 -56 -64 61 16 4 -196 -165 -97 -234 327 -5 92 58 -253 139 284 -236 -73 -65 105 103 149 -64 -95 47 93
$$ packed form
7656b07J72K82l40q7K08R9j46k17M49q5J61j56k53M07m90M39m44J16L48k45Q1
7677I2q7J59l30j52J51K78k5J13q1q3N5j56L90j93m70M06j4k29K80k0j14K85l81
7700a26O0j03K76k97J91J59k90K97n4L3k14K3J35k41K33k5J04p5J88k47o9J26
7722H4J47l35K37r3M0P2J05m21q5R8J80j7j32K58o3J4k76M15m30K15o7J74Q7l13
7746a06k1O3J77k82N7J72k66J65j68K13l2j38R6N30n90M4QJ02k09OL82j83k5K66
7770B61o6r7o1P8k00l5K1n8K89O9l29K22J12j54R8O4o0J54k95O8j12j67m7n5K14
7795h6J20P4l40K13L5J02j69L25k80k42J93Q1K5l09m0K13J78j6k63L80k80j1M5
7818e2mqJ25m5j2k00L1O8j37N61l32R7l4l11L92J45n20J63QJ70kM6k13l1J42M6
$$ plain form
7844 93 50 -73 92 -156 57 166 102 -137 5 90 26 27 163 114 -134 -53 -98 -119 17 -75 -156 386 280 99
7868 99 39 36 -330 63 261 178 -157 -310 225 -102 286 -189 31 66 26 36 -73 29 -35 30 168 -125 -68 114
7892 114 407 82 -25 -66 203 166 20 368 -69 146 -95 317 197 -57 -167 293 71 -12 -98 -119 -67 -341
7914 -341 115 225 -61 -311 312 -147 23 -288 -152 131 28 -337 -421 -113 141 173 -49 -32 -362 -15 71
7935 71 96 -150 -278 -42 -115 -157 -149 -219 -244 24 -106 -82 -20 76 205 -124 -191 -29 167 219 142 88 -9 96 343
7960 343 251 193 147 46 -177 238 236 -162 306 -52 -223 -68 39 73 29 98 16 -32 87 272 -27 211 71
7983 71 275 -100 0 -82 -42 -84 -181 397 -140 -217 172 -62 75 188 -104 -196 149 38 -11 -399 -18 136 -23
8006 -23 -65 61 -268 106 -13 99 137 124 -42 -45 167 -229 1 198 -127 87 -368 265 128 -405 -415 -137
$$ packed form
7844I3m3j23J65k48K13J09o4k39J42Q5o4JJ36m9k48Q1m5k1J36r2q1N42j06j81
7868I9o0ll66L93J98q3l35j53N35l27L88m75K20L5m0J0j09J02o4O5J38k93N7J82
7892A14K93l25j07m1K69l7j46L48m37K15k41M12j20k54j10M60k22q3q6k1N2k74
7914c41M56J10k86k50O23m59J70l11J36K83j03l65q4L08K54L2k22J7l30L47Q6
7935G1K5k46j28K36p3m2Qp0k5K68j30K4O2R6J29l29o7J62J96N2p7n4r7J05K47
7960C43r2n8m6j01k23M15kl98M68l58j71J55J07L4m4O9q2m8J19J85k99K38j40
7983G1K04l75J00q2M0m2r7N78n37p7L89k34J37J13k92r2L45j11m9l88L81J54j59
8006b3m2J26l29L74j19J12L8j3j66lK12l96K30J97l25K14m55O33j37n33j0K78
$$ plain form
8028 -137 16 -92 84 -16 19 -256 -122 -85 149 -277 -100 -39 -45 -115 233 -98 125 -186 179 -109 -99 312
8050 312 192 -64 -333 10 -197 -38 35 -203 83 -205 40 19 -66 -69 -75 159 42 -84 120 119 -119 31 -125
8073 -125 -162 -35 -295 122 -20 339 -204 -44 7 117 127 101 -321 25 -21 361 -40 43 -38 26 -49 19 137
8096 137 161 128 -22 67 -46 169 -172 409 -43 -28 184 -89 220 -3 293 -53 153 172 -99 -225 -115 -81
8118 -81 145 -5 13 -213 209 199 93 -475 -319 203 -221 170 -35 -236 -183 84 188 -76 -433 -22 -240
8139 -240 -98 -195 166 -32 -116 53 -358 26 -91 -181 -251 23 -28 336 -46 -7 238 49 -142 -33 -112 147
8161 147 -185 62 32 166 -129 106 200 -49 41 -61 234 103 8 46 -272 -480 -17 -2 364 -83 48 -74
8183 -74 -34 -249 50 315 106 93 -155 136
$$ packed form
8028a37J53j08J76j00L5k75J34L7K34m26J77O1op0L48l31K23l11L65k88J0M11
8050C12j20k56k69L43k07J59P3k38K86k88K45k1q5loK34j17j26K04jk38J50j56
8073a25l7J27k60M17j42L59n43J60N1J10J0k6m22L46m6L82m01Q3q1O4p5O8J18
8096A37K4l3j50Q9j13K15l41N81m52J5K12k73L09k23K96l46K06J9k71j26J10L4
8118h1K26j50J8k26M22j0j06n68J56N22m24L91k05k01N3K67J04k64l57M11k18
8139b40J42r7L61j98q4J69m11L84j17r0p0K74n1L64l82L9K45j89j91J09p9K59
8161A47l32K47l0J34k95K35R4k49R0j02K95j31r5L8l18k08M63J5L66m47J31j22
8183g4M0k15K99K65k09j3k48K91
8191A36
$$ Imaginary data points
##PAGE= N=2
##DATA TABLE= (X++(I..I)), XYDATA
$$ plain form
0 0 0 0 0 0 0 0 -8 5 -4 8 -8 8 -15 16 -16 24 -28 32 -38 47 -54 61 -71 84 -93 109 -123 139 -160 182 -200
31 -200 226 -253 284 -315 354 -392 436 -484 537 -594 656 -727 803 -893 992 -1101 1227 -1374
49 -1374 1547 -1750 1997 -2300 2691 -3208 3934 -5022 6841 -10444 20382 -104699 -376514 -203840
63 -203840 105831 249262 84218 -114145 -105591 92986 209998 131059 -4209 27618 197231
74 197231 277625 120536 -111601 -147082 74631 295035 255671 -5217 -184678 -93474 142697
85 142697 245427 128809 -41931 -75080 12966 66620 7362 -70533 -50923 45008 82847
96 82847 998 -102467 -86667 54266 177184 158070 32801 -53972 -18817 76720 122927
107 122927 92935 44948 29847 34279 31593 33566 68949 121362 133112 79601 5955 -18127
$$ packed form
0@%%%%%%qJ3rJ2j6J6k3L1l2M0n2O0p0Q5j01J15j32J55j77K02k32K62k99L42l82
31b00M26m79N37n99O69p46Q28r20J021j131J250j383J530j696J885k093K328k601
49a374K921l297L747m297M991n899P142q956J1863j7285L0826j25081k71815J72674
63b03840L09671J43431j65044j98363Q554J98577J17012p8939j35268L1827J69613
74A97231Q0394j57089k32137l5481K21713K20404l9364k60888j79461R1204K36171
85A42697J02730j16618j70740l3149Q8046N3654n9258p7895J9610R5931L7839
96H2847q1849j03465J5800J40933J22918j9114j25269q6773L5155R5537M6207
107A22927k9992m7987j5101M432k686J973L5383N2413J1750n3511p3646k4082
$$ plain form
119 -18127 19466 63837 57355 3407 -52298 -77473 -76352 -66418 -47327 -18777 -5688 -37291 -100881
132 -100881 -134484 -96497 -25981 -5391 -61692 -135725 -152965 -111070 -70937 -66563 -68836 -42011
144 -42011 -8478 -21754 -77597 -97535 -26539 76810 92100 -14947 -133526 -127133 -1506
155 -1506 98473 61324 -50739 -88540 -7249 79287 55675 -39775 -64466 27817 113294 53893
167 53893 -109622 -186769 -73023 106351 135325 -27821 -189170 -153092 39046 159641 76713
178 76713 -89003 -125074 2419 114443 59032 -86692 -121942 13682 155828 122935 -45628
189 -45628 -131511 -8980 191526 238389 81882 -84379 -64961 102558 204840 122478 -30854
200 -30854 -63000 49619 147746 103914 -13873 -42803 57506 152689 112314 -23716 -95249
$$ packed form
119a8127L7593M4371o482n3948n5705k5175J121R934J9091K8550J3089l1603o3590
132a00881l3603L7987P0516K0590n6301p4033j7240M1895M0133M374k273K6825
144d2011L3533j3276n5843j9938P0996J03349J5290j07047j18579O393J25627
155a506R9979l7149j12063l7801Q1291Q6536k3612r5450k4691R2283Q5477n9401
167E3893j63515p7147J13746J79374K8974j63146j61349L6078J92138J20595q2928
178G6713j65716l6071J27493J12024n5411j45724l5250J35624J42146l2893j68563
189d5628q5883J22531K00506M6863j56507j66261J9418J67519J02282q2362j53332
200c0854l2146J12619R8127m3832j17787k8930J00309R5183m0375j36030p1533
$$ plain form
211 -95249 -23441 92359 100839 -13884 -118049 -97864 6427 62920 15487 -58412 -60609 400
223 400 34185 -2931 -53170 -44917 8926 29379 -16922 -75089 -70415 -4802 48791 37093 -14189
236 -14189 -37159 -9363 31627 38092 13086 -5162 -2631 -807 -20466 -42373 -35209 -2496 15617
249 15617 -5153 -41835 -51860 -28308 -1965 76 -17041 -33262 -43783 -55363 -65433 -56498
261 -56498 -28027 -6329 -19922 -55766 -68292 -32485 19215 32540 -952 -31674 -18203 17451
273 17451 19689 -18434 -39618 -576 59591 61154 -6825 -58716 -16840 84102 127264 57076
285 57076 -45937 -59444 29131 103463 65733 -39743 -79727 -4927 84587 67759 -36646
296 -36646 -89067 -10628 105268 108351 -15034 -116637 -70391 65697 120903 23048 -108517
$$ packed form
211i5249P1808J15800Q480j14723j04165K0185J04291N6493m7433p3899k197O1009
223D00L3785l7116n0239Q253N3843K0453m6301n8167M674O5613N3593j1698n1282
236a4189k2970K7796M0990O465k5006j8248K531J824j9659k1907P164L2713J8113
249A5617k0770l6682j0025K3552K6343K041j7117j6221j0521j1580j0070Q935
261e6498K8471K1698j3593l5844j2526L5807N1700J3325l3492l0722J3471L5654
273A7451K238l8123k1184L9042O0167J563o7979n1891M1876J00942M3162p0188
285E7076j03013j3507Q8575P4332l7730j05476l9984P4800Q9514j6828j04405
296c6646n2421P8439J15896L083j23385j01603M6246J36088N5206r7855j31565
$$ plain form
307 -108517 -112266 14302 114371 69273 -53542 -91532 5171 111793 90804 -29358 -94511
318 -94511 -21804 92140 96321 -18014 -107375 -59402 66358 114704 31583 -74348 -71557 30103
330 30103 99789 52408 -48347 -78300 -11160 54958 30889 -49328 -78037 -18005 52336 42644
342 42644 -31730 -71864 -25214 48562 56863 -9152 -66493 -52005 6673 32183 -1584 -42926
354 -42926 -35951 6809 27572 2821 -26798 -14945 26729 43578 10728 -33359 -37205 143
366 143 30403 18925 -13556 -24942 -5950 16033 17680 7581 7478 18295 20810 6601 -9791
379 -9791 -7663 7728 14823 4647 -8289 -7726 1671 4893 1413 5144 19744 26177 7488 -21554
393 -21554 -25257 4374 29619 13492 -30842 -49229 -17259 26381 26176 -16899 -43558 -14268 35761
$$ packed form
307a08517l749J26568J00069m5098j22815l7990R6703J06622k0989j20162o5153
318i4511P2707J13944M181j14335q9361M7973J25760M8346q3121j05931K791J01660
330C0103O9686m7381j00755k9953O7140O6118k4069q0217k8709O0032P0341r692
342D2644p4374m0134M6650P3776Q301o6015n7341J4488N8678K5510l3767m1342
354d2926O975M2760K0763k4751k9619J1853M1674J6849l2850m4087l846L7348
366A43L0260j1478l2481j1386J8992K1983J647j0099j03J0817K515j4209j6392
379i791K128J5391P095j0176j2936N63R397L222l480L731J4600O433j8689k9042
393b1554l703K9631K5245j6127m4334j8387L1970M3640k05m3075k6659K9290N0029
$$ plain form
406 35761 38443 -16426 -61732 -36765 29497 50440 -7393 -75721 -66107 15834 72110 32582
418 32582 -51830 -71353 1587 76586 57612 -32710 -81644 -27378 58120 63293 -21571 -87911
430 -87911 -48714 49610 83398 9233 -78140 -66775 30352 89922 34358 -68454 -92929 -12688
442 -12688 67241 46031 -46166 -90061 -30378 56507 61493 -15692 -70681 -29874 54979 73586
454 73586 2730 -66577 -46622 36360 78993 31611 -40586 -43529 25008 79879 57503 -4196
466 -4196 -22534 23314 69013 52580 -4583 -28846 8469 56013 49654 -3761 -35926 -8992
478 -8992 41092 50477 11088 -26547 -18811 15590 26030 -1355 -31733 -26698 1200 11786 -9082
491 -9082 -33399 -26683 3448 21660 8052 -15272 -19008 -1281 12984 7870 -6062 -9843 -1593
$$ packed form
406C5761K682n4869m5306K4967O6262K0943n7833o8328R614Q1941N6276l9528
418C2582q4412j9523P2940P4999j8974r0322m8934N4266Q5498N173q4864o6340
430h7911L9197R8324L3788p4165q7373J1365R7127N9570n5564j02812k4475Q0241
442a2688P9929k1210r2197m3895N9683Q6885M986p7185n4989M0807Q4853J8607
454G3586p0856o9307J9955Q2982M2633m7382p2197k943O8537N4871k2376o1699
466d196j8338M5848M5699j6433n7163k4263L7315M7544o359n3415l2165K6934
478h992N0084R385l9389l7635P736L4401J0440k7385l0378N035K7898J0586k0868
491i082k4317O716L0131J8212j3608k3324l736J7727J4265n114j3932l781Q250
$$ plain form
504 -1593 3698 -483 -3951 2427 11582 11049 1152 -3040 4332 10045 7 -16510 -20290 -7388 -230
519 -230 -15526 -39416 -40566 -14250 6268 -9216 -44785 -54469 -23006 10540 85 -45566 -69947
532 -69947 -39746 8661 14302 -31092 -66674 -40985 19690 43564 1789 -47509 -35668 28516
544 28516 66110 27615 -37789 -45296 18621 75203 53391 -18822 -48855 3835 74052 75051 6175
557 6175 -44396 -13747 56039 71851 10145 -53008 -38625 32872 67087 18979 -51498 -53887
569 -53887 15379 69811 42452 -30156 -54922 -3071 57185 50370 -12347 -48476 -11751 49992
581 49992 58332 5597 -35617 -8560 54730 75736 29895 -22507 -15072 39612 69785 37219
593 37219 -15693 -23637 17583 50810 31778 -13714 -27297 5377 38765 26435 -17713 -41047
$$ packed form
504a593N291m181l468O378R155n33r897m192P372N713j0038j6517l780J2902P158
519b30j5296k3890j150K6316K0518j5484l5569r684L1463L3546j0455m5651k4381
532f9947L0201M8407N641m5394l5582K5689O0675K3874m1775m9298J1841O4184
544B8516L7594l8495o5404p507O3917N6582k1812p2213l0033N2690P0217R99o8876
557F175n0571L0649O9786J5812o1706o3153J4383P1497L4215m8108p0477k389
569e3887O9266N4432k7359p2608k4766N1851O0256o815o2717l6129L6725O1743
581D9992Q340n2735m1214K7057O3290K1006m5841n2402P435N4684L0173l2566
593C7219n2912p944M1220L3227j9032m5492j3583L2674L3388j2330m4148k3334
$$ plain form
605 -41047 -18367 15222 12564 -25950 -53219 -39623 -7762 -243 -25015 -47335 -38543 -11748 -2591
618 -2591 -19386 -37771 -33624 -14312 -4994 -15197 -28773 -26558 -11745 -2313 -5716 -12015 -8802 1084
632 1084 4656 202 -2880 1288 5302 -202 -9683 -9609 1236 6426 -4841 -20027 -17504 1925 12601
647 12601 -1687 -25249 -27779 -5723 11286 -1774 -31955 -40199 -13284 15404 8643 -26356 -42048
660 -42048 -11604 31684 35712 -3647 -33703 -12069 37815 54054 17686 -22792 -12220 38900
672 38900 67635 38303 -9728 -11504 40103 80569 58019 -1210 -22618 20302 70833 61561
684 61561 696 -37423 -8241 47434 55073 2564 -42779 -25417 30210 49867 5758 -47713
696 -47713 -44607 9544 43257 12604 -45055 -56453 -7253 39199 26224 -26156 -47418 -8830
$$ packed form
605d1047K2680L3589k658l8514k7269J3596L1861P519k4772k2320Q792K6795R157
618b591j6795j8385M147J9312R318j0203j3576K215J4813R432l403o299L213R886
632A084L572m454l082M168M014n504r481P4J0845N190j1267j5186K523J9429J0676
647A2601j4288k3562k530K2056J7009j3060l0181q244K6915K8688o761l4999j5692
660d2048L0444M3288M028l9359l0056K1634M9884J6239l6368m0478J0572N1120
672C8900K8735k9332m8031j776N1607M0466k2550n9229k1408M2920N0531r272
684F1561o0865l8119K9182N5675P639n2509m5343J7362N5627J9657m4109n3471
696d7713L106N4151L3713l0653n7659j1398M9200M6452j2975n2380k1262L8588
$$ plain form
708 -8830 40209 38090 -9069 -39252 -12853 34117 41559 949 -35481 -22549 22022 40752 11082
721 11082 -28683 -28399 8510 30977 9194 -30484 -39290 -11630 12734 -1334 -36473 -49598 -27107
734 -27107 -1296 -4560 -31250 -45184 -29717 -5747 -3427 -22785 -37487 -28089 -7467 -519 -13183
747 -13183 -24886 -18102 -374 8010 1236 -4537 1316 11818 14265 7485 4799 10714 16125 12663
761 12663 4712 4960 12999 17347 10354 1834 4497 15928 19458 7030 -8100 -6620 10650 20152
775 20152 5839 -17499 -20387 2631 22013 12019 -15041 -21120 4434 29991 22108 -9300 -22452
788 -22452 2012 34265 33775 -25 -24080 -5046 34377 46525 15601 -17694 -8865 32414 52752
801 52752 24214 -17600 -19359 20401 48100 25347 -21640 -34135 2534 39552 28610 -18210
$$ packed form
708h830M9039k119m7159l0183K6399M6970P442m0610l6430J2932M4571J8730k9670
721A1082l9765K84L6909K2467k1783l9678q806K7660K4364j4068l5139j3125K2491
734b7107K5811l264k6690j3934J5467K3970K320j9358j4702R398K0622O948j2664
747a3183j1703O784J7728Q384o774n773N853J0502K447o780k686N915N411l462
761A2663p951K48Q039M348o993q520K663J1431L530j2428j5130J480J7270R502
775B0152j4313k3338k888K3018J9382r994k7060o079K5554K5557p883l1408j3152
788b2452K4464L2253m90l3800k4055J9034L9423J2148l0924l3295Q829M1279K0338
801E2752k8538m1814j759L9760K7699k2753m6987j2495L6669L7018j0942m6820
$$ plain form
813 -18210 -42314 -14581 27500 28987 -14910 -48735 -31181 13166 25708 -11865 -51268 -41710
825 -41710 5260 29246 773 -42055 -42882 -326 30622 12632 -29596 -41532 -7803 27894
837 27894 20619 -18655 -38841 -12524 26505 29856 -5304 -32082 -16456 20109 30517 1312
849 1312 -28489 -22400 9544 23318 2346 -26754 -26549 468 19254 7324 -18890 -25601 -6410
862 -6410 13257 8379 -13184 -23067 -9677 8101 7548 -8241 -15816 -5051 10606 11568 711 -5308
876 -5308 1415 12004 12770 5943 2477 6598 11018 9463 4539 4927 11591 15338 10099 2489 4130
891 4130 13007 15977 6854 -3845 -1828 9682 13881 983 -13799 -10144 8203 17004 3349 -16407
905 -16407 -16254 4659 18995 7731 -16395 -22068 -1562 19325 11938 -15374 -26615 -5316 23227
$$ packed form
813a8210k4104K7733M2081J487m3897l3825J7554M4347J2542l7573l9403R558
825d1710M6970K3986k8473m2828q27M2556L0948j7990m2228j1936L3729L5697
837B7894p275l9274k0186K6317L9029L351l5160k6778J5626L6565J0408k9205
849A312k9801O089L1944J3774k0972k9100K05K7017J8786j1930k6214o711J9191
862f410J9667m878k1563r883J3390J7778n53j5789p575J0765J5657R62j0857o019
876e308O723J0589P66o827l466M121M420j555m924L88O664L747n239p610J641
891D130Q877K970r123j0699K017J1510M199j2898j4782L655J8347Q801j3655j9756
905a6407J53K0913J4336j1264k4126n673K0506K0887p387k7312j1241K1299K8543
$$ plain form
918 23227 21733 -7680 -27364 -9892 23252 28998 -633 -27984 -18175 16687 30121 4463 -27505
931 -27505 -24427 10106 32751 13274 -23814 -30996 1313 31205 19293 -20015 -36940 -10357
943 -10357 24851 22228 -14509 -37514 -16861 20998 27847 -4585 -33782 -22070 14673 30192
955 30192 5030 -28303 -27571 6238 29514 12608 -21479 -27748 2137 29572 20368 -12710 -26252
968 -26252 -3186 26077 23731 -5775 -24594 -10232 17459 23018 360 -19919 -12112 13127 23037
981 23037 5734 -16023 -14054 7901 20187 7613 -13616 -15964 1086 14235 7186 -8820 -12734
994 -12734 -694 10309 6543 -6102 -9794 -1732 6455 4164 -5467 -9593 -3784 2703 1038 -4927
1008 -4927 -6521 -786 3534 -660 -6099 -3729 3842 5403 -2541 -8862 -5408 5236 6986 -2669 -10371
$$ packed form
918B3227j494k9413j9684J7472L3144N746k9631k7351R809L4862J3434k5658l1968
931b7505L078L4533K2645j9477l7088p182L2309K9892j1912l9308j6925K6583
943a0357L5208k623l6737k3005K0653L7859O849l2432k9197J1712L6743J5519
955C0192k5162l3333P32L3809K3276j6906l4087o269K9885K7435r204l3078j3542
968b6252K3066K9263k346k9506j8819J4362K7691N559k2658k0279P807K5239R910
981B3037j7303k1757J969K1955J2286j2574k1229k348J7050J3149p049j6006l914
994a2734J2040J1003l766j2645l692Q062Q187k291r631m126N809O487j665n965
1008d927j594N735M320m194n439K370P571J561p944o321L454J0644J750r655p702
$$ plain form
1023 -10371 -4695 8422 11693 296 -11164 -6532 9456 16209 3450 -13774 -12964 5592 18267
1036 18267 6858 -14217 -16524 3284 20817 11808 -12460 -20286 -773 20721 16298 -9968 -24320
1049 -24320 -8120 18269 20970 -3681 -24072 -12376 16871 27440 4955 -21060 -16304 14356
1061 14356 31277 12040 -18324 -20643 8419 31568 19448 -12570 -21420 2994 30163 24836
1073 24836 -6032 -23132 -4853 24682 26373 -2938 -26710 -14773 16042 25324 1061 -26008
1085 -26008 -21489 7608 22631 4998 -23159 -25186 -157 18238 6651 -20221 -27817 -7433
1097 -7433 14909 11356 -12724 -25194 -10300 13016 15235 -5106 -19491 -10164 10190 15181 -514
1110 -514 -15890 -10937 6888 14539 3055 -11573 -10490 2854 11522 4096 -8448 -10891 -1534 5708
$$ packed form
1023a0371N676J3117L271j1397j1460M632J5988O753j2759j7224Q10J8556J2675
1036A8267j1409k1075k307J9808J7533r009k4268p826J9513K1494m423k6266j4352
1049b4320J6200K6389K701k4651k0391J1696K9247J0569k2485k6015M756L0660
1061A4356J6921j9237l0364k319K9062K3149j2120l2018q850K4414K7169n327
1073B4836l0868j7100J8279K9535J691k9311k3772J1937L0815R282k4263k7069
1085b6008M519K9097J5023j7633k8157k027K5029J8395j1587k6872p596K0384
1097g433K2342l553k4080j2470J4894K3316K219k0341j4385R327K0354M991j5695
1110e14j5376M953J7825P651j1484j4628J083J3344Q668p426j2544k443R357P242
$$ plain form
1124 5708 299 -9972 -11619 -4017 1749 -2048 -9433 -9900 -3309 868 -2852 -7678 -6141 -206 1682
1139 1682 -3275 -6884 -2262 5216 6838 578 -3906 2104 12394 14203 5125 -2057 4145 16292
1153 16292 18852 6220 -4439 639 16337 21486 7989 -7161 -3936 13416 22012 9022 -9530
1166 -9530 -11032 6760 19485 8788 -12978 -18776 -1121 17685 12089 -11407 -22715 -6591 16745
1179 16745 16808 -6156 -22142 -10135 14978 20874 -106 -20411 -12884 13355 25571 7735 -15836
1192 -15836 -15536 9062 27114 14334 -12367 -19399 2027 22511 15355 -11795 -23675 -6980 16057
1205 16057 14652 -10344 -27604 -15763 8728 13098 -8285 -28368 -22808 300 10394 -5493
1217 -5493 -26486 -25351 -3688 11026 562 -20476 -23439 -4140 12928 7443 -11859 -19053 -4214
$$ packed form
1124E708n409j0271j647P602N766l797p385m67O591M177l720m826J537N935J888
1139A682m957l609M622P478J622o260m484O010J0290J809r078p182O202J2147
1153A6292K560j2632j0659N078J5698N149j3497j5150L225J7352Q596j2990j8552
1166i530j502J7792J2725j0697k1766n798J7655J8806n596k3496j1308J6124K3336
1179A6745O3k2964j5986J2007K5113N896k0980k0305P527K6239J2216j7836k3571
1192a5836L00K4598J8052j2780k6701p032K1426K0484p156k7150j1880J6695K3037
1205A6057j405k4996j7260J1841K4491M370k1383k0083N560K3108J0094j5887
1217e493k0993J135K1663J4714j0464k1038k963J9299J7068n485j9302p194J4839
$$ plain form
1230 -4214 13341 12480 -4148 -13270 -2979 13307 15714 2679 -8390 -2413 11807 15689 4934
1243 4934 -6272 -4283 6754 11376 3747 -5815 -5094 3438 7094 2015 -5271 -5172 1866 5083 784
1258 784 -4803 -4165 1532 3354 -148 -3243 -250 5485 6243 1489 -892 4232 11360 10852 3909 451
1274 451 5741 14345 13745 4572 -1390 4749 15651 15933 4148 -5056 751 13610 16633 3345 -10284
1289 -10284 -7291 7725 13935 1390 -15227 -14899 1070 11293 1722 -17515 -20891 -4194 11121
1302 11121 4700 -15738 -23976 -9076 10239 8950 -11035 -23496 -11179 10409 14793 -4092 -20541
1315 -20541 -12171 10794 19155 2481 -17342 -14430 7065 19925 7468 -14370 -17929 1362 17898
1328 17898 9965 -12118 -20417 -4489 14217 10850 -10644 -23300 -11536 8601 10564 -8101 -22566
$$ packed form
1230d214J7555q61j6628r122J0291J6286K407j3035j1069N977J4220L882j0755
1243D934j1206J989J1037M622p629r562P21Q532L656n079p286R9P038L217m299
1258G84n587O38N697J822l502l095K993N735P58m754k381N124P128n08o943l458
1274D51N290Q604o00r173n962O139J0902K82j1785r204N807J2859L023j3288j3629
1289a0284K993J5016O210j2545j6617L28J5969J0223r571j9237l376J6697J5315
1302A1121o421k0438q238J4900J9315j289j9985j2461J2317K1588M384j8885j6449
1315b0541Q370K2965Q361j6674j9823K912K1495J2860j2457k1838l559J9291J6536
1328A7898p933k2083q299J5928J8706l367k1494j2656J1764K0137J963j8665j4465
$$ plain form
1341 -22566 -15307 4818 11640 -2871 -18290 -14994 3437 13548 3254 -12600 -13180 3193 15917
1354 15917 9369 -5675 -9308 3997 16768 14013 951 -5186 4044 16292 15518 3132 -4365
1367 -4365 1630 12223 13359 3759 -4059 -971 7945 9739 2338 -4460 -2829 4094 5118 -608 -5896
1382 -5896 -4082 1577 2872 -1969 -5338 -2986 1984 2224 -1606 -3888 -126 4590 3731 -2050 -3734
1397 -3734 1346 7867 5976 -1998 -4686 2157 9545 7603 -1467 -6416 262 9371 8097 -3203 -10509
1412 -10509 -4758 6910 8437 -3538 -13807 -9749 3653 8591 -2263 -15820 -14061 961 9490
1425 9490 -199 -16034 -17358 -1758 10572 4474 -12835 -17884 -3907 11463 9769 -7360 -16396
1438 -16396 -5165 12228 13618 -2321 -15115 -7262 11087 16664 2445 -13365 -9920 8779 18221
$$ packed form
1341b2566P259K0125O822j4511j5419L296J8431J0111j0294j5854n80J6373J2724
1354A5917o548j5044l633J3305J2771k755j3062o137R230J2248p74j2386p497
1367d365N995J0593J136r600p818L088Q916J794p401o798J631O923J024n726n288
1382e896J814N659J295m841l369K352M970K40l830k282L762M716q59n781j684
1397c734N080O521j891p974k688O843P388j942r070m949O678R109j274j1300p306
1412a0509N751J1668J527j1975j0269M058J3402M938j0854j3557J759J5022Q529
1425I490r689j5835j324J5600J2330o098j7309n049J3977J5370j694j7129r036
1438a6396J1231J7393J390j5939j2794P853J8349N577j4219j5810L445J8699R442
$$ plain form
1451 18221 6591 -11362 -11876 4939 16626 8354 -9483 -14158 60 14316 10351 -6926 -15406
1464 -15406 -4153 11832 12046 -3748 -14548 -6625 9006 12888 -577 -13039 -8280 7101 13142
1477 13142 2732 -10036 -8817 4986 12700 5979 -6577 -8592 2275 11596 7653 -3863 -8175
1490 -8175 49 9398 7507 -2630 -7403 -1204 7548 6672 -1624 -6104 -2446 4031 4708 -1346 -5732
1505 -5732 -2893 2080 2757 -1594 -5427 -2845 1735 2327 -1864 -4598 -1719 2432 1608 -3483 -5089 -542
1521 -542 3696 1508 -4111 -5213 568 5253 2728 -4105 -5964 692 6775 4700 -3531 -7048 -711
1536 -711 7831 6922 -2591 -8216 -2132 8931 10110 -873 -9461 -3878 8293 11573 823 -9908
1550 -9908 -6613 6206 12365 2959 -9583 -8987 4045 12700 6260 -7924 -12216 -275 12375 8321
$$ packed form
1451A8221j1630j7953n14J6815J1687q272j7837m675J4218J4256l965j7277q480
1464a5406J1253J5985K14j5794j0800P923J5631L882j3465j2462M759J5381O041
1477A3142j0410j2768J219J3803P714o721j2556k015J0867R321l943j1516m312
1490h175Q224R349j891j0137m773O199Q752q76q296m480L658O477O77o054m386
1505e732K839M973O77m351l833K582M580N92m191k734K879M151q24n091j606M547
1521e42M238k188n619j102N781M685k525o833j859O656O083k075q231l517O337
1536g11Q542r09r513n625O084J1063J179j0983q588N583J2171L280j0750j0731
1550i908L295J2819O159r406j2542N96J3032Q655o440j4184m292J1941J2650m054
$$ plain form
1564 8321 -6988 -14409 -3515 10768 9946 -5160 -14645 -5937 8969 11418 -2075 -13629 -8365
1577 -8365 6469 12263 2065 -11510 -10629 3611 13109 5714 -9471 -11470 1506 12940 7739
1590 7739 -6676 -12290 -1326 10728 8585 -5135 -12593 -4798 7297 8116 -3194 -12235 -7326 4497
1604 4497 7942 -1250 -11708 -9873 1227 7346 92 -10243 -9957 -275 6534 2024 -6830 -7784 -38
1619 -38 6383 3897 -3486 -5612 664 7289 5921 41 -2971 1353 7041 6662 1471 -893 2563 7186
1635 7186 6194 1387 -651 2738 5836 3814 -471 -1616 1888 4388 2180 -2432 -2965 1359 3663
1650 3663 1131 -3868 -4608 371 4556 1713 -4229 -5604 365 6371 3647 -3773 -5648 1481 8538
1665 8538 6588 -2438 -5662 713 9177 8946 -457 -6132 -1319 8082 10214 987 -7723 -4555 5513
$$ packed form
1564H321j5309p421J0894J4283q22j5106r485Q708J4906K449j3493j1554N264
1577h365J4834N794j0198j3575Q81J4240R498p395j5185j999J2976J1434n201
1590G739j4415n614J0964J2054k143j3720p458P795J2095Q19j1310r041M909J1823
1604D497L445r192j0458J835J1100O119p254j0335K86R682O809m510q854r54P746
1619c8O421k486p383k126O276O625j368n880l012M324N688l79n191k364L456M623
1635G186r92m807k038L389L098k022m285j145L504K500k208m612n33M324K304
1650C663k532m999p40M979M185k843n942j375N969O006k724p420j875P129P057
1665H538j950r026l224O375Q464k31r403n675M813R401K132r227q710L168J0068
$$ plain form
1680 5513 10330 1166 -9998 -9142 2043 8576 604 -11817 -13474 -2311 6340 1261 -11661 -15150
1694 -15150 -5786 4708 2773 -9551 -15704 -7861 4855 6196 -5076 -14553 -8737 5431 9310
1707 9310 -698 -10986 -7645 5691 11720 3390 -7782 -7077 4388 12460 6600 -5198 -7737 1637
1721 1637 10970 7973 -3273 -8847 -1542 8501 7911 -2989 -9516 -4380 5321 6584 -2677 -9619
1735 -9619 -6458 2950 5848 -557 -7651 -5846 1994 6662 2801 -4066 -3730 3224 8179 5366 -350
1750 -350 -1082 4718 10109 7982 2032 1430 5970 9671 7692 3035 1778 5207 7632 5041 1324 -3
1766 -3 2777 4557 2446 -1949 -3087 -306 1997 -866 -5083 -5859 -1865 626 -2288 -7624 -7609 -2300
1782 -2300 1077 -2076 -7642 -7015 -967 3217 457 -5808 -6460 14 5472 3728 -3686 -6276 -73
$$ packed form
1680E513M817r164j1164Q56J1185O533p972j2421j657J1163Q651n079j2922l489
1694a5150R364J0494j935j2324o153P843J2716J341j1272r477N816J4168L879
1707I310j0008j0288L341J3336O029q330j1172P05J1465Q072n860j1798k539R374
1721A637R333k997j1246n574P305J0043n90j0900o527N136R701J263r261o942
1735i619L161R408K898o405p094J805P840M668l861o867L36O954M955k813n716
1750c50p32N800N391k127n950o02M540L701j979m657j257L429K425k591l717j327
1766cK780J780k111m395j138K781K303k863m217p76L994K491k914n336J5N309
1782b300L377l153n566O27O048M184k760o265o52O474N458j744p414k590O203
$$ plain form
1797 -73 7084 6494 -1815 -6564 -1530 7012 7408 -1658 -8110 -4474 4368 6518 -2081 -10527 -8340 1004
1813 1004 5066 -1867 -11505 -11727 -2321 4438 -514 -10660 -12951 -3844 5228 2565 -7561 -12036 -3456
1828 -3456 6740 6817 -2958 -8638 -1986 8503 11028 2456 -5202 -1691 8945 13097 5703 -3326 -2211
1843 -2211 7849 13665 7440 -2807 -3911 4756 11169 6953 -3005 -6000 823 7765 5640 -2917
1857 -2917 -7687 -2556 4626 4804 -2673 -7565 -4455 3346 5257 -885 -6218 -3907 3434 6081 1459
1872 1459 -3843 -2020 3975 6729 3313 -1191 -397 4224 7085 4217 -46 -415 2958 5252 3168
1887 3168 -884 -1574 1677 3141 671 -3025 -3444 -443 1036 -1849 -5259 -5455 -2198 -904 -3585 -7310
1903 -7310 -6597 -2864 -942 -3518 -6973 -6309 -1694 860 -1731 -5806 -5582 -558 3773 1225 -4066 -4856
$$ packed form
1797g3P157n90q309m749N034Q542L96r066o452L636Q842K150q599q446K187R344
1813A004M062o933r638k22R406O759m952j0146k291R107R072k663j0126m475Q580
1828c456J0196P7r775n680O652J0489K525q572p658L511J0636M152p394r029J115
1843b211J0060N816o225j0247j104Q667O413m216r958k995O823O942k125q557
1857b917m770N131P182J78p477m892L110P801J911o142n333K311P341K647m622
1872A459n302J823N995K754l416m504P94M621K861k868m263l69L373K294k084
1887C168m052o90L251J464k470l696m19L001J479k885l410j96L257J294k681l725
1903g310P13L733J922k576l455O64M615K554k591m075K24N024M331k548n291p90
$$ plain form
1919 -4856 1563 6465 3558 -2717 -4592 1643 7330 5807 -1671 -4753 54 6846 6265 -1141 -6068
1934 -6068 -2409 5296 6645 -795 -7543 -5012 3044 6354 -141 -8316 -7170 1579 6462 1403 -7117
1949 -7117 -7407 756 6850 3889 -4598 -7021 86 7979 6830 -1834 -6001 -214 8500 9044 1282
1964 1282 -4789 -734 7915 9999 2698 -4417 -2237 6220 9182 3099 -4372 -4375 2605 7278 3092 -4596
1980 -4596 -5840 -504 5453 2714 -4383 -7203 -2317 3762 2670 -3990 -7384 -3070 2854 3019 -2491
1995 -2491 -6249 -2871 2125 3446 -823 -4450 -2769 2291 3703 693 -2909 -1981 2156 3936 1006
2010 1006 -2156 -1511 1820 3464 1123 -2221 -1807 1559 2367 -252 -2933 -2237 830 1546 -760 -3457
2026 -3457 -2270 669 1618 -1256 -4065 -2576 1017 2196 -1096 -3768 -3115 1650 3258 540 -3797
$$ packed form
1919d856O419M902k907o275j875O235N687j523p478l082M807O792n81p406m927
1934f068L659P705J349p440o748K531Q056L310o495q175J146Q749M883n059q520
1949g117k90Q163O094k961q487k423P107P893j149q664m167N787Q714N44p762
1964A282o071M055Q649K084p301p115K180Q457K962o083p471lO980M673m186p688
1980d596j244N336N957k739p097k820M886O079j092o660l394M314N924J65n510
1995b491l758L378M996J321m269l627J681N060J412l010l602R28M137J780k930
2010A006l162O45L331J644k341l344M14L366Q08k619k681O96L067P16k306k697
2026c457J187K939R49k874k809J489L593J179l292k672O53M765J608k718m337
$$ plain form
2041 -3797 -3032 2192 4655 1692 -3122 -3045 2075 5726 2793 -2664 -3802 1036 6160 4087 -2019 -4460
2057 -4460 -11 5416 4756 -1200 -5191 -1371 4792 5394 -750 -5817 -2937 3987 5309 167 -5859
2072 -5859 -4112 2270 5877 1068 -5478 -5368 1479 5252 2021 -5163 -6415 164 5305 2900 -3756
2087 -3756 -6409 -1314 4888 4340 -2412 -6347 -2206 4541 5253 -921 -5722 -2917 3847 5630 582
2102 582 -4991 -3629 3069 6366 1705 -4217 -3871 1768 5784 3165 -2937 -4142 713 5096 3352
2117 3352 -2161 -4224 -661 4069 3383 -1440 -4152 -1353 2820 2726 -1028 -4092 -1565 2220 2689 -320
2133 -320 -2979 -1541 1636 2420 483 -1997 -948 1934 2830 652 -1380 28 2674 2824 668 -1042
2149 -1042 81 2834 3205 624 -1627 8 2846 2739 -98 -2704 -1491 2147 2732 -1004 -3943 -2907
$$ packed form
2041c797P65N224K463k963m814P7N120L651k933n457j138M838N124k073o106k441
2057d460M449N427o60n956l991L820O163O02o144n067K880O924J322n142o026
2072e859J747O382L607m809o546J10O847L773l231p184j252O579N141k405o656
2087c756k653N095O202n48o752l935M141O747P12o174m801K805O764J783n048
2102E82n573J362O698L297m661n922L46N639M016k619o102j205M855M383j744
2117C352n513k063L563M730o86m823k712K799M173r4l754l064K527L785M69l009
2133c20k659J438L177P84j937k480J049K882Q96k178k032J408K646J50k156j710
2149a042J123K753L71k581k251J635K838j07k837k606J213L638N85l736k939J036
$$ plain form
2165 -2907 1293 2267 -1039 -5149 -4518 85 2088 -1147 -5494 -5312 -658 2618 -268 -4771 -5495 -907
2181 -907 3321 1922 -3488 -4945 -452 4264 3607 -1937 -4243 -667 4447 4462 -306 -3650 -1014 3918
2197 3918 4831 224 -4061 -2285 2998 4705 440 -4254 -4172 1401 4046 640 -5092 -5248 -67 3823
2213 3823 865 -4781 -5769 -675 3655 2065 -3546 -5011 -748 4244 4200 -941 -3756 -575 5000 6244
2229 6244 1447 -2723 -270 5395 7540 2913 -1443 -635 4771 7107 3784 -1223 -1816 2642 5785
2244 5785 3110 -1678 -3251 106 3320 1989 -2040 -4199 -2088 1280 836 -2411 -4717 -2780 45
2259 45 206 -2201 -3894 -1992 384 914 -1353 -2238 -493 1606 1392 -230 -912 709 2328 2480 -15
2276 -15 -725 653 3146 2503 -475 -2189 217 2722 2034 -1203 -3640 -1764 1405 1400 -2395 -5555 -3782
$$ packed form
2165b907M200R74l306m110O31M603K003l235m347J82M654L276k886m503p24M588
2181i07M228j399n410j457M493M716o57n544k306L576N114J5m768l344K636M932
2197C918R13m607m285J776N283J707m265m694Q2N573K645l406n732j56N181L890
2213C823k958n646r88N094M330j590n611j465M263M992m4n141k815L181N575J244
2229F244m797m170K453N665K145m627m356Q08N406K336l323n007n93M458L143
2244E785k675m788j573L357L214j331m029k159K111L368m44l247k306J937K825
2259D5J61k407j693J902K376N30k267q85J745K099k14j622o82J621J619J52k495
2276a5p10J378K493o43k978j714K406K505o88l237k437J876L169nl795l160J773
$$ plain form
2293 -3782 -216 616 -2769 -5991 -5193 -1215 702 -1744 -5709 -5122 -1061 2229 433 -3612 -4333 127
2309 127 3567 2583 -1366 -2419 1325 4956 4024 578 -1226 1644 5400 5077 1608 -1140 993 4783
2325 4783 4732 1276 -2271 -201 3431 3807 -33 -3856 -2097 1969 3320 -693 -4385 -3406 528 2656
2341 2656 -191 -4284 -4292 460 3698 1407 -3304 -4043 455 4746 3667 -1129 -3116 786 5933 5713
2357 5713 568 -2239 337 5068 5583 1774 -1753 -557 3386 4954 2183 -2224 -2329 1267 3272
2372 3272 1192 -3227 -4679 -1376 1083 -242 -4049 -5048 -2938 -484 -1129 -3913 -4517 -2888 -884 -959
2388 -959 -2529 -2792 -1548 26 77 -985 -1584 7 1939 1501 -658 -788 1723 3558 2406 -325 -630
2405 -630 1823 3694 2339 -774 -1527 649 2940 1986 -1392 -3311 -1548 1790 1606 -1928 -4573 -3238
$$ packed form
2293c782L566Q32l385l222P98L978J917k446l965N87M061L290j796m045p21M460
2309A27L440r84l949j053L744L631r32l446j804K870L756l23l469k748K133L790
2325D783n1l456l547K070L632L76l840l823J759M066J351m013l692R79L934K128
2341B656k847m093qM752L238k291m711p39M498M291j079m796j987L902N147k20
2357E713n145k807K576M731N15l809l527J196L943J568k771m407j05L596K005
2372C272k080m419j452L303K459j325l807r99K110K454o45k784o04J629K004p5
2388i59j570k63J244J574N1j062n99J591J932m38k159j30K511J835j152k731l05
2405f30K453J871j355l113p53K176K291r54l378j919J763L338j84l534k645J335
$$ plain form
2421 -3238 592 1581 -1597 -4966 -3352 415 2202 -465 -3731 -3116 840 3205 1251 -1835 -1645 1374
2437 1374 4158 2996 459 -429 2238 5195 4397 1505 38 2144 4486 4034 598 -980 1306 3566
2453 3566 3172 -230 -2237 -555 2342 1599 -1478 -3413 -2082 901 1452 -1936 -4869 -3693 645 2264
2469 2264 -1181 -4614 -3713 852 3019 484 -3489 -3402 976 4285 2455 -1782 -2810 691 4304 4057
2485 4057 -75 -2547 -553 3876 4307 484 -2827 -2010 2222 3441 489 -3019 -2832 262 1815 -493
2501 -493 -3366 -3939 -1406 239 -674 -2748 -3530 -2051 -369 -637 -2305 -2490 -1165 432 -4 -1503 -1275
2518 -1275 10 1522 293 -859 -98 1645 2709 1264 -631 -31 2179 3159 1737 -580 -822 1733
2534 1733 3601 2347 -1135 -2198 284 3017 2323 -1402 -3176 -1003 1711 1729 -1338 -3842 -2195 1456
$$ packed form
2421c238L830R89l178l369J614L767J787k667l266O15L956K365j954l086J90L019
2437A374K784j162k537q88K667K957p98k892j467K106K342m52l436j578K286K260
2453C566l94l402k007J682K897p43l077j935J331K983N51l388k933J176M338J619
2469B264l445l433R01M565K167k535l973Q7M378L309j830m237j028L501L613k47
2485D057m132k472J994M429M31l823l311Q17M232J219k952l508J87L094J553k308
2501d93k873n73K533J645r13k074p82J479J682k68j668j85J325J597m36j499K28
2518a275J285J512j229j152P61J743J064j445j895O00K210R80j422k317k42K555
2534A733J868j254l482j063K482K733o94l725j774K173K714J8l067k504J647L651
$$ plain form
2550 1456 2214 -725 -3408 -2397 405 2398 433 -2297 -2226 768 2912 1412 -1248 -1713 869 3027
2566 3027 1957 -495 -935 1340 2840 1963 -471 -1014 1056 2515 1251 -750 -1337 347 2154 993
2582 993 -1509 -2539 -764 1800 958 -2193 -3570 -962 1491 1179 -2240 -3947 -1793 1661 2039 -1308
2598 -1308 -3543 -2506 1453 2589 477 -3240 -2955 1281 3492 2094 -1990 -2883 404 3730 2980 -1215
2614 -1215 -3069 -387 2739 2943 -121 -2699 -1237 1833 2761 516 -2029 -1870 662 1894 548 -1869
2630 -1869 -1937 -322 944 113 -1612 -1156 -61 804 -276 -976 -711 364 712 -392 -966 -389 962
2647 962 1403 -195 -1295 -731 1423 1998 335 -1624 -1276 1715 2822 600 -1702 -1749 1199 3140 1136
2664 1136 -1932 -2123 584 2396 1350 -1470 -2630 -1007 1884 1896 -760 -2947 -1658 1358 2155 352
$$ packed form
2550A456P58k939k683J011K802J993j965k730P1K994K144j500k660m65K582K158
2566C027j070k452m40K275J500q77k434n43K070J459j264k001n87J684J807j161
2582I93k502j030J775K564q42l151j377K608K453l12l419j707K154L454L78l347
2598a308k235J037L959J136k112l717K85M236K211j398m084q93L287L326p50m195
2614a215j854K682L126K04l064k578J462L070R28k245k545J59K532J232j346k417
2630a869o8J615J266q31j725M56J095Q65j080p00K65J075L48j104n74N77J351
2647I62M41j598j100N64K154N75j663j959L48K991J107k222k302m7K948J941k004
2664A136l068j91K707J812j046k820j160J623K891J2k656k187J289L016P97j803
$$ plain form
2680 352 -2226 -1888 958 2090 421 -1705 -1804 527 1937 402 -1540 -1431 47 1553 999 -747
2696 -747 -1103 120 1341 682 -903 -1216 440 1609 578 -1348 -1120 1077 2230 565 -1532 -1715
2712 -1715 706 2611 1180 -1586 -2328 229 2482 1976 -1051 -2605 -902 2215 2372 -726 -3019 -1932
2728 -1932 1467 3029 188 -2766 -2572 935 2883 1055 -2319 -2875 83 2362 1611 -1471 -2440 -413
2744 -413 1789 2168 -388 -1600 -726 1269 2289 183 -1413 -916 1057 1672 302 -646 -603 640 1172
2761 1172 -303 -533 -505 572 311 -241 -1045 -537 680 463 -574 -1528 -880 491 917 -1280 -2393 -789
2779 -789 942 1520 -744 -2107 -1563 925 2137 520 -2015 -1723 816 2729 1268 -1344 -1773 168
2795 168 2672 1590 -706 -1813 185 2463 2563 -174 -2097 -584 1416 2045 8 -1866 -877 645
$$ packed form
2680C52k578L38K846J132j669k126r9K331J410j535j942J09J478J506n54j746
2696g47l56J223J221o59j585l13J656J169j031j926K28K197J153j665k097j83
2712a715K421J905j431k766p42K557K253n06l027j554J703L117J57l098k293J087
2728a932L399J562k841k954J94L507J948j828l374n56K958K279p51l082r69K027
2744d13K202L79k556j212Q74J995J020k106j596M97J973O15j370r48M3J243N32
2761A172j475k30K8J077k61n52q04N08J217k17j037r54O48J371M26k197j113J604
2779g89J731N78k264j363N44K488J212j617k535K92K539J913j461k612m29J941
2795A68K504j082k296j107J998K278J00k737j923J513K000O29k037j874R89J522
$$ plain form
2811 645 1440 135 -1964 -1287 14 820 41 -1206 -1394 66 854 -313 -1521 -914 627 930 15
2828 15 -535 -271 1227 1459 58 -656 -198 1859 2107 753 -862 -963 1121 2890 1590 -915 -1743
2845 -1743 472 2467 1589 -1175 -2021 -476 1937 1693 -985 -2946 -1807 928 1631 -437 -2892 -2489
2861 -2489 201 1558 -19 -2340 -2899 -319 1236 1199 -1355 -1812 -468 1568 1469 -361 -1001 -71 1546
2878 1546 1925 405 -498 28 1169 1192 303 -436 131 1124 671 -95 -583 278 595 157 -945 -1063 -589
2897 -589 660 170 -1551 -2048 -606 504 616 -1771 -2233 -1218 1104 1236 -883 -1688 -1283 1005 1826
2914 1826 554 -1149 -1150 1100 2647 1628 -643 -1188 736 2717 2061 -215 -997 39 2054 1880 -316
2931 -316 -1185 -376 1363 997 -133 -1611 -1157 140 411 -638 -1608 -1214 -532 -301 -735 -1468 -1088 -86
$$ packed form
2811F45P95j305k099O77J301Q06p79j247j88J460P88j167j208O07J541L03r15
2828A5n50K64J498K32j401p14M58K057K48j354j615j01K084J769j300k505q28
2845a743K215J995q78k764q46J545K413k44k678j961J139K735P03k068k455M03
2861b489K690J357j577k321n59K580J555l7k554m57J344K036r9j830o40R30J617
2878A546L79j520r03N26J141K3q89p39N67R93m53p66m88Q61L17m38j102j18M74
2897e89J249m90j721m97J442J110J12k387m62J015K322J32k119q05M05K288Q21
2914A826j272j703jK250J547j019k271n45J924J981o56k276p82J036K015j74k196
2931c16q69Q09J739l66j130j478M54J297K71j049r70L94O82K31m34p33L80J002
$$ plain form
2949 -86 100 -546 -1306 -512 679 962 -107 -982 -105 1243 1613 171 -650 -66 1824 2468 738 -923
2967 -923 -765 1134 2213 827 -1083 -1428 298 2085 1025 -1290 -2228 -648 1343 826 -1305 -2678
2983 -2678 -1388 574 1278 -807 -2375 -2138 9 1356 -160 -1584 -1977 247 1306 686 -752 -995
2999 -995 422 1427 1501 499 -152 551 1433 1180 172 -326 912 1268 724 337 -554 261 1045 452 -744
3018 -744 -878 -131 826 102 -1066 -1435 -545 933 19 -1644 -1865 -609 699 304 -1204 -1850 -777 1201
3036 1201 1355 -236 -1757 -648 1350 1531 561 -841 -646 1362 2123 1242 -590 -769 932 1995 1329
3053 1329 -50 -670 257 1276 1055 -275 -925 -381 396 350 -609 -1261 -718 208 219 -795 -1523 -1045 258
3072 258 140 -858 -1326 -502 334 376 -470 -1146 -185 1053 768 -306 -763 164 1142 1682 508 -347 -385 1243
$$ packed form
2949h6J86o46p60P94J191K83j069q75Q77J348L70j442q21N84J890O44j730j661
2967i23J58J899J079j386j910l45J726J787j060k315r38J580J991n17k131j373
2983b678J290J962P04k085j568K37K147J347j516j424l93K224J059o20j438k43
2999i95J417J005P4j002o51P03Q82k53j008m98J238L56n44l87q91Q15P84n93j196
3018g44j34P47R57p24j168l69Q90J478r14j663k21J256J308l95j508o46J073J978
3036A201J54j591j521J109J998J81r70j402J95K008P61q81j832j79J701J063o66
3053A329j379o20R27J019k21j330o50N44P77m6r59o52N43R26J1j014p28M78J303
3072B58j18r98m68Q24Q36M2q46o76R61J238k85j074m57R27R78N40j174q55l8J628
$$ plain form
3092 1243 1947 591 -669 -1064 826 1963 735 -999 -1213 368 1014 489 -1261 -1861 -539 645
3108 645 893 -1033 -1898 -1220 347 1050 -561 -2033 -939 447 1092 -335 -1101 -836 647 1386 215
3125 215 -276 -506 808 1317 715 -268 -581 618 1469 442 180 -183 472 1015 687 -925 -451 110 908
3144 908 100 -1090 -971 40 580 73 -1005 -1137 -424 422 519 -963 -1120 -669 859 585 -703 -1448
3162 -1448 -746 1064 1135 126 -1319 -616 1100 1305 264 -649 -461 712 1472 808 -761 -457 687
3179 687 1152 740 -638 -819 90 897 980 -718 -1033 -390 643 124 -689 -1098 -276 543 37 -1086 -904
3198 -904 -135 496 207 -532 -792 -362 595 692 -108 -845 30 979 1318 20 -1017 -201 1505 1074 12
3217 12 -742 -302 974 1173 287 -927 -562 371 1030 316 -892 -1208 287 1087 459 -714 -1065 -79 614
$$ packed form
3092A243P04j356j260l95J890J137j228j734k14J581O46n25j750o00J322J184
3108F45K48j926q65O78J567P03j611j472J094J386O45j427p66K65J483P39j171
3125B15m91k30J314N09o02r83l13J199Q51j027k62l63O55N43l28j612M74N61P98
3144I08q08j190J19J011N40n07j078j32P13Q46R7j482j57M51J528k74j288p45
3162a448P02J810P1j009j445P03J716K05j041r13J88J173P60o64j569L04J144
3179F87M65m12j378j81R09Q07Q3j698l15O43J033n19q13m09Q22Q19n06j123J82
3198i04P69O31k89p39k60M30R57R7q00p37Q75R49L39j298j037Q16J706m31j062
3217A2p54M40J276J99q86j214L65R33O59p14j208l16J495Q00o28j173l51R86O93
$$ plain form
3236 614 573 -838 -1371 -412 710 748 -495 -1075 -543 630 765 143 -919 -494 622 712 396 -350 -54
3255 -54 431 972 485 -100 -45 583 748 162 -752 -320 425 711 155 -563 -354 190 634 -159 -696 -549 89
3276 89 665 231 -533 -794 -14 619 544 -806 -1011 -84 845 782 -616 -840 -47 954 813 -325 -1013 -206
3296 -206 580 841 256 -783 -594 455 1246 369 -422 -680 459 1063 287 -692 -467 161 773 193 -309
3315 -309 -570 227 487 365 -75 -474 -83 287 591 -497 -934 -27 611 433 -336 -945 -416 879 297
3334 297 -441 -653 -188 583 803 170 -584 -307 1056 840 -88 -878 -508 514 877 252 -1122 -698 355
3353 355 1079 172 -938 -745 591 762 317 -303 -727 284 584 560 -254 -653 -124 474 593 -264 -826
3372 -826 -24 595 494 -234 -970 -221 651 570 -487 -642 -53 537 426 -419 -582 -244 662 290 284 -446 -517
$$ packed form
3236F14m1j411n33R59J122L8j243n80N32J173J35o22j062M25J116R0l16p46K96
3255e4M85N41m87n85N5O28J65n86r14M32P45K86n56p18K09N44M44p93n37J47O38
3276H9N76m34p64k61P80O33p5j350k05R27R29o3j398k24P93J001j41j138o88Q07
3296b06P86K61n85j039J89J049P91q77p91k58J139O04p76r79K25O28O12n80n02
3315c09k61P97K60j22m40l99L91L70L04j088m37R07O38j78p69o09N29J295n82
3334B97p38k12M65P71K20o33p54K77J363k16r28p90L70J022L63o25j374M24J053
3353C55P24r07j110J93J336J71m45o20m24J011L00k4q14l99N29N98J19q57n62
3372h26Q02O19j01p28p36P49Q72q1j057j55N89N90j11q45j63L38R06l72op30p1
$$ plain form
3393 -517 707 696 102 -556 -915 161 889 165 -855 -609 429 679 162 -585 -570 317 957 -106 -584
3412 -584 -728 -189 402 350 -661 -888 -265 654 655 -509 -987 -345 890 154 -364 -710 -175 635 619 -472
3432 -472 -586 -204 200 696 155 -488 -538 164 711 136 -194 -297 585 787 302 -692 -476 310 835 307
3452 307 -725 -407 -61 795 359 -456 -555 -208 447 338 -664 -692 -347 599 420 -626 -914 -428 609
3471 609 360 -67 -742 3 821 607 -115 -208 -68 746 782 350 -422 -70 295 798 1 -418 -278 198 844
3492 844 142 -567 -631 -6 584 53 -215 -445 -297 522 42 -509 -850 -379 163 401 -226 -649 -355 329
3512 329 339 -310 -520 -166 553 372 -111 -500 -319 636 770 285 -300 -39 552 385 164 -239 -506 376
3532 376 835 378 -391 -556 90 765 -7 -468 -829 58 352 116 -511 -834 -31 452 195 -201 -649 -220
$$ packed form
3393e17J224j1n94o58l59J076P28p24j020K46J038K50n17p47J5Q87O40j063m78
3412e84j44N39N91n2j011k27O23R19Jj164m78O42J235p36n18l46N35Q10j6j091
3432d72j14L82M04M96n41o43n0P02N47n75l30j03Q82K02m85r94K16P86N25n28
3452C07j032L18L46Q56m36q15r9L47O55j09j002k8L45R46j79j046k88M86J037
3471F09k49m27o75P45Q18k14p22r3J40Q14L6m32p72L52L65N03p97m19J40M76O46
3492H44p02p09o4O25N90n31k68k30J48Q19m80n51l41M71N42K38o27m23K94O84
3512C29J0o49k10L54P19j81m83l89J81R55J34m85n85K61N91j67k21m03k67Q82
3532C76M59m57p69j65O46O75p72m61l61Q87K94k36o27l23Q03M83k57l96m48M29
$$ plain form
3552 -220 156 156 -399 -689 -388 446 526 45 -502 -192 532 693 30 -384 -140 591 589 183 -553 -121 431 575
3574 575 653 -193 -412 207 770 -9 -273 -379 -74 329 122 -252 -783 -7 414 3 -536 -701 -363 425
3594 425 189 -319 -519 -86 201 568 -36 -597 -11 652 425 -106 -684 23 177 416 -249 -232 -245 395 631
3615 631 244 -255 -425 265 638 -83 -992 -484 195 471 29 -437 -564 -203 180 80 -378 -580 -332 205
3635 205 237 -327 -354 -108 292 420 -284 -290 -371 389 516 -147 -491 -29 704 560 -39 -303 48 515 810 423
3657 423 -233 -444 381 616 233 -622 -430 421 188 186 -556 -335 -136 506 -227 -190 -303 24 583 -66 -505
3678 -505 -441 -331 265 245 -392 -239 -27 577 438 -226 -285 -195 613 670 -16 -204 -143 413 677 -59 -592 -229
3700 -229 261 372 184 -397 -73 271 286 31 -458 -436 36 253 12 -384 -398 -318 382 -112 -543 -492 -146 -75
$$ packed form
3552b20L76%n55k90L01Q34Q0m81n47L10P24J61o63m14K44P31km06p36M32N52J44
3574E75P8q46k19O19N63p79k64j06L05M03k07l74n31P76M21m11n39j65L38P88
3594D25k36n08k00M33K87L67o04n61N86O63k27n31n78P07J54K39o65J7j3O40K36
3615F31l87m99j70O90L73p21r09N08O79K76m42m66j27L61L83j00m58k02K48N37
3635B05L2n64k7K46M00J28p04oq1P60J27o63l44M62P33j44n99k64L51M67K95l87
3657D23o56k11Q25K35l83q55J92Q51k33kp42K21J99O42p33L7j13L27N59o49m39
3678e05O4J10N96k0o37J53K12O04j39o64n9R0Q08N7o86j88O1N56K64p36n33L63
3700b29M90J11j88n81L24L44J5k55m89K2M72K17k41l96j4Q0P00m94m31N1L46P1
$$ plain form
3722 -75 164 -325 -392 54 357 318 -295 -253 138 199 80 -90 -328 -88 527 787 -3 -177 -108 82 520 157
3744 157 -324 -197 340 272 -279 -545 -412 159 529 -63 -484 -381 -15 294 23 -120 -226 143 292 498
3764 498 -199 -539 -24 486 214 12 -209 -108 571 289 -355 -714 -264 161 390 -115 -186 -161 371 496 -42
3785 -42 -451 86 282 439 90 -506 -331 300 225 43 -350 -326 213 431 100 -577 -344 -71 60 222 -228
3806 -228 -277 -33 141 -64 -272 -336 -100 732 43 -295 -535 -79 282 69 -210 -482 72 356 456 -146 -248
3827 -248 217 127 653 53 -347 -133 235 543 -73 -545 -197 -175 205 114 -148 -152 -192 432 252 -535 -313 303
3849 303 228 317 -279 -387 -314 127 187 -373 -254 108 268 408 -225 -396 97 304 122 180 -226 79 236 -8
3871 -8 -183 -609 -221 -113 270 13 -342 -91 156 364 9 31 -385 293 195 -320 -358 -163 -122 503 497 -370 -207
$$ packed form
3722g5K39m89o7M46L03l9o13M2L91O1j19j70k38K40O15K60p90j74O9J90M38l63
3744A57m81J27N37o8n51k66J33N71L70n92m21J03L66L09k71j43j06L69J49K06
3764D98o97l40N15N10k72k02k21J01O79k82o44l59M50M25K29n05p1K5N32J25n38
3785d2m09N37J96J57l49n96J75O31p5j82l93K4N39K18l31o77K33K73J31J62m50
3806b28m9K44J74k05k08o4K36Q32o89l38k40M56L61k13k79k72N54K84J00o02j02
3827b48M65r0N26o00m00K14L68L08o16m72L48K2L80r1k62mm0O24j80p87K22O16
3849C03p5Q9n96j08P3M41O0n60J19L62J60J40o33j71M93K07j82N8m06L05J57k44
3871hj75m26L88J08L83k57l55K51K47K08l55K2m16O78r8n15l8J95M1O25oq67J63
$$ plain form
3894 -207 -86 73 -49 -305 -355 87 409 441 -461 -154 -321 108 175 -97 -246 -131 294 311 -165 -142 -137 187
3916 187 358 -276 -3 -226 146 221 211 -68 -403 95 441 -12 -123 -200 122 345 264 -128 -78 -94 -82 179
3938 179 -164 -355 -11 201 127 -356 -602 264 238 361 -156 -349 23 303 563 55 -440 -34 232 357 -36
3959 -36 -226 -363 387 -1 -133 -144 -88 282 455 142 27 -116 138 321 229 -274 -428 22 356 71 -96
3980 -96 -80 214 112 -140 -202 -412 -43 -78 -180 37 -331 -503 340 372 -408 -129 -166 83 298 -75 -401 182
4002 182 272 9 -34 -109 74 206 -4 -359 -109 167 -45 422 153 -225 36 71 35 44 -457 -400 52 31 -28
4025 -28 -204 -189 28 81 -13 -265 -102 -13 95 -31 152 -42 121 174 314 -192 -360 268 592 311 179 22
4047 22 209 344 281 129 -244 134 389 133 17 -86 -47 -107 52 -252 -330 -209 -20 226 24 -141 -52 28
$$ packed form
3894b07J21J59j22k56n0M42L22L2r02L07j67M29O7k72j49J15M25J7m76K3NL24
3916A87J71o34K73k23L72P5j0k79l35M98L46m53j11p7L22K23q1l92N0j6J2K61
3938A79l43j91L44K12p4m83k46Q66k6J23n17j93L72K80K60n08m95M06K66J25l93
3959c6j90j37P50l88j32j1N6L70J73l13j15j43K54J83r2n03j54M50L34k85j67
3980i6J6K94j02k52o2k10L69l5j02K17l68j72Q43L2p80K79l7K49K15l73l26N83
4002A82R0k63m3p5J83J32k10l55K50K76k12M67k69l78K61L5l6Rn01N7M52k1n9
4025b8j76J5K17N3r4k52J63Q9J08j26J83j94J63N3J40n06j68O28L24k81j32j57
4047B2J87J35o3j52l73L78K55k56j16j03L9o0J59l04p8J21J89K46k02j65Q9Q0
$$ plain form
4069 28 98 216 -349 -87 -111 104 48 -303 -235 188 208 6 -132 23 178 266 321 -192 -171 -177 281 419 60 -288
4093 -288 27 526 310 -46 29 -303 63 268 -59 -114 -291 -175 -12 -154 -390 -322 -344 -90 -56 -382 59 20
4115 20 338 57 -78 -64 78 239 65 17 -191 131 200 327 -373 -318 96 44 311 2 -244 163 186 208 109
4138 109 -125 -125 -31 -218 -14 -258 -160 -12 94 54 -122 -94 -288 127 121 -195 -176 -3 195 -12 -23 16 -21 451
4162 451 -140 54 -150 -75 306 -125 12 -338 258 -119 152 7 -171 -359 340 583 -114 -122 -263 -15 95
4183 95 -246 -394 -394 -108 379 -165 -29 -96 47 54 -207 -248 -134 -285 -159 -142 -201 -112 -21 -153 -125 -373 27 -130
4207 -130 105 153 -190 -361 -102 439 -144 -38 -261 -39 -132 414 -203 -197 4 142 402 -262 -44 63 15 403
4229 403 -203 -180 217 197 124 -177 -394 -65 196 -92 315 -253 -80 279 12 46 -443 -59 0 264 156 -134
$$ packed form
4069B8P0J18n65K62k4K15n6l51O8M23K0k02j38J55J55Q8N5n13K1oM58J38l59l48
4093b88L15M99k16l56P5l32L66K05l27n5j77J16J63j42k36O8k2K54L4l26M41l9
4115B0L18k81j35J4J42J61j74m8k08L22O9J27p00N5M14n2K67l09k46M07K3K2r9
4138A09k34%R4j87K04k44R8J48J06m0j76K8j94M15ol16J9J73J98k07j1L9l7M72
4162D51n91J94k04P5L81m31J37l50N96l77K71j45j78j88O99K43o97qj41K48J10
4183I5l41j48%K86M87n44J36o7J43Pk61m1J14j51J26J7n9Q9R1j32K8k48M00j57
4207a30K35M8l43j71K59N41n83J06k23K22r3N46o17OK01J38K60o64K18J07m8L88
4229D03o06K3L97k0p3l01k17L29K61k88M07n68J73L59k67L4m89L84N9K64j08k90
$$ plain form
4251 -134 201 128 254 310 -457 28 -31 224 235 -60 -17 -60 -53 156 -56 -81 -214 -125 366 -153 -54 205 -267 -58
4275 -58 -243 -67 -231 236 460 -284 154 -241 303 31 122 -394 129 159 181 113 26 -316 173 332 -108 -430
4297 -430 -95 -160 -42 -211 -29 76 -118 198 87 -245 -149 -5 290 203 -117 -125 -41 70 194 -57 -293 -81
4319 -81 32 -305 -171 -62 51 45 -64 160 80 -109 158 164 -137 117 -59 136 379 204 41 56 126 39 -68
4342 -68 -58 -112 -171 45 85 128 -188 -313 308 311 -46 20 129 377 240 -333 85 -125 -92 288 95 -114 -172 203
4366 203 262 -170 -290 153 -229 349 147 -112 -245 137 186 -58 -221 -267 -237 72 51 -128 -160 -308 139 -168
4388 -168 -327 -358 -225 423 -259 -16 37 -80 -206 -270 13 -246 -382 -18 -91 23 32 -8 242 -110 189 33
4410 33 -202 -22 112 -122 -5 -277 -374 297 -25 -18 -140 2 -162 -103 -304 -2 0 104 -47 -127 76 -10 388
$$ packed form
4251a34L35p3J26N6p67M85n9K55J1k95M3m3PK09k12k5j33Q9M91n19R9K59m72K09
4275e8j85J76j64M67K24p44M38l95N44k72R1n16N23L0K2o8q7l42M89J59m40l22
4297d30L35o5J18j69J82J05j94L16j11l32R6J44K95q7l20qQ4J11J24k51k36K12
4319h1J13l37J34J09J13oj09K24q0j89K67Ol01K54j76J95K43j75j63J5P0q7j07
4342f8J0n4n9K16M0M3l16j25O21Ll57O6J09K48j37n73M18k10L3L80j93k09n8L75
4366B03N9m32j20M43l82N78k02k59j33L82M9k44j63m6L0L09k1j79l2j48M47l07
4388a68j59l1J33O48o82K43N3j17j26o4K83k59j36L64p3J14Rm0K50l52K99j56
4410C3k35J80J34k34J17k72r7O71l22Pj22J42j64N9k01L02KJ04j51q0K03q6L98
$$ plain form
4433 388 115 -343 -307 118 204 55 301 -518 227 175 94 0 4 -40 265 108 16 145 -90 79 -173 -134 -472
4456 -472 -39 76 -134 59 -63 -26 -261 -241 -409 -254 -142 130 -24 -300 -115 -239 -144 16 -149 -227 -14
4477 -14 24 176 -24 -40 40 -252 58 -6 -179 -117 -229 -285 -51 -74 -250 15 234 -319 -229 -144 -326 51 -128
4500 -128 140 -305 -333 -9 25 17 -218 168 -72 -79 174 -214 -414 -44 -7 188 -149 63 265 208 192 -6 45
4523 45 137 -26 211 -34 157 84 203 338 -172 258 230 275 -55 75 -370 56 -207 60 8 -81 -95 57 -58
4546 -58 -21 -6 -53 21 79 197 -247 67 12 116 91 -162 11 125 -14 194 237 -514 -66 -18 14 345 -12 -7
4570 -7 111 65 127 -69 -73 360 19 -146 -148 -52 -276 -223 -195 -200 -317 322 -176 -184 -310 -161 -212 153 -181 91 -233
4595 -233 -288 45 -23 -74 -124 -167 36 -15 106 -36 -86 171 110 -26 -13 -68 289 -51 -22 75 -85 148 312 90
$$ packed form
4433C88k73m58L6M25Q6j49K46q19P45n2q1r4Mm4L05j57r2J29k35J69k52L9l38
4456d72M33J15k10J93j22L7k35K0j68J55J12K72j54k76J85j24R5J60j65p8K13
4477a4L8J52k00j6Q0k92L10o4j73O2j12n6K34k3j76K65K19n53R0Q5j82L77j79
4500a28K68m45k8L24L4qk35L86k40pK53l88k00L70L7J95l37K12K02n7j6j98N1
4523D5R2j63K37k45J91p3J19J35n10M30k8M5l30J30m45M26k63K67n2q9j4J52j15
4546e8L7J5m7P4N8J18m44L14n5J04k5k53J73J14j39K08M3p51M48M8L2L31l57N
4570gJ18m6O2j96mM33l41j65kR6k24N3K8nj17O39m98qj26J49n1L65l34K72l24
4595b33n5L33o8n1n0m3K03n1J21j42n0K57o1j36J3n5L57l40K9R7j60K33J64k22
$$ plain form
4619 90 -179 -238 10 -131 40 -136 157 -69 47 197 -105 114 -11 64 -17 -256 106 -15 15 109 166 -88
4641 -88 182 245 483 75 185 269 117 264 -274 -82 188 207 167 155 -90 -18 428 131 -38 -75 -216 71 273
4664 273 147 -359 -97 -27 88 -187 168 -158 42 -111 -133 -218 1 -26 -182 177 160 54 126 79 47 88 211
4687 211 127 -262 144 -361 -30 140 165 279 -194 -149 -55 52 97 100 -322 166 46 24 -127 113 -250 -473 94
$$ packed form
4619I0k69n9K48j41J71j76K93k26J16J50l02K19j25P5q1k39L62j21L0R4N7k54
4641h8K70O3K38m08J10Q4j52J47n38J92K70J9m0j2k45P2M46k97j69l7j41K87K02
4664B73j26n06K62P0J15k75L55l26K00j53k2q5K19k7j56L59j7j06P2m7l2M1J23
4687B11q4l89M06n05L31J70K5J14m73M5R4J07M5Lm22M88j20k2j51K40l63k23N67
$$ [...]
8191a66
##END NTUPLES=NMR FID
##END=
