##TITLE=1H_CA-7777-3-1
 CDCl3, 8 sc, 
 9.1.2019
##JCAMPDX= 6.0         $$ Bruker NMR JCAMP-DX V2.0
##DATA TYPE= NMR FID
##DATA CLASS= NTUPLES
##ORIGIN= UXNMR, Bruker Analytische Messtechnik GmbH
##OWNER= root
$$ XWIN-NMR		Version 3.5
$$ Wed Jan  9 14:04:01 2019 Russian Standard Time (UT+4h)  she@DPX200
##.OBSERVE FREQUENCY= 200.1313
##.OBSERVE NUCLEUS= ^1H
##.DELAY= (6, 6)
##.ACQUISITION MODE= SIMULTANEOUS
##.ACQUISITION SCHEME= undefined
##.AVERAGES= 8
##.DIGITISER RES= 18
##SPECTROMETER/DATA SYSTEM= spect
##.PULSE SEQUENCE= zg30
##.SOLVENT NAME= CDCl3
##.SHIFT REFERENCE= (INTERNAL, CDCl3, 0, 15.7039)
##AUDIT TRAIL= $$ (NUMBER, WHEN, WHO, WHERE, WHAT)
$$ ##TITLE= Audit trail, XWIN-NMR		Version 3.5
$$ ##JCAMPDX= 5.01
$$ ##ORIGIN= Bruker BioSpin GmbH
$$ ##OWNER= she
$$ F:/spectra/data/she/nmr/H-F/1/audita.txt
$$ ##AUDIT TRAIL=  $$ (NUMBER, WHEN, WHO, WHERE, WHAT)
(   1,<2019-01-09 14:02:44.09 +0400>,<she>,<DPX200>,
      <created by zg, POWCHK disabled, PULCHK disabled
       configuration hash MD5:
       00 E9 B6 7A A2 85 ED C7 34 08 36 98 17 FE 4E 26
       data hash MD5: 16K
       70 F9 87 D3 CD 9C 58 EC 12 C9 02 DD 3C 5F 3F B1>)
$$ ##END=
$$ 
$$ hash MD5
$$ E4 06 8B 82 00 35 1A 1A 2E 84 DC 86 0C B1 FD C1
##$RELAX= 
##$RELAX= 
##$RELAX= 
##$RELAX= 
##$RELAX= 
##$RELAX= 
$$ Bruker specific parameters
$$ --------------------------
##$DU= <F:/spectra>
##$EXPNO= 1
##$NAME= <H-F>
##$PROCNO= 1
##$TYPE= <nmr>
##$USER= <she>
##$AMP= (0..31)
100 100 100 100 100 100 100 100 100 100 100 100 100 100 100 100 100 100 
100 100 100 100 100 100 100 100 100 100 100 100 100 100 
##$AQSEQ= 0
##$AQ_mod= 1
##$AUNM= <au_zg>
##$AUTOPOS= <>
##$BF1= 200.13
##$BF2= 200.13
##$BF3= 200.13
##$BF4= 200.13
##$BF5= 200.13
##$BF6= 200.13
##$BF7= 200.13
##$BF8= 200.13
##$BYTORDA= 1
##$CFDGTYP= 0
##$CFRGTYP= 5
##$CHEMSTR= <none>
##$CNST= (0..31)
1 1 145 1 1 1 1 1 1 1 1 1 1 1 1 1 1 1 1 1 1 1 1 1 1 1 1 1 1 1 1 1 
##$CPDPRG= <>
##$CPDPRG1= <>
##$CPDPRG2= <>
##$CPDPRG3= <>
##$CPDPRG4= <mlev>
##$CPDPRG5= <mlev>
##$CPDPRG6= <mlev>
##$CPDPRG7= <mlev>
##$CPDPRG8= <mlev>
##$CPDPRGB= <>
##$CPDPRGT= <>
##$D= (0..31)
0 1.2 0 0 0 0 0 0 0 0 0 0.03 0 0 0 0 0 0 0 0 0 0 0 0 0 0 0 0 0 0 0 0 
##$DATE= 1547028163
##$DBL= (0..7)
120 120 120 120 120 120 120 120 
##$DBP= (0..7)
150 150 150 150 150 150 150 150 
##$DBP07= 0
##$DBPNAM0= <>
##$DBPNAM1= <>
##$DBPNAM2= <>
##$DBPNAM3= <>
##$DBPNAM4= <>
##$DBPNAM5= <>
##$DBPNAM6= <>
##$DBPNAM7= <>
##$DBPOAL= (0..7)
0.5 0.5 0.5 0.5 0.5 0.5 0.5 0.5 
##$DBPOFFS= (0..7)
0 0 0 0 0 0 0 0 
##$DE= 6
##$DECBNUC= <off>
##$DECIM= 24
##$DECNUC= <off>
##$DECSTAT= 4
##$DIGMOD= 1
##$DIGTYP= 9
##$DL= (0..7)
0 120 120 120 120 120 120 120 
##$DP= (0..7)
150 150 150 150 150 150 150 150 
##$DP07= 0
##$DPNAME0= <>
##$DPNAME1= <>
##$DPNAME2= <>
##$DPNAME3= <>
##$DPNAME4= <>
##$DPNAME5= <>
##$DPNAME6= <>
##$DPNAME7= <>
##$DPOAL= (0..7)
0.5 0.5 0.5 0.5 0.5 0.5 0.5 0.5 
##$DPOFFS= (0..7)
0 0 0 0 0 0 0 0 
##$DQDMODE= 0
##$DR= 18
##$DS= 0
##$DSLIST= <SSSSSSSSSSSSSSS>
##$DSPFIRM= 0
$$ [...]
##$SUBNAM2= <"">
##$SUBNAM3= <"">
##$SUBNAM4= <"">
##$SUBNAM5= <"">
##$SUBNAM6= <"">
##$SUBNAM7= <"">
##$SUBNAM8= <"">
##$SUBNAM9= <"">
##$SW= 24.933730806125
##$SWIBOX= (0..15)
0 0 2 0 0 0 0 0 0 0 0 0 0 0 0 0 
##$SW_h= 4990.01996007984
##$TD= 16384
##$TD0= 1
##$TE= 0
##$TE2= 300
##$TE3= 300
##$TEG= 300
##$TL= (0..7)
0 120 120 120 120 120 120 120 
##$TP= (0..7)
150 150 150 150 150 150 150 150 
##$TP07= 0
##$TPNAME0= <>
##$TPNAME1= <>
##$TPNAME2= <>
##$TPNAME3= <>
##$TPNAME4= <>
##$TPNAME5= <>
##$TPNAME6= <>
##$TPNAME7= <>
##$TPOAL= (0..7)
0.5 0.5 0.5 0.5 0.5 0.5 0.5 0.5 
##$TPOFFS= (0..7)
0 0 0 0 0 0 0 0 
##$TUNHIN= 0
##$TUNHOUT= 0
##$TUNXOUT= 0
##$USERA1= <user>
##$USERA2= <user>
##$USERA3= <user>
##$USERA4= <user>
##$USERA5= <user>
##$V9= 5
##$VALIST= <valist>
##$VCLIST= <CCCCCCCCCCCCCCC>
##$VD= 0
##$VDLIST= <DDDDDDDDDDDDDDD>
##$VPLIST= <PPPPPPPPPPPPPPP>
##$VTLIST= <TTTTTTTTTTTTTTT>
##$WBST= 1024
##$WBSW= 4
##$XGAIN= (0..3)
0 0 0 0 
##$XL= 0
##$YL= 0
##$YMAX_a= 174499
##$YMIN_a= -273964
##$ZGOPTNS= <>
##$ZL1= 120
##$ZL2= 120
##$ZL3= 120
##$ZL4= 120
##$ABSF1= 10
##$ABSF2= 0
##$ABSG= 5
##$ABSL= 3
##$ALPHA= 0
##$AQORDER= 0
##$ASSFAC= 0
##$ASSFACI= 0
##$ASSFACX= 0
##$ASSWID= 0
##$AUNMP= <proc_1d>
##$AZFE= 0.1
##$AZFW= 0.1
##$BCFW= 1
##$BC_mod= 2
##$BYTORDP= 1
##$COROFFS= 0
##$CY= 11.3945322036743
##$DATMOD= 1
##$DC= 2
##$DFILT= <>
##$DTYPP= 0
##$F1P= 18.9103706918063
##$F2P= -1.10871071338519
##$FCOR= 0.5
##$FTSIZE= 0
##$FT_mod= 4
##$GAMMA= 1
##$GB= 0.15
##$INTBC= 1
##$INTSCL= 1
##$ISEN= 128
##$LB= 0.24
##$LEV0= 0
##$LPBIN= 0
##$MAXI= 10000
##$MC2= 0
##$MEAN= 0
##$ME_mod= 0
##$MI= 1.114404
##$NCOEF= 0
##$NC_proc= 0
##$NLEV= 6
##$NOISF1= 3.799351
##$NOISF2= 2.8
##$NSP= 1
##$NTH_PI= 0
##$NZP= 0
##$OFFSET= 15.70392
##$PC= 1
##$PHC0= -8856.186
##$PHC1= 17.00007
##$PH_mod= 1
##$PKNL= yes
##$PPARMOD= 0
##$PSCAL= 0
##$PSIGN= 0
##$REVERSE= no
##$SF= 200.130013532006
##$SI= 16384
##$SIGF1= 3
##$SIGF2= 2
##$SINO= 400
##$SIOLD= 16384
##$SREGLST= <1H.CDCl3>
##$SSB= 0
##$STSI= 0
##$STSR= 0
##$SW_p= 3612.71676300578
##$SYMM= 0
##$S_DEV= 0
##$TDeff= 0
##$TDoff= 0
##$TI= <>
##$TILT= no
##$TM1= 0
##$TM2= 0
##$TOPLEV= 0
##$USERP1= <user>
##$USERP2= <user>
##$USERP3= <user>
##$USERP4= <user>
##$USERP5= <user>
##$WDW= 1
##$XDIM= 8192
##$YMAX_p= 0
##$YMIN_p= 0
$$ End of Bruker specific parameters
$$ ---------------------------------
##NTUPLES= NMR FID
##VAR_NAME=  TIME,          FID/REAL,        FID/IMAG
##SYMBOL=    X,             R,               I
##VAR_TYPE=  INDEPENDENT,   DEPENDENT,       DEPENDENT
##VAR_FORM=  AFFN,          ASDF,            ASDF
##VAR_DIM=   8192,          8192,            8192
##UNITS=     SECONDS,       ARBITRARY UNITS, ARBITRARY UNITS
##FACTOR=    0.0002004,     1,               1
##FIRST=     0,             0,               0
##LAST=      1.6414764,     0,               0
##MIN=       0,             -273964,         0
##MAX=       1.6414764,     174499,          0
$$ Real data points
##PAGE= N=1
##DATA TABLE= (X++(R..R)), XYDATA
$$ [...]
2665B62j791J603J413k192j45K412o3l536M2K722j90k495J457K369j749j917J900
2682A02J523k525q05L169P02l168K20K513p21k115M80K556j140k177K176J248
2698B038k887j642L130R38k531l13K622m82k811J191J991j531k051K355K042j992
2714F7j892K495P15k527k6K664J1k191P38K009j572k664K000K231k024j929K722
2731H27J112l072n42K116M92k641P50L114j771k722J583K133j461j746K384J083
2747A639k316n67K819Nl177R15K712l84k790J570J382j563k229K140J204k299
2763i39r57L082J46l187J40K738n78k261J079K512j538k006K586J033k770j139
2779b059L042J101k829n4K293j78k584J241K155j632j969J886J878k436j674J998
$$ y = [262, -1529, 74, 1487, -705, -850, 1562, 1499, -2037, -1995, 727, 537, -1958, -501, 1868, 119, -1798, 102, 1625, -900, -1705, 1464, 2166, -1002, -782, 1731, 1010, -1105, -625, 1931, 791, -1386, 790, 2038, -849, -2491, 639, 1577, -954, -1267, 1355, 873, -1938, -747, 1244, -287, -2338, 17, 2059, 67, -1825, 670, 1385, -1142, -1168, 1496, 1507, -684, 54, 2063, 491, -2173, -173, 2058, 34, -1895, 827, 1939, -1133, -1675, 441, 933, -1708, -958, 2156, 385, -2337, -754, 1379, -82, -1828, 556, 1639, -677, -1244, 1575, 1580, -1597, -682, 2030, 1646, -1144, 426, 1808, 245, -1984, 156, 1360, -939, -1896, 1186, 1332, -1855, -1715, 1023, 445, -1816, -737, 1775, 237, -1769, 817, 1850, -920, -2059, 983, 2084, -745, -799, 1494, 1316, -1268, -27, 2128, 496, -1473, 413, 2291, -145, -1819, 179]
2795A79R81k787l30K619J41k843P10K538j517k181K231K513k082j913K216J457
2811A932k333n38K526r1k806R16K748j309k561J356J510j761j738K691Q64k462
2827a056m72K398j91k917K80L189o93k663J739J961j646k028K233J246k100j01
2843h21K910j07k877j33K448l62k150R25K028j632j899J967J200k740j099K715
2859C73R47k285k0J983o81k534J085K461j414j571K220J670k854j095K356Q26
2875A467k033j52K676p08k323N45J792j469k385K673J773j811j886K030R13k215
2891a113k93K755j34k453R88K453j605k505J228J857j618j001K144R34k655o88
2907a706K440q6k388Q29K998q34k620J079K038j763j267J760J298k472n60K348
$$ y = [179, 1160, -1627, -1957, 662, 803, -2040, -1330, 1208, -309, -2490, -259, 2254, 172, -1741, 475, 1932, -401, -939, 1587, 1496, -1310, -394, 2354, 1045, -1516, -160, 1350, -411, -2149, 542, 1406, -1056, -1528, 870, 679, -2238, -1958, 1231, 538, -2125, -386, 1575, -71, -2099, 134, 1380, -720, -821, 2089, 1982, -895, -1028, 1420, 1058, -1092, -167, 1861, 229, -1670, 297, 1497, -1243, -2342, 373, 1320, -965, -985, 998, 317, -2217, -1132, 1329, -85, -1656, 564, 2234, -620, -1715, 641, 1467, -566, -718, 1958, 1250, -1073, -528, 1264, -205, -2590, 83, 1856, 45, -1841, 189, 1102, -1113, -1406, 1349, 1215, -1238, -250, 2203, 598, -1907, -679, 1178, -440, -1441, 703, 1637, -1018, -1706, 734, 648, -1740, -911, 2087, 1253, -1367, -288, 1750, -13, -1280, 480, 1778, -694, -1254, 1094]
2923A094K36k977Q3K821m45j677J032J712j921j948K139J352k942m35K467N71
2939A162k710l91K781q13k044J233K554j144j848K434J129k386j376K451R91k619
2955e96K18J892j161k544J388K158j677k175K050K215k039j376J974Q95k384K23
2971i39K322K4k685P41K221j396k089J501K118j794j598K143J334k904l99K717
2987A317j0k710P13K437j003k558J129J949j384j529K097J080k227p42L148q6
3003A621k980L22K301j67k082J195J690j991k085K052J240k009j112K366Q71k790
3019a558J05K464p26j846J035K404j422j640K014J577k511j190K533R66k192j78
3035a65K063o57k534N88K002j393k217J926J672k145j405J535P23j437j99K388
$$ y = [1094, 1330, -1647, -1564, 1257, 812, -865, 167, 1879, -42, -1990, 149, 1501, -1441, -1876, 591, 1162, -1548, -1939, 842, 29, -2015, -782, 1772, 628, -1220, 1214, 2343, -43, -1419, 1032, 2023, -596, -378, 1514, 353, -2191, -803, 1355, -322, -2497, -447, 1768, -271, -1647, 327, 1222, -1162, -939, 1383, 1407, -1278, -537, 1684, 288, -1801, -300, 1818, 24, -1574, 569, 1903, -1001, -1400, 1317, 1307, -1403, -690, 1747, 744, -1814, -685, 1264, -120, -1649, 448, 1528, -699, -1441, 1707, 1621, -1359, -1037, 1264, 1097, -985, 210, 1900, -91, -2176, -124, 1116, -893, -2005, 361, 1232, -1558, -1453, 1011, 285, -1561, -526, 1878, 456, -1184, 830, 2407, -104, -1294, 1239, 2205, 13, -165, 1898, 1241, -1293, -705, 1297, -96, -2313, -387, 1285, -860, -2265, -730, -7, -1444, -1643, 745]
3051G45K11k535J121K415j448j910J759K170j485j531J950Q54k666n28K233kk436
3068a083N94K341r21k466N57J596j352j523K040J328k531r23K483N64k645P95
3084a146K277q5j802J153J858j530j756K203J142k334p30K341K82k685k20J815
3100G83j63k360J282J974j773j750J730J500k187r76K285P87k079j44K292o28
3116E73k298P36K751j520j788J929J503j698j536J998R68k028j28K202m91k452
3132a279N45J944j275j869J373K072j556j535K157M25k427K18K504r5k203M29
3148e72K098r91k178J094J603j122j315K207Q42k566o51K375N86k385RK518p34
3165H18k233J215J577j531j188J511J259j832q13J991Q46k980j32K357k69j868
$$ y = [745, 956, -1579, -458, 1957, 509, -1401, 358, 2528, 1043, -488, 1462, 2316, -350, -878, 1355, 1353, -1083, -489, 1852, 931, -1535, -978, 618, -734, -2257, -217, 1111, -1420, -2343, 140, 704, -1941, -1146, 1131, 1046, -756, 397, 2255, 725, -1031, 1172, 2314, -20, -750, 1591, 1873, -812, -1032, 783, 620, -1740, -458, 1516, -257, -2007, -277, 1223, -964, -1940, 345, 1132, -947, -1091, 1201, 573, -1725, -989, 1762, 242, -1546, 383, 1886, 188, -1348, 650, 1618, -410, -538, 1664, 1173, -1279, -734, 1210, -65, -1934, -561, 1511, -45, -1580, 577, 1002, -1425, -1207, 1297, 1202, -1001, -572, 1526, 535, -1643, -549, 1054, -68, -1383, 824, 1666, -900, -1551, 824, 1410, -975, -966, 1552, 818, -1415, -200, 1377, -154, -1342, 169, 1428, -404, -1217, 774, 1620, -1360, -1492, 865, 596, -1272]
3181a272J018J676j656k012K194J314j738o92K146L26j880k61J923n36j880J152
3197a78J928j252j966J330J607j806j412K174O54k076J16K078k78k201N55J995
3213A268o55k013J257J920j717j212J575P40j876n98J972N20k293L37K062o75
3229F12j926R21J729j623j307J957R84k065j000K378M5j854O67J848o83j854P93
3246c78J794j451j228K344P70k073q22J981K77k048j52K037m96k047J113J833
3262A454j612k001J963J205j300j169K061M06k039J2K136l31k008J023J913j135
3278E78j870J545R48j310j299J682Q64j681m5J625l39k068N39J807o06j759J358
3295c1J446j601j323J964L48j703j06K011q4k025R50J623r75j980J428J638j457
$$ y = [-1272, -254, 1422, -234, -2246, -52, 1262, -476, -1168, 978, 1304, -576, -837, 1086, 550, -1330, -178, 1750, 498, -1468, -138, 1469, -337, -1749, 425, 1079, -997, -881, 1197, 919, -1282, -727, 1268, 613, -1400, -143, 1777, 60, -1152, 423, 1163, -713, -1311, 661, 1181, -1112, -775, 1287, 612, -1314, -393, 1336, -287, -1594, 363, 1347, -718, -1718, 660, 705, -1149, -482, 1366, 683, -1171, -378, 1416, -35, -1263, 1081, 1851, -222, -1044, 937, 1214, -834, -986, 1051, 555, -1492, -379, 1454, -158, -2159, -196, 1009, -291, -1460, 601, 1007, -1032, -1020, 1116, 785, -1223, -200, 1713, 578, -1292, 253, 1201, -109, -1408, 274, 1138, -543, -588, 1037, 698, -1370, -831, 976, 370, -1389, -31, 1415, -186, -1509, 455, 803, -900, -1006, 1005, 921, -1104, -154, 1469, 494, -1486, -58, 1580, 123]
3312A23j292J774P82k031o83K230J25k023M52J666n64k084R85J533j207j206J431
3329A1J344j984o26J895O4j846J33K038r2j963Q13J583j152j210J473J078j731
3346a72r03J833Q8j413l46J806m21j806R50J624r99j678J197J134j278j448K346
3363E14P30k047j82K204j80k285Q69J795p99j539J274R73j320j200J763J024k360
3380g66n6J649L70k256K37J772j101j384J227J910j736j004J231J009j638n47
3396a083K052L14k026j3K048p52j586J223J109j396j031J533Q29k262k09J713
3412D63K50j665j08K523j018j427R28J285j320j297J765Q46j944l36J846J5j373
3429e67n42K200n8j770O39J855j492j562J286J493j773p34J770O9j599k08J757
$$ y = [123, -1169, 605, 1387, -644, -1327, 903, 1028, -995, -543, 1123, 559, -1525, -540, 993, -214, -1420, 11, 1355, -629, -1255, 640, 704, -1142, -1009, 1029, 937, -1026, -213, 1370, 218, -992, 481, 1559, -172, -1075, 758, 846, -567, -913, 893, 472, -1334, -384, 1240, 241, -1437, -240, 894, -384, -1832, 514, 1244, -803, -985, 1219, 1039, -1246, -377, 1418, 619, -920, 354, 1327, 7, -1193, 570, 1594, -766, -822, 827, 1197, -1059, -822, 950, -151, -1535, -308, 1602, -134, -1138, 93, 1102, -536, -1083, 969, 1283, -743, -756, 1292, 540, -1046, 177, 1286, -110, -1141, 392, 1221, -1041, -1250, 463, 713, -952, -1060, 1463, 445, -982, -54, 1231, -89, -1386, 379, 1225, -719, -1055, 791, 806, -567, -1109, 1091, 1033, -737, -98, 1757, 265, -1297, -11, 1482, -291, -1025, 745, 814, -785, -993, 764]
3446G64j43j975J015J681j079j486J125J283j259j000J434R40k037j67J871k46
3462G21j882Q11J243n04j510R45J461j333j004J584Q33j993m40J808J56j886K27
3479g63J781p91j397J013J329j245j415J771R73j779p51K002M72j882J89J842
3495A349n88j963Q88J757j166j378J439R52j553q92J681Q8j269k76J751n73j606
3512a359Q29J411r27j316J377J099j346o60J648P35k057P1J895r4k417P22J786
3529A397r58j258Q79R32j410p03J510L46j667k23J731j66j667K96J456m03j671
3546a579J045J335j287q60J619J082j761j55J989pk132N83J688m62j894P30J388
3563A322j124j340J197J077j982n98J742K16j845K72K213j230j299N36J984j362
$$ y = [764, 621, -1354, -339, 1342, 263, -1223, -98, 1185, -74, -1074, 360, 1300, -737, -904, 967, 721, -1161, -350, 893, 389, -1121, -176, 1285, -48, -1052, 532, 1365, -628, -1068, 740, 896, -990, -763, 1018, 227, -1170, -157, 1172, -73, -1488, 283, 1256, -523, -1274, 728, 1200, -682, -493, 1349, 761, -1202, -314, 1443, 277, -1101, 338, 1290, -263, -1155, 526, 614, -655, -931, 820, 247, -1359, -530, 881, -46, -1362, 15, 1114, -232, -892, 756, 1491, -566, -495, 1400, 1306, -1111, -389, 1397, 439, -819, 60, 992, -418, -1121, 389, 735, -932, -1155, 576, 410, -1257, -961, 495, 92, -1579, -534, 801, -486, -1346, 273, 1355, -406, -561, 1428, 1421, -711, -128, 1560, 1098, -796, -66, 1322, 198, -1142, 55, 1132, -850, -1448, 294, 510, -1335, -1063, 1150, -80, -1379, -843, 1141, -221]
3579b21o04J048R99j184o10J599M3j222k47J832n84j814J113J484j481j130R73
3596fJ286j948m43J085L79j285o09K158l17j541L13J642o95r11J007J248j145
3613B18j058J766L59j489k95J478j89j539M44J389m79j731R64J253j187j015J462
3630C51Q11j897k46J836l39j445J58J478k71j763J051J411j416j074J566P06j645
3647g28m15J723L06j539K4J534n53j393J067J393j329r40R72J001j459l07J390
3664G47j7j347M9J326l89j612R97J454j223j332J163R40j423k81J422M40j812
3681h98J52J316l2j541L17J910p32j364J237L40o23q59J417O61j674k76J727j96
3699H82j805L06J599p72j282O11R20q84p04J226Q56j718n8J592r3j230p5J768
$$ y = [-221, -825, 223, 1222, 38, -572, 1027, 1070, -152, -399, 1433, 849, -965, 148, 1632, 151, -979, -6, 1280, -668, -1111, -26, 353, -932, -1541, 617, 300, -1241, -928, 714, 19, -892, 115, 1363, 218, -840, 926, 1285, -204, -499, 979, 790, -749, -305, 1084, 605, -1126, -162, 1091, -96, -1111, 351, 1162, -735, -981, 855, 516, -929, -771, 707, 436, -1327, -276, 1135, -281, -1355, 211, 917, -728, -1143, 580, 886, -653, -629, 905, 352, -1041, 26, 1419, 90, -850, 122, 1123, -336, -643, 747, 730, -617, -568, 758, 369, -1243, -246, 1208, -15, -1347, -184, 756, -667, -948, 474, 914, -898, -746, 570, 538, -1003, -686, 1224, 492, -872, 365, 705, 82, -777, 640, 1301, -373, -649, 1078, 882, -923, -617, 982, 210, -1072, -461, 459, -425, -1129, 97, 953, -765, -823, 769, 676, -554, -629, 1139]
3717A139q13j147R29Q37q85p92J017P21j380m42J396R3j548J03J595n79r35N46
3735a45J389j165r24J115O76j161p74J691P1j171o6J552o09j608J022J327j109
3752A11j070P29J127j222p57J455K00j345m91K173p04j247L31J347k51j300J079
3769A65R95r80q62J514J80j223k43J572q8k044M75J133n38j159Q66R15r03r94
3787a219J466J39j158j47J346J40j553L31J366k58j406O56J691j198q61J301O32
3804A268j371o19J806M1j563K9J422n66j356O79R77o47j171Q05Q31j142o49J696
3822D70N9j523L75J110J21j547O46J449j048q47R72J044j293n50J416J45j206
3839b07l27J156l20j268N48J419r33j140R07O13r57p96J290P59j657L02J162l13
$$ y = [1139, 326, -821, 108, 945, 60, -732, 285, 1006, -374, -816, 580, 673, -875, -772, 823, 244, -691, -145, 1244, 79, -845, 270, 946, -215, -989, 702, 773, -398, -464, 1088, 479, -1129, -107, 1220, 111, -959, -230, 897, -325, -1082, 373, 573, -772, -1263, 910, 206, -1041, -710, 637, 386, -914, 165, 1160, 180, -682, 832, 1012, -211, -454, 1118, 1030, -1014, -539, 594, 56, -1103, -237, 678, -225, -1219, 247, 386, -772, -919, 427, 567, -986, -655, 711, 453, -953, -297, 1394, 196, -665, 636, 1268, -103, -722, 1084, 1125, -438, -409, 1013, 447, -909, -230, 747, 100, -1071, -266, 565, -577, -1226, 470, 529, -994, -619, 491, 612, -935, -289, 1160, 112, -735, 237, 1281, -12, -562, 854, 999, -207, -534, 622, 302, -966, -418, 1001, 68, -1072, -165, 448, -509, -1305, -15, 744, -913, -611, 551, 238]
3857B38j291N98J143k23j427R75J293j322q32J663L6j003p26J277L47j298L5J239
3875G22m72j142N11J182j064r65J251M32j097j31J180lj269N00J280m23j288N59
3893b37J319r60p70J125O57j327n50J237J46j612P46J095m45j006M40R08q27j235
3911a296J236Q26j158p98J559L93j408l46J745m59j201N44J333n98p88M34R66
3928I84j127p08J354N5j133j42J511p0j505k17J307Q2j255Q31Q77j273m14J014
3946A71O83j619l08J301M81j358M3J649p93q80N20J242j166m93P57R63j286n87
3964f80J237L16j550J56J304m91j665J107J044j310m97R71R16j215r45J593M42
3981G33j470n2J732l30j230P41Q67r42p76R52P57q95q27J369L65j539k41J643
$$ y = [238, -1053, -455, 688, 465, -962, 13, 1306, -16, -848, 815, 851, -152, -878, 399, 746, -552, -517, 722, 250, -892, -381, 801, -263, -1228, 23, 455, -642, -773, 407, 404, -865, -365, 915, 492, -796, -237, 1082, 122, -648, 477, 1134, -193, -743, 494, 640, -972, -226, 869, 424, -582, -142, 766, -61, -1296, -60, 766, -392, -1190, 369, 762, -646, -992, 753, 294, -907, -363, 970, 372, -416, 18, 984, -143, -851, 503, 558, -575, -717, 794, 724, -781, -998, 309, 391, -864, -33, 844, -429, -843, 171, 854, -765, -1073, 228, 709, -649, -606, 1043, 250, -630, -110, 1132, -34, -527, 230, 1193, -93, -680, 557, 873, -677, -521, 783, 292, -1373, -266, 778, -532, -1029, -58, 858, -357, -1302, 291, 733, -737, -789, 943, 613, -617, 124, 991, 49, -727, 225, 982, 87, -740, 629, 994, -545, -786, 857]
3999H57q2j508O61Q25p63r24R41O50q87q04J147N57j062l15J595n27j184M26J174
4018G77l77j359Q62J187r63r34J315M51j360l83J422J80j607J77J248p02r90P31
4036c25J395j139q92J059P87j431p44J987J7j441K07J454n84j011O65Q23q90q65
4054i28J032R47q68j004J346M79j512j10J147k4j399P13O57l25r53P76O19q93
4072c00n17J165J33o17p71J558J60j188L9J291p55q75Q45O97p05r28J246l8q95
4091d55k37J142k9j292K99J527p00j075Q76N21p07r78P83J228j198l12R41K24
4109E58j510N96R80l83o01L35R81j077o04J186M16j124l96J125M10j479q1J286
4127F18m3j901J002Q75n78r39J022O07j128k52J037M79j407J3J459l80j268O23
$$ y = [857, 775, -733, -72, 753, -10, -934, 7, 657, -230, -1034, 113, 670, -392, -707, 888, 361, -823, -397, 777, 400, -959, -97, 1090, 127, -807, 508, 959, -401, -784, 638, 818, -789, -612, 636, -66, -1056, -325, 1070, -69, -961, 98, 885, -546, -1290, 697, 714, -727, -520, 934, 350, -661, 4, 827, -63, -928, 104, 1051, 183, -821, 525, 1004, -508, -618, 529, 505, -894, -181, 476, 151, -802, -26, 593, -300, -817, 348, 481, -136, -907, 651, 811, -377, -338, 953, 198, -677, 168, 865, 160, -768, 478, 440, -455, -692, 450, 421, -871, -572, 955, 255, -820, 56, 577, -130, -1108, -325, 903, -295, -607, 334, 558, -952, -356, 624, 241, -360, -25, 956, -121, -725, 461, 877, -247, -643, 482, 892, -587, -668, 618, 575, -1326, -324, 551, -27, -966, 56, 663, -465, -717, 320, 799, -608, -595, 864, 484, -784, -161]
4145a61J096p95p07O62M44o65q52J363L53j305J97J132m02j223M8J565n37j243
4163a030J103Q67j341m64J184K85j274p3J157j22q92L48Q75j55j094J004N45j133
4181b10m73R83O12j483q3J354O6j295J41J218o37j251Q73J016j265m13R70P39
4199H62j241k49J073J87j210L25J180m40j079N67J018q26q79R03N93r50o76J399
4217E57jr25k76J077m15q09L46J009m70j000J053N92j377l59J675l27r47j60J547
4236G90n3j575N21R55n85o09O10R89j231n27J243K58j418Q7J217l4j630N94R85
4255E87o52j067J169R51j076n24J000K15j082l39J500j17j027N16N47k34j170
4272h03Q67P33p16q34J012N60j590r4J135K5j630O20J045n25q73J143R48j274
$$ y = [-161, 935, 140, -567, 95, 539, -126, -978, 385, 738, -567, -370, 762, 360, -863, -815, 750, 213, -1030, 73, 940, -401, -865, 319, 604, -670, -743, 414, 292, -600, -252, 623, 468, -626, 378, 923, -210, -683, 300, 912, -571, -654, 700, 766, -529, -388, 830, 193, -1058, -185, 831, -434, -847, 123, 862, -379, -628, 445, 632, -578, -253, 927, 487, -592, -25, 993, 167, -712, 191, 784, -166, -842, 557, 556, -369, -645, 432, 17, -792, -446, 563, 93, -907, 146, 738, -639, -998, 677, 350, -597, -757, 790, 737, -838, -317, 638, 53, -556, 54, 1043, -188, -715, 528, 786, -632, -545, 672, 638, -992, -398, 587, -65, -1132, 37, 988, -88, -612, 388, 603, -479, -818, 682, 565, -462, 54, 601, 367, -803, 64, 797, 81, -753, 259, 819, -771, -865, 270, 295, -1335, -715, 330, -195, -1068, 75, 1023, -251]
4290b51j086R84J342j090m83R42N65j455K52J289m73j215N40J360r60j165R19
4307A5P57j700k0J316L15j502p8J569n07j115M64Q57p09m62J018P42q91q73J369
4326E65M15j132j26J273l96j104Q6J543r19p72O02Q56r71q57J562k01q76o27J382
4345C03M78j596M15J041k85j228Q90Q64j067q88J310P22j280k66J302k22r72K26
4363b53J097n86j021P14P46n65j042J109P02j366j92J261M34j783J84J110l94
4380A55j145P61J265p57j144J020O39j238j21J153J47r40k95J390l96j023N73
4397D4N95o45p20P95Q54r10p23J069J9r46m6J141k01p01q3J212o85r68J018Q09
4417I28j183l96P94N45j456L90J015j39j070L80Q81n02r72O44R32q03p81J033
$$ y = [-251, -1337, -353, 989, -101, -584, 358, 923, -532, -280, 1009, 536, -679, -139, 1221, 261, -904, 15, 772, -928, -948, 368, 683, -819, -897, 672, 165, -950, -486, 371, -338, -800, 218, 960, 69, -804, 565, 980, -152, -278, 995, 599, -505, -419, 1124, 205, -567, 35, 891, -80, -937, 625, 424, -452, -1079, 303, 781, -815, -400, 641, 356, -872, 18, 882, -185, -1073, 237, 959, -321, -587, 715, 493, -479, -253, 844, 258, -763, -49, 697, 132, -910, 199, 901, -465, -657, 604, 1038, -745, -561, 549, 155, -990, -229, 1036, 279, -865, 155, 794, -444, -565, 588, 735, -205, -500, 890, 494, -529, 44, 639, -6, -726, 69, 923, 13, -710, 359, 378, -568, -614, 527, 326, -375, -458, 754, 69, -899, 119, 928, -255, -651, 143, 688, -768, -378, 637, 498, -572, -192, 689, 187, -785, -141, 791, -12, -793, 240]
4435B40N57j172l15P76K03j219K52J256l09j140P21O93p07m16P70N23q82j73Q59
4454E17k11q35O6J261o83p75J057N31q91p57J059K88q31m88J323M0j569M70Q15
4473C87n31q59N03J408p16r07Q42O71q54o73J008O98j398m5J510j21j652K82J174
4492G27l01j020N25Q31r64q69J664k40r49j42J012J2o88J87P18j3j345P10J030
4511H85p25r00J307M4j218P3J254l73p47M4R86l44r41P97N22p37p34Q82M28q33
4531c30m12J039J8r85K07R24k45r34L50J005j40j198R21N24j031j57Q64L09j014
4550b85j17J105k64j138O16N65m41p45R69M73j099k35P97K21j035l1J445m64j259
4569i22N75J059m85q86Q30M02q01k48R17M44j259k05J181M3j171L55J093p67p00
$$ y = [240, 797, -375, -690, 86, 289, -930, -678, 578, 269, -871, -150, 543, -164, -580, 190, 713, -169, -342, 517, 306, -529, -463, 798, 115, -660, 397, 928, 37, -720, 339, 627, -204, -692, 631, 671, -898, -428, 387, -144, -1003, -500, 908, 192, -715, 127, 798, -56, -729, 279, 977, -421, -466, 1044, 923, -729, -447, 727, 426, -594, -69, 762, -202, -1071, 593, 353, -596, -738, 274, 286, -402, -215, 503, 490, -855, -145, 885, 160, -740, 567, 611, -607, -534, 720, 347, -400, -356, 630, 286, -655, 142, 664, -73, -807, 75, 503, -330, -742, 297, 315, -670, -463, 461, 216, -718, -368, 637, 497, -701, 220, 744, -287, -444, 420, 729, -285, -402, 703, 439, -699, -83, 482, 41, -704, 265, 738, -361, -596, 201, 422, -613, -644, 801, 337, -922, -347, 712, 227, -659, 171, 573, -228, -476, 441, 885, -374, -579, 602, 645, -526, -171, 922, 155, -545]
4588e45M22J096j080q22J087O84j441l1J140j79r42J85J038m34n86K15Q78n93
4606I2p01M90P02q57k87J006j37p38L16Q39o77m52K7J288r67r45J261P8n06n89
4626g57J077J82j244L05J009k74j161N48J264r79n42O10K63l79o95J152L81j239
4644d79J8J182m13j048N27Q25p15n17R74J91j041k09J087M06j231j80J032K32
4662F41j358L94J101m87q74P98O34r86k79R57K5r69J06P39J30j244K54J140m78
4681B44j090P54R13r98q43R82P33j107o32J395n3j124N15O22l8o73L44Q02o70
4700G6o17J098K20q45l68J382l93r20j47J093j36j003K50P35o28p26J085K91j037
4719e90j33R96L9r56R5J038kr88M07O24k72q42P80Q47r31n81Q96M32j000m47J230
$$ y = [-545, -123, 973, -107, -929, 158, 842, -599, -630, 510, 331, -611, -426, 612, 178, -408, -193, 685, 92, -609, -119, 583, -274, -561, 445, 308, -430, -114, 725, 48, -404, -377, 911, -56, -1001, 260, 338, -168, -757, 320, 502, -742, -437, 572, 298, -863, -315, 949, -30, -572, 38, 301, -78, -773, 379, 760, -479, -461, 721, 308, -740, -213, 612, -103, -620, 354, 545, -496, -705, 382, 788, -443, -623, 409, 641, -717, -323, 778, 291, -583, 215, 849, -137, -416, 541, 566, -403, -297, 442, 572, -672, -418, 722, 244, -846, -92, 821, -177, -1020, -38, 695, -412, -1044, 351, 298, -826, -311, 311, 273, -400, -56, 746, 76, -541, 557, 777, -68, -436, 946, 553, -367, -514, 579, 443, -560, -310, 425, -203, -929, 156, 447, -590, -723, 273, 312, -644, -549, 489, 487, -501, -94, 530, 258, -584, 196, 1043, 112, -469, 427, 859, -141, -588, 642]
4740F42j47r44l2J091o23p61R77M59o35q99Q66M47r08q0J132j97j102O21P93n55
4760A45o33N62P11j130k56R35K49p38l86J105j37j075J80J005l72j084R18M28
4778D27n60q46J199N49j226j91J130J59j384N24Q11l73o99L9J089n12n77L88O23
4797E70n48l02M99K73j179K24J055R6j146J62R25m92o64N20K63k44o49Q10M10
4816E83j067K8Q67M8p73o9J230n14r85J031L26p37l91Q88J95j075K52P32j47r61
4836e39KR89l87p69N30N11n95q44J184J9k29l85J146m9p78o2P39l51m39K09Q42
4857G44o34q18Q50M94r16nO04M93j384J87J034k84j174O60P86q38p84R91M73n81
4877a02m01N28O01r41k02J229k31q89L8J157p86o21R27N24r70k94P74K50r13n0
$$ y = [642, 495, -449, -481, 610, -13, -774, 203, 662, 27, -872, -6, 441, -467, -547, 585, 388, -714, -93, 700, 145, -488, 74, 785, -345, -601, 334, 583, -155, -541, 564, 427, -648, -468, 537, 165, -919, -1, 427, -133, -979, 220, 769, -457, -648, 482, 641, -743, -219, 592, 219, -480, -441, 648, 136, -441, -53, 570, 22, -280, 219, 492, -687, -463, 592, 688, -458, -296, 629, 137, -527, -7, 256, 12, -637, 173, 583, -484, -456, 411, 459, -314, -383, 847, 333, -652, 379, 705, -32, -423, 465, 660, -415, -163, 569, 422, -539, -537, 452, 65, -704, -174, 337, -258, -1102, 82, 101, -128, -513, 633, 584, -194, -256, 483, 132, -307, -98, 744, 110, -708, 142, 636, -280, -285, 319, 812, -572, -385, 649, 365, -809, -149, 637, -201, -985, 6, 479, -102, -503, 25, 626, -315, -517, 712, 481, -408, -370, 787, 1, -620, 307, 831, -139, -433, 341, 591, -322, -372]
4897c72Q32m01n90O06J07l02k46J61Q80j058l74Q55L99j061K46J047j88r76K90
4916a45P11l94q24M35Q43q07l25O97L52p99l25J095r2r39m1J053k64j430J114
4935h5Q81q09o74R96J93j057j03Q66K33q57J75R58m56q00N82N45n51k28J73O45
4955F27r48m24J017K00o86j11P05K20j049J73R30n12o67P41N50j122j34N15N83
4974F08p15k40Q42L1r19J71J054o28n62M74N95p86m67P97L02j051J09N88J8m40
4994b19n07J214n30r51Q90N95o97m40P33M17r19o3R95J65p74j98J082o69n11L02
5014h5R13p63p80J005L83j051j20R50O0j078J11J112m26q00L35Q86p71m74K96
5033b97P87p60j01N93J02p80K14P60q0r16M63O19j46q95M21M73n24k64L03N84
$$ y = [-372, 460, 59, -531, 75, 182, -120, -366, -205, 675, -383, -757, 98, 497, -564, -318, 729, 541, -435, -145, 566, 172, -652, -217, 626, -181, -506, 191, 543, -256, -581, 514, 422, -517, -558, 495, 231, -1199, -85, 796, -13, -687, 309, 502, -555, -658, 208, 441, -416, -241, 717, 261, -539, 43, 588, 37, -191, -18, 627, -321, -745, 272, 472, -214, -325, 380, 600, -449, -276, 654, 142, -525, 216, 766, -356, -490, 25, 608, -107, -347, 495, 526, -393, -222, 832, 204, -358, 116, 711, -75, -542, 255, 557, -494, -385, 203, 221, -219, -726, 488, -42, -993, -103, 492, -205, -645, 88, 505, -414, -477, 518, 683, -91, -289, 793, 124, -387, -85, 828, 65, -715, 290, 673, -378, -498, 452, 512, -566, -455, 657, 231, -569, -234, 652, -119, -593, -297, 490, -270, -371, 222, 324, -456, -242, 518, 438, -478, -15, 604, 458, -437, -16, 457, -67, -331, -28, 556]
5053E56j038K05O25k53l82k86R00m06m29J99J160r97m47J030J38j050M63M21K76
5072F85r64M25M23l24p46L77J038j144J47J82O04r30k06Q62k19q43K40P13j58
5091A62q21K47R50o88m99J074p5n87k01P70J35p88j87J176j49j153O91M33l87
5110A03q88J375j7r22k40P99J83r40L68N81j56q45K55J048q63l28O39N16p41k44
5130c17P73J47p89N1M36P0o81J37P76o55o18Q58L43p14n35P37M76r18k87J197
5150D87l19p52L33J073o45p17L48O35m27p29J224k33m42l66J020j12p70L18P65
5169F91j59p56P0P57q56l06P71J52n83n02R70j73r82M20R38m28n16K94N60j65
5189A97r24R06L96q69j26J121p6q34lQ08j11q55L28O26k19m68K44K32n67m13P15
$$ y = [556, -482, -277, 348, 95, -287, -573, 327, -79, -508, -309, 851, -146, -593, 437, 575, -475, -12, 409, 685, -279, 146, 569, 245, -501, -124, 914, -230, -83, 99, 703, -227, -433, 429, 210, -633, -393, 320, 162, -659, -412, 538, -150, -649, 425, 350, -237, -438, 332, 467, -321, -508, 668, 519, -634, 57, 490, 103, -785, 590, 573, -349, -589, 210, 393, -547, -179, 402, 246, -599, -344, 704, -159, -487, 152, 668, -73, -317, 456, 603, -186, -135, 301, 371, -310, -173, 603, -52, -670, 188, 531, -183, -718, 19, 495, -423, -710, 487, 168, -584, -251, 822, 177, -540, -192, 443, 16, -713, 511, 278, -164, -530, 490, 378, -392, -74, 691, 532, -224, -154, 603, -253, -559, 212, 364, -219, -721, 249, 76, -906, -486, 452, 24, -492, -198, 362, 197, -727, 179, 575, -294, -420, 701, 625, -209, -212, 596, 485, -370, -42, 584, 365, -103, 141, 373, -194, -607, 108]
5210A08L52o36k34J191k42j092M80N96o20j82O05K63r84l65N35Q93j140K1Q20
5229C69M6p84K61Q24m09p43N80N36p08m14O63Q0n16l13P79M03r16m9Q07j84q03
5250d91L39R85r36l07M13M37p46l36J240k65q15L32Q75n87k97Q6M30l18o00Q14
5270B53N98j399J53M82O16j241J28O44k39m07O8Q21m42o28P45J17l16j51O28J07
5290E37p21j35Q86n49j41j2Q15r55k02L16O65o02n91O67L33r91M54P26k57n16
5310b73l07J120m67m04M28M96o73j40L26K24j83k93N16J74j131J5J139k32q90
5329e55O00N50q02l83R49j78m32k16N67r2l77k2Q41l09p49P57J92l45j47K38K61
5350C48m99j86N76Q6r58K48R91k90j040M40Q83l33n66J20N38n77O0qN45j084K48
$$ y = [108, 460, -176, -410, 781, 539, -553, -73, 523, -97, -279, 326, 589, -395, -760, -225, 668, -472, -451, 369, 415, -369, -108, 716, 307, -436, 144, 680, -28, -442, 221, 301, -215, -528, 251, 654, -262, -311, 496, 312, -491, -152, 833, -103, -410, 3, 440, -306, -642, 598, 333, -482, -150, 725, 138, -159, -73, 357, 39, -561, 253, 851, -548, -395, 87, 703, -538, -410, 234, -5, -412, -344, 477, 35, -593, 152, 269, -47, -198, 430, 537, -184, -319, 567, 18, -123, -135, 680, -275, -477, -161, 504, -98, -689, -22, 311, -680, -226, 500, 243, -273, -580, 540, 73, -331, 97, 593, -80, -220, 106, 330, 147, -146, 370, 544, -587, -572, 567, 335, -555, 45, 595, -207, -590, 359, 181, -251, -467, 100, 8, -369, -391, 450, 141, -608, 149, 341, -4, -151, 87, 348, -151, -337, 239, 325, -633, -385, 606, 316, -724, -284, 599, 266, -300, -180, 358, -219, -159, -167, 378, -706, -458]
5371d58R28j18p60J98N34j92o74P09K43o34MN65mm41l28N73K65j015K39Q26l36
5392A24m24J50P30o77k35M41J8k69k65N96K6o33N7N76pp33M78M41l36l61M38K12
5414C47k52k76N52K28r87M5O13j77n02N74L80m80q11R45K14q80p9Q68J42p48q3
5435c67P27l1m94R2N20k51n81K32P83n25n10L62O49j234N75M62k20m18k04J095
5455F62o00q32N42O94q52k13Q19K4q89J02N95L26n99j21N94j07p00Q49J1m87J11
5476g1N79j53l93l15O98N1o04r4Q48m0j214Q17K50k52o23O09J49n56j07P45j71
5497A53o25K02O38j70m09L34N77o75k95O41n4p50J57O38mp47L52O60l39p36M33
5518a9K20m2r25J167l5l05m69N49J12n18J53M58L9r60M44Q26p91k34O21K24p58
$$ y = [-458, 470, 352, -408, -210, 324, 132, -542, 167, 410, -224, -220, 345, 341, -100, -428, 145, 410, -605, -366, 460, 124, -300, -150, 580, -97, -332, 109, 127, -142, -407, 189, 215, -418, -361, 215, 208, -525, -47, 394, 58, -303, 135, 347, 95, -181, 371, 599, -388, -343, 270, 93, -409, 165, 545, 65, -746, 199, 413, -467, -546, 322, 464, -284, -367, 360, 329, -165, -73, 447, 196, -385, -153, 630, 105, -405, -43, 606, -628, -53, 409, 189, -229, -433, 662, 62, -770, -228, 466, -386, -599, 220, 244, -645, -543, 52, 378, -221, -342, 252, 145, -555, 294, 305, -182, -71, 508, 355, -38, -353, 345, 396, -208, -302, 546, 506, -708, 109, 359, 107, -516, 93, 242, -314, -421, 324, 153, -472, -270, 368, 198, -211, 123, 700, 25, -270, 371, 317, -433, -276, 362, 358, -389, -37, 623, 284, -452, -19, 201, 159, -766, 401, 366, 61, -408, 141, 253, -265, -112, 346, 385, -575, -131, 695, -96, -330, 291, 515, -243]
5539b43j72P43P7p16n6P70oo97j2P79n14l03L81L52m69l91M71M84o78j95J149
5560G54m18p78L35L95r6p17P97K71l83o56L45M71l83m22R71j74n29j55P20m41
5580i3l07L55K80n32m4J66M01m06n4L52j6k27k41Q46k71p08N08M84j38p50N74
5601A79L00p77N8M35J24o28K98M43l28m32J70K14o7n25M13M66k69m72P63M20r18
5622a33k02O83j62o00L60P69q55m74P34J77l38m87P48K64j007K25P09N1j093M62
5642a69O01o41j13K77L57j85m00K93N74q07k34J009l35n96K78M47k00n17J88O09
5662D36l01l34N79L90j034j12O44o7l68j02O31j87n76K57K40r7n83M91L99n48
5682b42j35N34L49o68j50P16j35o72O09P5n0n61L51K85n69q6P13o9p74L29J65
$$ y = [-243, -415, 328, 405, -311, -367, 403, 397, -300, -312, 467, -47, -350, 31, 383, -86, -477, -6, 478, -200, -395, 754, 336, -442, -107, 288, 192, -525, 272, 543, 160, -496, -151, 320, -63, -485, 486, 312, -217, -372, 348, -93, -400, -45, 235, -297, -341, -175, 226, -180, -234, 118, 102, -125, -366, 480, 209, -499, 9, 493, 355, -395, 179, 479, -298, -240, 195, 319, -309, -11, 432, 104, -328, -158, 56, -11, -536, -123, 343, 74, -398, 365, 785, -133, -335, 348, 186, -414, -54, 715, -140, -614, 120, 297, -41, -528, 220, 484, -523, -298, 411, 462, -631, -169, 432, -209, -322, -45, 312, 127, -273, 20, 594, -213, -447, 562, 227, -369, -91, 356, 156, -361, -173, 436, 135, -199, 380, 770, -264, -376, 268, 201, -167, -269, 362, 175, -401, -144, 96, -1, -584, -93, 306, -242, -377, 157, 506, -162, -312, 404, 269, -403, 206, 281, 231, -330, 21, 306, -263, -349, 364, 295, -479, -150, 15]
5703A5L11r01N12M38k37p47Q46j13l93o1L72J85l53k49P66n4p97O08K83k40n59
5724c68K24O44n68l55O25J77k75m55N31J48p04K94L43j40q33N31P92p52k71M74
5744F2L62p99L7O93N5n37J4O31r6n81K34L98l08p10R25o0l07k40N63j03m56K35
5766A2Q9j36m55J96N00l32m61Q99l5k75n84R38l52j87k94O72N4p58N25M81n45
5787d8l14M34N46p23k94N12M67r85J29K12N17r02J98O47j60r47P05L60m94k71
5807d11O09K57p96p4O52J80n58r2M68J36p26L05J39m0n16O90Q6n50K65J54R3n87
5829c16K7P36q74j54K65N68l35m40P61j94k20k49P26J33r51N21K65p0l57k16Q15
5850D41n09J6L01J36m62j91L90J34n74J1O35j49m80M16K63m35l74M37K30j92j21
$$ y = [15, 326, -575, -63, 375, 138, -609, 237, 124, -269, -330, 42, 227, -126, -375, 391, 337, -460, 148, 431, 191, -368, -144, 500, -68, -423, 202, 379, 104, -351, 180, 328, -376, -82, 261, 121, -712, -181, 611, -141, -412, 62, 424, -375, -338, 355, 410, -127, -113, 518, 422, -159, 75, 473, 165, -545, 380, 320, 13, -227, 336, 233, -223, 12, 101, -35, -490, -294, 206, -126, -587, 312, 277, 2, -582, 356, 4, -183, -477, 195, 249, -509, 16, 497, -48, -362, 72, 618, -105, -399, 113, 580, -405, -276, -64, 453, -449, -251, 396, 236, -711, -6, 354, -140, -411, 198, 455, -341, -415, 237, 417, -141, -233, 235, 371, -355, -50, 89, 49, -467, 223, 309, -241, 24, 178, 271, -316, -289, 447, -427, -581, -316, 252, -83, -523, 238, 44, -176, -425, 301, 434, -517, 4, 269, 199, -158, -374, 441, -68, -52, 249, 385, -77, -268, 122, 256, -318, -307, 328, 179, -301, 115, 378, -57, -431, 6, 236, 44, -77]
5871g7K01N4n68L1O52l8n02O6N69j57o90P21L32q55j79M67N40r24l23J047m45
5892g8l97L27M64n63j47M31L77j66o70M19P49p19l27J55O30j097K03O03m8k24
5912g8K54M36q62l49P19O78j178j5P86K5q04j2P87k02p05M00K88k46j71N72K04
5933E27q40O3L85K45q43K18K88J62n59M48M29n55p7RN05n13k26J99M49m76k4N61
5955C75j52m33o4N29l69k52L59L57l48r0K08L38p81q9Q14n9m55p0O29m68l99J97
5977b23M60k35l22O64k34k58k8N60k97m72K28N73m5q16M94K12l89l11L84M78n87
5998a64k2N99k5m92L6M62k36o75N56L97n68l85M63L64l35l58L19L34o87P2K32
6019a13M98r40O39L43m22n60N26M60k61k54L08J84o82J17P11k73l51j53L84N9
$$ y = [-77, 124, 178, -390, -359, 293, 255, -247, -181, 388, 231, -459, 262, 594, -261, -440, 27, 567, -357, -680, 367, -78, -475, -148, 316, -247, -394, 37, 414, 248, -422, -3, 746, 27, -300, -145, 485, -612, -409, 194, 146, -78, 176, 612, -250, -599, 120, 798, -380, -395, 391, 416, -388, -400, 387, 185, -520, -120, 168, -78, -249, 323, 527, -313, -250, 135, 380, -463, -245, 43, 205, -354, 94, 523, -32, -109, -100, 405, -108, -334, -135, 314, -162, -186, 375, 223, -210, -274, 255, -114, -366, -7, 350, 2, -88, 120, 458, -323, -412, 402, 343, -112, -182, 447, -21, -420, -223, 237, 2, -320, 344, 110, -148, -176, 384, 87, -385, -157, 416, 371, -445, 49, 261, -128, -439, -55, 423, -164, -186, 413, 388, -104, -68, 394, 158, -517, 39, 436, -132, -517, -54, 310, -25, -383, -64, 270, -417, -345, -113, 385, -555, 84, 427, 5, -555, -29, 431, 170, -84, 224, 408, -274, -157, 554, 281, -70, -223, 161, 220]
6039B20n54L15N51p68n67J074j29m58j48L16M66m91l7M34k23n29L62M78k20k49
6059a57L94j47j15j14L86j46m69K06M79n0o81K85O08n37l54O39O1n53k50Q34m67
6080a48q2j11P57j63q07O72O10m62n01J90N82j78q53Q73L3n69J47L17K0n27J4
6101a86N77k03p02N47L31l63m16Q50n72M8n11J097k15q23K36P76n76k71L08N39
6121D71m86k11N85K32r13M54M24k74o73K53M75r2p64P67M45q15l13M1P49n94J08
6142a31K19K15m79J68O37o44l06L92K09l61m13O75M08n44l02L61M12r31J64N18
6162B67k2o30N30L64n36m47M98K83p05J85K97J30o14o2O22J25o08K90N03l92k54
6183a76K02J48m35j44L77N17p15J49K04k0o87N65K74l05l77K79N36k19m81M01
$$ y = [220, -334, -19, 532, -236, -803, 271, 142, -316, -464, -148, 318, -173, -210, 224, 1, -528, -166, 312, 92, -157, 237, 90, -25, -139, 247, 101, -368, -162, 317, 267, -414, -129, 479, -58, -412, 227, 288, -265, -515, 319, -148, -230, -341, 416, 253, -554, 118, 728, 266, -235, -45, 537, 359, -494, 379, 412, -157, -10, 307, 327, -200, -186, 391, 188, -514, 33, 364, 1, -415, 435, -137, -89, -600, 497, 282, -541, -305, 471, -105, -376, -68, 471, -15, -226, 359, 591, -322, 132, 556, 282, -391, -138, 337, 245, -519, 248, 693, -122, -435, -394, 355, -239, -131, 88, 303, -176, -8, 629, -15, -321, 71, 280, -81, -494, 181, 589, 45, -257, 104, 516, -415, -251, 267, 245, -385, 145, 509, -27, -474, 24, 307, -398, -213, 84, 214, -400, -462, 160, 285, -323, -33, 470, 78, -176, 26, 174, -261, -405, -28, 489, -226, -77, 127, 107, -580, -15, 259, -46, -423, -144, 392, 173, -308, 93]
6203I3j49k37J42N68l94j39J1O17o55p1J49N12l74n31Q06l94J49l44N68l16k02
6224a91K70L17k92n57K02P61p54J6M39K01p40j57O30j06m39jO47j69m70J69O00
6245C76l02l49L36J17k59m5L51J8n77L20L34m9q92P10J76l77nl0L80n21N5J03
6267a30P02r19p6O32l7q53N53K95l51J10L99J0o42j09O78R0p31L16J82L3k36K36
6289A52Rm8l32L19L81l88l53K59p1o9j26L17Q6n14l4L17N91p79K38L54n21K4J27
6312f1J99k23J5M24P3p22K23O17m23l14K19J77k83j44K39L98n48r0L12J1j17o4
6334h2L50j81m76O14J47l47j58L52L36m27m08O99ql45m68P14l6n35K08O96p33
6355h8m80P37K10n87PK51j23m2LM14J1o00M8M02j44l00L66K04m95K43J3K21l69
$$ y = [93, -56, -293, -151, 417, 23, -116, -105, 512, -143, -214, -65, 447, 73, -458, 348, -46, 103, -241, 327, 11, -191, 79, 396, 104, -453, -251, 510, -244, -228, 211, 412, -328, -485, 145, 39, -400, -401, 246, 77, -393, -224, 376, 74, -275, 61, 178, -81, -126, 225, 243, -334, -14, 320, 271, -621, 89, 265, -112, -117, -147, 233, -288, -233, -130, 572, -347, -423, 209, 172, -681, -128, 167, -184, -74, 325, 335, -307, -416, 262, 352, -379, -63, 119, 152, -84, 152, 161, 113, -219, 100, 481, 93, -260, -1, -72, -141, -267, 50, 136, -378, -412, -95, 496, -283, -45, 309, -212, -188, -61, 138, -85, -70, 354, 427, -295, -72, 545, 122, -192, 27, 204, -79, -223, 16, 414, -134, -224, 88, 99, -18, -82, 268, 87, -389, 225, 372, 25, -133, 219, 555, 128, -280, 419, 411, 66, -402, 312, 276, -259, -51, 645, -88, -568, 169, 379, -208, -201, 50, -73, -115, -112, 302, 313, -287, -239, 163, 19, -281, 85, 289, -206, 37, 50, 271, -98]
6378i8j64M18L07p93k1N63n1o42K53O99o00l58N06K28m17N2N3L65n57Q4O37o33
6400a69j50L77L69n19j72M04L05m47l33N49m67P9J30K11r0o46N50J32r1n62M65
6421g5K19k98j89M83q9j93n5L94J5p18M66O46m64n81N13J26l33m25P34j1l53Q9
6443i9J55J31m13J89J53m64j36M13R5j83j82M87K00o31n7M57k34l40K19O61m02
6464A9k88O5M90k35k61O41j62l42j55P15j2r08R7Q30j24m63n3N90n56m52M30M07
6486B73m52k45L87N05o92K35L99j5p85M43L68l86k04L01M48q04k11Q53l58j6m42
6507c98N42l59k8J72M07l53n48N68K18j96l07M18N0l30j75L85M6m82M61R4k21
6528c6j3j28O90m96l95L85K30n56K56J10J43o21J96M83l11n46N32L43k96o38J014
$$ y = [-98, -262, 156, 463, -330, -351, 212, 161, -481, -228, 471, -129, -487, 19, 247, -170, -118, -65, 300, -257, -173, 464, -169, -319, 58, 427, -92, -264, 140, 445, -2, -335, 214, -253, -174, -44, 167, 77, -569, -19, 113, 22, -540, -75, 144, -154, -343, 140, 51, -142, -197, 197, 212, -506, -40, 606, 142, -439, 74, 200, -133, -558, 176, 165, -188, -99, 56, 187, -226, -37, 116, -348, -484, -71, 24, -159, -341, 146, 346, -285, -342, 115, -119, -459, -240, 421, 19, -269, -204, 286, 51, -210, 431, 269, -73, -228, 487, 475, -433, -336, 494, 370, -93, -146, 444, -112, -564, -134, 273, -179, -424, -37, 468, -224, 11, 410, 395, -390, 53, 421, 35, -169, 132, 580, -224, -435, 418, 60, 44, -398, 144, -215, -243, -71, 336, -17, -565, 3, 221, 25, -282, 136, 186, -144, -319, 66, 112, -370, 91, 185, -36, -49, -177, 513, 17, -378, 7, 237, -319, -63, 47, 190, -431, -235, 248, -63, -609, -77, 266, -30, -668, 346]
6549C46l05l9l08N18R9p31L43M72n03j25M96j02l72O7M85j15o21M6N47k53Ol16
6571c65N06l05j52Q8O51n74j70L43K93o27O7n1M87m02K3L71J90n48j39N88l06
6592c2m07N23K54m04k68P40k04n98J22K78J1p49N45K73k6m07L55K19m37j13M60
6613A35O8l24n7O22o7o35J96K62j95k28J70L11j03l90K56K85k34k86L45kn16L26
6635f1K54j43l22j4O39o02K20J71k7k9l73L58K83n87J29L20j81n51L84M44k42
6656G0p7J21J89o09J82L60j17n29L21K58p9l68k5M08p7k15M19l0n41k27Q83Q9
6678D06n86r0O00k04m09J72Q9J35n21M08L16l63PK54N6o02L31J40m22M6J99J43
6700A05k63j61O7O23m17p8J3K97j54o9N2J07k94J46K91P4m45O8K76m39j9M56L5
$$ y = [346, 41, 2, -306, 212, 311, -420, -77, 395, -108, -233, 263, 161, -211, -144, 341, 226, -395, -349, 198, -55, -49, -365, 141, -164, -316, -228, 423, -151, -321, 22, 315, -312, -245, -296, 191, -211, -188, 183, 373, -175, -314, 274, -32, -439, 84, 338, -66, -334, 406, 202, -396, -274, 4, 15, -734, -189, 84, 58, -349, 6, 225, -212, -325, 135, 203, -121, -178, 444, 377, -258, -62, 200, 5, -223, -53, 258, 155, -235, 21, 306, 72, -214, 131, 129, -387, -61, 193, 50, -272, -286, 353, -249, -29, 142, 115, 86, -287, 71, 354, -233, -104, 216, 35, -516, -132, 312, 70, -7, 114, 303, -306, -124, 236, 119, -410, -89, 169, 90, -278, -303, 105, 28, -187, 232, 202, -339, -566, 317, 406, -180, -270, 330, 126, -283, -111, -22, 113, -408, 0, 316, -47, -40, 214, 270, -332, -1, 139, -283, -237, -38, 105, -158, -319, -252, 371, -46, -124, -111, 186, 32, -37, 15, 122, -172, -26, 265, 339, -106, -38, 238, -201, -220, 236, 271]
6723B71m89j06L37K93n40J82O10n21m62L82K74L1m77K03M36q88L68K20j10n6j44
6744a86K72J92m13j70O12k85k32K47L36n55L3M79O2m30j22N15l45m06L86K81k63
6765Hl54J20M99o08l6L96L30m66p5J6J87j66J86L7M3l95L45m4n4j10K55K32l96
6788e0j87M38j30n23L3N14k30k63N33J62l78j72N65k9l96%J42Q3j16r7L64j57
6810A06m20L22J9p0J48o9J63k20l58N15J99p99J38O09m1m52L13K28k95Q6n8N1
6832A15m57K40K62M4l85K07M86k30l63j62L79k63l1K89K25p87j10O00K0l28K1
6853b28N05m25k3m4L09m2k32mN95n43k15M56O7l46K70K47j10o90P52K30n19j52
6875a42M8J94j91j51m0P80o75rL10m59r7L2O03j43n48K92M25m12Q5K63J78m71
$$ y = [271, -218, -324, 13, 306, -234, -52, 558, 37, -425, -43, 231, 262, -215, -12, 424, -464, -96, 124, 14, -42, -186, 86, 278, -135, -305, 307, 22, -210, 37, 373, -182, -149, 330, 392, -38, -160, 355, 10, -396, -10, 271, 8, -346, -226, 273, -335, -371, 25, 355, -111, -186, -170, 17, -149, 37, 74, 117, -278, 67, 23, -31, -141, 114, 346, -50, -237, 201, 71, -452, -419, 95, -135, -398, 135, 297, -81, -253, 312, 283, -113, -113, 29, 112, -4, -101, 263, 106, -314, 8, 27, -43, 105, 36, 199, -21, -379, 136, 335, -464, -326, 283, 242, -210, 103, 331, 36, 122, 64, 115, -342, -102, 160, 204, -181, 26, 512, 282, -81, -243, 136, -127, -158, 131, 356, -431, -541, 59, 79, -249, -228, 277, -148, -171, -215, 94, 52, -180, -184, 411, -132, -347, 109, 176, -170, 100, 347, 237, -453, 299, 529, 10, -142, -94, 100, -91, -242, -282, 498, -177, -186, 124, -335, -432, -400, 203, 60, -488, -196, 229, -183, -98, 165, 343, -128]
6897a28J84j12K53p4m83Q31m69n0p0K07k06k99K34J16K66o42M14K51j31j88L09
6918B13M0m88J23O15p11k32M93L26l68l75N83M08p04J99P5K43o63J55L81l32l08
6939c27L28M03n33j32N48j3m35l61J062k51k97k78L32j9k80M40m7l32K63lq5j56
6961a73J43J39J82j30j96J3K8j20M3J27j64l60L43N15o94l34M91K44n59j58P52
6982A32j93m08P47j37J23l99J26K70k53j45J97K44l55j16N65k80l20K37J51j45
7002D1m36L92n8p7n2K82l6k53K27K22n9n02K67K19j01l45K41L39q0m40L28Mm69
7025c46M2N71n5m39J80pN1r7r2L26k42j7L4L1l01k28R28r8n92J62M44l16j81J83
7049e9M54l96l91L15J33j23J04J12pj47k49M26j73j00N1K56l73j50K69M51m97
$$ y = [-128, 56, -56, 197, 123, -360, 471, 2, -48, -118, 89, -117, -416, -182, -66, 200, -442, -28, 223, 92, -96, 213, 253, -235, -112, 503, -208, -440, 53, 379, 11, -364, 219, 627, -77, 122, 197, 440, -223, -68, 313, -19, -327, 1, 404, -129, -261, 287, 274, -161, -522, 540, 289, -8, -286, 46, 27, -253, 187, 140, -192, 71, 68, -17, -173, -30, 109, 291, 161, -35, -22, 6, -114, -71, 56, -108, -468, -125, 390, -304, -638, -147, 97, -462, -620, 132, -61, -469, 278, 141, 264, -135, -9, 261, 8, -137, 60, 304, -51, -167, 398, 118, -202, 35, 186, 41, -395, -3, -61, -138, -190, 92, 56, -197, 30, 252, 193, -309, -42, 177, 76, -269, -28, 311, 231, -209, 119, 123, -346, -304, 267, 212, -227, -47, -54, -3, -100, -192, 134, -108, -125, -91, -60, -361, -589, 339, 241, -351, -189, 255, -61, -242, -59, 395, -1, -392, -77, 56, -67, 37, 149, 142, -5, -254, 172, -1, -101, -50, 206, -167, -317, -48, 403, -94]
7070i4n86P39k42j97P9M40r1j09j58L93l01k1j17N43l85L8L98L45o24l33N25k34
7092HP4J24L11q02k1M51R7m0m90L56p4m41K34K27M7m28K96L2L40l99J93K71m02
7115c6k5K99N2l67j05N76j24p07K04P62m35l95L58J25k03k40J73L66l87l34O31
7136A88k48J12j04K51r1k89Q9N33m90l01L18L63l24k86O90km73k8K89l75p7K82
7158B7K22k27j10q5N89l33m20O78p5k43l09K65J52j76j57N93m50l30O28l7m2j28
7180C2J02K78l23j50M32l74l0n07P66l5l32J77N02p57N4K19k2L4l2j00L8J90j72
7203a0J87J12o24M54L19o83k1K14J90l59m1M14k64j93P3J87N4p9n2K75m06L60
7225A07k48L98m44p7L34m5k12r4M14j99k54K37L40j22m8l4L87o75R3K72j25k34
$$ y = [-94, -680, 59, -183, -380, -301, 139, 48, -61, -219, 174, -127, -148, -265, 278, -107, -69, 329, 674, 50, -283, 242, 8, 82, 206, 517, -285, -306, 145, 242, 202, -288, 68, -6, -447, -213, 14, 61, -367, -71, -39, 301, -98, 95, 366, -36, -61, 238, 290, -77, -182, 394, 270, -437, -233, 529, 94, -301, 57, 182, -21, -261, -88, 278, -109, -443, 188, -60, 52, -52, 199, 108, -181, -92, 441, -49, -350, -32, 331, 7, -279, 411, 409, -64, -92, 197, -178, -255, 27, 249, 22, -88, -173, 416, 83, -337, 341, 266, 23, -286, -21, 131, -45, -202, 391, -59, -389, 239, 202, 160, 32, 134, 412, 89, -61, 371, -3, -33, -540, 226, 191, -141, 36, 538, -219, -165, 54, 32, 66, 34, -66, -28, 162, -10, 177, 289, -335, 119, 438, -245, -266, -52, 138, -221, -262, 152, -112, -305, -232, -45, 9, -70, -122, 153, -253, 107, -141, 257, -187, -264, 70, 25, -187, -281, 133, -66, -320, -83, 257, 135, 87, 53, 440, -235, -142, 130, 5, -229]
7247b29j06M72J03n18J85N75n16k95M59J29l81k54J39M25m25q9N41j79m34M69
7267G1K05l90j10J54N66j70o91L98J24l06J56k4L01n04O7K54k74LP9K47m46l98
7289f88P03M3j42j87L57K90j93k58L03k40j98j3K90j41J67j14Q8j83R5K73N1o83
7311c80L85K36O9p53K27O79p22q5K40L10l29l12M40K49l75j15N58j80l51J75L87
7332C53l35m46L79K95j7l26L88n9k24K6J87j13k71P5K60r3l25M44J60m88j63L81
7354H8J24k57l33O68k22o55N08j6J64l64K43L45l09l71N00J35n74M5M44l08j52
7375b97J77L64l28p6J14L66m84n4J02L08m94J10J48J10j89j24N78j42m12K08K04
7396A89l22J77J50N2j60m71M12O9j00n6K84j62o3OJ73j41l96K90M33k18m43O62
$$ y = [-229, -335, 137, 240, -278, -93, 482, -34, -329, 130, 259, -122, -376, -237, 188, -237, -326, 215, 36, -398, 71, 276, -114, -224, -70, 496, 326, -365, 33, 157, -149, 7, -17, 284, -220, -153, 101, -173, -170, -91, 156, -290, -688, 15, 58, -84, -271, 86, 376, 183, -75, 228, -12, -210, -223, 67, -74, 93, -21, 67, -116, -21, 252, 303, -380, 5, 241, 310, -443, -216, 463, -259, -344, -104, 206, -123, -435, 5, 254, -121, -236, 322, 142, -209, -34, 353, 18, -428, -49, 246, 229, -97, 291, 232, 8, 34, 221, 108, -163, -88, 172, 79, -246, 198, 358, -130, -293, 88, 212, -45, -378, 290, 68, -587, -79, -95, 69, -295, -52, 293, -16, -387, 113, 248, -326, -281, 163, -145, -297, -120, 244, -84, -160, -46, 320, -164, -218, -116, 192, -302, -192, -44, 66, -123, -247, 331, 189, -223, -15, 189, -133, 44, 194, 246, 86, -385, 27, 96, -4, -60, 224, 62, -1, 5, 178, 37, -359, -69, 364, 146, -297, 365]
7418C65j88k7n08O18j50j77q7M53l9l63PM72l35k27l1L87j31k31M83k22m79J21
7440b89L75j45o95N35L89j34k83M11Q5m00K36J70o6k32k66M83k01K19j32K89k49
7461A00r8J49K33o66K6P08m91K6l97P10j80m50L49L21k66n98K95O8O9k05J28O28
7483D59p12P2M74j11k04k5L95m59k11K89J10k23L14q4K41n15j06N47l81k79K64
7504a45N31n07k60J47K79K54l58K83R2n77L97K42l44k74P9J52L16q16K42L54n3
7525C4j34N0N74q28K64K64R5m08l74N52k05%J12J52j32j03J21L07l24q3J69q8
7547A5l1l84N88j85j30K61N9l27k36L77K82l37O9M0L0l11J74K49n5j83o8J16j27
7570a14j19L57N1k60j35L23k7j67j53L42J06j40o8q1J19j32K19K62m80j12K78
$$ y = [365, 177, 150, -358, 260, 110, -67, -154, 299, 260, -103, -96, 376, 41, -186, -217, 170, 39, -192, 291, 69, -410, -289, 86, -59, -754, -219, 170, 36, -247, 164, 249, -151, 85, 255, 189, -43, -309, 174, -27, 192, 60, 349, 100, 2, 151, 384, -282, -256, 452, -39, -13, -410, 300, 120, -330, 19, 340, 74, -524, -229, -161, -92, -297, -169, 459, -253, -181, 293, 182, -22, -47, 348, -111, -322, -33, 77, -146, 168, 84, 325, -190, -296, 251, -130, -409, -145, 386, -121, -381, -234, 45, 299, -59, 224, 316, -261, 136, 378, 34, -240, -161, -9, 307, -509, -267, 87, 34, -100, -50, 524, -304, -40, 224, 319, -89, -463, 89, -116, -116, -4, 148, 16, -87, 34, 341, 17, -66, 103, 15, -16, -400, 188, 3, -127, 134, 193, -134, -370, 7, 289, -48, 21, 61, 91, -220, -46, 203, 148, -35, -103, 13, -114, -233, 124, 175, -85, -220, 103, 76, -91, -244, 98, 204, 64, -4, -85, 34, -98, 121, 383, -97, -209, 69]
7591F9J41j48k80L74k98k22N20M06n90k20M0M79l61j47J12M20m17m7K64J16j67
7612D4j88O3L10m53R3O72m69j43J76P1o62K03L71j01n12L02M22l26j12J69J41
7633G1j04l01J69L37k36q6J64M9r5r8J91j16J05m43Q27n69m0M16q8m30J58K28
7655A09Pn08L67J44k24q1nM35l22N5K66R7l69K8J05J03l06m66P81k24r4j18M24
7678B04n8l98L11RP9l49N31j82j40k40K45K29l69J16J64k67m00N49N49o93j67
7699b77M38k76M8J35K03m08L5Q9L60j18k02K4qj43k31M08J8k15R2j95M62n38M53
7722A54k50J63k34l6L78O4l95jL11l06r2O20l18r9l1J90j21j84j66L21K80j21
7744A27j5J43o13K48j21p4P8J00K69k58k26K94K27k87k48K45M10l40k34K29L54
$$ y = [69, 210, 62, -218, 156, -142, -364, 156, 562, -28, -248, -208, 271, -90, -237, -125, 295, -122, -169, 95, 211, 44, -144, -81, 229, -224, -131, 541, 72, -71, 105, 176, -486, -283, 88, -13, -525, -223, 199, -127, -239, -70, 71, -33, -334, -165, 172, -64, -150, 14, 63, -32, -130, 61, -55, 50, -393, 434, -135, -175, 241, 153, -277, -119, 109, 116, -392, -25, 119, -105, -186, -191, 244, -78, -23, 243, 340, -29, -1, 104, 207, -99, -565, 216, -8, -102, -220, 204, 146, -252, 59, 68, 147, -202, 329, 147, 7, -233, 12, 241, -128, -12, 152, -115, -515, 34, 583, -110, -277, 161, -115, -67, 68, 271, -137, -102, -13, 347, 229, 27, 51, 43, -100, -331, 77, 95, -120, -28, -223, 239, -299, 154, -96, 67, -167, -203, 175, 239, -156, -157, 154, -152, -244, 376, 58, -41, -72, 118, -3, -187, -353, -32, 248, 127, 112, 255, -358, -110, -231, -305, -227, -127, 142, -116, -342, -48, 179, -108, -356, -111, 299, -41, -275, -46, 308]
7765C08n60nO11r0M9l23K51K9o16M11j78p4J17K3K87m11jL95l85j54K63J34p8
7788CK12l81L91k6l70K10k0k48J83L94j95jk86L49l07m7L0L18l77l34L02K80m41
7811c61o5N65L3k78J5K55k38k1J70J73j5j14p5M25n36j56L26J47l12m25M15L31
7833B59m41K55J51q6p6j20J31l70R5L57K06m50N6l5J11j69J51J2k3Q3l27N12m02
7856a20n8J29J54J23l67N11l22l92R7M34m5m96J68L03j3k95J16M30o23L2N36n43
7878b41N8k95O70j54O2nL43n80J45K23jk45l54O68q0j09j53J92K3l42j0N58m11
7901c8n2L16R1l84k4L12j52k88k46P72k30j52j63O39l48j77L6N09q27J82K68j27
7923h3j49K27K22l20r2j95K68q6N8R9K80m82J0N48k49l57P1L69k11j38J76M46
$$ y = [308, -252, -257, 354, 264, 313, -10, 241, 270, -346, 65, -113, -187, -70, -47, 240, -171, -172, 223, -162, -316, -53, 81, 3, 215, -166, 225, 199, -171, 39, 19, -229, -46, 348, 153, 152, -134, 215, -92, -139, -109, 209, -168, -502, -200, 80, -361, -426, 139, 172, -106, -91, 164, -74, -95, 75, 248, 233, 119, 44, 469, -67, -223, 103, 250, -62, -487, -72, 259, -182, 73, 224, 138, 62, -58, 73, -297, -202, 155, 361, -89, -33, -68, 43, -126, 25, 37, 14, 97, -230, 282, -120, -178, -49, 105, 228, -139, 372, 50, -342, -245, 189, 144, -352, -184, 119, 106, -189, -73, 357, -266, -234, 302, -241, -183, -478, 192, 38, 100, 95, 438, -142, 3, 226, 225, -20, -374, 294, 214, 105, -48, 144, 167, -175, -185, 373, -38, -90, 226, 317, -67, -91, 221, 69, -219, -465, 307, 77, -75, -238, 401, 53, -124, -88, 421, -406, -224, 44, -83, -232, -5, 217, -103, -195, -390, -122, -208, -150, -51, 229, -253, -243, 305, 56, -301, -230, 139, -72, -210, -34, 412]
7945D12l49k09N0pL28n54L80J00l71J74K43l13J6K91L7k45N6J21J64n87J24J43
7967DK30j85l67M07O5l05J48j9J11j88J34K52k1l60j08M82n3k55M3J17l83O5N81
7990C95j57m56K16K66l37l40L41N28p3n62M8K81o60L03K91L73m43k53K48O4k89
8011b16J96j25L06r0J25K21p33L42j76L99o31J71L65j1o7JK34n52M7L62J74m49
8033a07j71M25K4m47L88l6j71N3O6J43l23j97O45M1l45M9J50m5m15J3M05j31k3
8056ik66O03p0q05M01O3k13J34K59J82j08l46K72J03l85J32K67M2o01L99K28l33
8078e1Q4M2L47o26L44k59J57k21M6O9K39j81r2L03j92j89K09K82n98M74k40M1
8100a2J8O5N9j01j19K64K53k26n91N62L8k99K9P3L19j95k96M01j80Ok53M86l86
$$ y = [412, 63, -146, -96, -103, 225, -329, 51, 151, -220, -46, 197, -116, -100, 191, 228, -17, 39, 160, 324, -263, -139, 4, 234, 49, -318, 89, 154, -151, -3, -22, 89, -99, 35, 287, 266, -94, -202, 280, 227, -28, 15, 132, -251, -186, 395, 238, -218, -2, 264, -73, -413, -72, 456, 383, -179, -131, 150, -510, -207, 84, 457, 14, -239, 9, 73, -216, -20, -145, 161, 71, 196, 417, -316, 26, -150, 249, -382, -211, 154, 143, 76, 77, 311, -241, -194, 168, 342, -107, -278, 147, 171, -276, 112, 76, -95, -42, 24, 167, -156, -353, 292, 333, -12, 37, 187, 142, -273, -260, 145, 14, -9, -275, 328, 258, -547, -146, -83, -296, -162, 97, 279, 171, -175, 97, 200, -185, -53, 214, 256, -345, 54, 282, -51, 33, 75, 422, -204, 140, -119, 38, -183, -137, -68, 171, -10, -102, 201, 9, -180, 29, 311, -287, 187, -53, -12, 6, 71, 130, 29, -90, 174, 427, 201, -390, 172, 210, -89, -60, 13, 332, 137, -159, 242, 62, 68, -185, 301, -85]
8123h5J7J32J53j31J21q3L16n73%L91j20l52K40K57l31l71M32J16j3l04L75p0
8145A17n65K25K81j58r3L3K34o1l39K35m2K9j87N65J0k67j10L25k13k98L49M7
8167A17j79p6M97o1j04n63L07P36n40l84L79J4j92M2q3j01k99L46K53k66j50N33
8189B26R7n18
$$ y = [-85, -68, 64, 217, 86, 207, 124, 440, -133, -133, 258, 138, -214, 26, 283, -48, -419, 13, 129, 116, -188, 187, 117, -448, -223, 58, -100, -193, -160, 74, 13, -326, -91, -133, -104, -291, 274, 284, 17, -93, 232, 19, -279, 70, 117, -62, -138, 359, 298, 194, -369, -62, 674, 134, -250, 129, 143, -49, -7, -90, -191, -490, -144, 109, -157, -307, 226, 323, -195]
8191a95
$$ Imaginary data points
##PAGE= N=2
##DATA TABLE= (X++(I..I)), XYDATA
0@%%%%%%%%%Qj6J6j6K3l1L2m0M8n5O5p4Q8j04J20j37J57j79K03k29K60k94L29
32A74l72M18m65N17n74O38p10P87q71R64j066J181j309J452j613J796k008K252
50A191k540K888l314L849m547N501o891R115j3246K3513r5550j93933J12309J78441
64A6786J10866J817k8235n1724j5563K8070J0621o0350l0496N3326L6383p5642
76d141q6793N805N5082J8569m932n758j526L9331Q8484J8518j26970j44681P522
89a41490J15435P2848n556l1484l6923k4273K2568L4644j8909k0421O6876R2534
101A25849j7169j02920n4219K5456L6780K1434O522k9860l9701J4499L6812l7653
113a4170p9968R492J00354N8036l2528n1809k3709K656L5714M0367k7435p5101
$$ y = [0, 0, 0, 0, 0, 0, 0, 0, 0, 0, 8, -8, 8, -8, 15, -16, 16, -24, 24, -31, 34, -40, 48, -56, 64, -73, 84, -95, 108, -121, 139, -155, 174, -198, 220, -245, 272, -302, 336, -374, 413, -458, 506, -560, 621, -688, 764, -849, 947, -1061, 1191, -1349, 1539, -1775, 2074, -2473, 3028, -3863, 5252, -7994, 15519, -80031, -273964, -161655, 16786, 127652, 129469, 101234, 49510, 33947, 62017, 72638, 12288, -18208, 35118, 71501, -4141, -90934, -85129, -30047, -11478, -16410, -22168, -23694, 15637, 104121, 122639, -4331, -149012, -141490, -26055, 46793, 41237, 9753, -27170, -51443, -28875, 5769, -13140, -33561, 33315, 125849, 108680, 5760, -48459, -23003, 13777, 35211, 41733, 11873, -27828, -13329, 23483, -14170, -94138, -84646, 15708, 73744, 41216, -10593, -34302, -31646, 4068, 44435, 17000, -58101]
125e8101k347R0272N0057n0086o1566m133J8640J6875K2837K390l2726j1583K8293
138H822p784o2096r136Q9066P6158k4686p0730m0221K170M3533O3882M317q6397
151a3102o8227L9497P3558O672l1604o857n79j8752n634J2274l874j721L1422
164A3073J1969n8130n1210M5203Q6447K0366m0746l5677j1300J3672M4714K6950
176F5331n0383p4698O147O6291K4582k6828j0934J0157o188p992R308J866o913
189b54K4804L1011l5439p8884k0447M9087L3286j0685r421J976k898J1016K4866
202A8018r728l8176J3514P1595L1386m7338n1513p498P151O052J6726J381k7768
215a6198o966L7054J2532m4896l0591L0275L5022k832n632R866l869j3559J980
$$ y = [-58101, -60448, 29824, 79881, 29795, -31771, -35904, -17264, -389, 22448, 24838, -7888, -19471, 8822, 1038, -61058, -70194, 18872, 95030, 70344, -386, -40607, -38437, 5096, 68978, 73295, -13102, -81329, -41832, 31726, 38398, 6794, -63, -642, -19394, -25028, -12754, -16628, -18349, 13073, 25042, -33088, -84298, -39095, 47352, 67718, 26972, -8705, -20005, -6333, 38381, 65331, 14948, -59750, -53603, 12688, 37270, 10442, -492, 9665, 3477, -4515, 4793, 6659, -254, 24550, 55561, 20122, -58762, -79209, -30122, 3164, -7521, -16942, -14966, -17864, -6848, 18018, 8290, -29886, -16372, 55223, 86609, 39271, -12242, -19740, -12589, -6537, 10189, 11570, -16198, -23164, 13890, 26422, -18474, -49065, -18790, 16232, 13400, 7768, 17634, 13765, 206, 2186]
228B186o559l3577k055O3112M8825l5715o7929k4455J1697K1633L5788K7731j8698
241B1984l3176Q302K3076j7938k5329K1912L5389p403k7721p631j972p924Q995
254i436J3579j9659k2480L4071N6677o91n0191k8758M283R838J9961K7598m662
267C0130l8465j5613J4640n235k3819J4865M4939J1519k4885j6045k326o712Q411
280h596K7985J197l0785m148L5467J1746l3380k2219J1489J2360N770J5206J978
293B4070k9226j7585K0758J1765k5282j3431K6896K0866j3146j1625K664q186
305a1462p804J9746J9322j5538j5110K0339J4896k6577k5125J4191K2212L148
317A2238L301J844k1582k1924J9876L0708j1428k8449M003J8456l750o976Q572
$$ y = [2186, -4373, -37950, -40005, 23107, 71932, 36217, -31712, -56167, -44470, -22837, 12951, 40682, 21984, -11192, -2890, 20186, 2248, -23081, -1169, 34220, 26817, -904, -8535, -10507, -18431, -9436, 4143, -15516, -37996, -3925, 52752, 52061, 1870, -26888, -22605, -12767, 7194, 34792, 30130, -8335, -23948, -9308, -14543, -38362, -23497, 21442, 32961, 8076, -7969, -10295, -17007, -8596, 19389, 20586, -10199, -14347, 21120, 32866, -514, -22733, -11244, 1116, 6886, 22092, 24070, -5156, -22741, -1983, 9782, -15500, -28931, -2035, 18831, 5685, -5940, -3276, -11462, -19266, 480, 19802, 4264, -10846, 9493, 24389, -2188, -27313, -13122, 9090, 12238, 15539, 17383, -4199, -26123, -6247, 24461, 13033, -15416, -11413, 7043, 3293, -3683, 4889]
330D889j227j7425K153J9763l074j7368J0618K1995j3551l0052K267K1939O373
343G300N63P779r335k4005M367L0703M543k5436o925J6846J28j1831M418P678
357F793j2918p384J6325N174j9115k390K5341N497k4943r677J4598M938l723R656
371H172O240j8992j1450J9228J3289j8176j1145J7409Q450j4052n011R224m961
384a775j0536J2081J4437j3939j4200J6310J5384j4791j4727J0582P227r822R26
397b843J1510r071j7199R223J7969r643j7223J2067J8272n428q690P567L27j4196
411g358L937J9915l343k0050J206J4682q092j7023P459J5049o359p926R779J822
425C698j4442J788K0701M12k0863r76J7662J48j0925L225N389j2876o077J7604
$$ y = [4889, 3662, -13763, -11610, 8153, 5079, -12289, -1671, 20324, 6773, -23279, -21012, 927, 7300, 7863, 15642, 6307, -17698, -13331, 17372, 21915, -3521, -10446, 6400, 6528, -5303, -885, 6793, -6125, -13509, 2816, 7990, -11125, -13515, 11826, 17323, -7620, -17297, -2699, 2239, -1484, 8172, 14412, -4580, -16030, 3198, 16487, -1689, -12834, 4575, 13025, -1027, -6038, 3186, -1775, -12311, -230, 14207, 268, -13932, 2378, 17762, 2971, -11756, -1174, 6053, -3769, -2843, 8667, -404, -17603, -8380, 9589, -54, -17277, -5210, 13062, 7634, -1056, 6511, 6838, -7358, -3421, 16494, 13151, -6899, -5693, 8989, 897, -16126, -8667, 6382, 23, -7903, 1876, 3698, -10744, -8956, 11745, 12157, -8706, -9682, 7980, 8128, -2797, 428, 5817, -7059, -13136, 4468]
439D468R114j5799p003J4541L075j5411R08J6342j087j3060M411P666j2338q727
453a2900J4981R215j5840r378J4501O543j2441j426J1542l630j1068R081J3321
466A2501j0572j3457J0812J1348j0987o902J2707N075j2739l14J3469m181j5265
479h505N070J4456q401j4745P378R984j1084q780J1376O113j0553J547J5936k049
493G743j5211L975J6659m200j2597N910Q565j1572r092J0919M551j3716k136J5358
507E156J768j3494K607J5195k767j1871O115R304j0117r422R374L699j6835p615
521a8903J2805L656j1656K062J4815j267r752Q671J4602m925o980J1527O822j4155
535G322r166J0462J226j5590l332R937m343j2762O072J2744o809r543J1222J1517
$$ y = [4468, 13582, -2217, -9220, 5321, 8396, -7015, -6107, 10235, 9148, -3912, 499, 8165, -4173, -12900, 2081, 11296, -4544, -13922, 579, 7122, -5319, -6745, 4797, 1167, -9901, -820, 12501, 1929, -11528, -716, 10632, -355, -7257, 5450, 10525, -2214, -2528, 10941, 6760, -8505, -3435, 11021, 2620, -12125, -4747, 5237, -5847, -14627, -3251, 2862, -7691, -6144, 9792, 7743, -7468, -3493, 13166, 8966, -3631, 2279, 10844, -728, -9820, 1099, 5650, -8066, -10202, 5156, 6924, -6570, -3963, 11232, 8465, -3406, 2709, 12013, 1896, -7526, 1848, 5547, -11288, -18903, -6098, -2442, -14098, -12036, 2779, 1512, -8240, 431, 15033, 10108, 3128, 14655, 21477, 7322, -1844, 8618, 9844, -5746, -9078, 859, -3484, -16246, -10174, 2570, -4239, -13782, -2560, 8957]
549H957q237m964J1302K148j4537k541J2147k289j3333L725J1546n954j0067J0254
563a843J2310p056m466J3527O214j1747k729J0835l688j5813M70J0229q073j3898
577a5728M656P597q817o517J3103P630r450j514J4933K926j1038K548J1712m080
591G961j2113O201J0195q858r496Q452M480j1617k829J3623K592j2137q07J0511
605F158k841j0690N610J0127q423j0235Q791P038r560m873J1655K710j1992n99
619g124J2476m99j1135M151R150p471r786R164R061q296o217R372L347j1367J30
634e044J3565k00j1698K520J0282o223j0524O828Q536r396p518R590N212r985
648d055r91J2286o74j2055K524J2225l792j1626L835O504j0321q538R191N003
$$ y = [8957, 720, -4244, 7058, 9206, -5331, -7872, 4275, 1986, -11347, -7622, 3924, -2030, -12097, -1843, 10467, 3411, -1055, 12472, 18686, 6939, 4210, 15045, 11357, -4456, -3986, 6243, -1830, -15728, -11072, -3475, -12292, -18809, -5706, 1924, -7526, -9040, 5893, 8819, -2219, 329, 12041, 7961, -4152, 2049, 12244, 3386, -6110, 2342, 6822, -4795, -7624, 5999, 8591, -3546, -4353, 6158, 3317, -7373, -1763, 8364, -59, -10294, -1503, 5535, -4025, -8898, 2757, 5467, -6525, -7124, 5352, 4853, -6282, -2131, 7019, -452, -10238, -1074, 7987, -309, -6526, 2846, 6193, -5174, -5044, 8521, 8321, -3377, -857, 9425, 3202, -7322, -494, 8042, -1354, -8872, 718, 5930, -4055, -5046, 7240, 6566, -5489, -2965, 9260, 5468, -6158, -2323, 4181, -6140, -14678, -5487, -484]
662d84j0641k460J2956K960q881L790J4778r3p697O831Q755q320r838O428L025
677A1109j3565o114Q932o37j3038j563J0804o26p238P713R930n618p379J0499
691C209Q211j0027p002P954J506j0798k51J0531k075j0730L783J1659l311n353
705b694J0871Q515j0005p424Q111L460r294k042P783o094j4874J533J1379m125
719d900r920O258Q844n748l136J2319O240r043j611J0629o32j0789K348R866o296
734D429j3382J910O992n380l510J0444M003j1044k498J2682M055r226J634J0239
748A1348l688j0395L491O618q123p280Q587N497j0329l832J0911K620j1655j452
762g682R426j237p532M673P798q149q483P954P233p613l710J1176N331q617j020
$$ y = [-484, -11125, -13585, -629, 2331, -6550, -2760, 12018, 11925, 4228, 11059, 19814, 11494, 1656, 8084, 11109, -2456, -8570, 362, -275, -13313, -14876, -4072, -4698, -11936, -4223, 5707, 89, -7290, 3209, 11420, 1393, -5609, 2345, 3851, -6947, -7198, 3333, 1258, -9472, -5689, 5970, 2659, -2694, 8177, 16692, 6687, -737, 7374, 10834, 1540, -502, 7281, 1187, -13687, -12154, -775, -4900, -14820, -8562, 282, -5466, -8602, 3717, 9957, 914, -697, 9932, 9300, -1489, 859, 10725, 4429, -8953, -7043, -51, -5431, -8941, 1503, 5506, -5538, -8036, 4646, 8701, -525, 1109, 11348, 7660, -2735, 756, 7374, -749, -8029, 558, 6055, -4274, -8106, 2805, 5425, -6230, -7682, 1744, 507, -7025, -2352, 5446, -2703, -11186, -3232, 4001, -3612, -7322, 3854, 9185, 568, -452]
777d52Q103k961r550N732J2128m977r681M425M694r185o211R579M627q194j884
792c807P498m229j2025L098J0875m077r990N761R291m856m770P349K618r575J738
807e101J5890L921r497o52O708n838r677O679J0003n235p368L789j899j3767k782
822a4826J3371L799j0121J52Q906j996p580N242P392o428m397J1373P109j0105
836A891o824O244J97r467J753J2762J526p235K511M742r011p534J1199J0141p252
851E643o508M933p83j1879k283Q384n14o224O058J0582o862j0694N215Q483m477
866i26j890R996L720r668l273O722l254r998M741J1400k500r897M093N517p370
881b587o082Q102M585o181J179J0896k258j4824p79R439M20n016O184N297r636
$$ y = [-452, 7651, 4690, -4860, 872, 13000, 8023, -1658, 2767, 7461, -1724, -7935, 1644, 6271, -1923, -3807, 3691, -538, -12563, -9465, 1410, -2667, -12657, -6896, 2395, -2461, -7231, 118, 2736, -6839, -5101, 10789, 14710, 5213, 4561, 11269, 5431, -4246, 2433, 12436, 7201, -167, 3622, 1723, -12044, -14826, -1455, 2344, -7777, -7625, 1281, -715, -8295, -3053, 4339, -2089, -6486, 4887, 11996, 1891, -4933, 1311, 1508, -7959, -6206, 6556, 8082, 847, 3358, 8100, -911, -8445, 2754, 12895, 5643, -865, 4068, 3285, -8594, -10877, -2493, -3007, -9231, -3173, 7409, 547, -10147, -4932, 3551, -926, -2816, 7180, 10900, 1232, -2041, 4681, 1427, -8571, -3830, 7570, 5070, -4827, -734, 4783, -2587, -8669, -567, 4018, -2163, -984, 9912, 7654, -7170, -7949, 1490, 1910, -3106, 3078, 8375, -1261]
896a261q236O566N304p395k82J1590J063j1118q32R406q62p489L192O064o475
911g65m591R320N106j1731o374P544M125n877J900Q521l558j0035K373P639m165
926e68n802Q170N809r255n914Q534M248o953l49P046k102q632N053J0249n292
941D242r821L951N679o660l719Q573L046p929j281Q180k470j0012K719J0331k695
956B134p553M854O439o711n970P111L435p034J304J0756l64j1166j360Q112k702
971A285o831N311P483n464n251O489J909j1152l521J0612M219o509Q20O589n927
986F2j1075L178R010k317j701R740L777j1963o769Q212M233n188J938Q714l122
1001F729j0125J797M818p219o966Q416Q980m964l921O353j326j0700j021J0470
$$ y = [-1261, -9497, -2931, 2373, -5022, -5304, 6286, 7349, -3769, -4601, 4805, 3943, -3546, -354, 5710, -765, -5356, 3964, 9070, -2661, -9035, -1491, 2634, -3243, -1343, 7178, 3620, -6415, -4042, 3597, -568, -6370, 1800, 7609, -1646, -7560, 974, 5222, -1731, -2080, 4966, 2864, -5768, -715, 9534, 4242, -5579, -1628, 4051, -2609, -6328, 2245, 5291, -2638, -3919, 4261, 1791, -8221, -5502, 4829, 2134, -5419, -565, 5874, -837, -6807, 304, 3739, -3295, -1991, 8765, 8401, -2765, -4125, 3987, 1285, -5546, -235, 7248, 1784, -3467, 3022, 4931, -6221, -9742, 870, 5089, -1420, -600, 5989, 62, -11013, -7835, 1175, -1142, -2843, 6897, 10674, -1289, -8058, 154, 4387, -801, 1137, 9851, 6729, -3396, -1599, 3219, -4000, -10966, -2550, 6430, 1466, -2455, 3898, 2572, -8128, -9149, 1321]
1015A321L199m101M438N846r430j2484M218Q332k228j150Q231Q99j0929l569P808
1030D01k62o582O015J0854k504q845J582K988p840m616R328O168o853j781O590
1045D643l836j1651J543J1219J463l957N402M997r001p365N551M436o973j56J0229
1060F544P82j1238k831N556k288n344P855R711m340o761M880K374r141l039J0500
1075C220L987p220r13N866l833q847L719P669m523n029P923O234p888n903N729
1090A91J468o993J829J0119j075q519J301O079n193o543P410O844n829n006N869
1105A952J190p936n65Q745r60q532L092Q946k928p475M042N052n852l430P824
1120C165M028q119j985P512j522r342J235Q190j723o625M394N402n699m739P247
$$ y = [1321, 4520, 419, 4857, 10703, 1273, -11211, -6993, 1339, -889, -2039, 6192, 7091, -3838, -7407, 401, 139, -6443, -428, 10426, 7922, -923, 659, 3647, -4193, -8809, 519, 6687, -166, -1947, 4643, 807, -10844, -9301, 1918, 3381, -576, 4826, 9823, 822, -6543, -992, 3444, -3529, -3685, 6544, 7326, -3912, -6743, -1187, -3475, -8819, -964, 8747, 4407, -2354, 2526, 4900, -4241, -7280, 3220, 7207, -13, -926, 4940, 1107, -7740, -4021, 3648, -875, -5904, 2019, 8253, 365, -5538, 191, 1659, -5334, -3505, 6614, 5539, -2980, -1679, 4400, -793, -7336, 74, 6918, 1089, -3917, 1952, 3142, -4794, -5359, 3386, 2426, -6106, -3014, 5932, 3004, -4471, -429, 4623, -1229, -4659, 3165, 7193, -926, -2911, 4601, 3079, -6263, -5028, 3162, 1439, -5186, -792, 4610, -1089, -5828, 1419]
1135A419L650q089j185R830J964r074j354O134m016p292M857P036m802m885P116
1150A309M354q303l157Q777L682o297J273P387l479r308J494M888n573n707P821
1165h39O237p364n913N538K079n826L193J0067o04p051K109O648o364q030M788
1180a332O168n641l383O350R36q821j373Q238l7n731M993R680l484r440J785M316
1196C224n227k546P851K334r181l014O791r13q020K504J0040k3n403L726M793
1211F936o300m780P059L873p720j302P982J69j0372k312O340j332m225N187O831
1226F034n974o327O498M242p637k730R085L164p528p65N241l078p058M544P626
1241E337m426n268O468N120p482m567O272L030n640P92O385l313q382L046P448
$$ y = [1419, 5069, -3020, -4205, 5625, 7589, -1485, -2839, 3295, -721, -8013, -3156, 3880, -922, -5807, 1309, 5663, -2640, -5797, 2980, 6662, 365, 1638, 9025, 5546, -3762, -2268, 2620, -2953, -8660, -839, 5398, -1966, -7879, -2341, -262, -6088, -2895, 7172, 6568, -483, 1626, 8274, 1910, -6120, -1332, 4836, -805, -4188, 2162, 3098, -5723, -7096, 1142, 1105, -4626, 367, 10047, 6563, -2877, -1092, 3224, -2003, -4549, 3302, 5636, -3545, -6559, 232, -681, -8701, -6197, 3843, 3820, -1583, 2143, 6936, 636, -4144, 2915, 6788, -932, -2234, 5748, 5917, -4455, -6767, -427, -1759, -5984, -797, 6034, 60, -6267, 231, 4473, -3164, -5894, 3191, 6355, -1173, -1938, 3303, 225, -6833, -2289, 5337, 911, -4357, 2111, 7231, -251, -4818, 1454, 4484, -1156, -364, 6021, 2708, -5674, -2628, 4820]
1256D820n028p501N410O281m424m131N270R82p623O49Q605m81p489L157P785l239
1272C043p136L683O247l301k564N557O89q245j687Q649k96r486l80O641j173n962
1288e721L031M612n859l335P457M003p019j246Q572J588q293r20O500j187m720
1303b537M043M096o394n229P869N224p512m030P615K956o374k61N489l248p237
1318e530M202N543o224o682N902N510n990m896O271K893m350J716P657k040p374
1333c392M135Q311m776q030L996O561m744m846L919J5o768J002Q657j371q475
1348e806K350Q228j944o767K804N048m410k862N501P39p742l15Q246k38q713P70
1364e111Q436O8m872K367K888m983k099Q060L311q780l895P323J571p828n77O629
$$ y = [4820, -208, -7709, -2299, 3982, -442, -4573, 697, 1679, -5944, -5295, 3310, 2829, -4660, -1503, 6282, 3043, -4093, -410, 5837, 2536, -28, 5529, 6218, -2027, -3714, 4935, 4639, -4847, -5227, 1414, 241, -5721, -2690, 1922, -3937, -7272, 185, 4188, -2831, -4077, 4495, 6083, -2210, -3130, 3370, 2183, -2537, 1506, 5602, -792, -6021, 1848, 7072, -440, -4470, 3145, 6101, -273, -534, 4955, 1707, -5530, -1328, 4215, -2009, -8691, -2789, 2721, -3269, -8165, -1894, 999, -3351, -1635, 6022, 3982, -3392, 743, 9054, 4278, -3752, 244, 6805, 2061, -2785, 1134, 1149, -5619, -4617, 4040, 2669, -5806, -3456, 4772, 2828, -3939, -1135, 3913, -497, -3359, 2142, 2881, -4861, -5176, 3070, 2832, -5881, -5111, 3325, 3393, -1479, 888, 3776, -1207, -3306, 4754, 8065, -715, -4610, 2713, 4284, -3544, -4121, 2508]
1380B508j557m622L402L552n811l796Q226M987p749m786O534L595n143p92M250
1395B798k833n708N203O627n498o711N292N677n492l912N857K343n248M86N564
1410D445l563o835M783Q009m053q022L340N719l715l442M353J039o034J005P990
1425E019k113r256K001Q439j018o341K381M281l847j955N488Q59p587o31Q895
1440D615L98q339p89O698j095n173K321L635m119j622P425J695r235l187Q895
1455B123L308n397j554M466k060m967L957M428n494m251P215M398p396l981O102
1470H97K783n048n28M564k080m671M577N532p045p292N587P191l390l791M101
1485A387O98n820J398O434j790n948L771P153m555p656L300N590k834l193L994
$$ y = [2508, 951, -3671, -269, 3283, -2528, -6324, 1902, 6889, -860, -5646, 888, 4483, -660, -1452, 2798, -35, -5743, -540, 6087, 589, -6122, -830, 4847, -645, -4557, 1300, 3643, -1605, -1119, 4445, 882, -5953, -1170, 6839, 2786, -5236, -1896, 3823, 108, -3334, 1019, 2058, -3976, -2971, 5019, 2906, -6350, -4349, 4090, 3072, -3269, -888, 3393, -454, -2409, 3079, 3938, -3649, -4280, 4615, 5013, -3326, -4115, 2583, 1488, -3685, -1364, 2271, -1848, -3470, 3955, 5650, -3585, -6772, 2123, 5431, 34, -1520, 2946, 886, -4081, -124, 4304, -1190, -5441, 1774, 6172, -1224, -5205, 897, 3680, -1368, -1896, 2668, 588, -4083, 494, 6026, -1019, -8311, -2724, 4467, 1077, -2714, 1387, 2085, -3735, -2337, 4097, 2307, -3641, 130, 7283, 2728, -4928, -1628, 3962, 1128, -2065, 1929]
1500A929j01n803J035P376j967r162J974Q018m18n892K078L149m127j813N821
1515B097J542p033N6Q529j50q245p68O251L71l935K375L046n240k794O235K008
1531D345p381k404P782K595o422j752L846j571l285M394M255n715m765P130M530
1546E582n947m350N475K334m254L24M999k534m892L411N043n417n687N878O250
1561F215m832n018L555P18m319K347O315l081p419K874P387l230o175L219N272
1576C828l836l043M908Q74n424Q18O637j699q299K198P778j107o073J219L218
1591A997l865j165N853J537p998q83P416O33o804k04O157j016m677K935L063m463
1607a484k615O616K326p391k520P121K518n581o34M155j856l695L525L986n041
$$ y = [1929, 1828, -3975, -2940, 4436, 2469, -6693, -4719, 3299, 2881, -3011, -933, 2216, -1911, -3724, 2097, 3639, -3394, -3338, 5191, 5041, -3204, -3972, 2279, 2650, -1285, 1090, 4136, -1104, -3898, 2337, 4345, -3036, -5440, 2342, 4937, -1485, -3237, 609, -962, -4247, 147, 4402, -1313, -6078, 1052, 5582, -365, -4715, 760, 3094, -1160, -836, 4163, 1629, -3263, 148, 5191, -226, -5913, -35, 6215, 1383, -3635, -80, 638, -3681, -1334, 4981, 1900, -5519, -2645, 4742, 1512, -4663, -1444, 3828, -8, -3051, 1857, 2731, -2693, -1875, 4762, 3063, -5236, -3038, 4740, 3633, -2440, -1221, 1997, -1868, -3033, 2820, 4357, -3641, -4524, 2892, 3525, -3279, -3483, 2674, 1658, -3019, -84, 2979, -1484, -4099, 2517, 4843, -2548, -5068, 2053, 4571, -1010, -1644, 2511, 655, -3040, 485, 4471, -570]
1622e70m034O178L975o174m373M582K244m072P58M355k470n478L692N499m365
1637b53m758M713N508m011l786M412P29m649J167N321k297o361K977O721k945
1652B488o887K201M074k742j159M598O27o665q36O494p04o292J911O932j697o039
1668c696J658L514l244j028N832J345o516p74P269N32o734o16N495j175l218K779
1684A423K908n588l972N033L022n981j355O559J469o105j159M312j287l089M400
1699E90M264m577m699N238L847n388l133N359J932m019L61M356k552n573K879
1714a115N695l498m611L891L855m535l594L696J185m182Q33N862j740o163J560
1729b861N883k558m772L422M654k795k255L928j71n644M70O873m1o226P17N117
$$ y = [-570, -4604, 1574, 5549, -625, -4998, -416, 1828, -2244, -1486, 2869, 399, -5079, -1387, 4112, -253, -5011, -298, 5210, 1199, -2587, 1825, 2554, -2095, -928, 4393, 2096, -4265, -1288, 5433, 2488, -4399, -2198, 1876, -866, -2025, 2573, 3200, -3465, -4301, 2193, 1489, -4803, -2892, 4040, 2343, -3696, -2038, 1476, -1768, -2796, 3036, 4381, -2135, -2909, 4360, 4892, -1842, -2458, 3037, 1862, -1356, 1423, 4331, -1257, -5229, -196, 2826, -3155, -4510, 2049, 3518, -2587, -3746, 566, -721, -3810, 590, 4854, 277, -4422, 816, 4663, -725, -3858, 1501, 3433, -586, -225, 4131, 1579, -3994, -1115, 4580, 1082, -3529, 362, 4217, -318, -3912, -216, 969, -3213, -2380, 3482, 1742, -4421, -2861, 3022, 464, -4308, -886, 3768, 973, -1282, 2646, 2475, -3169, -2699, 4174, 4133, -2093, -1376, 3741]
1745C741k271n220K924L558l595k258M841J121o355r63O378L43n421N36N453n50
1761B262m362K447K732m950k523N792L524n701k011M742N17m907Q7N275j039m261
1777b376L148L284m575m113M486L911m722k421M300R62m041OM361k294m346L337
1793a093N057k655m600L075L670m188j878M502J631m768M18M662j842o063K188
1808a884N402k276m510L169L056l814k202M103J016m752L26N666o20o112P88N206
1824B562j560m060K656L463l588k318M762J673n665p05N333N04m789P5M839j630
1840A552m384K197L023l587k421M996K439n858k025M963R53m642N89M861j516
1855A140m628K999M190l636l355M151K800m216k130M799R10m437p6L742j399m381
$$ y = [3741, 1470, -3750, -826, 2732, -863, -3121, 1720, 2841, -3514, -4477, 1901, 2244, -3177, -2641, 2812, 2262, -2100, 347, 3079, -1871, -4394, 1398, 4922, -779, -2790, 1952, 2469, -2438, -2351, 2924, 1885, -2376, 772, 4056, -519, -4632, -146, 3765, -957, -3378, 922, 1884, -2157, -2151, 2210, -84, -4430, -1093, 3964, 1309, -3291, -216, 3454, -734, -2612, 1890, 3521, -1247, -829, 3833, 1991, -4072, -1884, 3518, 1242, -3268, -99, 2957, -857, -3059, 1044, 2060, -2692, -2366, 3300, 2680, -3432, -2644, 2562, 1002, -3058, -402, 3061, -527, -2845, 1917, 3590, -2075, -2780, 2553, 3057, -1732, -1657, 3182, 1552, -2832, -635, 2388, -1199, -3620, 1376, 3815, -2043, -4068, 895, 1848, -2794, -2205, 2656, 1140, -3488, -489, 3701, 65, -3290, 861, 3661, -555, -2685, 2114, 3024, -1413, -1489, 2253, 854, -3527]
1871c527K847M662l433m354L327L166l654j984M198Q74m605K93M749j162n083
1886c686J710M984j961l778K967L689l756k525L713J540m900J89N468o32n324
1901b302L02M396k053l698K676L227l285k510M361J537n578j059N710M06l947
1916a817O99M264k166m093K473L622l157k434M928K214n295k081M509O66m273
1931a941Q3M707j599l640K098L215m139l710M105L363l349j765M268j1m599K4
1947b890M923q20l664K493M313l114m483L329K775l277j676M378Q17m595k38L989
1963B260j174m793J931M854j800m019K641K154l736k235M380J394l743J84M841
1978C139j207m707P96M406j371l008L196K754l538k773L660J357m842j1M772n3
$$ y = [-3527, -680, 3982, 549, -3805, -478, 2688, -966, -2950, 1248, 2122, -2483, -2190, 2559, 1397, -3686, -1976, 3008, 1047, -2731, 236, 3925, 169, -2356, 1357, 2897, -2003, -1814, 3654, 3022, -2302, -2000, 2396, 343, -3355, -679, 2548, -737, -3247, 1114, 2651, -2927, -3986, 1724, 2130, -1817, -1118, 3146, 980, -3113, -640, 2982, -175, -2609, 2319, 4533, -762, -2843, 1666, 2332, -1941, -1858, 2849, 1250, -2390, -292, 2923, -1216, -4926, -821, 2542, -807, -2572, 1696, 1685, -2914, -2890, 2033, 1213, -2451, 42, 4355, 1241, -3242, 87, 2862, -415, -2091, 2287, 3104, -1491, -1729, 2260, 1086, -3707, -1776, 3078, 1278, -2741, -100, 2054, -1682, -3917, 463, 1857, -1886, -1702, 3139, 1932, -2775, -1979, 2427, 1056, -1952, 1244, 3998, 460, -2313, 1347, 2704, -2138, -2149, 2623, 2570]
1994B570m361J72L960k572l605L079L722l255k443L859J536m822j550M844P43
2009A877l577O00M228k027l824K202L424l319k606M219K876m144j740L230K79
2024A698m147Q91M276j313m203J943L534l225l152L323K874l111j943L849M83
2039A777l726l56M415p52m036J426M725j882l725K566J869k976k185M549J523
2054C212m307n95M260r12m574R75M157j700l193K487K621l219k120L412J358l967
2070b105m26M710K36m011L49L797j459m088L338K772k992k372L959J521m282j485
2086b538L604P37l369M88L695j983l873K261K955k870k527L951K252l572j767
2101b556L742L74l895O78M470j167l891K333L474k847l302K756K576l112j010
$$ y = [2570, -1791, -1619, 2341, -231, -3836, -757, 2965, -290, -2733, 1126, 2662, -2160, -3710, 1134, 1877, -1700, -1100, 3128, 1101, -2723, -521, 2903, -416, -3022, 1197, 4073, -71, -1811, 1419, 1698, -2449, -1558, 2718, 1405, -2798, -855, 2679, -546, -3698, -375, 2499, -612, -2555, 1294, 1777, -1949, -2305, 2110, 1358, -2678, -1252, 3473, 1591, -2134, 432, 2301, -675, -2860, 1689, 3212, -1095, -1690, 2570, 1658, -2916, -1941, 2216, 516, -2677, -190, 2431, -788, -2908, 504, 1862, -2105, -2531, 2179, 2415, -1596, -1247, 2550, 1091, -2997, 341, 3113, 121, -2251, 1708, 3229, -1053, -2538, 1066, 1803, -1566, -1078, 2617, 634, -3239, -978, 1977, -893, -3420, 531, 2783, -789, -2556, 1186, 1560, -2335, -1657, 2813, 1646, -2245, 88, 3562, 715, -2587, 169, 2745, -367, -1377]
2116a377L699o9m091n32L944q69l802K319M041k681l342K135K094k601j488M441
2132A821P29l909k09L767l75m128J194L836j698k678K453K423l691k389L641J611
2148B398m095j22M551m50l961l47L533j333l102K926K653k895k658L664J157l632
2164a713o55L918R04l956J001L544k146l389K443L012k928k349L360J723l456
2179f87j703L518K93l467O83M179j895l625J864L308k628k859K985K149k716j143
2195a744L100L38l893K10M299l61l729J040L580j795l627K809K020k370k001L180
2211A056R00l656j28L879n80l845N99L464j131k868K430J629k855j822M032J047
2227B151l713q12M325k46l883J144L306j330k857K394K617l015k271L241J774
$$ y = [-1377, 2322, 2253, -1838, -2370, 1574, 705, -3097, -778, 3263, 582, -2760, -625, 1469, -1132, -2620, 1821, 2550, -1359, -1568, 2199, 1824, -2304, -1110, 2726, 1028, -1650, 803, 3226, -465, -2854, 787, 2398, -1697, -1819, 2732, 2282, -1679, -2026, 1507, 174, -2928, -2, 2651, -244, -2902, 762, 1919, -1713, -2368, 1550, 2454, -1502, -501, 3043, 897, -2492, -49, 2963, 35, -2314, 1046, 2769, -687, -2390, 1128, 1421, -2046, -1363, 2816, 921, -2704, -840, 2468, -160, -3019, -34, 2115, -601, -1744, 1356, 1694, -2199, -1989, 2310, 1949, -1780, -740, 2840, 1045, -2582, 227, 2247, -123, -2124, 1056, 1956, -1700, -1828, 2051, 1471, -2374, -1775, 1689, 558, -2310, 120, 1749, -1106, -2928, 1104, 2151, -1562, -2374, 1951, 1705, -2178, -1034, 2272, 942, -1915, 479, 3096, 81, -2190, 1051, 2825]
2242B825l801j508L663J48l561R18L215j762l013K191K665k325k465L302K191
2257B683l310j285K950L40l043M83L930j321l845J916L172j898k797K301K126
2272B402k519j297L155M3m088L80L416r67l401J063L520j811l150K292K283k330
2288a009j279L659J091l265j05M036p57m110J157L458j390k980K067J642l227
2303a012j596L344R85l450o76L334J46l207R39K589j491k903K449K531k626k195
2319b839L715J198l297j026L928O89k918O07K974j513l002K472K390l009k530
2334b161K910J201k883j854L064L44l128j13M185j141l610K141K955k000k486
2349b576K766K171k914q47K815P20l379J95L457p32l402J286L151j867k501J826
$$ y = [2825, -976, -2484, 1179, 1327, -2234, -1316, 1899, 137, -2876, -685, 1980, -345, -2810, 492, 2683, -627, -1912, 1038, 1378, -1665, -1182, 2748, 1427, -2418, -502, 2670, 772, -2025, 276, 2402, -117, -1414, 1741, 1784, -2304, -1924, 1492, 525, -2876, -1813, 1707, -104, -3254, -962, 1321, -1009, -2288, 1371, 2462, -803, -908, 3128, 2371, -1739, -582, 2876, 1486, -1494, 573, 2215, -1012, -2608, 736, 1721, -1729, -2405, 929, 1075, -2132, -1193, 1396, -95, -2998, -549, 1982, -644, -2839, 876, 2074, -1223, -2249, 1679, 2368, -550, 57, 3031, 1518, -1484, 988, 3378, 369, -2161, 749, 1950, -933, -2787, 277, 621, -2507, -2620, 1565, 424, -3186, -1045, 1910, -90, -2576, 190, 2361, -553, -1400, 1415, 2135, -1244, -1049, 2408, 1676, -1726, -440, 2711, 844, -1657, 169]
2365A69J670k519j221K967L57l533R6L538p13l215P51L008j253k147K064K126
2381B145k636j791L420J312l526n65L370k45k977O63L233k093k413K251K271k550
2397a31j960K989J315l310q10L072K55l108O17K637j154k625J942K680k506k433
2413b530L139J657k854q08K792L8l516P11L254j083l286J434K920j918k130K504
2429C24J952k565j401L099Q64l149p8L134j103l263J160K793j740k352J692K083
2445A450k571j118L387R02l071l43L854r47k792M47K850j733k397K401J877k857
2461f61j816K763J105k819l06L439J73l303N98K882j641k367J965K243k587j880
2477b212K715J087l021o88K849O18k860Q64L396j603k877J521K361j899k086K525
$$ y = [169, 1839, -680, -1901, 1066, 1423, -2110, -2014, 1524, 811, -2404, -1653, 1355, 102, -2045, 19, 2145, -491, -2282, 1138, 2450, -1076, -1641, 1729, 1484, -1493, -830, 2403, 310, -2103, 148, 2419, -131, -2091, 898, 2213, -1097, -1907, 1165, 1420, -1688, -1071, 1566, 412, -2213, -271, 2409, -97, -2530, 609, 2266, -588, -1396, 1396, 1434, -2082, -1371, 1883, 800, -2486, -1052, 1868, -50, -2180, 324, 2276, -289, -1690, 1409, 2273, -876, -954, 2180, 1077, -2186, -1026, 1767, 27, -2325, -633, 1450, -1121, -2239, 1148, 2050, -1021, -1364, 2490, 1543, -1249, -802, 2048, 315, -2082, 319, 2196, -661, -2477, 286, 1391, -1428, -1734, 1705, 1878, -1425, -827, 2055, 414, -1953, 12, 2255, -332, -2212, 503, 1590, -1431, -2119, 730, 1348, -1512, -648, 2748, 1145, -1732, -211, 2150, 251, -1835, 690]
2493F90J539l249j005K703K96l297P98L310j141k992J799K383j590k251K531J736
2509B260k446j316L197K50l453J92L265r57k787J720K410j952k155J936J040k651
2525a447o29L114O10l097p47L307n07k940J358K820j620j668J714K198k711j384
2541a629K887N56k707J43L011k47l626M74K889j423k304K349J820k500k083K403
2557A3J714l172q59L069L30k915P10K617j321k545J946K306j678j589K090J769
2573B485k816j013K923K48k919N7K926r45l004J116K640j708k332J892J787k062
2589g25q19K472J98l008O8L457q58k435J074K469j684k421K546J232k161r32K918
2606A391P54k858n19L236n65l030J347K088j567k032J851J457k673j457K982P48
$$ y = [690, 2229, -1020, -2025, 678, 974, -2323, -1525, 1785, 644, -2348, -549, 1834, 244, -2007, 524, 2260, -186, -1502, 1695, 1945, -1508, -1316, 1949, 992, -1795, -75, 2335, 383, -1772, 164, 1204, -1447, -2076, 1038, 1648, -1449, -2196, 1111, 604, -2336, -978, 1842, 222, -1446, 268, 2466, -245, -1629, 1258, 1814, -893, -750, 2261, 2014, -1612, -1138, 1751, 328, -1976, 373, 2193, -307, -2390, 13, 1727, -1445, -2304, 765, 1095, -1820, -1110, 1507, 186, -2359, -413, 1893, 215, -1374, 716, 2485, -331, -1344, 1579, 1827, -1092, -1035, 1891, 946, -2058, -942, 1698, -10, -2342, -450, 1337, -725, -1544, 928, 1126, -1882, -1814, 1643, 785, -1650, -576, 1893, 209, -2212, 334, 1566, -595, -1527, 1391, 2145, -713, -1232, 2004, 1439, -1591, -244, 1844, 277, -1755, 96, 1553, -1120, -2577, 405, 1153]
2622A153k954k57K711M36k557O26K174q49j946J633K384k284j981K695R80k695
2638g31n34K285L05k458M62K539j129l428K176K248k117j746K514J688l345o97
2654a968K412K95k549R02K658p65k498J249K119j742k149K423J900k061r28K298
2670A596Ll117j19L633p22k646P97K298k181j914K553J165k496q92L152O91l038
2687a237m47K723j97k761J219K845j178j955J499J593k955p50L095R34k816n70
2703i58K329l18k836M86K556j079k018J954J843k401k179K426J387k507m16L003
2719A272p7k518L31K431j208k290K288K085j712j760J992O54k063r35K421P23
2735A634k992Q17K689j622l161J774K438j687j874K091J364k575o03K286L38k719
$$ y = [1153, -1801, -2058, 653, 1089, -1468, -842, 1332, 483, -1463, 170, 2554, 270, -1711, 984, 1964, -731, -1265, 1020, 1325, -1133, -671, 1868, 739, -2689, -513, 1735, -382, -2128, 386, 2074, -1271, -1968, 444, 739, -1810, -908, 1750, 985, -1513, -264, 1855, 113, -2036, 387, 2287, 226, -702, 1596, 1599, -1518, -1637, 1996, 1274, -1372, -575, 1723, -458, -2372, 181, 1346, -1150, -2042, 1110, 1801, -1237, -1684, 1039, 842, -1919, -700, 2145, 967, -988, 511, 2104, -851, -1601, 1494, 2428, -388, -958, 1371, 1053, -1783, -1297, 1259, 180, -1838, 116, 1959, -442, -2621, -195, 1192, -1315, -1731, 1272, 1195, -1323, -992, 1439, 231, -2059, 229, 2314, 602, -1158, 834, 1488, -575, -1510, 911, 1634, -1358, -541, 2148, 526, -2635, -861, 1577, -110, -1984, 107, 1471, -1104, -1707, 579, 917, -1802]
2751a802M89L389p96k620R76K257j740j468K042J384k137j234K624N04l128l87
2767a647K754O6k887R59K169j095k465J828J794k353r31K899Q48l037o33K280
2783E49M09k514R51K305j058k230K011K152k179j895K679R07k541m85K583K46
2799A890l188J63K247j115k272J795J820j882j941J952J425k209m50K356P01k486
2815a194O00K621n99l192J149K810j656j815K142J359k547p89K169J18k879M00
2831a303L066o29k766R15K141k092j988K098J721k062r13K701J88k743j7K733
2847A050L88k623J045K052j109k030J899J185k446j039K976J027k926p63K266
2862I52n12k638J076K415j049k119J622J872k608j881K795J299j995j46K346j99
$$ y = [-1802, -1313, 2076, 1280, -1340, -364, 1893, 153, -1315, 727, 2111, -26, -1260, 1364, 1868, -1260, -1647, 1107, 1173, -1714, -755, 1414, 319, -2146, -318, 1476, -877, -1808, 1091, 1939, -1098, -1731, 549, 958, -1556, -605, 1700, 642, -1588, 423, 2575, 396, -1499, 1180, 2087, -454, -939, 1644, 1890, -1298, -1135, 1112, -3, -2275, -480, 1340, -542, -2483, -531, 894, -1315, -1765, 591, 1292, -1194, -594, 2027, 1428, -1764, -615, 2195, 539, -1276, 866, 2225, -322, -1111, 1058, 1176, -1703, -1303, 1763, 1134, -1632, -717, 1424, -668, -2656, -558, 1163, -899, -1812, 889, 1077, -1666, -1683, 1050, 1438, -1185, -140, 1912, 803, -1227, 672, 1857, -589, -1628, 1348, 2375, -551, -1314, 952, 440, -2198, -1122, 1293, 244, -1875, -253, 1619, -989, -2870, -75, 1224, -771, -917, 1429, 1230]
2878A230k543M95K168q14j908J885K087k307k057K214R19k441n51K814kk508O98
2895f21K521j012k887J563K442j398j451J887O18k519j359K494O60k372K27K863
2911A656r96k752R70K342j250j397K319J046k074j005K431r0k855n7L020j20k318
2928a130Q86J834j576j809K376J397k072r89K757L54k995o95K276k6k521R67K378
2945A412j896j887J810J784k542r05L004J684k325j049K196Nk225N74K577j544
2961F73k451K210J611k080j824J745J096j772o21K510l9k251K55K684j373k265
2977a892J669J969j308k015K145N71k229o96K780L61k756N36K533p42k777J044
2993h07K220j135j882J812J269k172r15K510K82k646k93L495m70j794N68J752
$$ y = [1230, -1313, -818, 1350, 536, -1372, 513, 2600, 293, -1764, 450, 1369, -1072, -1623, 1191, 1189, -1319, -621, 1900, 888, -1999, -436, 2006, 608, -843, 1044, 1662, -857, -2216, 278, 938, -1434, -1207, 1656, 660, -2092, -1122, 1220, -30, -1427, 892, 1938, -136, -1141, 1290, 1200, -1655, -1712, 1308, 1188, -1130, -244, 1590, 14, -1795, 581, 1978, -94, -1083, 1674, 2028, -967, -1662, 614, 588, -1933, -966, 1412, -484, -2371, -561, 1223, -1319, -2224, 780, 2464, 139, -910, 1286, 1291, -934, -360, 2217, 673, -1778, 432, 2043, -37, -1861, -116, 980, -792, -1413, 1097, 1058, -1193, -938, 1746, 373, -1892, -223, 1746, 438, -1577, 568, 1139, -1090, -1786, 994, 1355, -1401, -865, 1668, 926, -1851, -807, 1413, 278, -1604, 208, 1477, -695, -1610, 900, 1182, -1464, -1757, 1738, 1268, -526, 42, 1794]
3009A794j465j755J864J337k032j184K683J20k512n80K121j47k084J031K087j637
3025c59j473J463J483j988j479K892J626k402m37K072j00k073R46K326j206k235
3041i44J672J840k088k049J554Q33k087l12K351n32k230J80K026o62j938J267
3057a119K740j513j505J484J218j909o93K696L36k499L99K712q06k640J164J879
3073A944j106j569J740J214k662j211K263m1k373QK164j25k638R66J744j207j443
3090b332K561J715k313p98K644O96k635k39K167J92k383R11J540j340j972J658
3106G2J263k086r87K340J069k606p44K225m4j939P21K136j254k182J332J908j743
3123e19j598K363P23j451l98K479pk726L84K554r78k077R88K001j566j631J449
$$ y = [1794, 329, -1426, 438, 1775, -257, -1441, 1242, 1362, -1150, -1730, 391, 244, -1840, -809, 1278, -359, -1832, -369, 1114, -874, -2353, 539, 2165, -237, -674, 1398, 1298, -775, 171, 2497, 1291, -944, 728, 2568, 480, -1569, -15, 818, -1269, -1581, 770, 238, -1992, -1812, 214, -448, -2386, -1119, 1621, 108, -1397, 87, 1305, -604, -1297, 1399, 1735, -764, -365, 2347, 1541, -1099, 65, 1944, 838, -731, 1009, 2223, -439, -1650, 613, 572, -1801, -1793, 371, 246, -2392, -1426, 318, -889, -2332, 229, 1944, -369, -1167, 1477, 2173, -462, -701, 1466, 1658, -725, 186, 1726, 386, -1586, 72, 1335, -751, -1738, 602, 1671, -935, -1679, 546, 502, -1437, -716, 1420, 166, -2016, -684, 1224, -519, -2117, 246, 969, -482, -880, 1599, 1592, -1134, -750, 1804, 826, -1251, -263, 1738, 172, -1459, -10]
3140a0J021j979k45K322J08k610K59K651q97k405J245J989j622q85J472R64j929
3157e51q37K078O09k413J39K178j86k349Q21J653p36j947J764J307j878r22J848
3174E78P54k361k38K501j1k300Q45J965j762j868J592K055k316j032K291O84k296
3191i19m68K526j51k012O67K274j331k101J644J282j392j510K140R67k151p5J644
3208A034l36k343O88K006l53k487J340K142j569j620J844P42j770m38K122N45
3224A547k692L20K153q45j990J180J930j499j506J533J231k073o75K057L39k116
3240a106k7K093m88j826M57J864j157j211J474J434k024q34K093M96k000K6K054
3257A318k31k262R07J658j357j446J284J931k017j366K159P64k362j99J927j75
$$ y = [-10, 1011, -968, -1213, 1109, 1217, -1393, -1134, 1517, 620, -1785, -540, 1449, -173, -1058, 414, 1378, -551, -1388, 690, 1299, -1114, -975, 1203, 1017, -1332, -511, 1142, 406, -1541, 223, 1530, -348, -1270, 578, 1332, -1029, -1267, 1234, 1223, -1077, -232, 1733, -29, -1897, -305, 1750, -566, -1598, 693, 1377, -919, -1387, 1139, 988, -1024, -357, 1917, 586, -1515, 129, 1411, 19, -1491, 649, 1616, -535, -610, 1034, 698, -1645, -957, 1049, 696, -1791, -451, 1691, 122, -1498, 346, 1088, -682, -1120, 1002, 1547, -1145, -825, 1328, 483, -1507, -327, 1603, 104, -1402, 131, 1362, -711, -1386, 671, 1010, -1106, -1133, 960, 472, -1354, -897, 967, -190, -1401, 73, 1507, -517, -1351, 742, 1238, -762, -736, 1318, 1087, -1175, -268, 1390, 33, -1413, -129, 1802, -215, -1581, 578, 1342, -1020, -1219, 708, 533]
3273E33k026O64K384j278j806J165J688j489j233J837J034j925l65K074l46k006
3289a095M57K123r05j598J076J455j580j831K164P48j580p68K109K55k059P1J825
3306H67k63j951Q09J685q65j420J395J010j921n72K638m3k021l13K096m91j725
3323a085O98J808j412j355J676J036j895j286K133R68k117o5J851m48j817N35
3339g75K113j258j542J482J734j709j246J996O45k038P5J526p5k130P00K021r83
3356E36k088J378J263j488r89J568J079j846o61K048k36j730L00K124o11k095
3372a448J230J442j221j166J530Q58j851l04J989K54k309K55K143m32j983Q97
3388a16J120r37j391J367R30j802q58K129L88j861J57J813j16k331J282J726j185
$$ y = [533, -1493, -829, 1555, 277, -1529, -364, 1324, -165, -1398, 439, 1473, -452, -817, 1257, 911, -1095, -638, 1485, 580, -1018, 58, 1513, -67, -1898, 266, 1014, -566, -1334, 775, 1030, -1029, -958, 867, 604, -1347, -538, 1147, 282, -1138, 257, 1267, -654, -1226, 1412, 1369, -652, -965, 1131, 640, -1085, -387, 1421, 9, -1346, 330, 1366, -529, -1815, 318, 1286, -831, -896, 955, 507, -1310, -775, 1338, 80, -1462, 20, 1754, 45, -1201, 795, 1440, -598, -523, 1003, 928, -1202, -502, 1519, 536, -1552, -174, 1089, -399, -1388, 180, 1259, -587, -1248, 800, 564, -1166, -866, 1258, 647, -1448, -218, 1224, 3, -1163, 367, 1225, -626, -930, 1059, 1313, -996, -741, 1402, 970, -1013, -116, 1004, 67, -1324, 43, 973, -829, -1687, 442, 830, -1031, -874, 939, 823, -1508, -226, 1500, 315]
3405C15j300J067J241j782q99J724O89j744j66K120m51j834N37J650r60j386J633
3422D54P91j293j282J829K50j817n53K423j60j904N78J775r22j751J546J589j338
3439B15j397K113L95k181n6K175n80j796O05J714r62j669J103J743j642j008J685
3456D57M52r59j154J836K22j840K90J856m95j882J043J124r34j132J576P07j137
3473C0p84J835J66k007m2J743l24j641P62J170p25j634J181J177j480p78J618
3490B67L45j467j34J531R5j549M99J330q33j361J512J307j487r72J292Q99j701
3507d27m65J971o66j549M34J501r64j363J213J263j413j074J684R18j972N8J496
3524F45o0j493L75J857q96j362J050J117j197q07J625L25j558l16J861r1k025
$$ y = [315, -985, 82, 1323, -459, -1358, 366, 1055, -689, -855, 1265, 814, -1020, -483, 1167, 207, -1179, 454, 1245, -48, -1330, 499, 749, -1068, -1621, 802, 642, -1262, -684, 1091, 169, -1582, -36, 1553, 215, -1182, 931, 1326, -855, -911, 1264, 684, -1112, -507, 1207, 245, -1424, -321, 1422, -220, -1228, 457, 909, -50, -1204, 632, 854, -986, -696, 1160, 665, -1217, -174, 950, 16, -1116, 460, 1167, 30, -754, 1081, 1247, -760, -802, 941, 617, -1024, -262, 908, 183, -1451, -270, 907, -573, -1351, 267, 612, -855, -989, 542, 637, -912, -413, 917, 84, -1277, 235, 1542, 55, -917, 375, 1274, -427, -892, 1079, 413, -1136, -702, 799, -165, -1528, -315, 948, -465, -1539, 145, 1063, -909, -851, 645, 585, -908, -533, 1324, 428, -934, 116, 1233, 36, -771, 854, 1179, -379, -695, 1166, 1075, -950]
3541i50L74J705m99k223R51J329j032j251J259J092j554r64K314J69j773L86J436
3558G69J67j560R93J008p57j285J450O97j556n74J264N97k012j11J621o71j489
3575a449P03J600j092j315J718O27j205r49J699M00j701K5J665J65k054O95J932
3592A464r97j182J197J043j112j128J651K28j482n17J635J92k204M37J603j124
3608b96j433J127J364j375n41J382M31j191m67K134m25j448J22J596j03j815J142
3625B04J059j080j248J358O76j321o33J726K53j689K11J375l69j434P75J286j260
3642a11j299J821N36j486o57J383R08j914p8J556k05j452M05J566j058j054Q49
3659b90J354j439p14J785L03j333p43J889k8j674O55J441r52j191R12J163j471
$$ y = [-950, -576, 1129, 630, -1593, -642, 687, -345, -1596, -337, 755, -799, -1763, 551, 720, -1053, -667, 769, 936, -624, 369, 1377, 620, -665, 785, 1482, -74, -648, 616, 1213, -799, -910, 711, 40, -1449, -746, 854, -238, -1553, 165, 792, -413, -1362, 337, 737, -964, -939, 726, 891, -1163, -468, 1464, 467, -715, 482, 1525, 413, -715, 936, 1164, -318, -835, 800, 992, -1212, -775, 828, -296, -1729, -602, 762, -613, -1154, 228, 659, -532, -999, 1135, 710, -738, -616, 980, 877, -938, 204, 1263, 183, -1065, 293, 969, -352, -985, 741, 994, -695, -484, 891, 522, -912, -137, 1149, -111, -1410, 411, 947, -539, -1196, 187, 1095, -819, -897, 659, 454, -998, -593, 973, -85, -1139, -290, 1064, -375, -1089, 696, 999, -334, -1077, 812, 784, -890, -235, 1206, 254, -937, -25, 1138, -333]
3676c33q03K032k7j350m38J578P3j716N42J185l83j244J22J584q73j031J179P13
3694H10j538K0J627j19j584K61J452k28j434M58J509r20j205J077Q65j715m47
3711a111J721Q7j786L74J646n95j269O01J323r83o45O32J131j111p64J226L39
3728H16j559P4J471k27j752O96J519j136j084J239J162j721m29J458L49j197n11
3745h32J841k81j662N99J407o54j302P63J223j363n12J218O12j648j35J351j38
3762D87j534k2J828m55j600J046J098r77q20J226N13j081m31J654q3j519M20J517
3780A267q37j040P80J006r86j202J368N53j386q67J733O11j919j35J508m02j005
3797i53N03J162p33j013R16R76j009q58J630J81j165M4J545n47j311L88J181m47
$$ y = [-333, -1136, 896, 869, -481, -919, 659, 732, -984, -442, 743, 360, -884, -762, 822, -51, -1082, 97, 810, -728, -708, 919, 800, -784, -523, 929, 701, -733, -275, 1234, 314, -891, 186, 1051, -664, -1111, 610, 697, -1089, -715, 931, 336, -933, -332, 991, 8, -637, -5, 1126, 15, -749, 477, 816, -743, -669, 802, 575, -1177, -481, 1038, -98, -1182, 57, 1219, -502, -931, 527, 876, -321, -832, 1009, 728, -934, -335, 1072, 418, -884, -121, 1102, -261, -773, 445, 1057, -591, -726, 625, 487, -1047, -1069, 759, 304, -1296, -250, 848, -129, -949, 277, 790, -291, -722, 932, 849, -670, -250, 1267, 430, -610, 170, 1176, 190, -1012, 356, 909, -477, -1344, 389, 1000, -919, -1054, 454, 52, -953, -450, 712, -21, -1034, -118, 858, -151, -1009, 621, 802, -363, -319, 1226, 679, -632, -244, 937, 490]
3815D90j246R83J245j596p87J343r0q92l90J580l21j530Q62Q73n99j272P51J305
3833G09q62n96J126L53j170l22J699mj682L32J656m81j620O48J003j015l35R49
3851C88M9r21l56J406k08j431K83J635m22j421Q96Q79p31j009J068Q86j528l03
3869h40J450K55j348k68J738p05q20N14J288j087j190J292M97j116r02J953J6
3886G27j398j23J377k86j289N59J410j034p03O05J150j295p15J397M58j285Q3
3903c62J410n00j303M08J187p84n67N56J122j481o77J382L98j376k88J464J7j472
3921h66J98J552r27r46P18J203j163n17J114M23j258m61J913m59j013K14J290
3938A015m04j198N49J316j089j144J027P84j148o13J354K34j447L4J189k13j227
$$ y = [490, -756, 227, 1472, -124, -911, 432, 342, -550, -940, 640, 319, -1211, -349, 524, -75, -1347, -596, 709, -153, -749, 377, 730, -440, -762, 937, 933, -749, -417, 1239, 758, -862, -214, 789, -226, -561, 388, 437, -484, -840, 566, 358, -1073, -790, 845, 423, -998, -102, 777, 46, -963, 105, 991, -537, -840, 610, 865, -483, -751, 987, 282, -538, -24, 1264, 177, -1013, 279, 776, -340, -1242, 711, 727, -671, -794, 583, 297, -992, -433, 977, -57, -760, -155, 995, -300, -1015, 382, 840, -445, -362, 1048, 548, -755, -347, 840, 56, -511, 45, 1167, -314, -991, 391, 789, -587, -875, 589, 606, -866, -668, 884, -43, -989, -271, 932, -231, -748, 366, 789, -469, -930, 983, 524, -489, -275, 1015, 611, -587, -38, 1278, 189, -955, 72, 856, -292, -905, 449, 683, -764, -730, 459, 246, -981]
3955i81P39Q88p37r42J120P61r83o56J609J35j489L38J095m11j251O40J563r97
3973D41j328J031O72j239p44J393J42j070j91J435l42j037MJ381m66j006P47J165
3991I88p94r10J266K65j041l07J073O4j240L66J555p80j390J018P77j107p78J138
4009A63R46j710o59J483K41j126k90J687n26j182J012O80q99p84J474L78j075
4026a87m76J484L2j304j82J387j25j824R20J358j249q40J090P65j352m08J262
4043C51L31j209n0J070k44j140N04J210n96p66O44Q37j384k49J188M41j369r1
4061e22J675m39j145K00J302o05j433R12J135j473q08J378L00j362J64J407j12
4078E74j371L31J203n22j100N63J036p07o66J023N92j630k97J516j6j293K09J195
$$ y = [-981, -242, 646, -91, -1033, 87, 848, -135, -791, 818, 953, -536, -198, 897, 486, -765, -125, 1438, 441, -887, 144, 816, -423, -1167, 226, 368, -702, -893, 542, 200, -837, -833, 548, 82, -924, -177, 988, 194, -716, 550, 815, -226, -533, 540, 604, -636, -270, 1285, 505, -885, 133, 910, -197, -975, 163, 1109, -601, -1260, 223, 464, -662, -952, 735, 209, -973, 39, 719, -180, -964, 510, 888, -187, -663, 821, 853, -451, -633, 754, 629, -1195, -275, 1083, -166, -1006, 84, 849, -503, -911, 351, 682, -527, -577, 493, 249, -891, -387, 823, 227, -539, 105, 942, -442, -691, 497, 938, -431, -522, 1153, 714, -431, -231, 1071, 466, -967, -55, 1080, -393, -1201, 177, 477, -885, -721, 686, 574, -797, -466, 737, 215, -885, -322, 714, 7, -659, 364, 956, -674, -971, 545, 529, -764, -555, 640]
4096F40m25q90M38R26r13p84J186N73r00n29J103J35j217o4J698r45j000R10J031
4115I73r69q60J058Q64j306n59J335M42j469P3J262m11j007J003N75j039o56N71
4133a20J030j392m84J034L09j126o1J318k05j227M60J030n11o85P45Q70j206l41
4151e62J041L55q99n71J220J9r43l21J436l52j020O65O66r44q25J122O96j343
4169e60l79J634J29j569K81J400o94j273Q75R61q07p70J157J38p43l98J400r3
4187F89j366M29J145l84j686J350N04n94j208J038J011j345k71J204M11j353j93
4204f19J488n58r99L45J232o33j301R80Q76j111l25J152K51j422J03J122j62j119
4222g00M79J177q13j096Q52P11r88l19J018M03j338l42J502J8j563N59J338p78
$$ y = [640, 215, -675, -237, 689, -224, -1008, 178, 751, -149, -678, 425, 560, -657, -721, 977, 32, -968, -58, 973, 4, -856, 202, 1066, -240, -799, 536, 978, -491, -418, 844, 433, -574, 429, 1004, -35, -691, -120, 910, -482, -966, 68, 377, -749, -810, 508, 303, -924, -464, 566, 55, -630, 115, 985, -221, -562, 479, 834, -65, -636, 584, 603, -340, -661, 775, 423, -597, 68, 734, -210, -1035, 87, 783, -560, -939, 695, 824, -745, -464, 936, 242, -1031, -156, 805, -2, -772, 385, 523, -220, -618, 782, 689, -677, -248, 897, 513, -1173, 177, 681, 87, -1121, -83, 928, -417, -688, 516, 927, -426, -619, 869, 311, -688, -343, 889, 256, -1045, -65, 811, -300, -625, 527, 778, -644, -541, 581, 419, -700, -221, 956, 143, -953, -101, 610, -378, -697, 321, 724, -614, -956, 546, 564, -999, -440, 898, 120]
4240A20p79L89J442j079q77J363K45j113r7Q29M14j577L75R43m12j204J175O85
4258H42j308o28J118M11j025n86J417K28j066L44J131m14j321P74J065r05o39
4275e62R60M66j031m17J421l62p22k34J013k98j042K69J232p91j230J202L69n97
4293c54n40Q89M75j307J43J092O1j190M78J200o80q43Q47N31p49n14P04O02j113
4312b68l40J330l26j213L5J346m67j361Q12R12r63o89J454M83j414K3J260j25
4330D89j255K33J386n01q74N11R46q96n97J035O53j203p55J354J94j252L53R08
4348G29o73q53N33J000r50q50P82Q91j102m05J208Q6r73%J134n02q87O30J269
4367A067j084m86N46O95j006m77J285J55j176k80J581l14j153M76R91q39q27P62
$$ y = [120, -659, -270, 1172, 93, -784, 579, 824, -289, -386, 443, 857, -720, -345, 598, 186, -1018, 157, 842, -466, -1094, 24, 435, -590, -1176, 241, 469, -597, -253, 878, 464, -857, -83, 982, 77, -562, 398, 864, -167, -584, 837, 475, -247, -481, 532, 234, -808, -539, 693, -98, -1328, -126, 243, -354, -894, -5, 470, -837, -694, 398, 459, -731, -253, 947, 267, -576, 271, 802, 53, -461, 243, 845, -268, -608, 722, 396, -817, -782, 564, 97, -1264, -452, 460, -503, -1192, 262, 745, -669, -646, 614, 489, -766, -533, 853, 352, -522, -11, 935, 39, -558, 477, 1130, -73, -828, 526, 720, -532, -179, 729, 56, -797, -264, 736, -214, -1064, -282, 609, -493, -898, 310, 396, -577, -577, 557, 55, -832, -202, 1067, -17, -503, 43, 738, -268, -745, 540, 695, -481, -761, 820, 506, -647, -171, 820, -19, -846, -84]
4385h4Q26j094l91J200n0j125k40J470k78j006M71R47j32j172N34Q97j028n70
4403h25J095N16j304L67P73J34j594J39J269l71r30P39R35r66j169J313L75o65
4421a69o42J165L19j500M31P17o9j059P69J139j164n96R64P26j299m59J392K2
4439F87j395K92Q68j18r93L82J148j049q18R86N77q75n63J206K30j020k50J332
4457F27r5j068K60J160o39q79O18Q20p76n69J015L11j179j79J063j67j000M00
4475b77P23m12j027Q22Q65j365k90J190M01j496K15J076M46j490L54J273q31o49
4493d72M29Q28n14j100J549J51j415n4J215j00j055p1J149k93j197M93J202p67
4511b2q40Q96M51r53l79J401K57r35k93R72m2j420O76O02k60j001J326L78r09
$$ y = [-84, 742, -352, -743, 457, 407, -718, -958, 512, 234, -772, -301, 646, 514, -658, -124, 773, -255, -825, 270, 786, -518, -151, 622, 756, -838, -699, 570, 199, -731, 8, 943, -23, -1192, 121, 496, -169, -811, 354, 673, -827, -396, 321, 252, -807, -38, 1101, -63, -659, 305, 1031, -268, -727, 665, 687, -708, -416, 452, 334, -659, -277, 871, -178, -996, -10, 567, -308, -871, 335, 565, -455, -705, 627, 532, -536, -276, 884, 245, -634, -16, 804, 28, -541, 474, 785, -394, -573, 490, 323, -677, -277, 446, 34, -993, -171, 694, -671, -961, 229, 630, -866, -651, 425, 871, -619, -265, 1008, 177, -472, -43, 785, 271, -829, 720, 871, -544, -598, 617, 517, -538, -609, 540, 247, -950, -457, 745, -22, -862, 34, 485, -468, -847, 554, 811, -124, -417, 555, 513, -907, -231, 371, 111, -890, 436, 814, -95]
4530i5m43J215j39j013K03P20l02r01M99J302j218n39N67R34r31m73J194j05j053
4549e78L5R65Q3j147M1J307n06r77R04O63j030p44J314N63j407j22R86J40j284
4568g94M90R45p37o39R15O19q90p64J205L67j176J12Q37n5j112K62R94l64m89
4587b74J38P27p51m14R45N49j258m92J071P05j576J66J356l90j188M55J200j174
4605b05m29N61O10j080l5R24L40j080p0J167l37r14L14J043p16p21P67Q88j357
4624c30j28P81J57j275J34J181j72j128M70R76n16j143J000O69r80k23Q13M37
4642G23j125j94J355m12r64N13R41m90r40O59M48o24q86J064P36j200n89J419
4660D34k12p81J31Q79j93j354P29J061r34m04Q47K39o75j92R40L04j057J8Q38
$$ y = [-95, -538, 677, 538, -475, -272, 448, 146, -755, -256, 1046, -172, -711, -144, 790, -141, -614, 580, 475, -578, -543, 422, 505, -642, -601, 706, 200, -777, 127, 790, -240, -984, 330, 893, -514, -636, 350, 490, -794, -304, 641, -96, -735, 180, 799, -91, -855, 350, 717, -459, -347, 490, 435, -677, -415, 579, 215, -274, -136, 591, -160, -574, 371, 920, -338, -830, 241, 946, -630, -464, 892, 502, -686, -231, 969, -205, -634, -73, 537, -543, -578, 346, 686, -394, -464, 703, 366, -548, -234, 809, 93, -628, 139, 1027, -330, -458, 323, 480, -795, -661, 520, 348, -780, -310, 666, 150, -993, 7, 676, -304, -527, 286, 723, -402, -596, 759, 347, -617, -104, 837, 347, -593, 66, 514, -110, -996, 68, 804, -396, -985, 434, 222, -559, -428, 451, 258, -1096, -367, 694, -240, -644, 203, 442, -233, -425, 515, 819, -238, -220, 618]
4679F18N1j306N86Q83o68r15J112L15j048k05Q42Nj031K79J100l62j041N27J037
4698G79q89r29R28R37j273j09J130K9j008o2J333k32j363R54Q74j035p69P46M63
4717E04n67o34Q88M36r85m19J156l77r30L57J141m90j108Q93M56m44n85P25Q46
$$ y = [618, 669, -637, -51, 832, 164, -751, 361, 676, -372, -577, 265, 270, -761, -482, 618, 256, -785, -258, 779, -110, -1039, -111, 826, -447, -556, 574, 603, -405, -467, 866, 634, -729, 225, 1099, 64, -705, 41, 504, -63, -697, 191, 627, -358, -777, 379, 2, -928, -571, 570, 80, -1028, -135, 321, -123, -708, 17, 863]
$$ [...]
8191c12
##END NTUPLES=NMR FID
##END=
