##TITLE=1H_CA-6214-1
 DMSO, 8 sc, 
 27.6.2019
##JCAMPDX= 6.0         $$ Bruker NMR JCAMP-DX V2.0
##DATA TYPE= NMR FID
##DATA CLASS= NTUPLES
##ORIGIN= UXNMR, Bruker Analytische Messtechnik GmbH
##OWNER= root
$$ XWIN-NMR		Version 3.5
$$ Thu Jun 27 16:06:23 2019 Russian Standard Time (UT+4h)  she@DPX200
##.OBSERVE FREQUENCY= 200.13155
##.OBSERVE NUCLEUS= ^1H
##.DELAY= (6, 6)
##.ACQUISITION MODE= SIMULTANEOUS
##.ACQUISITION SCHEME= undefined
##.AVERAGES= 8
##.DIGITISER RES= 18
##SPECTROMETER/DATA SYSTEM= spect
##.PULSE SEQUENCE= zg30
##.SOLVENT NAME= DMSO
##.SHIFT REFERENCE= (INTERNAL, DMSO, 0, 15.7039)
##AUDIT TRAIL= $$ (NUMBER, WHEN, WHO, WHERE, WHAT)
$$ ##TITLE= Audit trail, XWIN-NMR		Version 3.5
$$ ##JCAMPDX= 5.01
$$ ##ORIGIN= Bruker BioSpin GmbH
$$ ##OWNER= she
$$ F:/spectra/data/she/nmr/H-F/1/audita.txt
$$ ##AUDIT TRAIL=  $$ (NUMBER, WHEN, WHO, WHERE, WHAT)
(   1,<2019-06-27 16:05:22.57 +0400>,<she>,<DPX200>,
      <created by zg, POWCHK disabled, PULCHK disabled
       configuration hash MD5:
       00 E9 B6 7A A2 85 ED C7 34 08 36 98 17 FE 4E 26
       data hash MD5: 16K
       88 B3 C6 4B 51 2F 77 09 0C 93 7C 9B 07 F2 88 30>)
$$ ##END=
$$ 
$$ hash MD5
$$ 0B 7E 66 78 B2 AD 42 2F D6 86 BF DF A3 7C 76 95
##$RELAX= 
##$RELAX= 
##$RELAX= 
##$RELAX= 
##$RELAX= 
##$RELAX= 
$$ Bruker specific parameters
$$ --------------------------
##$DU= <F:/spectra>
##$EXPNO= 1
##$NAME= <H-F>
##$PROCNO= 1
##$TYPE= <nmr>
##$USER= <she>
##$AMP= (0..31)
100 100 100 100 100 100 100 100 100 100 100 100 100 100 100 100 100 100 
100 100 100 100 100 100 100 100 100 100 100 100 100 100 
##$AQSEQ= 0
##$AQ_mod= 1
##$AUNM= <au_zg>
##$AUTOPOS= <>
##$BF1= 200.13
##$BF2= 200.13
##$BF3= 200.13
##$BF4= 200.13
##$BF5= 200.13
##$BF6= 200.13
##$BF7= 200.13
##$BF8= 200.13
##$BYTORDA= 1
##$CFDGTYP= 0
##$CFRGTYP= 5
##$CHEMSTR= <none>
##$CNST= (0..31)
1 1 145 1 1 1 1 1 1 1 1 1 1 1 1 1 1 1 1 1 1 1 1 1 1 1 1 1 1 1 1 1 
##$CPDPRG= <>
##$CPDPRG1= <>
##$CPDPRG2= <>
##$CPDPRG3= <>
##$CPDPRG4= <mlev>
##$CPDPRG5= <mlev>
##$CPDPRG6= <mlev>
##$CPDPRG7= <mlev>
##$CPDPRG8= <mlev>
##$CPDPRGB= <>
##$CPDPRGT= <>
##$D= (0..31)
0 1.2 0 0 0 0 0 0 0 0 0 0.03 0 0 0 0 0 0 0 0 0 0 0 0 0 0 0 0 0 0 0 0 
##$DATE= 1561637121
##$DBL= (0..7)
120 120 120 120 120 120 120 120 
##$DBP= (0..7)
150 150 150 150 150 150 150 150 
##$DBP07= 0
##$DBPNAM0= <>
##$DBPNAM1= <>
##$DBPNAM2= <>
##$DBPNAM3= <>
##$DBPNAM4= <>
##$DBPNAM5= <>
##$DBPNAM6= <>
##$DBPNAM7= <>
##$DBPOAL= (0..7)
0.5 0.5 0.5 0.5 0.5 0.5 0.5 0.5 
##$DBPOFFS= (0..7)
0 0 0 0 0 0 0 0 
##$DE= 6
##$DECBNUC= <off>
##$DECIM= 24
##$DECNUC= <off>
##$DECSTAT= 4
##$DIGMOD= 1
##$DIGTYP= 9
##$DL= (0..7)
0 120 120 120 120 120 120 120 
##$DP= (0..7)
150 150 150 150 150 150 150 150 
##$DP07= 0
##$DPNAME0= <>
##$DPNAME1= <>
##$DPNAME2= <>
##$DPNAME3= <>
##$DPNAME4= <>
##$DPNAME5= <>
##$DPNAME6= <>
##$DPNAME7= <>
##$DPOAL= (0..7)
0.5 0.5 0.5 0.5 0.5 0.5 0.5 0.5 
##$DPOFFS= (0..7)
0 0 0 0 0 0 0 0 
##$DQDMODE= 0
##$DR= 18
##$DS= 0
##$DSLIST= <SSSSSSSSSSSSSSS>
##$DSPFIRM= 0
$$ [...]
##$SUBNAM2= <"">
##$SUBNAM3= <"">
##$SUBNAM4= <"">
##$SUBNAM5= <"">
##$SUBNAM6= <"">
##$SUBNAM7= <"">
##$SUBNAM8= <"">
##$SUBNAM9= <"">
##$SW= 24.9336996594482
##$SWIBOX= (0..15)
0 0 2 0 0 0 0 0 0 0 0 0 0 0 0 0 
##$SW_h= 4990.01996007984
##$TD= 16384
##$TD0= 1
##$TE= 0
##$TE2= 300
##$TE3= 300
##$TEG= 300
##$TL= (0..7)
0 120 120 120 120 120 120 120 
##$TP= (0..7)
150 150 150 150 150 150 150 150 
##$TP07= 0
##$TPNAME0= <>
##$TPNAME1= <>
##$TPNAME2= <>
##$TPNAME3= <>
##$TPNAME4= <>
##$TPNAME5= <>
##$TPNAME6= <>
##$TPNAME7= <>
##$TPOAL= (0..7)
0.5 0.5 0.5 0.5 0.5 0.5 0.5 0.5 
##$TPOFFS= (0..7)
0 0 0 0 0 0 0 0 
##$TUNHIN= 0
##$TUNHOUT= 0
##$TUNXOUT= 0
##$USERA1= <user>
##$USERA2= <user>
##$USERA3= <user>
##$USERA4= <user>
##$USERA5= <user>
##$V9= 5
##$VALIST= <valist>
##$VCLIST= <CCCCCCCCCCCCCCC>
##$VD= 0
##$VDLIST= <DDDDDDDDDDDDDDD>
##$VPLIST= <PPPPPPPPPPPPPPP>
##$VTLIST= <TTTTTTTTTTTTTTT>
##$WBST= 1024
##$WBSW= 4
##$XGAIN= (0..3)
0 0 0 0 
##$XL= 0
##$YL= 0
##$YMAX_a= 56022
##$YMIN_a= -47063
##$ZGOPTNS= <>
##$ZL1= 120
##$ZL2= 120
##$ZL3= 120
##$ZL4= 120
##$ABSF1= 10
##$ABSF2= 0
##$ABSG= 5
##$ABSL= 3
##$ALPHA= 0
##$AQORDER= 0
##$ASSFAC= 0
##$ASSFACI= 0
##$ASSFACX= 0
##$ASSWID= 0
##$AUNMP= <proc_1d>
##$AZFE= 0.1
##$AZFW= 0.1
##$BCFW= 1
##$BC_mod= 2
##$BYTORDP= 1
##$COROFFS= 0
##$CY= 11.3945322036743
##$DATMOD= 1
##$DC= 2
##$DFILT= <>
##$DTYPP= 0
##$F1P= 18.9103706918063
##$F2P= -1.10871071338519
##$FCOR= 0.5
##$FTSIZE= 0
##$FT_mod= 4
##$GAMMA= 1
##$GB= 0.15
##$INTBC= 1
##$INTSCL= 1
##$ISEN= 128
##$LB= 0.24
##$LEV0= 0
##$LPBIN= 0
##$MAXI= 10000
##$MC2= 0
##$MEAN= 0
##$ME_mod= 0
##$MI= 1.114404
##$NCOEF= 0
##$NC_proc= 0
##$NLEV= 6
##$NOISF1= 3.799351
##$NOISF2= 2.8
##$NSP= 1
##$NTH_PI= 0
##$NZP= 0
##$OFFSET= 15.70392
##$PC= 1
##$PHC0= -8666.122
##$PHC1= 22.80098
##$PH_mod= 1
##$PKNL= yes
##$PPARMOD= 0
##$PSCAL= 0
##$PSIGN= 0
##$REVERSE= no
##$SF= 200.130013532006
##$SI= 16384
##$SIGF1= 3
##$SIGF2= 2
##$SINO= 400
##$SIOLD= 16384
##$SREGLST= <1H.CDCl3>
##$SSB= 0
##$STSI= 0
##$STSR= 0
##$SW_p= 3612.71676300578
##$SYMM= 0
##$S_DEV= 0
##$TDeff= 0
##$TDoff= 0
##$TI= <>
##$TILT= no
##$TM1= 0
##$TM2= 0
##$TOPLEV= 0
##$USERP1= <user>
##$USERP2= <user>
##$USERP3= <user>
##$USERP4= <user>
##$USERP5= <user>
##$WDW= 1
##$XDIM= 8192
##$YMAX_p= 0
##$YMIN_p= 0
$$ End of Bruker specific parameters
$$ ---------------------------------
##NTUPLES= NMR FID
##VAR_NAME=  TIME,          FID/REAL,        FID/IMAG
##SYMBOL=    X,             R,               I
##VAR_TYPE=  INDEPENDENT,   DEPENDENT,       DEPENDENT
##VAR_FORM=  AFFN,          ASDF,            ASDF
##VAR_DIM=   8192,          8192,            8192
##UNITS=     SECONDS,       ARBITRARY UNITS, ARBITRARY UNITS
##FACTOR=    0.0002004,     1,               1
##FIRST=     0,             0,               0
##LAST=      1.6414764,     0,               0
##MIN=       0,             -47063,          0
##MAX=       1.6414764,     56022,           0
$$ Real data points
##PAGE= N=1
##DATA TABLE= (X++(R..R)), XYDATA
$$ [...]
2113b593K648K610j75l062k153P66K952J941j470l252j372K218L404O77k702l163
2129b726k57L055K768n19l017k280J277L158J669j791l216j105K041K919P07k098
2145E85k686j22K198K096k15k396j798Q25K419J644j021k521j369J159K405Q02
2161B005j170k009m75J348J795J87j481j662l12J510J809L57j425k020j43J425
2177b61J801J18j842j623K42K170J718o78k504j745J070K751J334j403k677q04
2193b333J746K380M87k216k418J51K479K376m54k869k037P73K843J758j385k920
2209a639j082K038K995L70k611k750J80K810K473p79k854j620J133K696J007j643
2225G24k544m07J807K273M42j938k238k0J971J750k57j938j397N57J975J194q90
$$ y = [-2593, 55, 2665, 2490, -572, -2725, -1959, 993, 2934, 1464, -1788, -3160, -942, 2462, 3139, 437, -2726, -2983, 72, 2840, 2321, -696, -2976, -1699, 1459, 3128, 1337, -1879, -2984, -943, 1976, 2683, 585, -2101, -2223, -25, 2071, 1856, -540, -2338, -1513, 906, 2550, 1529, -992, -2361, -1202, 1203, 2005, 835, -1174, -1649, -301, 1494, 1681, 200, -1462, -1774, -264, 1545, 1902, 477, -1543, -1686, -261, 1540, 1658, -184, -1807, -1565, 605, 2323, 1645, -859, -2604, -1534, 1217, 2551, 1148, -1529, -2333, -587, 1793, 2280, 64, -2354, -2203, 276, 2652, 2198, -671, -2708, -1935, 908, 2666, 1281, -1639, -2721, -683, 2312, 2682, 71, -2679, -2499, 311, 2784, 2005, -849, -2469, -1336, 1360, 2367, 724, -1820, -2227, -420, 1853, 2295, 357, -1881, -1901, 70, 1820, 1563, -375, -1772, -1215, 760, 1954, 1064]
2242A064k004j042J214J776P55j050j689m79J082J414O9r10j358j05J211J270
2258A218L08j320j586l45J458J745J35j624j682L35J914J403q14k169j326J353
2274i97K372R29j586k364m13J806K040J2k017j873M38K311J636o62k622j570J130
2291a430K711J277j550k644p03K062K403N5k640k081O14K710J890j043k819j201
2307b389J471K354N34j586j952j54J719J760l05j565j720L22J664J541l82j715
2323d03j168N53J734R99j034j803n79J149J725M64j246j573k22J124J293J73j066
2340A20j139o5J138J135J06j315j469n2J604J717j08j990j562N40K146J291j135
2357I62k201r57J662K395M64k053k273LK095K008l46k181j640O83K234J490j177
$$ y = [1064, -940, -1982, -768, 1008, 1763, 713, -976, -1455, -373, 1041, 1110, 200, -1158, -1263, -52, 1218, 1526, 206, -1380, -1725, -267, 1478, 1613, -11, -1693, -1358, 556, 1959, 1145, -1024, -2350, -997, 1375, 2304, 718, -1646, -2059, -253, 1787, 1799, -218, -2091, -1653, 658, 2294, 1632, -990, -2560, -1430, 1281, 2558, 1008, -1636, -2339, -277, 2126, 2181, -459, -2540, -1926, 784, 2674, 1631, -1188, -2389, -918, 1436, 1970, 384, -1568, -1722, -3, 1757, 1452, -113, -1833, -1511, 153, 1694, 1312, -403, -1571, -1018, 716, 1715, 681, -1122, -1701, -552, 1173, 1637, 391, -1182, -1404, -280, 1013, 1186, 120, -1019, -1084, 54, 1189, 1295, -20, -1489, -1541, 63, 1780, 1672, -318, -1880, -1340, 806, 2097, 962, -1239, -2196, -534, 1861, 2325, 272, -2001, -1998, 97, 2105, 1759, -422, -2062, -1379, 855, 2345, 1168]
2374A168k485j096J395K677Q47j845k585l55K199K408m47k539j930J109K714J368
2390B603j576k689p77J797K231L35j842j728J68J662J365k27j698j359M08J656
2406C29J452n29j621j177L62J781R86p71j816p01J248J708L71j394j581l06J269
2423c90J575K68j324j242j41J177J214K08j387j456q1J755J701l34j994j716O47
2440a520K460J278j126k472r16J951K392K50k302k219M48K150J866m84k251j520
2456b015P14K354J186j205k316r04J526K424N69j731k579k75K387K222m90k361
2472d94j741R62K425J173j416k391o51J702J933L59j561j695L5J406J288o5j307
2489c8j325K14J336J313j63j601j420N41J592J213n56j840q36R05J591N43j121
$$ y = [1168, -1317, -2413, -1018, 1659, 2506, 661, -1924, -2279, -80, 2328, 1881, -658, -2588, -1479, 1235, 2603, 1027, -1662, -2439, -642, 1589, 1924, 82, -1646, -1478, 184, 1549, 1322, -376, -1735, -1327, 329, 1781, 1252, -369, -1546, -1184, 597, 1583, 812, -1004, -1705, -457, 1251, 1622, 228, -1353, -1659, -390, 1185, 1453, 129, -1113, -1254, -77, 1137, 1345, -42, -1498, -1579, 176, 1877, 1543, -451, -2167, -1520, 940, 2218, 1092, -1380, -2296, -345, 2047, 2297, -5, -2224, -1776, 374, 2240, 1756, -495, -2015, -1301, 1053, 2239, 1034, -1282, -2186, -660, 1764, 2333, 602, -1977, -2252, 135, 2357, 1867, -494, -2235, -1273, 1152, 2325, 909, -1482, -2133, -431, 1502, 1861, 300, -1395, -1360, 46, 1334, 1269, -38, -1363, -1149, 187, 1500, 1337, -264, -1684, -1143, 449, 1662, 1106, -734, -1570, -665, 926, 1469, 348]
2506C48j527l61J179J412M36j105j488l23J043J405L21j259j572n6J637J744k98
2523A536k000j754P56K305J400j188k454q44J739K296K34k155j940L65K186J619
2539B101o30k193j328R49J994R97j117j994o27J300J994N08j646k094j34K045
2555A25J859k40k305j460Q51K158R29j334j921m71J521J634M0j352j343J19J102
2572h8R51M2j046q43O4J005Q40k0j137j036O3J477J140n09j543q32O93J436N91
2591A248q64j367l79J030J386J81j055j271k74J158J280K35j210j502L9J557J455
2608A647l31k003j392R47K205J101j438k251n51J802K035j66j927j525N05K088
2624G46J204r29j904r80J148J716N11j048j606m90J284J717K53j568j791J79J954
$$ y = [348, -1179, -1540, -361, 1051, 1487, 382, -1106, -1429, -386, 1019, 1340, 81, -1491, -1547, 90, 1834, 1536, -464, -2218, -1462, 843, 2243, 1055, -1399, -2243, -504, 1792, 2026, -129, -2069, -1704, 482, 2101, 1471, -722, -2050, -1101, 893, 1890, 773, -1221, -1848, -548, 1446, 1954, 308, -1786, -1920, 125, 1984, 1744, -561, -2021, -1170, 988, 1917, 583, -1338, -1809, -288, 1346, 1386, 34, -1309, -1190, -88, 863, 905, -141, -984, -920, 85, 925, 905, -232, -1268, -1205, 272, 1412, 903, -640, -1472, -779, 657, 1248, 384, -983, -1362, -332, 1054, 1235, 180, -1091, -1365, -207, 1073, 1308, 98, -1404, -1365, 192, 1647, 1316, -687, -2079, -1132, 1073, 2174, 736, -1515, -2066, -264, 1771, 1605, -322, -1847, -1342, 746, 1950, 1021, -883, -1863, -715, 1001, 1512, 464, -1142, -1632, -348, 1369, 1622, 54, -1737, -1558, 396]
2641C96J466n56k034j135R33J916P12j305j636r1J405J234k37j247r27J58J123
2658A75P97Qj039p23Q7Q57Q11j1j107r98L33J325J019n25j586p62Q38J408N76
2677A483r89j448j80J265J114k0j192j118N2J032J270J34j423j363K41J591J209
2694A658m62j961j091J080K111O97j701k091k04K100J727m46k131j208R27J986
2710I91P66j110j906m40J257J640K36j256j518j58J297J482o4j537j340M45J649
2727D34J197p41j793q34J022J731M73j289j416k6J332J177l93j050q87L42Q26
2744A05Q20r1r32p82M9R02R86j86j067j053L74J360Q53m71j578p70R18J528N04
2763A469j128j431k61J215J393j32j300j105P4J384J171l23j283j254L90J570
$$ y = [396, 1862, 1306, -728, -1863, -930, 986, 1698, 393, -1243, -1334, 71, 1305, 1068, -179, -1106, -948, 175, 972, 980, -59, -782, -695, 162, 973, 962, -145, -1143, -810, 515, 1534, 1009, -577, -1339, -501, 907, 1483, 494, -954, -1134, 131, 1245, 1225, 33, -1085, -1033, -1, 1269, 1403, -20, -1383, -1142, 449, 1658, 1196, -765, -1856, -776, 1335, 2032, 331, -1760, -1964, 136, 1863, 1417, -714, -1922, -995, 991, 1757, 647, -1259, -1699, -442, 1198, 1434, 178, -1340, -1498, -201, 1281, 1217, -320, -1660, -1215, 434, 1631, 890, -903, -1737, -715, 1016, 1489, 200, -1216, -1242, 90, 1267, 874, -176, -1063, -721, 105, 925, 834, -98, -880, -831, 71, 1057, 871, -196, -1249, -875, 485, 1338, 867, -711, -1481, -563, 965, 1469, 341, -1090, -1351, -136, 1257, 1125, -175, -1280, -1206, 178, 1349, 1026, -257, -1511, -1121, 449]
2779D49J261p96j814r39J073K099M60j734j899R5J958J640n75k079j126R49J979
2796A001P57j250j638l07J303J372J65j238j458K9J204J436j38j432j261M61J567
2813E73R92o29j662p74J111J416N41j215j435m2J275R06j89q83q90J87Q43P39
2831H64K5q99q32NQ34J015j3r56j177K77J295R43n44j536q29R04J614M33j115
2850C08j459k58J355J238N7j335j169K59J401R21k00j522j169N75J637J077p92
2867I24k038o55J338J927K15j676j722J99K026J356p68j928j046J201J750M18
2883A521j160j472j30J110J336o0j086j148j31J332J094q1j467r52L98J432Q51
2900A387p18j339p34R49J245L64r41j140j98J091R33j61q78p09J73P47N06Q2o95
$$ y = [449, 1710, 914, -900, -1839, -766, 1333, 1793, 59, -1840, -1745, 213, 1853, 1278, -801, -1927, -978, 1001, 1758, 508, -1130, -1437, -134, 1238, 1403, 165, -1293, -1264, -60, 1376, 1238, -194, -1455, -994, 573, 1565, 936, -726, -1500, -389, 1027, 1568, 353, -1082, -1124, 151, 1057, 868, -15, -905, -718, 125, 864, 889, -10, -842, -837, -3, 1012, 999, 43, -1134, -857, 438, 1381, 837, -699, -1528, -624, 990, 1423, 308, -1151, -1409, -54, 1184, 1241, -94, -1263, -1004, 397, 1318, 1118, -404, -1573, -998, 639, 1716, 924, -1114, -1769, -431, 1496, 1711, 35, -1687, -1488, 538, 1894, 1126, -802, -1848, -647, 1103, 1521, 361, -1111, -1241, -131, 1205, 1145, 59, -1089, -1220, 112, 1206, 1125, -342, -1294, -896, 536, 1387, 669, -670, -1404, -455, 790, 1154, 213, -927, -1125, -34, 899, 738, -140, -849, -676, 71, 577, 659, -36]
2919c6q67nQ01R57Q1j071j075K46J345Q45n43j479o98Q87J532M33j195j409r4
2938a345J316J151l2j338j075K94J350J111n91j463r23P39J539Q96j121j638m41
2955a571J354J623J24j693j501L97J781J133p54j751p29J197J428L58j139j468
2971a211J25J153J071j23j060j045K84J105Q35k82j102q76M08J358N74p06j069
2988e61o25R12J140K10r89q73k0P49R10l4q15p46M3P06Q04l7q19p63o1R51Q93
3009I75k59j040q71L38J323Q75p38j460n52R98J502L02j368j265%J388J174l61
3027I61j370r20M65J407P43n93j394p25Q61J518M57j194j419k38J513J360k47
3044A185j581j186O14J650Q67r24j595m44J156J404M6j228j036Q1J172J034k95
$$ y = [-36, -903, -908, -107, 850, 931, -140, -1215, -969, 376, 1221, 678, -801, -1499, -612, 920, 1353, 158, -1251, -1345, -29, 1122, 1090, -248, -1323, -1029, 321, 1432, 841, -622, -1545, -806, 733, 1629, 508, -1130, -1571, -217, 1406, 1530, -163, -1664, -1267, 514, 1647, 893, -858, -1587, -390, 1038, 1396, 257, -1211, -1086, 67, 1138, 1015, -45, -1090, -806, 299, 1134, 852, -250, -1126, -718, 640, 1214, 508, -561, -1186, -274, 866, 1076, 87, -786, -806, -57, 853, 819, 4, -742, -699, 7, 811, 774, -45, -808, -869, 82, 975, 716, -324, -1195, -857, 466, 1341, 603, -857, -1409, -411, 1091, 1393, 25, -1240, -1240, 148, 1322, 961, -409, -1329, -864, 543, 1286, 693, -701, -1426, -565, 953, 1410, 216, -1203, -1441, 72, 1432, 1185, -396, -1582, -968, 682, 1549, 625, -970, -1414, -258, 1146, 1192, -36, -1072, -991, 181, 1215, 920]
3061I20j268o03J95J012P98l63j059o34N28R97N58o52j086l44P37J030K06p34
3079B38r99m2P56Q87j41p79o39N2P17P81j11q62p95J57R66Q78k47j207q61N95
3099f56J313O83q41j464l63J102J269J65j162j322K83J387R81m42j499p23N92
3116f97J456O75q25j500m93J048J415J72j077j420L6J465J252m41j513j040O78
3133h09J597P36r80j449l60J043J311n3r91j025Q4J070P99k45r71p44M21J004
3151D38N27l51r48o43M45R53O35o12j001l73O88J045R7o09j047j25P44R89r5p54
3171Cp91N8R20P08j21r26q07J79J013Q94l88j188p64N92J300O27q98j358l13J146
3191a14J364L6j411j107K88J366R45m71j388p37O28J467M26q99j304l59J078J273
$$ y = [920, -348, -951, -756, 256, 1054, 691, -368, -1002, -474, 523, 1081, 429, -657, -1001, -264, 766, 972, 238, -761, -803, -47, 840, 699, -80, -719, -667, 50, 831, 720, -142, -937, -780, 186, 1064, 817, -390, -1251, -656, 657, 1340, 499, -965, -1328, -226, 1043, 1208, 46, -1276, -993, 394, 1375, 933, -566, -1289, -697, 759, 1434, 609, -891, -1384, -336, 1079, 1251, 174, -1246, -1210, 255, 1507, 1066, -447, -1487, -809, 788, 1524, 544, -905, -1265, -222, 1089, 1036, 45, -980, -896, 174, 973, 728, -243, -987, -566, 438, 965, 614, -334, -977, -532, 421, 1056, 444, -557, -930, -242, 803, 900, 291, -756, -881, -137, 852, 757, 3, -788, -730, 190, 898, 777, -149, -956, -777, 236, 1130, 742, -446, -1210, -618, 682, 1309, 411, -947, -1260, -114, 1250, 1286, -125, -1232, -944, 422, 1367, 896, -492, -1229, -601, 866, 1292, 393, -911, -1270, -192, 1081]
3209A081J34j180j310L02J374R53m91j371p30O03J443N36j071j272j29R06J132
3226I10P8j054q96K05R39O54k88q50o14L27P80N08j65j044n12M29R70L49m66r07
3246f47l56N75R25K79o71q66k29Q49P45J15q45p75J8Q57Q85j36r46p95K24J087
3266B93P59m26j197o48O42J350L16p58j345j19J201J035k4j240j103M53J326Q59
3284A374o74j305n96Q52J282L05r78j214o6J099J181k10j148r94L09J102Q49l62
3302H06j240o22N80J397J36q59j011j21Q65Q93q6p77p87J59R06N86l26o87n01
3321f89K38P17O23m84p16n12N07P67L84m67p15l78M87Q73K03o25q94j15P86Q95
3341H85m8q16p74Q4Q62Q28l56p99p32L07J118O45n92j113o58Q27J221L21j066
$$ y = [1081, 1215, 35, -1275, -973, 401, 1354, 863, -508, -1238, -635, 808, 1344, 273, -999, -1128, -222, 910, 988, -66, -962, -757, 182, 836, 548, -302, -916, -589, 191, 699, 534, -510, -1022, -593, 377, 726, 260, -647, -1003, -428, 497, 776, 105, -761, -990, -141, 604, 719, -126, -901, -883, -26, 859, 723, -223, -1018, -794, 293, 1052, 626, -571, -1219, -577, 773, 1089, 331, -1014, -1133, 68, 1103, 1079, -161, -1264, -811, 515, 1374, 700, -605, -1201, -349, 933, 1238, 260, -954, -1020, 79, 1260, 1050, -98, -1092, -783, 319, 1168, 806, -434, -1056, -476, 921, 1057, 198, -813, -934, -69, 824, 738, -39, -826, -667, 239, 825, 499, -188, -689, -451, 266, 889, 405, -311, -823, -316, 451, 835, 368, -347, -725, -238, 635, 838, 213, -681, -796, -10, 885, 837, 21, -753, -669, 193, 1021, 665, -134, -866, -559, 559, 1204, 612, -501, -1159, -332, 889, 1210, 144]
3360A44j150L4J051J028k41j201r17N87J307M99o74j196l74P34J191J24r25j145
3378a124J91R96R91l41j189o26L06J236N25n62j090l29O21J040J53q50p99j1R11
3397D9O81k9q74p19K33P22O20k59p25m28K15Q05M60l37p45m71M54P89K85m09p71
3418d54k29M83Q48J93n99r18m7O92Q88m6r78p27J56J022P02k05j188n73N41J058
3438F19M61p21j173l08J004J123O4j127j047J27J256R13m29j284p36P46J272M05
3456A165p91j360j68R73J102J10j028r94N7J264P76m40j193n52N36J102N84o85
3474D58j085j39O20R23J31p45r14Q3Q55N87J5p32p09O2Q67N82k90o95m68K00P95
3495D01L85l21p78m21L58Q64L86m31r08m25N88Q92L74q41r10LQ00R00j82q74p81
$$ y = [144, -1006, -972, 79, 1107, 866, -335, -1252, -665, 642, 1141, 467, -729, -1103, -369, 822, 946, 21, -1124, -933, 63, 1054, 713, -476, -1102, -796, 440, 965, 403, -687, -1016, -395, 645, 798, -52, -851, -862, 49, 730, 701, -173, -892, -659, 63, 683, 424, -301, -729, -514, 291, 751, 414, -331, -802, -348, 441, 726, 317, -454, -683, -200, 648, 841, 242, -676, -723, -31, 857, 811, -167, -894, -738, 284, 986, 781, -407, -980, -439, 619, 1080, 359, -814, -1122, -118, 1005, 1069, -58, -1105, -978, 278, 1191, 762, -522, -1258, -512, 760, 1165, 374, -986, -1154, -181, 921, 1031, 3, -991, -934, 330, 1106, 666, -527, -1079, -543, 559, 1143, 458, -627, -766, -146, 777, 908, 163, -751, -668, 187, 774, 789, 57, -652, -590, 277, 859, 569, -126, -594, -394, 401, 786, 465, -313, -734, -376, 488, 874, 443, -465, -890, -302, 590, 964, 123, -787, -784, 16, 916, 734, -140, -921]
3516i21N6J184O62l14j206n65O53J036N10q38j123k01Q79J212J8j150j025K14
3534i19J202P80l12j315o64O86J172M32p96j123k03R01R79J23j083q11J89R70
3552B08O67l02j014n53M76J018L82o06q44k71M82Q80K10o54o14j00M87P49j14
3571D87n38o35K29O22N00q8o90n06J45O18N56k33o63m72K46Q19M00l84r21l47
3591h55O38P81K99o29r09j28P16R56j41q90p96M01Q75P45m68j047o09O39J038
3610F16M06q38r83j04R05R28k33q51q31K35J102N74l33j108m48N89J036J82o90
3629A54r16j06Q63Q32pr60n88P5J016L09k01q68l14L88Q46J26m62o16j89M69N99
3650D50J94m92p68qO39M80l8n05l78j74O48M82j48n13n65R5P91L62j70n73m69
$$ y = [-921, -865, 319, 981, 667, -539, -1104, -451, 585, 1095, 257, -866, -1067, -188, 1024, 1042, -108, -1133, -919, 283, 1063, 751, -564, -1228, -542, 630, 1062, 266, -857, -1060, -159, 820, 943, -140, -951, -762, 208, 875, 573, -441, -994, -518, 500, 882, 276, -568, -839, -357, 523, 733, 79, -535, -635, -148, 601, 487, -51, -686, -457, 165, 665, 577, -113, -619, -474, 144, 700, 467, -196, -668, -422, 397, 797, 413, -508, -855, -217, 564, 863, 234, -675, -803, -87, 869, 728, -162, -958, -557, 318, 1063, 595, -452, -1061, -422, 616, 1022, 184, -799, -903, 2, 930, 697, -154, -985, -750, 352, 926, 593, -515, -963, -374, 662, 844, 154, -762, -868, -5, 827, 820, -140, -728, -653, 363, 672, 471, -397, -711, -323, 523, 649, 187, -429, -618, -149, 450, 644, 152, -616, -624, 15, 495, 457, -48, -426, -600, 48, 530, 382, -131, -696, -601, 190, 552, 382, -191, -660]
3671f60K95P39L29m93q38j58O23P08J74o36p93j48Q42O92r0r19o39L37J005N22
3691H92n97q39m34O49R51L44p46r46o4Q70Q51l55q99o34M30J095M09n43j038k63
3711h67P80P60J70o85q38l0Q78O56k04q35m95L36P87L97m45o65l04L93O98K66
3731G53n55o37o4N65N52N5o11n27mN23M70P0o26m37J30N27N53k84o16n49L89O02
3753B79M07k14q36l10L98P19K73n54q24p9O39Q36l1q41o77R7Q25O58k13r03o05
3774i56M94R20M81p11j009k17Q65Q75J38r34q16J98Q29O57k52j006m15L75R98
3793E14M10o69r62j33O99P94J12o14r04K70O35O70k76p92m97L45P84L83l85q25
3813d41j66L06P42J35l48o38k34N84N99N8n09p24J03M80N57R1n58n33P7N05N39
$$ y = [-660, -365, 374, 703, 210, -628, -786, -163, 545, 719, 83, -710, -858, -16, 676, 586, -333, -972, -635, 370, 892, 295, -544, -978, -329, 622, 966, 220, -726, -790, 80, 931, 576, -323, -957, -527, 568, 977, 434, -604, -867, -87, 673, 843, 158, -680, -710, 168, 824, 620, -215, -710, -374, 413, 810, 365, -300, -604, -211, 487, 753, 198, -439, -503, 62, 614, 669, 58, -469, -473, 50, 520, 590, -36, -473, -343, 184, 737, 453, -163, -712, -323, 279, 686, 472, -364, -674, -276, 443, 716, 162, -662, -741, -102, 734, 703, -138, -815, -718, 107, 765, 552, -351, -956, -462, 458, 939, 228, -781, -998, -133, 742, 880, -54, -870, -672, 157, 814, 562, -444, -859, -484, 514, 924, 255, -707, -840, -141, 653, 765, 151, -753, -483, 152, 822, 546, -246, -743, -398, 386, 769, 384, -441, -607, -301, 441, 576, 228, -410, -644, -60, 539, 597, 88, -636, -533, -53, 504, 595, 37, -496, -419, 86, 625]
3834F25p2p97l69J67O75N50k95q71m40N58Q66J73m95q50q4N97P26J9p83p48J58
3855f90R22O51l14q66o49M49J082K84o29q80k70Q60R12Nr28p96K37Q54O63l68
3875E29q76m52L61R99L14n56q35j84O25O99Q4o06p83J01N65O54r8p76l85K50O34
3896B64M27l64n52m22M26N37K45l31n10k60L25O57J30m41n95j33N08N83N6n19
3916C1o88K9N48O74j30o39m44J50O92M90k77q43l55M08Q19K84m44r22j20O06P03
3937E72J25r22m69J42P96O23l61q83n64N00R26L60n46q54j10N60Q46r0o45p31
3957g25L01P53M65k97p82m67M87O98K12m36o11k82O34O01p1m51n86J36N33N15
3977F27l06m69k82J60L87L54j82n82k50L60M34J85k81m33j91K49M68O2j33n66
$$ y = [625, 553, -244, -613, -446, 229, 779, 484, -387, -827, -269, 597, 770, 275, -575, -659, -62, 664, 683, -100, -848, -690, 232, 883, 569, -297, -946, -497, 585, 869, 240, -640, -910, -50, 862, 867, -61, -857, -620, 234, 897, 529, -347, -799, -438, 561, 875, 319, -516, -700, -75, 624, 708, 102, -681, -580, -15, 639, 541, -235, -620, -370, 264, 691, 327, -225, -647, -221, 316, 561, 230, -280, -540, -215, 442, 572, 131, -464, -597, -89, 494, 550, 31, -657, -628, -80, 594, 464, -175, -619, -469, 223, 713, 436, -407, -762, -354, 465, 749, 305, -617, -737, -131, 572, 697, -225, -694, -552, 244, 867, 506, -377, -941, -441, 485, 845, 299, -555, -665, -105, 741, 651, 6, -725, -424, 329, 794, 497, -285, -752, -265, 433, 645, 209, -402, -684, -50, 551, 480, 29, -557, -421, 112, 627, 321, -148, -430, -270, 117, 471, 289, -293, -543, -183, 251, 436, 155, -278, -469, -220, 248, 310, 177, -389]
3997c89j00M79L72M8m08n26J05M18N64j27o35l07J47O10L98k77p22l09M92O62
4017D95K67n85p94l3N76P13j9p15n91K66P57M28l74q14l47N11P60J52n78o91L6
4038e80O56O06k02p35l17J62Q22K57l44q55j86N15P23K8m22o19j35O22N40q6n90
4059a40m07J02N63L53j56m04m00L15K72L17j66n39j65K16O47J1k71m99r7M18M70
4080D40J02l97n57k9N07M85o2o13l22M1O29N01k80o85l10K39P98J64l64p15k22
4101f50N71P21j16n36o17J2P90O06k05q60m74M42P82K94l78r16j39N67P59qo36
4122Io48Q0P23M70j92n96n38K70Q27K62l74o99l19N55O33J29n60n09P2L26N78
4143D99k8n05n71K80M65M45j99n97l43K33M90K98j59n71j86K56N06J58l47n68
$$ y = [-389, -489, -10, 362, 410, 2, -524, -419, -1, 563, 436, -199, -506, -359, 251, 649, 372, -350, -659, -167, 495, 762, 177, -617, -650, -74, 639, 620, -95, -686, -420, 337, 765, 391, -423, -770, -259, 501, 653, 75, -616, -580, 76, 682, 480, -255, -572, -410, 412, 669, 325, -530, -716, -201, 522, 550, 128, -491, -626, -4, 536, 450, -140, -547, -445, 118, 471, 315, -89, -489, -174, 98, 415, 249, -290, -455, -239, 408, 419, 148, -351, -448, -30, 440, 542, 145, -412, -441, 66, 551, 489, -124, -446, -405, 224, 725, 445, -240, -550, -311, 487, 651, 287, -428, -650, -79, 642, 526, -10, -627, -615, 175, 781, 576, -284, -758, -316, 466, 760, 382, -534, -673, -106, 653, 645, 9, -639, -559, 164, 634, 442, -154, -692, -422, 405, 667, 293, -406, -725, -170, 463, 592, 32, -477, -405, -79, 499, 471, -34, -605, -325, 140, 585, 386, -211, -554, -321, 169, 467, 308, -263, -449, -193, 313, 471, 124, -444]
4163d44j86N78M57J84n98m40n2M14O34n1o01m62J18O58M61k75o71m64L73O79L70
4184F82m05p55k64P81O02k9o80n70mQ79N42l00p77m18L12Q29L28m33p86j23N67
4205b2O26P1q19n03Q2P05N58k09p80l00K37P36K60m50n79j48N02M70L0l95m62
4226c90p1M58N85j42m84m03J44N16K59m6n42l48J98M90K56k25l05m07L19M71K38
4247E71m26m58j47M32M83R7l64o62pM87N02M9p66l62K67N24M24l89n50l94L53
4268c36Q12J75m09q14r9P32M14J03p05n14K27N82L90j30q18k26L01P23L3k62o11
4289d32j80M87P67k09o34n47L53N53K63j38n31l32K76N82P0j57o55pL48M16J46
4310D39l43m02j18M03L51j13k90l40R8L94K30J0l37k77j5M67K25j33l42l46J82
$$ y = [-444, -630, -52, 405, 589, -9, -449, -501, -87, 547, 496, -105, -567, -449, 209, 670, 395, -276, -740, -367, 312, 682, 277, -478, -742, 39, 641, 612, -68, -638, -642, 237, 779, 479, -298, -716, -404, 425, 753, 320, -466, -589, -22, 604, 675, -144, -647, -565, 140, 698, 489, -291, -591, -354, 382, 642, 192, -387, -535, -33, 437, 467, 72, -390, -461, -3, 582, 440, -44, -447, -303, 213, 472, 426, -116, -464, -266, 224, 480, 255, -50, -457, -138, 333, 571, 145, -313, -460, -28, 455, 552, 188, -474, -481, 6, 508, 557, -209, -571, -304, 220, 644, 255, -295, -689, -336, 476, 651, 242, -572, -671, 61, 475, 578, -127, -641, -414, 168, 558, 428, -390, -616, -315, 408, 441, 179, -432, -612, -125, 642, 433, -201, -748, -395, 158, 421, 283, -248, -580, -304, 278, 348, 191, -464, -471, -123, 293, 439, 96, -306, -424, -21, 330, 217, -73, -413, -315, 79, 309, 319, -18, -295, -310, 157, 382, 249, -93, -439, -257]
4331b57M08K65k06m94j79L71M99O9l43n47J11K58N13J2o42k37P3N39L50k69o43
4352c49k01K82P04J59m64o55O2M38N15r5m81m51K24O50L06l61o62j30L38N60L4
4373D23l53n03j7M65M94r8n95k79K81M40K69l06n86r0L90M05R1m42k86l8M16K78
4395C59k4l62l07P4L04K20Q0m71l50J37M42K81j70l58j13K9M00K37k81m23o4J92
4417a68M27J81l80m16j10M62M30p4l50m96J02M95L31j54n57k73K88N77K12l70
4437A57o56L3L38N32K14o60m96R0O03L24r2o84m14L71N98L69l71o59j95M97O11
4458E10p4n01l74Q9M66M03j28n35m15M04L53J86j20n98o2L29M46L7k51m43KK52
4480b4K77N7k92l20O6K76L39p3l00m20K46L09L01k45l77k07J78M90K09k42n18
$$ y = [-257, 151, 416, 210, -284, -463, -92, 407, 476, 133, -414, -303, -45, 468, 480, -162, -399, -326, 213, 563, 294, -349, -550, -268, 436, 595, 131, -524, -462, -24, 491, 396, -85, -536, -312, 338, 644, 283, -379, -509, -171, 389, 423, 70, -433, -450, 15, 509, 411, -184, -463, -182, 258, 527, 221, -365, -455, -65, 340, 431, -11, -297, -335, 81, 359, 335, -27, -334, -260, 44, 264, 344, -127, -477, -340, 102, 383, 213, -145, -258, -229, 171, 408, 127, -296, -360, -168, 259, 440, 60, -356, -466, -4, 426, 352, 2, -494, -392, 103, 434, 280, -277, -550, -262, 315, 527, 157, -499, -466, -128, 404, 618, -42, -538, -448, 155, 479, 387, -297, -711, -340, 258, 627, 256, -403, -598, -101, 510, 436, -65, -439, -350, 116, 519, 391, -144, -559, -155, 198, 384, 264, -334, -396, -67, 379, 416, 165, -278, -276, -24, 253, 310, 18, -302, -236, 40, 379, 306, 6, -414, -168, 141, 442, 197, -180, -387, -209, 281, 490, 248, -270]
4501b70j85J83N97J34l13n12j08N27M26j70l68m37M7N88M94l54m90m16M40M31
4521B44L85n90n78j1N12M97K3n59m94J71N20N63l41o57k76K53O01K79m07m90p7
4542d32L80N71qm79n00K0O18L14k05m07k92J94M84K57k98m23l06M04M05J18k75
4563A40m13o0L03K98J19l89l32k2L70L88q3l66l28M0L72L66j66l27l19J45M29
4584A65L16k82m56j70K60M63J90l79n66NM87M25r4n08k71J5N51L33j98n02l85
4605f01L18O50J31l43o51p5N27N06pn15m39P1N62L77r3o36l02L01M67R9j91m15
4627b59j66M32L92o7k84o11K40M15L43j21m98j21O9L71J97k15k87r2P0M39J11
4648C58j48m18j31L41K69J7k16l59k5K70M16n9m12l13Q6L39K96o6l86l16J24M89
$$ y = [-270, -455, -272, 325, 459, 146, -366, -474, 53, 479, 309, -59, -496, -449, 139, 633, 279, -211, -627, -187, 244, 629, 39, -539, -550, -38, 459, 482, -77, -571, -400, 120, 683, 342, -315, -591, -338, 263, 542, 135, -355, -432, -52, 519, 511, 32, -468, -448, 170, 484, 279, -128, -420, -226, 258, 515, 217, -206, -512, -108, 297, 415, 140, -273, -333, -30, 268, 387, -2, -334, -356, 14, 402, 319, -47, -375, -335, 37, 403, 237, -90, -409, -264, 165, 481, 199, -257, -427, -167, 296, 486, 107, -459, -454, 33, 458, 364, -144, -415, -400, 151, 484, 286, -216, -601, -283, 367, 498, 155, -496, -571, -44, 462, 455, -60, -499, -428, 134, 511, 418, -218, -520, -219, 248, 347, 156, -259, -425, 7, 399, 332, 48, -563, -323, 92, 435, 314, -184, -305, -236, 135, 332, 117, -170, -262, -192, 247, 358, 210, -208, -339, 2, 271, 288, 72, -287, -312, -42, 374, 315, -97, -410, -324, 15, 311, 245, -141, -457, -333, 156]
4670A56K71k62m29j32K04N92M7m17m10N6L65M21k1o12l65K94M22K88l13n09j75
4691e29L69N20J81n24m52J08L79L59o8o00j64J70M92L06m21l45j46K48M80O0l24
4712I9n12J42K63L75o6m18k32J48K78K87n8n23l0P8M25M7k24l37p9L23K73P2k12
4735A19l07j20K93K27Q8k05m27J33K13J96J1l10k68P8M38J60p8m71r7J56L94J93
4757D16k96m12j32M48K77Ll80l35N9M38L50j54m36k97K81M39K52l86n62K3L01
4778a03N06rm33l43J44M09K57j93m29k48J46M98J69k08m82n2K58N02J2m95k40
4799c34%L65K38m5l59k68K68K59K52k41l95j37J58L29J68j69k92j43J61L85J15
4820C15k87k81r1K73L63m6k92l30K14K33K98j39l06k51R7L57J96j30m03j71K58
$$ y = [156, 427, 165, -264, -396, -192, 400, 447, 30, -380, -324, 41, 462, 441, -171, -536, -242, 180, 468, 155, -354, -529, -160, 360, 541, 17, -435, -327, 52, 411, 343, -257, -421, -251, 241, 547, 126, -219, -365, -117, 363, 423, 99, -413, -271, -8, 367, 301, -117, -349, -201, 77, 364, 306, -217, -247, -169, 256, 303, 79, -258, -337, -14, 259, 331, 119, -188, -308, -15, 212, 300, 95, -332, -199, 14, 210, 221, -89, -357, -279, 159, 319, 241, -230, -327, -171, 223, 416, 120, -292, -424, 24, 301, 304, -76, -411, -352, 86, 436, 282, -154, -451, -170, 269, 521, 135, -427, -404, -103, 403, 394, -39, -382, -238, 171, 428, 235, -194, -442, -296, 202, 371, 163, -319, -371, -113, 389, 401, -94, -334, -334, 31, 269, 224, -135, -403, -135, 124, 376, 135, -260, -397, -239, 90, 258, 89, -203, -346, -185, 200, 315, 28, -253, -344, -71, 292, 246, -46, -376, -162, 71, 369, 230, -76, -327, -230, 127, 323, 193, -210, -381, -123]
4841a23M08J80k38m59j39M34L74o0m35l54P5N50L42k04m95k90K64M63K27m53l53
4862b86j46M82L37p1k49m43O3M09L30j46l89k85K19L49K05l46k51j08J96L86N8
4883C14l63l20P1M22K43k14k94j54J16K07L06j82l23j29M0L28K04j39l42n2N7
4904b04M26J02k93j75k03L22K89l5k10l17k5L30K96o7l86l92L21L43K09j94l66
4925b29j52K83L90kk27m01m8L43M44q6l97m62K06N70K84k94m68j30J10O10K25
4946E69n48l31m7L80K57J7l38l70K99J80K24j00l32k53K29L13J55j63l44j04K17
4967i0L60J06m18j95r0L84K62r8l32r5M4L35Q9p2k50k18K08K10J70j73l41q0K35
4990d9K02K42l84k12n0J71L90q2j47l43l9M87J59k27l51n1k2M18K01j51l16j68
$$ y = [-123, 285, 465, 227, -232, -371, 63, 437, 377, -58, -412, -337, 213, 555, 351, -144, -434, -170, 293, 520, 67, -286, -432, 50, 387, 316, 67, -376, -313, 96, 426, 280, -109, -394, -175, 174, 379, 33, -218, -326, -130, 256, 314, -49, -369, -298, 124, 367, 153, -141, -295, -179, 28, 334, 152, -171, -300, -260, 68, 272, 133, -209, -261, -204, 222, 324, 31, -144, -347, -25, 264, 229, 19, -298, -323, 7, 303, 236, -150, -542, -221, 122, 331, 137, -229, -381, -98, 292, 290, 63, -338, -386, -43, 401, 315, -82, -544, -338, 232, 516, 222, -246, -376, -266, 344, 569, 21, -310, -357, 23, 280, 297, -41, -411, -112, 68, 292, 192, -140, -393, -164, 149, 304, 141, -203, -307, -90, 270, 376, -42, -237, -327, 57, 319, 221, -111, -206, -162, 173, 262, 190, -60, -278, -70, 140, 310, 137, -204, -284, -49, 153, 395, 11, -201, -251, -80, 310, 228, 81, -262, -301, 186, 345, 118, -233, -284, -306, 112, 313, 162, -154, -322]
5012c22K33L67j7j56n06J76K01M47j40l09l64R5M48K53k08m41o5J87L16R8l28
5033c5l45J38K44L74p7l49k01J6L25K90k29l42j26J21L97j4j37k40m1J63L19J4
5055B65k90k13O2J84K54r3k84q5j5K50J69j07k37j66K21L05o7n5j84k62K64K72
5077A88l3j05l10j00L56K54Q4l88k20J7L54K45j31l63j57J84K26K71k64l73o7
5098c32L65K56K8l70k20n3L93K31r0l48k21J91K95J83j25l93j26L32L14pk67m85
5120d49K15L51J50k0l32k51K63J76J14m6l45j30J57L13J40k93k51O2J89J94J23
5141C30k54l57J83J43J61m3l23J3l3K79J80j09j75k23J86J94K05k96j55j41Q5
5162a50M07O2j40m54n3K47M63o1m12k45R2L78K42j95k88j52Q2L60J20k74k77j64
$$ y = [-322, -89, 278, 261, 105, -401, -225, -24, 423, 283, -26, -390, -295, 153, 406, 198, -243, -308, -121, 195, 293, -35, -380, -242, 2, 376, 299, -50, -251, -235, 90, 380, 151, -191, -317, -196, 201, 187, 50, -190, -231, -68, 251, 265, -25, -238, -176, 8, 262, 169, -115, -200, -215, 35, 204, 97, -140, -306, -85, 220, 153, 98, -86, -348, -84, 188, 155, 50, -260, -360, -4, 250, 334, -54, -274, -257, 97, 342, 211, -152, -309, -125, 101, 372, 108, -265, -332, 33, 289, 317, -53, -273, -326, 67, 298, 208, -140, -361, -170, 125, 308, 183, -210, -336, -4, 310, 303, 36, -449, -234, 117, 267, 247, -85, -336, -73, 103, 217, 171, -174, -304, -147, 166, 306, 13, -238, -176, 13, 207, 330, 76, -281, -98, 45, 206, 163, -160, -147, -180, 99, 279, 170, -5, -228, -42, 152, 357, 61, -94, -235, -150, 257, 319, 179, -275, -328, -81, 382, 321, -91, -336, -244, 134, 376, 181, -107, -259, -177, 183, 303, 29, -248, -412]
5184d12M46K41J08l80l38O4K70L35j31l88k39K19M48Q7k00l58r8L37M25r5n13
5205a72j46R8L90J71o8m71j51K13L63P2j69l36%J25K32L0j06j95j61L04K28N0
5227C01l11j66j25L21J48m8k83r0J28J17L39k47k87M0Q0J68J36j34k88p5J43L26
5249A93J51k79k87j23K85L37l4k48l31P8M65J71j31m06j18J39L79J37l37l20R5
5270a84J37L29J3k50l06N2J78K47J5m00j76J25N50m2k47l10m8L93J58M7l52j80
5292b51K0L81Q2m6k40l09J92M38r0r3k19rJ58J92o7m5k58RJ29L14p3k67j62OJ65
5317d3K38r7j33j96J54J90M2k8k46r7J16K17P3K0m09l5J80K34J05k93k31l1K58
5340a2L42j70k81q9K9K59K70k09l68p8K86K65rk34k69q0L63L27j42k23k81J29
$$ y = [-412, 34, 275, 383, 3, -335, -271, -1, 334, 203, -185, -424, -205, 243, 330, 130, -228, -326, 11, 436, 341, -172, -318, -220, 170, 341, 273, -198, -349, -136, 227, 299, 130, -206, -206, -81, 151, 181, 75, -120, -281, 23, 251, 301, -10, -176, -301, 20, 168, 120, -163, -253, -125, -8, 331, 84, -203, -163, -83, 85, 221, 87, -201, -276, -133, 193, 344, 65, -222, -345, -60, 277, 243, -5, -336, -258, 207, 378, 247, -159, -277, -138, 241, 378, 41, -279, -184, -47, 282, 295, 45, -261, -209, -31, 216, 231, -169, -345, -220, 330, 288, 41, -269, -317, 76, 234, 281, -71, -251, -231, 150, 232, 186, -54, -363, -171, 267, 177, 84, -135, -144, 14, 206, 139, 94, -164, -155, -26, 288, 215, -52, -214, -208, -43, 195, 98, -35, -231, -77, 113, 155, 127, -119, -216, -100, 117, 190, 210, -199, -234, -54, 180, 285, -8, -239, -270, -12, 330, 160, -121, -210, -181, 78, 348, 139, -229, -307, -21, 244, 235, 1, -268, -348, 15, 342, 200, -23, -304, -175]
5362a75K61J93k61k02j81J51M68M2k82l45P0L40J50q1k24j87J81N5K41j00k02
5383h8o9M1K06P4j70j84j3P7K27J20j96k05r6K10L18j66j73q8o1K52K91j16k31
5406d0j74J40J97J27j33k94k8J73J84J10k00k23p0K13K45O1m31j65R5K69K39j05
5428A90l32j32J36L30mj91j39j31K19K07O5j95l79J62J30L34k03k18j21N6M12
5449A96qm2l68p7K66K66Lk82j77k0K59J55L5k80j06Q4K25O6j01k07m8K07PJ74
5473B27k03j25p9J69J24P0k23q8q0J58L11q4j46k44l7K55L34j04k91j96M5L92
5495A85Q5r2l64q7J84L09n6j34k12q1K30K61j50r6k29J39K14J26m0l33j09J35
5517a15L20R9k40m01P3K49K39Ol24k01Q7K36J78j1m11r0L19L03J4k77k21n6K09
$$ y = [-175, 86, 279, 18, -184, -365, -214, 254, 296, 14, -331, -261, 79, 229, 148, -76, -263, -82, -27, 214, 114, -88, -157, -116, 90, 164, -6, -190, -203, -126, 101, 221, 25, -180, -276, -66, 252, 86, -87, -175, -236, 16, 307, 191, -40, -214, -74, 123, 250, 117, -177, -205, -32, 152, 262, 62, -161, -231, -18, 227, 288, -143, -308, -213, 56, 295, 190, -142, -274, -138, 192, 188, -3, -142, -273, -54, 153, 218, 23, -356, -194, -64, 270, 67, -151, -272, -216, 196, 188, 146, -222, -299, -33, 233, 236, -46, -223, -243, 16, 171, 206, -74, -180, -96, 129, 195, 94, -113, -161, 46, 53, 227, 24, -101, -180, -11, 113, 183, -40, -128, -208, -50, 261, 177, 31, -213, -250, 5, 339, 235, -56, -252, -207, 185, 270, 178, -186, -273, -89, 220, 164, 30, -182, -263, -33, 228, 78, -18, -247, -108, 106, 232, 192, -141, -250, -115, 205, 304, 64, -337, -264, -15, 224, 230, -94, -295, -208, 28, 206, 195, -216, -306, 13, 316, 330, 53, -168, -224, -15]
5540a5J46Q8k17k89K39J76K8J5k92k2O6K11J27j33j97pk1J62J04j20j37k45J92
5563a41L07L2j73k25M1J33J39J44k55j82J17J36J54l2k75j99R8K60J09r4k74j20
5585c00K13K12P0j88k38m2L07K67p7k25k21J27K52O8r1l24j21K48L08L4k78k66
5607b65k3L77J90j8l18j66kK98R2l7k66j4L9K35O6n6l37q7K10K54P6j53k91R1
5631a05P2J64m9j17k27J19K48R8n5k97L8O9J80j3m4k08p5J13K24QMk85q5J89K45
5656B11K1k56j63N1R5K34j23j63j57J06L25o8q6j83q5J05L05m1j98j35JK27K02
5679B25J4k72k93J88J71J54Ll17o2J54K63N9k55k51J42J35J09O9k66j49N5K42
5701A18R7j55k42j2N8K49M9j03k07n0J86K07j76m8j67J24J35O8Lj72m4jJ77O8
$$ y = [-15, 131, 219, 2, -287, -48, 128, 156, 171, -121, -143, -77, 134, 261, 128, -69, -76, -97, 65, 169, 49, -88, -333, -141, 166, 198, 25, -200, -159, -26, 113, 257, 2, -180, -63, 73, 227, 195, -80, -279, -181, 79, 188, 94, -180, -300, -87, 125, 195, 7, -231, -273, 34, 301, 224, -1, -222, -95, 157, 225, 134, -190, -311, -63, 245, 279, 1, -265, -288, 89, 279, 261, -57, -223, -225, 73, 165, 128, -138, -152, -113, 122, 188, 132, -205, -292, -82, 172, 248, 95, -196, -105, -33, 131, 82, -35, -262, -143, 105, 203, 148, -149, -111, -42, 138, 125, 81, -127, -202, -89, 135, 143, 147, -138, -223, -34, 211, 232, -24, -187, -136, -41, 193, 70, -93, -250, -144, 181, 113, 27, -156, -241, -136, 169, 128, -70, -205, -204, 23, 225, 239, -33, -326, -138, 33, 187, 190, -127, -189, -35, 228, 287, 32, -219, -77, 58, 167, 236, -30, -179, -124, 118, 215, 60, -182, -194, -136, 113, 162, 59, -148, -198, -12, 195, 19, -29, -196, -72, 63, 131, 134, -38, -82, -83, 94, 162]
5725A62j21j07j08J37J82k0k8j72j72J86K09p2n6r8j80K29K28o4k64j80M5L44
5747H0J10j76j36n7J19J53J52k01j93lJ26J92L5j54l30P1L39J23j75j65k21O7
5769b44L68K0pk86l0J69J65O0j96k56J07K27j9R8k95j04J43J58L9j26r8n2J49
5792a0R1N4j36n2o2J56J28n5j03j71L6J57R9n4j85Nm1J93R3j07k13K0J03J50J22
5817B18j21k12QK5K68n9q5j59l9Q2K62Jk49j41R2K22J91j82k01m4Q2J98L6j16
5841G7k40m4J13K53n0j84j31N6K27J83k01j09n5j5K66J36j57l19M4J88K36j25
5863A49j50j73mK44J40m7k34q8nK99K9j13j50r5J75N5J37j29j72p5J84K09k7k02
5887d3j46P0K21P9n7j76m7L6J22N9Rk25J7RJ03R9r7k21J8K41j17K14j22k89J5
$$ y = [162, 41, -66, -174, -37, 145, 125, 97, -75, -247, -61, 148, 76, 20, -78, -258, -29, 199, 135, -129, -309, -264, 80, 190, 14, -122, -179, -60, 93, 245, 44, -149, -152, -26, 166, 201, 47, -283, -212, 127, 250, 75, -90, -311, -244, 124, 144, 137, -149, -179, -10, 155, 215, 19, -237, -130, 97, 78, 176, -119, -223, -80, 78, 117, -9, -107, -159, -10, 81, 135, -1, -53, -115, 41, 169, 114, 11, -160, -124, 33, 132, 78, -107, -102, -143, 50, 143, 36, -177, -157, -54, 96, 218, 97, -115, -107, -82, 186, 127, 42, -117, -156, -74, 188, 189, -60, -201, -109, 113, 304, 122, -79, -123, -41, 157, 193, 77, -163, -207, -94, 159, 109, -75, -206, -150, 77, 260, 59, -50, -105, -120, 146, 282, 125, -194, -150, 38, 274, 149, -1, -174, -178, 66, 206, 159, -75, -163, -168, 131, 160, 47, -103, -198, -23, 32, 169, 40, -132, -207, -23, 186, 159, -43, -189, -119, 102, 181, 124, -52, -99, -63, 59, 118, 127, -98, -81, -72, 31, 130, 33, -188, -170, 71, -46, 168, 46, -243, -228]
5912b28J98J68k3k42J5k3K65J04j36l17OQ2L41M8k51j29o3J16K22N8k00k24Q1
5935a32K97O3q2k19j05J24K04J09k28j44j33J61L46l2k72j04J6J90L6m6p1k29
5957b51K38M6J47j54j47m8M2K45j9j58p1J22J4J65nk31p6L1J71N7k7j20r0PJ50
5982C8J26j83n4j00R2J01O7Mk80N0J49J17L2j48j31o9J24K54q8j19j40J34J46
6005A22P2k7j69k52M8L39R5j03k92n4K12P2J10j49j83J4J71K30k27j70q1J58K73
6028B09m5j31j53o9K00J14O9j84k79J47J43J27n5j79o3O2K35m7K4k43j3MJ50Q4
6052A07q1j4r9K2K00k9j75j7q5J70J92j80p1J8j6R6J57j55L7k35R6J80Q2j71j14
6077h5JP6J37p6Q2k58K3J51N5K6k48m4J6J44J78j38j56r8J71K13l5j61k27oL59
$$ y = [-228, -30, 138, 115, -127, -112, -135, 130, 234, 98, -219, -213, -131, 210, 258, 7, -122, -185, -69, 153, 211, 11, -213, -132, 165, 228, 146, -73, -178, -54, 150, 259, 31, -113, -246, -85, 261, 229, -43, -147, -131, 59, 95, 49, -22, -251, -13, 33, 180, 26, -121, -169, -127, 118, 99, -59, -130, -8, 6, 171, 166, -65, -141, -110, 61, 118, 91, -29, -119, -112, 38, 164, -19, -73, -173, -81, 20, 87, 91, -189, -139, 10, 127, 159, 11, -120, -189, -65, 189, 101, -18, -158, -24, 122, 194, 167, -2, -254, -206, 133, 228, 125, -167, -221, -9, 63, 173, 24, -159, -145, 26, 256, 29, -141, -222, -64, 209, 164, 33, -120, -189, 11, 125, 194, 10, -269, -122, 21, 148, 93, -86, -149, -87, 148, 101, 125, -118, -131, -127, 23, 107, 26, 12, -87, -65, 135, 106, -69, -86, -171, -1, 191, 11, -60, -42, -58, 38, 195, 40, 77, -158, -62, 118, 200, 29, -85, -84, -8, 129, 53, 135, -123, -100, 51, 106, 132, -116, -160, -144, 0, 178, 40, -116, -214, -43, 170, 135, -26, -253, -259, 100]
6102A00Q1j01k08m6O9J22J36j20j53j8J16J29P3k18m4M4K6J75o8j62p3k4K40O
6126H2O5k48l7J23J62q6N0j84M5PJ44Rj22j52Q1J22J7L7j68j0m1J12J87j18j64
6151h7j15J03J72P0m9k54L7M9J37M2j26p0l0J52R5J4j88j14N9J09K37k12r8j84
6175b51J55K47m0j28j86J72OJ63l9j26r4n3J61J29O5k22j31J48K40J3k14j23q1
6198a89J52R3J03j71n4j49K37J85p3p4j89J30L1J82j73k28N8P3J55j7j1j64QM0
6222d5R7Kj36J12j55J03N9Q7j12j45qK19m0L0k11l2J43R1O4j14j27j8O2J60Q3
6247A69k21r1l8J70P3Q9k04j6r4K31J35j26j84j33J91J87J6n0j25j78K46J43n7
6270A33j55n1r1J72J11l9j78q2N1K81K9j38r1o5N4J27P1j67j09M5J49O7l6j49
$$ y = [100, 181, 80, -128, -174, -105, 17, 153, 33, -120, -138, -22, 107, 180, -38, -82, -38, -12, 163, 95, -67, -140, -164, 76, 82, 147, -101, -138, -15, 147, 61, 111, -73, -28, -21, 123, 132, 10, -142, -61, 61, 78, 115, -53, -63, -104, 8, 195, 77, -87, -202, -99, 73, 143, 94, -160, -123, -74, 63, 105, -21, -91, -121, 31, 126, 140, -48, -162, -103, 6, 243, 31, -67, -251, -96, 151, 111, -17, -203, -31, -25, 138, 99, -27, -121, -174, -13, 116, 181, -41, -172, -24, 216, 229, 15, -108, -189, -37, 56, 159, -12, -66, -215, 22, 207, 134, 60, -129, 1, 32, 214, 41, -187, -129, -56, 99, 82, 71, -93, -85, -45, 52, 54, -82, 30, -125, -22, 37, 124, 12, -133, -141, 78, 38, 68, -143, -175, -32, 59, 123, 9, -118, -136, -74, 86, 169, -52, -143, -181, -11, 62, 151, -53, -69, -163, 68, 203, 77, -107, -240, -49, 138, 154, 104, -21, -199, 47, 190, 133, -22, -73, -164, 8, 119, 80, -98, -180, -129, 152, 181, 43, -48, -113, -59, 68, 139, -28, -137, -92, 57, 124, 88, -61]
6294f1rJ03q6J72o1p6k7j4Q2K00j92q4J5J11J54j07r9k8p1M1N1O6r3j18P6J9J44
6321A08J02k25j73J52Q3Q2m6j30qj6J74K8j34j62O0J09J84j8k56no7K25K7J60
6345B54l62r8J69K15p9j19j09q5K00L4M5p0j86K9K57N3Jj37n9Q0k3N2l6k02lK36
6371E7J28m4m1j83M6R8J02k5j15q5QK3J34j11o5j3P7N2N7j03q8QlJ96K9j39p1
6398g1N5k8K47o1j55m3L6N8m9R4k00j7J35J5P0m9j56K3K1J57m1o9m2r5J42J88
6424A65r9r1n2k4K53j4j31j10n2J90J29Kj45j67L4J44M3M3q7j24J6J97N0j09j62
6449a01n5J01J34J8j27KL1N9J09j08l1j50Q9K3J39r5J4l1o1J01J0M2j31j96J61
6474e3J56l0k10M0q3J32JM7n6m1k6J04J13o1k1q2p7J78J49r4j01j17J10J08Q6
$$ y = [-61, -70, 33, -53, 119, 58, -18, -45, -59, 23, 223, 31, -53, -38, 73, 227, 120, 21, -7, -78, -37, 14, 80, -13, -131, -55, -36, 108, 210, -15, -188, -36, 47, 129, 83, -47, -55, -71, 103, 131, -3, -165, -105, 4, 188, 170, -86, -91, -158, 67, 94, 254, -108, -206, -37, 178, 99, -20, -129, -214, -14, 20, 65, -5, -191, -162, 95, 148, 149, 12, -47, 33, 10, 62, 26, -176, -179, 57, 185, 141, 100, -83, -37, 61, 163, 138, 23, -62, -54, -31, 103, -8, -73, -86, -9, 43, 100, -3, -91, -83, -86, 110, 139, 0, -71, -16, -44, 203, 142, -13, -56, -20, 38, -11, 83, -117, -134, 1, 16, 86, 37, -119, -96, -75, 82, 41, -28, -70, -165, -23, 165, 66, -25, -77, -101, 152, 138, 7, -103, -155, 35, 164, 166, 21, -146, -112, 32, 75, 118, 31, -93, -77, 120, 170, 61, -101, -156, -55, 79, 97, -30, -28, 3, 62, 171, 63, 32, -118, -29, -6, 133, 38, 52, 21, -40, 61, 71, 113, -18, -214, -53, 103, 73, -137, -97, -180, -48, -47, 0, -56, -97, -123, -19, 94, 33, 12, -70, -147, 31, 180, 86, -15, -132, -22, 86, 172]
6499A72j55q9M5QJ42nj07j02N2J54N4j47k7p9n1J12P6p0j52Q1M2J82J3k09j04
6524a64J28J01n4Q4j59q4J3K19R0j63q5j38J13K09O1m9k09N7n9J10N8r6j4LN2
6549B4K5N6j36q9J03Q2O0j7j07q7j5K20p0o0j6j76J90K20o2p5j66j0J61j8J10
6574A47j32l9LQ0M4kj52j48Q8K58r2rj55rJ85P0O1k11p9P0K3J62r8r1j20J73m8
6601b1J13n9j05k3O4R0J01j93j20J49Q6L7k9j50j1MQ4J44j02j1j54J33m0J26q1
6626C2j35J7P5R3M6k06l6K9Q3J64o3r0n5L0j3J85r9j39J0k7K04n8l7r0k5R7J0
6653BO6n0j29J17M5J1J27j89m4M5j3J02m4j00r0O2J98J34k96l1o5J18J29j3p5
6678A7r4O7J09j9o4Nj86J10J53p3Q0k13K9L1J81M0j64m2l9J62K0m1r4q2J87M0
$$ y = [172, 17, -72, -27, -19, 123, 118, 11, -91, -39, 115, 169, 22, -5, -84, -135, -23, 53, -17, -169, -88, -46, 136, 149, -60, -164, -36, 65, 11, 95, -64, -148, -135, 84, 174, 11, -74, -212, -99, 110, 171, 122, -87, -30, -89, 21, 79, -17, -31, -28, 24, 49, 105, -31, -120, -17, 65, 125, 108, 1, -86, -101, 119, 49, -11, -27, -203, -13, 207, 145, 70, -96, -106, 55, 37, 147, 15, -24, -21, 59, 103, 101, -51, -199, -111, 147, 55, 46, -109, -118, 67, 137, 198, -13, -92, -22, 1, 163, 65, -26, -146, 27, -21, 92, 33, -72, -95, -31, 59, 160, -33, -153, -4, 82, 119, 90, -60, -71, -67, 17, 161, 59, 48, -106, 27, -13, 113, 32, -103, -86, -11, 82, 128, -78, -114, -85, -2, 162, 99, 9, -46, -16, -29, 156, 57, -82, -72, -99, 105, 47, 10, -80, -105, -8, 2, 68, 18, -111, 6, 51, 62, 189, 0, -44, 1, -12, 90, 46, -54, -144, -82, 116, 250, -46, -77, -142, -24, 105, 92, 17, -77, -10, 99, 80, 16, 21, -165, -55, 98, 25, 105, -108, -79, -48, 133, 173, 9, -33, -72, 90, 110, 69, -25, -107, 80, 120]
6704A20K1j53o2J9K0P1k6o7j2j6Q6J21l7j37J7k5J04O6j25J1p9N5J2R4o2j9n7
6731f0N1O0K1j9l5n9j0R8j8%j65LO8J35L8j13j54J24J25M2qk10k1J58j5O8p6j25
6759i7J28K1J0M2j11j1p8J69j5Pk38M2Q9M1J17r1n5q7J09J33j65l8QR6J1P9j21
6786el2q4K17rp7N2j36L0J05N6p4k1o4j16L0J96%l1k26J60J02l6pM4j61J07N4
6813G4O5j61P9j23J6J31M6q8n4l2N6J44o5j61j0j0P4J61j09mq5Q6K0k8P4j90J1
6840h3L4J23J06k79m3O6Q2P0J6j89j4L6N5J08l8q5j01J48Q4n4qn5j87K74J2m6
6866C2q4k6K7J07J02j04j01k0N4PJ9N0j44L4l1J65M0j17j80J16R6Q4j2j38p6j06
6892b06K26MJ0P4k60P1R6K0l9j12O5lJ50K4j34k3k5Q4J31j48p3K7M5J4J46q8r4
$$ y = [120, 141, -12, -74, -55, -35, 36, 10, -57, -69, -85, 1, 122, 85, -52, -35, -60, 44, 110, -15, -4, -83, -28, -16, 78, 16, -3, -60, -9, 51, 72, 53, 18, -41, -51, 47, 29, 29, -136, -133, -65, 70, 108, -5, -159, -35, 90, 132, 124, -86, -107, 51, 36, 104, 28, -97, 31, 52, 62, 104, -7, -18, -96, 73, 58, 65, -173, -131, -42, -1, 116, 25, -30, -117, -8, 125, -40, -78, -70, 26, 37, 116, -5, -37, -121, 96, 87, 10, 62, -74, -44, 61, 117, 43, 22, -42, -158, -128, 68, 68, 37, -189, -29, 73, 37, 30, 74, -87, 20, 74, 139, -22, 57, -66, -50, 81, 127, 39, -15, -47, 9, 153, 88, -73, -83, -93, -19, 142, 33, 29, -56, 30, 50, 22, 96, -94, -83, -49, 74, 180, -99, -142, -76, 6, 76, 92, -97, -111, -75, -20, 88, 50, -35, -136, 12, 96, 42, 34, -21, -208, 66, 78, 32, -52, -78, -51, 56, 158, 54, -47, -67, -13, -6, 13, 63, -81, -47, -78, 87, 127, 10, -170, -54, 42, 126, 114, -24, -100, -206, 20, 24, 34, 108, -152, -81, 15, 35, -4, -116, -51, -54, 96, 120, -14, -37, -62, 22, 153, 5, -68, -41, 4, 18, 164, 76, -18]
6919a8jL6J09rp2o1j6L3J05K3j41L6j13J07K8J3q8n8L0K27M9j60l5p9P9J51L4
6946B09k35q6M6M9R1Mo5p4P8j3O4K0j13j2Q3j0K5O1k63O3P8M8Rl7o6J6O1P5Pj35
6976b2k7K8J2J18o0j14R5p8J13K6Jl0j44N7J54o6qj47P3n4J41Q4k08l3JJ00J8
7003C0M7j23j36K34J1J6m8j57N1J7J74k7j34J3l9P8J77j46l8j57J94lmJ2q2J54
7029A14k30K55j28J7j22R5O2n8M6n8kJ0nJ31j06n9N1n2jJ36L9k74N9J46kK6j13
7056b3j25J04R5j8J20j72p8N0jJ55j39P0n6j8J18k8q7P0j29J24J8O5j07j62M0
7081a14P2J36k7j32q9L3J99M5j12r5N8L1O8q6M5pj94K30n9L4Rj20Q1J30p0l5m
7108B7j16P1J84j14q4Pk5L4N7R5n4j63QQ0Q8P5k68l0J04J13J0j32j2J11m5P4n0
$$ y = [-18, -19, 17, 126, 117, 45, -16, -32, 1, 106, 129, -12, 24, -89, 18, 46, 59, -29, -87, -57, 170, 219, 59, 24, -55, 24, 175, 209, -26, -112, -66, -17, 74, 78, 13, -61, 17, 4, 68, 88, -25, -37, 46, 36, 61, 122, -141, -78, 0, 48, 57, 20, -46, -30, 31, 106, 113, -22, -49, -21, -9, 109, 49, -65, 30, -48, 65, 91, 92, 62, -82, -25, 129, 63, 55, -92, -19, -73, 68, 152, -56, -89, -88, 12, 30, 77, -46, -182, 52, 63, 79, 31, -126, -75, -58, 116, 89, -45, -32, -71, 7, 184, 38, 0, -157, 37, 34, 30, 42, -40, 114, -116, 139, 11, 28, -94, 1, 63, 5, 51, -7, -9, 1, -4, 127, 21, -38, 13, -39, -40, 96, 135, -139, -80, 66, 64, 90, -23, -148, -44, 51, 33, 153, -19, -97, -47, -48, 107, -32, 38, -18, -36, 82, 54, -33, 37, -92, 32, 50, 115, 8, -154, -114, -42, 94, 67, -65, -154, -121, 78, 123, 11, -84, -26, 5, 73, -13, 32, 25, -169, 61, 2, 36, 45, -75, 6, 136, 66, 31, 27, -89, -18, 166, 52, -32, -25, -50, -16, 41, 136, 82, -81, -73, 7, 95, 170, -98, -128, -24, 89, 99, -33, -45, 66, 21, 95, 45]
7135D5pp3j02J3J36P6r0n8QM7k1K0k5Kq7J53J11q7q2n3N3R7j2r7J9Kmp3J45k9
7165B7k55J46J84m7n4o7j25J42P9O7rj00k7O8J23m0j37j21Q8L1M5L9q1k1%j5J17
7192E7qj33o4R2J19r1J21p9j71J54L9p9lm6J12r7K01q4Kj00l4J95o2L5p1k3L5
7219A7k2j0L1j06Nj8J82M3m3j85O7J2Q4k1j15N2l0P8LL1m6j77J48M3j5K2j14Q5
7247An1J43P3k05%r0K42k0j9j50m8J49M6R0j36k2j4j9J40J0j64p7K1J48J56j40
7273F4j39R9p6J9J59j54n4K7lJ24N0n8j25p5P6N8L3r8O1q5J52o0N6p3kq6J35O4
7301H9r2m2j3L1J3J6J9p7n8J55M6J5k6j10k2P0J67j02j28qL9Q8j30Q4j58PR6J46
7329A15p6n5oRN2P1l1j68k2O0J26N3q9j21p9R0J12n7J0j30J17P1K3J3j26L9m7
$$ y = [45, 38, -35, -137, -124, 12, 88, -2, -60, -52, -5, -26, -6, -31, -29, -116, 37, 148, 61, -21, -74, -21, 76, 64, -33, -14, -12, -16, -89, 56, 27, -228, -82, 102, 55, 1, -66, -191, -49, 30, 97, 88, -12, -39, 29, 152, 112, -25, -146, -58, -27, 18, 57, -24, -45, -45, -60, 57, 49, -84, -148, -56, 63, -28, 93, 14, -157, -3, 36, -43, -46, -92, 20, -77, 124, 40, 42, -58, -92, 103, 41, 76, 5, -18, 17, -5, -15, 16, -90, -85, -103, 79, 122, 79, -106, -39, -27, 57, 36, -79, -27, -57, 21, 24, 55, 9, -168, -20, 23, 8, 30, -84, 1, -50, 93, 166, -39, -39, -129, 113, 93, 74, -76, -124, 25, 71, 161, 25, 3, -11, -30, 110, 120, -44, -121, -100, 48, 204, 64, -75, 24, -52, -33, 126, -28, -82, -55, -58, 66, 116, 58, -67, -142, -66, -8, 25, -73, -12, -97, 55, -5, 51, -22, -24, -110, 25, 89, -3, -45, -58, -27, -14, 2, 21, -56, -114, 41, 87, 102, 76, -34, -56, 14, 181, 79, -49, -57, -18, 70, -60, 24, -134, -127, -31, 115, 39, -16, -22, -13, 39, 110, 79, -89, -111, -51, 75, 128, 39, -82, -161, -71, 41, -16, -6, -136, -19, 52, 75, 88, -38, 1, -46]
7356d6R7J33j95l6n5M8N7n3Lrk7M5J07K1m2q2o3N0J42L3q0n9OL4N8n6o9r9J71
7385C4o8N7O1k57J20K8rO5J30k12L2R4j15Q4j8q2l1j2J71qj03m3L9M1P0J2j50
7412g0RR9o2J17j49O0p3Q1J7P3j19k9J3O6J33r3n7j00J08O6M3j12q7J03O6m9M
7439E8k1l3n8J4J20j1q1j24K34K2q4M3j17M5R0j18RJ16q7n3L5K7M5j19j3N0L8
7466B7k8Q0p8QJ1N7q9OK8j00Q2R2p2Q6j11l6L6R9n5p0q6J01L2K6qN2k00J52J18
7495A60q8m6j29N3J67l8o1q9kO1j7K29j46p7N2l9PP2l6j18l3Q6Q1m6j5P2j9nq3
7524d7k4j2Q7j2L7k5nLk4K3J6j3Q3j46L1p2K41L8j66j3j76K82p9l4J1j35K5J67
7552F1K0j6j75N6k6J78n6K1j04P5J9k6J5j49p0L1J27O5knm9JK3J99k33J0QJ2n4
$$ y = [-46, 51, 184, -11, -47, -102, -54, 3, -50, -47, -56, -83, -38, 69, 90, 48, -34, -97, -47, 95, 128, 48, -11, -5, 29, 87, 31, -38, -137, 34, -34, 23, 84, -173, -53, -25, -34, 31, 161, -51, -19, 75, -40, 44, 26, -56, -87, -99, 72, 64, -39, -82, -43, -2, 68, 80, -70, -61, 38, -24, 93, -56, 4, -69, 12, 29, 102, -17, -46, -33, 33, 166, 73, 16, -84, 24, 90, 133, 21, -66, 37, 103, 54, 58, 37, 4, -54, -40, 80, 69, -12, -136, 98, 120, 36, 79, -38, 7, 97, -21, -12, 104, 17, -36, -1, 26, 71, -48, -61, -11, 27, -1, 79, 1, 9, 20, 77, -12, -6, 22, -78, 4, 96, 24, 110, -1, -37, -1, 98, 43, -27, -113, -12, 20, 46, 38, 90, -110, 42, 160, 72, 26, -103, -50, 117, 79, 18, -71, -73, -12, -29, 200, 54, -23, 29, -10, -3, 69, 33, -85, -118, -32, 49, 3, -12, 60, 41, 36, -47, -71, -83, 4, -8, 29, 4, -1, 2, -22, 1, 17, 4, 87, -59, -28, -100, 141, 179, 13, 0, -176, 106, 27, -7, 4, -131, -106, 61, 81, 65, -110, -54, -80, 98, 42, 63, -41, 34, 53, 27, 42, -107, -177, -146, -19, 46, 44, 39, -10, -9, 14, 213, -20, -10, -2, 10, -44]
7581d4M0O3j71J22p1J30L6j0j11j13J00P6qnj48O3P4N5m4j20J14l5n5J39p4Nk3
7608a5pJ62j03n4J8n4J1N4Ro0J3l1k0J09m8n7K8M9qJ2K9pp8O9K1j0n1j09O9J68
7638A09k5L1k27R2N5J7J1O7k13M4R7KM1p3n0K7Q0m2O9j25P4l3J3K1j0n2j11N1
7666f0O8J40m3j27O5N4r0J0j6j0j0k0J60l5j16p0pJ47l4n5K7l4O1k2M4n7J7qk0
7695d1J42l4j06l6M7L7J%Lo8l1J18n8K6N5o0O6QL6l8p7rK0J36o7r3K0o0J10Mn5
7726dL8j08Q0N4Q8j55p5M8P7m7P6p4m8p5Q9J89n5j07m6K7LP9l1j1k9N5m3J00l8
7755E7k86O2J93oO7j94J24m8J35k3j15J95k01j03K14M7m9j27J37K2r1P3j32J15
7779F6j03jJ83r4j03QJ7PM3n4n6J01o7J22M0m2q3N3n3J35p6r3k8J3L5M3M0q1N
$$ y = [-44, -4, 59, -112, 10, -61, 69, 105, 95, -16, -129, -29, 47, 39, 34, -114, -51, 23, 78, 34, -86, 28, -7, -62, 77, 3, 8, -15, -22, 140, 37, -17, 1, -53, -42, 12, 21, -39, -26, -57, -77, 32, -16, -73, -45, 4, -4, 8, 37, 30, -48, 21, 42, 32, -19, -128, -59, 109, 84, 115, -112, -20, 35, 52, 63, 130, -83, -39, 58, 60, 101, 28, -22, 5, 85, 43, 112, -13, 61, 28, 41, 62, 52, 0, -111, -60, 8, 148, 105, -22, 43, 97, 7, 17, 1, -9, -19, -39, 121, 86, -30, -100, -107, 40, 6, -49, -22, -56, 5, -17, 27, -30, -13, -21, -41, 101, 67, -39, -75, -28, 9, 10, 10, 13, -55, -86, 32, -26, 0, 55, -5, 61, 69, 105, 67, -10, -19, 1, 137, 70, -23, -3, -63, 47, 51, -4, 34, -74, 6, 60, 148, -7, -82, -34, 43, -4, 72, -2, -50, -125, -36, 153, 98, -9, -55, -28, -25, 54, 23, 12, -17, 38, -5, 95, 57, -229, -167, 26, 20, 87, -107, 17, -31, 104, 81, -34, 161, -40, -143, 71, 118, 69, -58, 79, 101, 10, 83, -49, 66, -37, -38, 145, 51, -52, -44, -27, -20, 23, -31, -87, 14, -53, 69, 109, 67, -16, 37, -16, 119, 43, -50, -78, -65, -30, 13, 53, -28, -23]
7808b3QJ69j33l1L2j15J35q8P7O1p5MpN0o8om1J1k1O6J04p6r2J5l5O1j8j8J00
7837D6j2Om9k7Jj0P9R1j08Q6j50P5j00R3K7q5rP2K3J0m3k7o4o8J94Orn7m0Q2n7
7868b4Q2k8n9j5J03mp6l4k3J12K3m8KJ5%p8J35K1p4p0NmJ54n2j12N0j8MO9J1j25
7899e8kk9N2J25m6p6RM7o7L8p9l3Q8J44l2j8n4j35jJ87l2k4koj8L6j6j8j11R0
7929d1N8lK8n3k4jJ29j10j8QM4n0J11k7n6j65J40j5J19m9n6m5N4J4M3n2n1m4R1
7958b1J06j1o5n1j7J05o7O0n1M7m4k0J61j07%o4M1R8r1L7n6k3J1J2J33o0j44k7
7986a08J02L6j4K0j09K1J12k7K9p5P4q9j0J57j35J6J4L5l6O6j35L5j0J03J9j08
8012a7O5p5k1R8p6J16j35n3N8K9J0o0N6mQ3n0j7j7q9O1M6K7L6k01M6O5R6qj0j28
$$ y = [-23, -15, 154, 21, -10, 22, -93, 42, -46, 31, 92, 17, 21, 14, 64, -4, -10, -51, -40, -61, 5, 109, 33, -59, -44, -79, -18, -36, -54, 46, 34, 40, -9, -36, -35, -45, 34, 125, 17, 103, -47, 28, -72, 21, 48, -37, -46, 26, 49, 59, 16, -11, -75, -143, 51, 57, 48, -9, -49, 33, -24, 58, 30, -29, -44, 59, 55, -21, -55, -78, 34, 57, 9, 11, 26, 26, -52, 83, 104, 30, -40, -35, -39, 115, 63, -49, 1, -17, -13, 56, 67, -58, -60, -89, -37, 88, 42, -34, -25, 22, -45, -7, -86, -119, -31, 113, 81, 63, 9, -126, -127, 60, 28, 4, 2, -4, -22, 14, -2, -20, -131, -41, 17, 14, 42, -11, -35, -36, 93, -17, -35, -27, 17, -33, 78, 51, -5, -170, -30, -45, 74, 25, -31, -76, -22, -8, 35, -17, -68, -112, -21, 85, 74, 9, -42, -59, 46, -21, 39, -12, 35, -9, -29, 132, 25, 25, -39, 2, 100, 9, 46, -10, -33, -22, -10, 123, 63, -81, -108, -6, 30, 16, 36, -73, -52, 60, 33, 62, -13, 61, -28, -38, 119, -16, 0, 14, 49, 13, 79, -56, -21, -31, 72, 91, -17, 48, -27, -48, 50, -26, 90, -45, -98, -40, -11, -1, -61, -5, -9, 74, 24, 7, -10, -99, -38, 8, 35, 71, -130, -84, -19, 77, 69, 59, -69]
8042f9P9M2j9j6J9j39R9J0rO2ln5%j12L5Q2oq3l3J92n4l9M9j78Q2J19n2J0k4j3
8072b4o8K53n8m1j73O5J08j02N5k1r5NJ86j07P5p6L7JR0lJ2k48J37k6L8p4R0q0
8100d4NN0N3m2l6j8N5J0J0j1l5%l6K9N1J4j14J17j09J30n9j06R7n7JK21j26j06
8128e6k6J13l6Q6r5L6Jp8J31q7j9L6Qn6Q0kJ7j01K1k7J62l1j65R8j18M6J07K1
8156F6o8j8%M6Q7j03j25L6J01M4M6j49M0o1J04j30O9p1Q9o3M2P1j76P8n9J2J53
8183F1r5Qo7N1J54j9n9n3
$$ y = [-69, 10, 52, 33, 17, 36, -103, -4, 6, -3, 59, 56, 1, 1, -111, -76, 6, 0, -83, -116, 76, 22, -17, 32, -146, -64, 55, 3, 13, -11, -24, -92, 161, 103, 62, -111, -46, 62, -40, 15, -6, -101, -96, 90, -17, 58, -18, 19, 20, 110, 107, 119, -129, 8, -18, 20, -54, 36, -44, -39, 11, 64, 22, -14, -32, 23, 33, 43, 32, -3, -3, -39, -10, 41, 55, -59, 58, -51, 79, 20, -86, 11, -46, -45, 176, 50, -56, -82, 31, -5, 81, -14, 22, 23, -55, 76, -11, -30, 6, 14, -42, 38, 36, 53, -48, -27, -54, 108, 77, -88, 10, -108, -62, 45, 66, -2, -20, -20, 26, 113, 10, -115, -79, 22, 66, 112, -37, 3, -58, 46, -84, -15, -86, 3, -60, -18, 53, -123, -45, -104, -92, 61, -34, -26, -93, -42, 112, 93, 34, -19]
8191a9
$$ Imaginary data points
##PAGE= N=2
##DATA TABLE= (X++(I..I)), XYDATA
0@%%%%%%%%%%%%%%%%%%%%%nJ0j3J6j6J6j6J6j8K3k6K9l2L6m1M2m9N7o0O8p6Q3
43D4r3J03j12J24j40J59j79K01k30K66l13L75m65O02q28J280k517J1672M6073
62E6022j2933n3478l2291K2478M4837J5300k9030l6175j586L3459L1184j921l0785
75E081k8637j399K4776K7068M452k2712k5925N19K8239K2527j2272l5900j9623
88c3806K0553L9718J4926k5777l5384o301K4258K2341m061k0938j2183Q327J6997
101H670R368n039j5635j5296k874J4178K1199Q370j5294k5412o013K2795K4177
114B3194o177l2047j9247J8759L7904J4158k5224l6041p666K5559K8025P55k3306
127a354j8732N852K2989J6196o951k5758k0454P123L0878K4149q790l3307k1374
$$ y = [0, 0, 0, 0, 0, 0, 0, 0, 0, 0, 0, 0, 0, 0, 0, 0, 0, 0, 0, 0, 0, 0, -5, 5, -8, 8, -8, 8, -8, 8, -10, 13, -13, 16, -16, 20, -21, 21, -28, 29, -31, 37, -39, 44, -49, 54, -58, 66, -74, 85, -94, 107, -123, 143, -170, 205, -260, 342, -486, 794, -1723, 9949, 56022, 43089, -10389, -42680, -20202, 24635, 39935, 10905, -25270, -26856, 6603, 37787, 35866, 5081, -23556, -24955, -179, 26889, 31341, 8629, -17296, -16777, 11462, 33989, 21717, -14183, -33806, -13253, 26465, 41391, 15614, -19770, -26071, -1813, 20528, 16467, -4471, -16654, -8327, 8670, 18038, 12999, -2636, -17932, -20806, -6628, 14571, 22941, 7647, -17765, -23778, -983, 23194, 17017, -15030, -34277, -15518, 22386, 36544, 11320, -24721, -32387, -6828, 21197, 21952, -1354, -20086, -14234, 8755, 24951, 18000, -7758, -28212, -21089, 9789, 33938, 25148, -8159, -29533]
140b9533J5814L5070J1907k8227l5235J691L9119L1785j3014m2124k2835J9103
152a6479L4741J0925k1419k5362k68K2509J8038n658k1495j6115K748J8512J8149
165A8826J234j7286j8828r25J7904J6089n722k1785j1731J4262K5316P411j9636
178E129k4700k686J9156J7052j566j3135q178L607R122M824l159q277p763n98
192a1172J0379J5501N079j3906k0552m330J8444K0209l511k3249j3453J4487K6092
205B0018O766k2112k6486j454K3980K1605k704k0355j4548N129J7115R864q166
218H652j8210j0244J0084K2560J2126j2909k6223j1881J5936K6082N750k2662
230i39k3621N421K9017J7311j6220l1377j0768K0791K7206L629k0781j8780L135
$$ y = [-29533, -13719, 21351, 33258, 5031, -30204, -28513, 10606, 42391, 29377, -12747, -35582, -16479, 18262, 29187, 7768, -17594, -17862, 4647, 22685, 17027, -4468, -20583, -17835, 677, 18826, 20060, 2774, -16054, -16979, 925, 17014, 11292, -10493, -22224, -7962, 17354, 24765, 5129, -19571, -22257, -3101, 13951, 12385, -750, -8928, -5321, 3801, 8625, 5466, -2811, -10574, -11172, -793, 14708, 19787, 5881, -14671, -19001, -557, 19652, 16141, -7108, -20561, -6074, 20018, 26784, 4672, -21814, -23268, 712, 22317, 19613, -742, -15290, -10161, 6954, 16818, 8652, -9558, -19802, -9718, 12842, 24968, 12059, -14164, -26045, -10109, 15973, 21723, -939, -24560, -19139, 9878, 27189, 10969, -20408, -31176, -10385, 16821, 20450, -331, -19111, -15976]
243a5976J7803J0520p571j5673p139P673J4551R236m811j5223j1524L697J5159
256G22J0578n402j5470o754J1705J6544J234j6675j5849K791J7351J2668l848
269I595j2769p344L355P944M106k475o538m494K136Q756R509m21j4183j4669K078
284a5414J8610J4902o543k0256r582J3876K0353J563k0123j9113M538K3266J6295
297B2372p755k1238j1411Q461J7007P568r328j5895m955J2500J7912M106j5521
310C823k0942l802J8812K1507L62k1382j7972P277K3891J1159j5862k4349m103
323b1581K0500K1974l74k0586j6511M254J6720R480o201j2865n268O907J1969
336H418N401o481j3011q101N497J4498R057n914j4468o780Q591J3699K061j2819
$$ y = [-15976, 1827, 12347, 4776, -10897, -18036, -10363, 4188, 13424, 8613, -6610, -18134, -14437, 722, 11300, 5898, -9572, -16326, -4621, 11923, 13157, -3518, -19367, -16576, 775, 13443, 9595, -3174, -10518, -7163, 781, 4887, 2412, -4126, -8620, -6484, 2272, 11781, 11360, -2823, -17492, -15414, 3196, 18098, 11555, -8701, -18283, -4407, 15946, 17509, -2614, -21727, -17189, 6077, 22372, 14617, -6621, -18032, -9571, 7436, 15004, 5676, -10219, -15174, -2674, 15238, 19344, 3823, -17119, -20921, -2109, 19398, 19760, -1622, -19594, -12317, 11574, 22733, 6871, -17478, -21581, -1081, 20893, 20519, -67, -16578, -12324, 4396, 13876, 7675, -5190, -10458, -3551, 8418, 13819, 7338, -5673, -13774, -8277, 6221, 15278, 9364, -5104, -11884, -3293, 10406, 12467, -352]
350c52j2498K337J4693J0754l356j3050r104K175R405P256p72p295p079P70R153
365C037Q755k412j3801j1735M935J8769J2333q888k0350q739J3011J8949K147
378A6011j7738j6285M710K0626J3397q484k0692j0668R278J7934P697r119j5599
391h932n010J1061J5251K279j4470j6738m27J7679J7788k067j9941j5104O396
404a2235J9717R481j1856j8733l067J6204J6596j559j7047j3220L268J4213R127
417A0889l696j0076n614L295Q398M674l895r342n983M262J1481P789m709j2780
431e307p404N843J2140M243p836j0390o58R967R015j430j0123q978P15R332R002
446H131O62q026q902r45Q680R319j402j2067r488N261J5962R353q855j8301p213
$$ y = [-352, -12850, -10513, 4180, 14934, 11578, -1472, -10576, -8401, 1004, 8260, 7488, 193, -6886, -6116, 3037, 11792, 9380, -4421, -16156, -11221, 7548, 19881, 10993, -9357, -18096, -5085, 13864, 16011, -1727, -18012, -13302, 7324, 20721, 12237, -8455, -19123, -9845, 8089, 15786, 6667, -8932, -13942, -2881, 12370, 14649, 179, -16559, -16986, 693, 18481, 16414, -3527, -18631, -12235, 7482, 16963, 5107, -13626, -16693, -489, 16107, 14548, -2499, -15719, -12451, 1762, 10889, 7193, -2883, -8497, -5202, 3196, 7870, 3975, -5367, -11350, -7088, 4393, 12182, 7473, -5307, -12711, -6868, 5272, 9515, 1679, -8711, -9369, 598, 9613, 8183, -1940, -10918, -10203, -871, 8131, 8793, 767, -8135, -9080, -400, 8919, 7517, -4550, -14038, -8777, 7185, 16538, 7683, -10618, -17831]
461a7831J2085J7312K606j4412j3930L013J6432J0305p478j6769p968R039J6024
474H428O428r171j3996m130R140J2380J787j1327j1939J115J4127J2147l807j5909
488d727j0943O290J5740P113q904j3470k170J0970J1131j983j2186q382L501J0560
502B540O752k859p949n067J801N807M115j509n836m379K632P849N068l561r504
517d100n642M386J0014M697n109q553k394O148P649K42p449p040O87P817Q012
532I365L31q180q606k23Q635Q383j026j0117p628M740J2744O108q638j4497m077
547a2686J1568J4194R03j2739j1300K538J3255Q090o566j3498n034Q767J2930
560A0422L452r285j2128k214R117J0381J87r694q746K057J1248P632n072j2500
$$ y = [-17831, -5746, 11566, 14172, -240, -14170, -11157, 5275, 15580, 8102, -8667, -16635, -7596, 8428, 14856, 5685, -8311, -12441, -3301, 9079, 10866, -461, -12400, -11285, 2842, 14989, 11182, -4727, -15670, -9380, 6360, 13473, 4569, -8901, -11071, -101, 11030, 9047, -3139, -11521, -8020, 2540, 9292, 6433, -1516, -6583, -4782, 1025, 5140, 3631, -2205, -6584, -3952, 3897, 8965, 5404, -4100, -9742, -5356, 4658, 9355, 4246, -4307, -6701, -553, 7096, 7338, -111, -7151, -6464, 1353, 9365, 9696, 1516, -7090, -7313, 1322, 9705, 8679, -1438, -9066, -4326, 8418, 14526, 5888, -8609, -12686, -1118, 13076, 13979, 1240, -10060, -7522, 5733, 13823, 7257, -6241, -11275, -2508, 10422, 13874, 4589, -7539, -9753, -636, 9745, 9932, 238, -8508, -6451, 4797, 12429, 7357, -5143]
574e143o364O483J2401M683q042j0680j378Q492P855j806q546n829L310Q335M571
589H342l142p125m190J922N560L991j061m995l902J692N980L794l356p456l785
604g731M315Q393L882n099q512k769N525P299J027o486o758M18P445O847j136
619F660q885p933J627R565P417k919j0410o439N130J1222L972q748j2165j608
633a3514J1419J1609r58j2691j0178L480J2415O920o116j2029l973Q540J1277
646F201J714r749j0484m38R812R518p03r803p508K756R945N927m718j0229m256
661a2015O725J0581L072p388r258j120P568P252m12o683n205J951O912M578k408
676D150o283m237J918O002M794r18n658m746J276O052M506k490o915l882M021
$$ y = [-5143, -11507, -5024, 7377, 12060, 4018, -6662, -8040, 452, 8307, 6501, -2045, -7874, -4564, 3771, 8342, 5200, -1925, -6115, -4193, 1367, 5358, 4297, -698, -4600, -2908, 3072, 6866, 3510, -3946, -7731, -3416, 4977, 8859, 3760, -4752, -7521, -1996, 5303, 6330, -156, -6914, -6496, 949, 7796, 6660, -2225, -10158, -8531, 1034, 8451, 5532, -4878, -11317, -6187, 5035, 9007, 259, -11906, -13514, -2095, 9514, 8556, -4135, -14313, -10833, 1582, 8502, 2386, -9643, -13616, -5076, 6201, 7915, -1834, -12318, -12756, -2944, 6574, 5871, -3932, -11440, -8684, 1261, 7188, 2470, -7759, -12015, -5290, 5291, 8363, 975, -8283, -9403, -1835, 5417, 5005, -1678, -6883, -4932, 1980, 6558, 4150, -2133, -6370, -4452, 1550, 6344, 5426, -232, -4978, -3702, 2350, 6856, 4366, -2549, -6431, -2410]
691b410Q018L824n041r027l123N899Q677J726o532p785m32P724P556j341r411
706a678p424K885J0500O972m189j1063n848N941J1172L652q356j1121p50J0997
720A690J0119j869j1919q763L774J2224O767n839j1235l840P392J0362J472q768
734A567r342K54R358Q454j213r470p070K707Q845N146l857q455l900N243Q482
749F749K294o171p878j481N883O719N94n665n636R5N237M614r97n490m512Q56
765d789N450M813o72o062n580R88O340M927j880o991m520L194P772L840m903q713
781f786k955O170Q751J913o987q307n21P957P792j273r254o875L731J0329N787
796I472m984j0719m622O769J0716K690q226r684N9R905Q442k412j0501p029M325
$$ y = [-2410, 5608, 9432, 4391, -4636, -7759, -1860, 6817, 8543, 2011, -5774, -6206, 1518, 9074, 7733, -1678, -9102, -6217, 4283, 11255, 7066, -3997, -9845, -3904, 7268, 10920, 2564, -8557, -9307, 1690, 11809, 9940, -1979, -10742, -6968, 5256, 12023, 6184, -5051, -8891, -1499, 8863, 10335, 1567, -7775, -7521, 1837, 10291, 9078, -392, -7462, -4755, 4090, 9236, 5379, -3076, -6976, -1733, 6749, 9043, 2872, -5006, -6487, -604, 6115, 6709, 1044, -4592, -4497, 740, 5354, 4357, -1133, -5645, -4789, 661, 5474, 4802, -1260, -6840, -5852, 488, 5415, 3535, -3456, -7976, -4782, 2990, 6830, 1927, -6786, -9741, -3571, 5180, 7093, 106, -8201, -8722, -765, 7027, 5754, -3500, -10375, -6644, 3685, 9472, 4488, -6231, -10853, -4084, 6632, 9322, 1096, -8588, -8529, 1376, 9818, 7406, -3095, -10124, -5799]
811e799J0861N713n859j0341l145P048Q872J032p362p680L73Q268O892j915q397
826a439n622K696P758M350l426p045l180M116O688J767m859o176j038M875N443
841D908Q12m408n378o99M546M707Q4m571m432K13N017M724o34n684n122J069O527
858A679M972j948o873m295K779P535L778m766q103k276O346P929J245p162p968
873g128J12Q132P221j829r078o024M064R701M239n724r780k960P035R480J383
888H844q485q477R08Q974O720k761r512n367M548R332L921o100q878k091O635
903a789P686M10o961o495R74P082N494k238p358m304L087O764L166l080o194k642
919f398L719N695J583l954n193q88M056M809Q66m012m962o58M354M817K15m310
$$ y = [-5799, 5062, 10775, 4916, -5425, -8570, -1522, 7350, 8382, 1020, -6660, -6287, 1981, 8873, 6958, -1439, -7061, -4365, 3393, 7743, 4317, -2728, -5908, -1792, 4896, 6663, 1804, -4372, -5410, -535, 4908, 5720, 1312, -4066, -4765, -219, 4488, 4572, 1, -4431, -4218, 799, 5523, 4889, -795, -5917, -4848, 1679, 6651, 4703, -2170, -6465, -3686, 3849, 7627, 2861, -5242, -7518, -1172, 6757, 8002, 840, -7128, -7016, 1116, 8337, 6508, -2570, -8594, -4530, 5171, 9410, 3686, -6094, -9054, -2019, 7461, 8844, 359, -8118, -7210, 1764, 8484, 5723, -3789, -9156, -4608, 4724, 8645, 2545, -6333, -8424, -1789, 5897, 6307, -654, -7149, -6175, 907, 6401, 4163, -3195, -7499, -4412, 2352, 5518, 2438, -3756, -6398, -2679, 3016, 4599, 645, -4548, -5436, -1380, 3429, 4295, 283, -4679, -5337, -983, 3834, 4049, -261]
935b61m596N7M935M756o40n834m662J636O552M428k572o891l963L701P404L050
951G100m934p717j580O362P587J68p430p065J031Q464O401l011q892m874M659
966c731R036L221o114q779j613P283Q438j70q367p113J952Q605N620l279q650
981c661m115M659Q487K524n962p589j028O409O660k18o529n695J401O570M422
996F335k169o433l428L000N835K570l087n517k046L248N256J432l531m709j170
1011d414L596M739Q52l946m764o76M359M697J45m664m536J10N266M690j011o018
1027a575m428K100O560L864l175o988l289M343P381K215n717p299r07O835O886
1042F806o78p563o233K204Q203N318l850q638l773N274Q385K081o382p860n70
$$ y = [-261, -4857, -4800, 135, 4891, 4251, -1583, -6245, -4609, 1943, 6371, 3799, -3092, -7055, -3354, 4050, 7100, 2166, -5551, -7131, -769, 6818, 6986, -444, -7509, -6478, 1986, 8387, 5376, -3516, -8390, -3731, 5305, 8526, 2412, -6367, -7980, -697, 7741, 7571, -796, -7909, -5957, 2648, 8268, 4989, -3661, -7776, -3117, 5370, 7894, 1932, -5657, -6685, -276, 6384, 6166, -363, -6058, -4657, 1913, 6335, 4166, -2267, -5695, -2695, 3140, 5710, 2623, -2894, -4940, -1692, 3564, 4996, 1465, -3244, -4414, -818, 3921, 4773, 827, -3937, -4613, -254, 4443, 4588, -76, -4612, -4502, 764, 5454, 4443, -1575, -6003, -3903, 2657, 6521, 3346, -3642, -6931, -2588, 4793, 7008, 1291, -6008, -6915, -80, 6806, 6128, -1435, -7668, -5464, 2739, 8057, 4207, -4431, -8204, -2930, 5455, 7536, 1154, -6706, -7276]
1057g276P453P085j247q072n782K794P933M555l935p845l051M880P315J735n652
1072H90o531k62N898N432o39n845m719J511N946L734k325n413k920K373N155K610
1088D895k791m998j841L010M641J500l163m607j284L362M644J178l709m696o25
1103d484M117M595J16m579m667N10N377M628j538o131m017K409O607L405l463
1118B885o926k555M673P044J477o098o705qO972O174j513p484n358K946P922M005
1134G451m393p741k519N515P464J051o514o906M47P093N940j923p441m433L209
1149c700P021L210m219o629k015M902O273O82n299n353K83N154M539j059n229
1164a439l595J760M986K994k176m782k466K296M474K163k299m395j824K724M200
$$ y = [-7276, 177, 7262, 6015, -2057, -7839, -5045, 2888, 7443, 3508, -4337, -7388, -2508, 4807, 6542, 890, -5641, -5903, -5, 5427, 4788, -1057, -5776, -4265, 1681, 5415, 3090, -2323, -5243, -2870, 2285, 4895, 2104, -2894, -4735, -1725, 2916, 4416, 1253, -3354, -4638, -1276, 3368, 4546, 837, -3859, -4484, -367, 4228, 4344, -235, -4902, -4392, 985, 5613, 4075, -2056, -6073, -3664, 2943, 6348, 2885, -4041, -6596, -1923, 5121, 6598, 500, -6205, -6213, 759, 6933, 5420, -2064, -7422, -4476, 3446, 7451, 3058, -4683, -7202, -1687, 5777, 6828, 314, -6592, -6145, 948, 6888, 4965, -2476, -6909, -3700, 3321, 6531, 2312, -4317, -6332, -1430, 4843, 5525, 226, -5127, -4844, 310, 4849, 3790, -1439, -5034, -3274, 1712, 4706, 2530, -2252, -4718, -2422, 2052, 4215, 1916, -2479, -4303, -1579, 2621]
1179B621J452k916m325j027L396M365Q03l798m307m35M071M432j69m643m108R53
1195c635N360L951k008n981l469L170O378K732l996o410j777N119O291L10n856
1210A79n864J193O780M964k398p163m020L607P196K825m826o832j127N654N950
1225F118j87o237n332J466O567M386k586o509l210L437O060J908m279n488q06
1240d692M582N024k32m877m285Q89M565L363j162m402k856J801M133J960j941
1255A870l881k065K259L848J673k130l893j660K231L964J252k642l838q61L164
1270g09M003M06l859m068Q9M047M165m43m633l809J334M990L267k357n548k504
1286e629L297N922J973m538n907j058N179N656l61o049m679J910O356L604l143
$$ y = [2621, 4073, 1157, -3168, -4195, -799, 3566, 4369, 571, -3736, -4171, -100, 4332, 4163, -480, -4588, -3635, 1725, 5676, 3668, -2313, -5782, -2612, 3766, 6498, 2502, -3908, -5685, -566, 5725, 6035, 179, -5685, -4492, 2288, 7252, 4854, -2309, -6329, -2722, 4474, 7299, 2473, -4359, -5486, 168, 6118, 5931, -306, -5638, -4172, 2395, 6781, 4195, -2314, -5524, -2087, 3973, 5881, 1602, -3886, -4692, -110, 4914, 4682, -195, -4480, -3591, 974, 4337, 3175, -1227, -4083, -2282, 1851, 3811, 1870, -2011, -4076, -1817, 2031, 3704, 1574, -2319, -3979, -1748, 2216, 3468, 826, -3012, -3873, -709, 3294, 3700, -159, -4227, -4138, -91, 4074, 3631, -1002, -4811, -3477, 1513, 4780, 2423, -3125, -5629, -2332, 3590, 5563, 1025, -4882, -5940, -761, 4895, 4534, -1515, -6194, -4284, 2072, 5676, 2533]
1301B533o745k577M157O456J516m821n894m24N557M819r69n804l858K166N751
1316A863L109k857n711k366L485N357J219l779m524j23M165L816o12m219l322
1331d499J141M312K739j202l760k363J482L480J882j556l422j485J926L541J535
1346C751k123l702j374K262L839J438k759l738o97L028L657K62l835l782M52M442
1362A121L818j246m734l490J662N138K714k560n316j890L638N482R33m839n269
1377d838m2N362M998j120n801m157K526N926K769l668n799j631M397N714N57n023
1393A70m893L55N017M259j425n087l058K236N089K302k977n058j562L624M578
1408C570P15l495l823k40L673L210n45l714k702J077L735K384j242l443k133R91
$$ y = [2533, -4212, -6789, -2632, 3824, 5340, 519, -5375, -5799, -242, 4577, 3608, -2196, -6054, -3888, 1863, 4972, 2115, -3596, -5962, -2477, 2880, 4099, 320, -4204, -4327, -162, 3654, 3042, -1177, -4499, -3358, 954, 3693, 2491, -1269, -3632, -2150, 1330, 3212, 1656, -1766, -3251, -1325, 2216, 3751, 1628, -2074, -3448, -1186, 2653, 4091, 1332, -2406, -3103, -75, 3582, 3844, 9, -3773, -3321, 1121, 4939, 3693, -1041, -4531, -2869, 2269, 4983, 2423, -2893, -4783, -1145, 4337, 5270, 431, -4838, -4880, 482, 5480, 4360, -1441, -5598, -3072, 2854, 5623, 1955, -3844, -5475, -1078, 4636, 5193, 170, -4723, -4368, 649, 4908, 3483, -1604, -4662, -2426, 2663, 4965, 1988, -3070, -4632, -1008, 3570, 4285, 790, -3033, -3273, 400, 3610, 3065, -649, -3351, -2274, 1461, 3845, 2603, -840, -2973, -1982]
1424a982L119K053r94l232j728J435L139J641j966l513j610K366L983J281k814
1439A178m002r18L151L693K82l731l736P21M427L446j471m890l123K035N109K573
1455D744k836n003j730L777M997L79m566m612M91N220M404j418n621l430K221
1470b983N571K362l394n062j039M049M769J54m522m475P08M870L468j290m551
1485a365k411J766M290J608k486l963j307K989L885O37k915l469k69K832K794
1500B616k1k833k467P49K702K022q29k795k027N87K966K178q41k858k009R82L015
1517A137J737j376l453j565K144L821J302k814l884q40K947L837L69l530l556
1532c724O72M110K982j492m576k550K158M937K143k883m804j392L577M536J58
$$ y = [-1982, 1137, 3190, 2196, -1036, -2764, -1329, 1810, 3451, 1485, -2028, -3638, -1272, 2711, 3992, 1178, -2824, -3742, -591, 3102, 3384, -347, -4083, -3362, 1065, 4511, 3040, -1850, -4973, -2938, 2171, 4744, 1908, -3095, -4825, -1048, 3949, 4328, -238, -4850, -4359, 861, 5265, 3847, -1774, -5204, -2983, 2588, 4950, 1556, -3506, -4545, -496, 4273, 4427, -95, -4570, -3862, 1008, 4476, 3186, -1365, -3776, -2010, 2280, 3888, 1402, -2561, -3868, -879, 3006, 3643, 728, -2741, -3010, -178, 2616, 2595, -238, -2705, -1956, 746, 2768, 1939, -856, -2883, -2296, 670, 2848, 2007, -851, -2860, -1878, 1137, 2874, 1498, -1955, -3520, -1376, 2445, 3747, 933, -2951, -3791, -844, 2993, 3362, -168, -3724, -3052, 1058, 4040, 2548, -2028, -4578, -2420, 2517, 4660, 1777, -3027, -4419, -842, 3694, 3852]
1547C852m361l798R34M687L460j870m983k811K709M844J755l189m363n22L573
1562h3L535j63m000l272J103M238K487j440l825k002J734L371J378k175l115n67
1578b796K483K737K31k523k660j08K374K392J05k331j986K90K215J688n77k165
1594f31j783N64K639K011q42k865j852R23K806J775j332k946j363K086L212Q38
1610C240k698l579l48L150L553n4l521l132O80L859K509j711m157j715K465M278
1626B819J510l187m506o25L801L875l60l931l159J317M246K377k191m544j743
1641d301K943M364R39l213l593j83L243L074p25l576k398J331L760J835j698l485
1657a683j467J847L005J047j939k636m57K172K284q1k273k126QK318K365j36k241
$$ y = [3852, -509, -4307, -3373, 1314, 4774, 2904, -2079, -4890, -2181, 2663, 4418, 1229, -3134, -3656, -83, 3452, 3289, -711, -3983, -2880, 1358, 3845, 2405, -1420, -3422, -1688, 1683, 3061, 886, -2229, -2796, -313, 2424, 2655, 132, -2528, -2636, -262, 2130, 2235, -96, -2082, -1792, 423, 2111, 1534, -631, -2414, -1850, 789, 2800, 1958, -907, -2759, -1836, 970, 2745, 1413, -1533, -2896, -810, 2402, 3240, 542, -3037, -3385, -235, 3318, 3264, -257, -3389, -2709, 1150, 3659, 1948, -2209, -3924, -1459, 2819, 4329, 1142, -3364, -3989, -188, 3687, 3327, -604, -3763, -2446, 1800, 4177, 1986, -2558, -4301, -1358, 3006, 3945, 732, -2861, -3044, 199, 3273, 2548, -1028, -3426, -2095, 1665, 3500, 1802, -1683, -3150, -1303, 1702, 2749, 810, -1826, -2283, -111, 2173, 2092, -181, -2307, -2299, 19, 2384, 2248, 7]
1674Gk103J92K031J807m33k188j719P55K630J779j137l060j677J397L068J662
1690C011j489l368j128K143L319L96k893l282K70L464L060m83m043k965J381M013
1706A406K271j965m160j280K819M116O50l629m014K3M174L393o98m073k733J304
1722b396M102K141k423m134j234L113L969M76l257l498l0L353K809m52l339k364
1738c164J321L405J553j789l108j363J785K985J270j806k664p28J721K291M15
1753B124j984k134k30K256K333q7k275k300m0K208K189J37k459k055M73K691J984
1770B831j157k971j897J524L399J805j931l559j408K449L423O41k930l292K30
1785b843L584L074r38m092k964J705M221K185k151m051j325K785L849M34l526
$$ y = [7, -2096, -1904, 127, 1934, 1501, -687, -2406, -1651, 979, 2758, 1621, -1439, -3116, -1719, 1349, 3011, 1522, -1846, -2974, -831, 2488, 2884, -9, -3291, -3021, 443, 3503, 3020, -1023, -3988, -2607, 1406, 3677, 1712, -2448, -3728, -909, 3207, 3857, 228, -3786, -3763, 411, 3804, 3106, -967, -3700, -2396, 1706, 3847, 1424, -2710, -3944, -831, 3138, 3614, 357, -3141, -3171, 182, 2991, 2539, -800, -3164, -1843, 1562, 3115, 1326, -1782, -3145, -1360, 1625, 2895, 1089, -1575, -2303, -582, 1709, 2124, 140, -1994, -2224, 32, 2365, 2278, 3, -2297, -2337, -129, 2060, 2197, -262, -2317, -1844, 847, 2831, 1674, -1297, -3194, -1670, 1729, 3534, 1603, -1956, -3364, -915, 2508, 3149, 219, -3073, -2843, 741, 3815, 2877, -1215, -4179, -2474, 1747, 3932, 1781, -2270, -3595, -810, 3039, 3473, -53]
1800e3l568K80L956L225q55m104k578J455L830J890k054l638j024K783L275K54
1816C074k995l056N5K965K717k35l030k033Q36K649J537j258k468j387J408K658
1832A437J179j428k611r08J403J972J080j448k167n32J686K304J55j931k334l04
1848b447K314K508k7k341k403L04K534K130q88k827j839J442L276J639j997l553
1864b175j270K520L464N95k830l151L29L122K708r22l772k428J753M124J701k131
1880A637l766j198K563L441K51l121k929O05L533K333j076l484k185J510L415
1895A529J425j729l019o64K188K547Pk401k313K52K553K202n61k488j692P87K019
1912F42J241p95k027r28J156J970P43j216k042q94J272K074P81j165j997o34J339
$$ y = [-53, -3621, -3341, 615, 3840, 2985, -1119, -3697, -2242, 1588, 3478, 1424, -2214, -3238, -455, 2820, 3074, 79, -2977, -2922, 43, 2760, 2525, -505, -2538, -1702, 947, 2484, 1226, -1242, -2629, -1221, 1437, 2616, 1188, -1423, -2331, -928, 1044, 2124, 676, -1491, -2023, -337, 1967, 2122, 191, -2143, -2447, -133, 2375, 2348, 7, -2396, -2092, 442, 2572, 1684, -1143, -2982, -1540, 1736, 3375, 1378, -2175, -3445, -925, 2539, 3134, 304, -2847, -2518, 604, 3312, 2390, -1382, -3810, -2057, 2067, 3768, 1637, -2129, -3327, -764, 2677, 2928, -193, -3122, -2517, 1016, 3349, 2273, -1211, -3396, -1886, 1529, 2954, 1225, -1794, -2458, -270, 2277, 2284, -117, -2430, -2178, 375, 2577, 2016, -472, -2164, -1377, 642, 1883, 1088, -939, -1867, -711, 1259, 2002, 786, -1256, -2150, -878, 1196, 1977, 812, -1185, -1819, -480]
1929d80J866L15j612k009q7K132K084o9k364k242M74K462J893p02k789j486J583
1946a031K725J095k029l193n39K556L113J23k936k702N89L007K185j322l406j407
1962c172K137L285R77k513l258m48K720K847j85k900k338J033L043J672j503l141
1978a744j277J924K921R23k081k579k66K088K070k09k327j745Q20K288J475r08
1994A373k254j248Q14K092R90q88j576r60J087J787M77j323j751m88J366J878
2010A376O44j437j991m77J562J913J26j781j880L58K234J843p80k540j866J011
2026a685K809J542j254k804j128J653K798O82k561k753O5L004K753o10l344k359
2042c192J099L372J843j772l385r19K466L065K94k848k965K00K978K728o20l178
$$ y = [-480, 1386, 1701, 89, -1920, -2007, 125, 2209, 2140, -224, -2466, -1992, 470, 2363, 1661, -1128, -2614, -1031, 1694, 2789, 760, -2433, -2972, -416, 2697, 2820, -116, -2818, -2229, 778, 2963, 1641, -1765, -3172, -1035, 2250, 3227, 714, -2544, -2992, -272, 2575, 2390, -510, -2848, -1815, 1228, 2900, 1397, -1744, -3021, -1097, 1824, 2747, 666, -1913, -2179, -91, 1979, 1770, -557, -2302, -1482, 806, 2281, 1373, -881, -2129, -1315, 777, 1767, 879, -697, -1657, -570, 1217, 1694, 371, -1380, -1868, -502, 1376, 2020, 583, -1408, -1885, -323, 1590, 1716, -65, -1945, -1587, 647, 2490, 1710, -830, -2696, -1685, 1124, 2666, 1412, -1392, -2520, -867, 1931, 2613, 52, -2701, -2636, 368, 3121, 2511, -833, -3192, -2093, 1279, 3122, 1350, -2035, -2954, -488, 2577, 2871, 23, -2942, -2742, 236, 2964, 2344, -834]
2058h34j877J075K894J560j752k971p94K036K825M26k189k624l9K149K168k39
2074A814k214j634O50K257J319r69k246j152R45K179J102r02k059r73Q79J865
2090H61R20j138k086m93J382K296N45j789k358m88K063K167K08k165k138L34K511
2107F32J803q84k841j502J238L017J567j647l132j138K024L000N92k588k818K16
2123b461K925K728q41l449k265J421L542J690k009l218r56K442K930Q1k638k696
2139b774M19K900K376p91k903j780J014K578J467j434k479j016J804K503M32j945
2155C71k385k26K083K060k5j987j586K61J779J347n29j803j239P90J851J144n80
2172A326k004j243P07J898J185q48k005j017J300K217O50j665k404l96K083K409
$$ y = [-834, -2711, -1636, 1258, 2818, 1066, -1905, -2699, -663, 2162, 2588, 399, -2225, -2264, -115, 2053, 1814, -400, -2034, -1384, 873, 2192, 1223, -1023, -2175, -1230, 949, 2051, 1149, -910, -1883, -1004, 861, 1781, 643, -1443, -1936, -554, 1742, 2287, 498, -1860, -2348, -285, 1882, 2090, -75, -2213, -1879, 632, 2435, 1551, -1290, -2792, -1554, 1463, 3030, 1383, -1749, -2887, -863, 2137, 2729, 141, -2677, -2461, 464, 3192, 2351, -1098, -3363, -1942, 1600, 3290, 1281, -1937, -2893, -451, 2479, 2560, -78, -2774, -2355, 545, 2921, 2130, -773, -2553, -1539, 1039, 2506, 1072, -1407, -2423, -619, 1884, 2316, 371, -2014, -2240, -157, 1903, 1878, -109, -1695, -1434, 345, 1692, 1163, -640, -1879, -1089, 762, 1906, 1326, -678, -1921, -1214, 684, 1869, 1021, -984, -2001, -701, 1516, 2166, 501, -1903, -2299, -216, 2193]
2188B193P4k357k137L23K369J860o93k698j500J327K773J262j649k922j013K098
2204f90K728N05k332k500K3K754K383j008l247j637J640L042J333j939k988o51
2220b584K169K463O1k443j958O45K461J418p24k468j425J059K332J060j211j981
2236a126p40J306J954L13j669j810L5J784J631p0j922j204K32J539R42l75j285
2253d65q49M64J465Q31o28j435r95N04J703J202p58k017q22J098J963N49j534
2270B76k099j28J994K021j74k275j872O68K293J482j033k278j053J354K312Q73
2286B361j998k307m16K044K459M2k341k116M46K558J821j322k692j128J703K792
2302A906O06k160k429j55K302J884k60k283j358Q29K011J120j119j950q83J104
$$ y = [2193, 2267, -90, -2227, -1904, 465, 2325, 1632, -1066, -2566, -1239, 1534, 2796, 1147, -1775, -2788, -690, 2038, 2543, 211, -2289, -2266, 488, 2871, 1863, -1384, -3021, -1381, 1661, 2994, 1055, -1933, -2584, -415, 2048, 2109, -334, -2292, -1647, 814, 2232, 1508, -960, -2385, -1326, 1006, 2066, 855, -1126, -1866, -560, 1394, 1707, 38, -1772, -1737, 47, 1678, 1608, -314, -1518, -1286, 253, 1195, 820, -465, -1314, -850, 615, 1446, 818, -617, -1612, -1108, 595, 1797, 1039, -978, -1800, -702, 1261, 1810, 276, -1823, -1951, 43, 2064, 1890, -385, -2257, -1589, 704, 2186, 1153, -1125, -2178, -824, 1488, 2361, 363, -1944, -2360, -316, 2143, 2185, -156, -2272, -1826, 732, 2553, 1231, -1461, -2589, -886, 1906, 2512, 352, -2077, -2232, 70, 1954, 1694, -589, -1947, -1118, 893, 2013, 894, -1056, -1939, -835]
2318h35J923Q31j214j904l56J227J539K49j410j557Q2J805J380m22j782j145N43
2335a046J515J017o69j236q25O29J284O87q41j359p13P95J622J029r16k047q52
2352a926J335K009N01j783j903K2K219J851p14k504j486J051K489J262j446k241
2368a264q12J625K228K65j942k209J80K223K064l43k526j974Q87K761J375j393
2384A145k734q15K000K517J78k348k273K68K511J749o48k258j173J052J845O92
2400A708j012j806o36J120J816N57j158j726n13J227J684K39j400j530Q4J629
2416B83J389m67j748j145N78J604J044n94j497r43O56J467P15m98j611q52P64
2433h55J943Q08j178k062p47J599K177M34k007k041R9K361J835r01k631j295J418
$$ y = [-835, 1088, 1919, 705, -1199, -1555, -328, 1211, 1460, 50, -1507, -1425, 380, 1760, 1338, -444, -1589, -1046, 469, 1486, 817, -419, -1244, -615, 669, 1356, 515, -844, -1557, -762, 860, 1889, 973, -1074, -1926, -591, 1418, 1919, 136, -1767, -1745, 474, 2325, 1611, -893, -2379, -1328, 1161, 2423, 977, -1264, -2076, -451, 1777, 2042, 100, -2109, -1929, 294, 2358, 2015, -511, -2485, -1598, 1163, 2538, 1145, -1589, -2404, -404, 2113, 2291, -57, -2330, -2062, 449, 2198, 1550, -708, -1881, -829, 1016, 1708, 696, -1110, -1746, -626, 1190, 1747, 589, -1137, -1650, -423, 1261, 1500, 100, -1430, -1346, 283, 1672, 1205, -543, -1688, -1110, 494, 1538, 944, -553, -1496, -840, 627, 1342, 844, -767, -1619, -855, 1088, 1896, 718, -1344, -2091, -492, 1685, 2119, 112, -1929, -1830, 531, 2366, 1465, -1166, -2461, -1043]
2450a043K343J076j630k320o44J780K149J60j803k022J1K238J930o05k317j822
2466b519Q10K749J405j357k648p82J903K359P8k146k018L54K320J542q90j909
2482g49j085Q07J742P67q52j546n60Q80J508N01r19j555o09J025J705N37j263
2499C34j567k56J468J350k9j684j107M85J444J029m57j458j029N54J404R12m58
2516I35j385j031O02J894Q74j111k066p84J612K326L44k008k196J86K409J694
2532B295r62k421j090J404K259P16j539k197m21J690J960J33j877j644J95J857
2548C58J646n19k171j412R53K243J154j345k327o46J636K008n3j765j615N41J923
2565F09J157q30j690p57Q17J313N55o44j048n76N60J136M97p22j143n43O04J460
$$ y = [-1043, 1300, 2376, 746, -1574, -2218, -438, 1711, 1871, 68, -1954, -1943, 295, 2225, 1620, -697, -2519, -1709, 1040, 2445, 1088, -1560, -2342, -439, 1920, 1998, -148, -2166, -1812, 508, 2050, 1160, -749, -1834, -1027, 715, 1482, 630, -916, -1476, -596, 912, 1413, 494, -1061, -1670, -645, 1060, 1597, 334, -1233, -1489, -21, 1329, 1300, -384, -1491, -1006, 438, 1467, 1010, -448, -1477, -923, 481, 1393, 935, -450, -1481, -879, 1015, 1889, 778, -1288, -2072, -460, 1866, 2210, 202, -1994, -1808, 601, 2295, 1333, -1088, -2178, -774, 1485, 2201, 662, -1535, -1956, -266, 1694, 1827, -50, -1694, -1499, 358, 2004, 1485, -686, -2098, -1145, 1098, 2252, 907, -1420, -2066, -430, 1578, 1525, -240, -1855, -1314, 609, 1766, 936, -754, -1511, -694, 619, 1174, 530, -518, -1094, -534, 602, 1099, 377, -766, -1309, -705, 755]
2583G55O76r94j588l42J358J297oj387j032K73J340J043n59j279r24N12J258R38
2601A339n22j405j016P98J599Q85j135j897n42J580K083pk004j788M27K229J593
2618B217j252k113q56J425K125K28j648j761j0J708J462j84j554j336K65J767
2634D83J083n46j793j156J147K021O80j442j871k90J606J677j85j768j211P73
2650g92J608P20p28j458n91R45J127L67p32q60m52N34R41M32m66j082m82P35J336
2669A102L99j089j379j82J370J163j46j403j040M53J349P69n26j435o81O96J351
2686G71N09n60j411o94P62J613O07j319j632l40J701J706j57k115j457O85K291
2703I60J071j344k200m13J584J855mj721j605L70J873J258o76j659r44N81J614
$$ y = [755, 1431, 437, -1151, -1493, -135, 1162, 1156, -231, -1263, -990, 350, 1393, 834, -445, -1369, -857, 401, 1339, 817, -588, -1604, -806, 793, 1678, 543, -1354, -1896, -316, 1767, 1760, -244, -2032, -1605, 624, 2217, 965, -1148, -2004, -579, 1546, 1774, 126, -1635, -1645, 63, 1525, 1341, -213, -1549, -1284, 483, 1566, 1020, -773, -1929, -782, 1239, 1919, 477, -1394, -1684, -78, 1599, 1414, -354, -1565, -792, 816, 1536, 808, -650, -1241, -296, 831, 1198, 466, -394, -846, -312, 629, 1061, 595, -487, -969, -234, 1102, 1501, 412, -967, -1149, 221, 1384, 1238, -165, -1205, -752, 597, 1366, 840, -595, -1276, -580, 771, 1280, 720, -691, -1385, -623, 990, 1597, 278, -1354, -1694, 7, 1713, 1556, -559, -2016, -1331, 960, 2031, 687, -1513, -1926, -342, 1513, 1509, -212, -1817, -1447, 426, 1684, 1008, -651, -1595, -1014, 600]
2720F00R70r02j580p84J134J676M64j429j589j12J765J369l73j640j069O29J672
2737H01N49r31j230k86P71J049L04p59q56l08L79R74M87m92j191n45Q50J232M99
2756A297j148j383l5J401J151k57j496j091M72J629P36o65j403o22Q82J206P67
2773A441r62j574m22J026J659M43j556j502j51J877J645m96k166j359J023K229
2789A155R06j381k099k90J653J714m5j748j333L95J651J007n54j565q52O34J461
2806G09Q54q26j491o38J052J507M23j343j441j45J528J323l45j498j062O19J401
2823F27N50p05j017l86N78R96L92n78j040l27M08R93O83o99j104n92P71J358L93
2842A301j102j406N6J210J449l95j495j062M58J449J058q81j427n61Q27J510L56
$$ y = [600, 1570, 668, -912, -1696, -562, 1114, 1578, 149, -1440, -1552, 213, 1582, 1209, -431, -1500, -871, 801, 1350, 419, -811, -1097, -326, 723, 1027, 268, -588, -896, -517, 457, 944, 452, -739, -1284, -434, 798, 1297, 149, -1234, -1269, 132, 1283, 1026, -470, -1561, -1089, 540, 1276, 611, -792, -1414, -532, 674, 1441, 479, -1095, -1517, -491, 1168, 1611, 55, -1447, -1598, 279, 1924, 1428, -738, -2097, -1074, 1155, 2061, 680, -1419, -1709, -56, 1658, 1613, -135, -1468, -1073, 578, 1585, 1031, -534, -1386, -752, 709, 1563, 737, -754, -1392, -340, 1167, 1590, 247, -1194, -1339, 189, 1512, 1167, -331, -1393, -774, 627, 1177, 472, -545, -931, -353, 643, 1035, 457, -583, -910, -502, 491, 1174, 475, -629, -1221, -450, 908, 1301, 199, -1207, -1151, 59, 1508, 1113, -382, -1444, -986, 463, 1521, 640, -787, -1348, -521, 989, 1345]
2859A345r04j436m04R87J679J78j307j710J62J767J432n94j930j189J098K013
2875A187O84j463j813j60J561J557l52j622j048M50J555Q02o32j348p18O85J370
2892F95M83p01j441l68R24J233L13j063j220r1J281J069l58j187q23O59J047N69
2910A021n96j035k95M31Q86L88m95q05m04M42J003M71n49j200n03Q39J270L89
2928A258j073j294j54J381J280k61j519j061O19J509P21p44j505m84R57J325L78
2945A333r36j493j90J212J422n2j423j387L45J697J179o74j952p10J090J901K35
2962A597j344j569R3J459J191m64j329j002N86J327P42p92j213l07O32J196L10
2979A113p94j061k82R11R20L06j039j205J50J147J028n39j023o59M61J052M80
$$ y = [1345, 441, -995, -1399, -412, 1267, 1445, 138, -1572, -1410, 357, 1789, 1195, -735, -1924, -826, 1187, 1871, 408, -1405, -1565, -4, 1553, 1201, -421, -1469, -1019, 536, 1338, 706, -642, -1360, -675, 695, 1178, 477, -964, -1332, -408, 825, 1138, 75, -1145, -1236, 45, 1114, 756, -431, -1254, -595, 452, 1021, 425, -610, -905, -474, 412, 800, 305, -500, -904, -462, 541, 1012, 463, -737, -1240, -401, 869, 1258, 185, -1109, -1263, 118, 1398, 1137, -382, -1443, -824, 685, 1406, 662, -843, -1327, -370, 955, 1333, 397, -1096, -1286, -74, 1348, 1296, -127, -1514, -1169, 528, 1707, 1033, -919, -1629, -539, 1362, 1597, 253, -1316, -1223, 236, 1427, 963, -366, -1368, -782, 545, 1287, 495, -718, -1025, -393, 803, 1113, 319, -742, -1024, -113, 807, 1113, 74, -1131, -981, 166, 1194, 655, -368, -1027, -566, 486, 966]
2996I66n72q15n00M93Q05L69m49q03l68L96R65N44p47r51o06R54J310N7r74j305
3016a231K0J443J112l97j474q60O81J446N39p85j531k41J115J229Q8j072j172
3033a090m1J280J299k48j627r70N66J612P68q40j573o31J201J659J29j427j375
3050a308L13J523R27n66j407o58O19J363M46p01j193l80P93J057K69q44j009j41
3068h97Q54J030Nj000r01K05R87O87k48j006o86L83J073N47n49r34l92M77Q98
3087E33L77n42q68m78P05R57L34o97j052k88Q79J277p9j224j089K89J440Q24m53
3106H45j487q00R09J373N08r94j489j95J240J248J5j384j098J39J419J126n31
3123H44j473r24P71J549N83r34j576k88J125J456K0j432j139L69J400Q14m44j503
$$ y = [966, 394, -421, -921, -428, 377, 746, 297, -506, -874, -478, 487, 1031, 284, -667, -1273, -319, 991, 1048, 74, -1231, -1211, 232, 1344, 947, -527, -1387, -706, 740, 1279, 494, -1037, -1278, -163, 1066, 1154, 82, -1090, -1131, 149, 1448, 1200, -427, -1397, -831, 781, 1549, 709, -864, -1495, -294, 1365, 1494, 67, -1308, -995, 528, 1455, 889, -518, -1176, -557, 806, 1252, 551, -642, -1022, -229, 828, 1097, 253, -756, -897, -43, 987, 992, -8, -909, -704, 283, 970, 722, -284, -970, -587, 486, 1033, 484, -450, -842, -365, 533, 910, 368, -500, -978, -273, 684, 1018, 321, -731, -1019, -140, 1137, 1058, -166, -1255, -966, 474, 1298, 845, -642, -1442, -533, 840, 1348, 354, -1135, -1330, -90, 1158, 1173, -211, -1309, -1170, 249, 1375, 844, -629, -1553, -782, 767, 1350, 416, -1160, -1448, -323, 1133, 1153, -279, -1418, -1049, 351, 1165, 721, -782]
3141g82n23P20J212L64p11j145k00P33R93J27p38q08k34P52R97M4r27q69K03Q83
3161I1Q11k16j010p38L63J047N65l81j002m17N44P79M82n24q72n71O77J188L53
3180A169r17j133k87J054J350j12j214j199M26J355R25o31j527o46Q42J459M82
3197A396j213j213j00J114J195k2j307j181L98J363R68n73j486o26P16J409M51
3214A289r91j385j86J188J242r1j318j007L86J195P61n35j071n99O86J037L15
3231I16o83q58j69N45Q14K16o01q98j03P37Q56j1p47p83O7Q56O20j37q50o51L21
3252e43R21N42l53q95n44L80J035M42o15j000k65P48R66K69p78j179k9R64J101
3271A167j61j178r63L52J349O83n79j391o71J115J374J88j202j141k4J181J034
$$ y = [-782, -1305, -585, 627, 991, 280, -865, -1065, -332, 661, 788, 50, -758, -992, -240, 757, 801, -126, -995, -792, 91, 902, 686, -324, -1062, -699, 348, 913, 532, -470, -887, -343, 436, 918, 394, -478, -1049, -372, 816, 1169, 252, -881, -1168, -114, 1236, 1124, -90, -1289, -863, 492, 1417, 786, -741, -1387, -545, 914, 1396, 183, -1030, -1130, -16, 1179, 1157, -150, -1331, -933, 430, 1398, 825, -661, -1287, -571, 838, 1289, 298, -1087, -1273, -85, 1157, 1066, -252, -1259, -873, 322, 1083, 548, -523, -1122, -436, 601, 916, 233, -625, -794, -249, 565, 781, 180, -718, -821, -84, 772, 761, 14, -769, -702, 154, 774, 637, -213, -864, -543, 378, 920, 567, -328, -872, -492, 543, 985, 370, -630, -895, -147, 819, 1088, 310, -869, -898, 66, 1167, 1006, -172, -1135, -783, 566, 1249, 670, -721, -1392, -277, 1097, 1285, 83, -1058, -1082, 99, 1133]
3288A133k63j195q39M49J187P98o90j341m48P36J181K26q06j072j27J132R72k25
3306H08j188o12M14R47N90m87j005l98N87Q67K13o20p23q1O25O27J54o67o29k20
3326g98O68Q49O1p21o52q6P83O57j87q65m66L46P96O53m98r63m24M97Q75M28o18
3347C35j112q9O65R95J60j045q87K6J101R95l51j164r55P08J232O85r54j236k78
3366a169R63J281K6j255j023J44J269P45l62j130o68O73J218L59o73j213l05R20
3384b00J021J19r14r78J01R88Q76l19j049n09M39R76L98n99p93l82N86Q73J74
3403H08n46p77p4N20P63q3n66n92n1O46P13r0p11n76kP70O24j26q52o23L32J048
3425E55L60m54r60m57N93J040L52q85r51j91Q77J076j84r60r26J89J198Q79m65
$$ y = [1133, 870, -325, -1164, -715, 472, 1270, 580, -761, -1209, -473, 708, 934, 128, -944, -1071, 61, 1033, 808, -380, -992, -578, 369, 959, 472, -533, -931, -344, 523, 736, 116, -607, -688, -63, 564, 718, 51, -578, -798, -130, 719, 780, 59, -593, -679, 104, 761, 574, -291, -757, -411, 385, 1038, 540, -423, -847, -350, 525, 953, 335, -777, -866, -201, 794, 954, -91, -978, -952, 149, 1144, 793, -371, -1326, -618, 614, 1299, 345, -891, -1169, -206, 1075, 1101, -154, -1177, -1033, 236, 981, 619, -511, -1179, -506, 712, 1071, 398, -815, -1120, -200, 821, 940, 26, -952, -851, 137, 1013, 694, -355, -864, -425, 551, 949, 350, -443, -825, -239, 634, 808, 262, -515, -589, -69, 694, 611, 45, -547, -598, 48, 761, 671, -40, -616, -618, 152, 776, 650, -202, -825, -493, 555, 915, 461, -499, -956, -363, 677, 1029, 144, -807, -998, -121, 955, 771, -189, -1115, -926, 272, 1151, 686]
3444F86j373n88Q01J149N56r45j084l09J104J083k24j043j024L30J202Q42n31
3461F32j201m26N83J085M03q16j082j89J017R45o3r24q92J79J025P42k84j121
3479c87n37M96Q98M14o43p23l63N34Q51K07m69q41q3L99P45J71o03q55J38O77
3499B6N78K5p90o19K1P96P10k32q02o47K87J013N19m82j063l34N41J143K89q36
3519A43r80j36Q84R74j0j082q58L70J056P94m29j365n07P51J082M53q72j112k79
3538a123J122J050j58j172p84L79J129P23n04j218m74O55J118K28q34q47k7O99
3556c8Q29q1p08p85J03R28O27l08q16m28J94Q17M13n09n82l88N57N37L75l97p71
3577d31j31L65P52K15m76p52k00O80O47P5p65o48O7Q15N79j08q84n70K81P44N62
$$ y = [686, -687, -1275, -474, 675, 1231, 286, -798, -1107, -3, 1080, 856, -187, -1211, -881, 321, 1163, 632, -569, -995, -412, 673, 1076, 260, -822, -1011, 6, 951, 888, -36, -928, -749, 276, 1018, 734, -387, -924, -428, 470, 884, 241, -482, -845, -311, 540, 747, 278, -563, -646, -247, 498, 669, 66, -789, -651, 26, 604, 629, -161, -780, -759, 37, 747, 515, -287, -934, -647, 366, 885, 403, -660, -994, -453, 690, 979, 143, -837, -973, -89, 885, 875, -207, -1065, -695, 361, 1155, 726, -639, -1146, -395, 687, 1140, 268, -844, -1123, -1, 1049, 891, -281, -1065, -686, 443, 1166, 662, -556, -1030, -375, 743, 971, 137, -710, -737, -38, 791, 710, 2, -783, -680, 248, 875, 567, -249, -677, -483, 334, 747, 238, -344, -732, -175, 362, 737, 340, -431, -562, -197, 555, 770, 294, -458, -658, 22, 669, 744, -21, -669, -602, 213, 792, 684, -200, -770, -489, 255, 817]
3598H17l81r60m83Q01Q96K34o99j146L1R57Q72j93r13q31K55J107O78n51j218
3617g27l96O92J144K28q29r90o4R35Q04j85r01p61M72J012L34m38r83l39O27R47
3637E82J99o67q09rO35P26j35o79n27J10P85M16k17o74m69K33P16L11l10n47l26
3658f56L72N97K13l75n89k15M74N88J95m53n92j05L59P98o7o82n72N4P77O20j87
3679E54q57m98L07R03M04m82q12l80O50R69K5q67p07M2R90P31j95j085n00L84
3699d24J011M28o06r33l02P82R12J04j006o92N3Q81P15l60r26l57M70Q87L15n01
3719D51q85k62O81O92k8n23o58J6O17M88n9p29m27K09P27L55l32o43l17L45N99
3740C17L65m32n40k68K64O18K34m33n96q5L78O98mn20n27o9O04O19k17m97p14
$$ y = [817, 436, -524, -1007, -206, 690, 924, 225, -921, -890, 67, 939, 746, -167, -998, -743, 364, 1042, 491, -727, -1123, -431, 713, 941, 112, -878, -942, -7, 797, 612, -289, -1050, -578, 434, 768, 330, -653, -992, -365, 582, 781, 114, -695, -704, -69, 657, 522, -157, -684, -574, 211, 627, 410, -264, -733, -500, 216, 527, 217, -330, -656, -284, 313, 526, 151, -438, -653, -179, 409, 604, 151, -441, -546, -187, 611, 544, -138, -710, -656, 121, 741, 554, -303, -801, -494, 409, 813, 331, -481, -861, -211, 758, 783, -84, -791, -749, 241, 972, 777, -308, -808, -424, 587, 1015, 409, -524, -826, -44, 868, 972, -34, -726, -673, 208, 923, 563, -363, -720, -250, 637, 952, 451, -434, -696, -15, 677, 649, 126, -532, -516, 101, 589, 530, -199, -626, -417, 310, 665, 333, -310, -627, -282, 317, 682, 250, -290, -558, -294, 324, 558, 125, -471, -556, -178, 520, 516, -4, -531, -600, 4, 623, 406, -91, -805]
3761h05K46Q11N70l49r78l67N13R00L72o44r18k13P42Q53R0r90p24K61R22P07
3781I99m34r28o01N40R18M21o95r41j40Q79Q40q5r71o95K08R41O34l52j006m05
3801h73N40Q09K68n11q90j12O50P11mn52o52j20P56O42j01o04n64K21O12L49k69
3822C06o66l51N19M09L86l04n54m46L34P35L32m61p26j87N51P56j5n26p63m8O96
3843b3O69j25o78n67J67R10N38m22r95l71N15J035K31o68q63k94R26Q39j39q38
3863a53o58J21J002O25m67r29m26M94R82K85o08q86j98Q05Q18l9r45o14K78P85
3883B72N98l76p83m85M23P00L19l39p59j12M48O77l7l94o25p1N84N25l3o09l84
3904d61P9M73N39k15n81l50K14N45L12k20n85k90K23O57K29k60o53l15N13O85
$$ y = [-805, -559, 252, 822, 473, -505, -872, -359, 541, 913, 269, -649, -862, -120, 733, 823, -167, -891, -630, 292, 999, 565, -363, -964, -424, 494, 915, 220, -721, -861, 18, 858, 773, -198, -893, -685, 256, 890, 538, -468, -873, -333, 476, 744, 233, -657, -769, -119, 592, 588, 36, -616, -736, 20, 662, 561, -43, -607, -386, 226, 575, 306, -360, -711, -192, 217, 603, 299, -255, -701, -367, 368, 700, 239, -487, -674, -123, 633, 618, 92, -671, -719, -23, 646, 521, -157, -724, -557, 353, 891, 469, -526, -897, -382, 653, 884, 216, -647, -941, -15, 824, 685, -153, -811, -690, 312, 937, 470, -459, -885, -391, 591, 876, 268, -618, -816, -11, 807, 768, -177, -791, -513, 272, 870, 494, -289, -774, -351, 349, 668, 329, -430, -542, -94, 583, 546, 152, -473, -544, 40, 565, 532, -77, -461, -382, 91, 630, 415, -166, -516, -302, 243, 555, 335, -250, -540, -317, 340, 569, 309, -344, -659, -146, 539]
3924E39J16n95o47M1O13O97j07q29n17J07Q42N98l33q26n43N19R26J77o20q89
3944g31k7P28Q62l4r24o43L38P02N03l42r00k11L45Q00L15o54p48q4O71O26l5
3965E57p82m48L05O27M32l97n46m02L45N59K28l16n25k57M01N50J22n54l54k9
3985d84L58M73K9m05l58j22O06K78Ln33l57K29M29M37l52n21k72K63N95K66l47
4006B15n26k41L80P55J01o11o67O2P06N60j82p60n33K65R34L18l66q28k83N74
4026a27P77M0p50n09K5O60O74k99p30n43L71P53K91l79p83j07N10O63K2n65n95
4047f01n3P81M80j43p36l44L09N75L00k80o73k27N24N26O5l94m25j98M78L76J37
4068D77n00l15J1N48K79k10m26j93M6M34L77j66m30l47J85M16L82l23n76j88L57
$$ y = [539, 655, 60, -587, -546, 67, 764, 657, -172, -689, -582, 260, 858, 525, -301, -844, -325, 601, 778, 158, -731, -758, -30, 832, 798, -126, -769, -431, 271, 774, 432, -468, -679, -334, 466, 781, 127, -621, -705, -34, 592, 557, -225, -673, -368, 259, 691, 294, -252, -654, -309, 250, 478, 162, -363, -620, -219, 331, 453, -101, -455, -484, -126, 347, 376, -29, -387, -509, 97, 375, 378, -155, -512, -283, 146, 583, 231, -290, -562, -299, 296, 562, 215, -311, -552, -172, 583, 684, 73, -594, -532, 174, 734, 552, -208, -741, -476, 458, 776, 410, -418, -701, -127, 650, 690, -60, -569, -544, 116, 790, 491, -239, -782, -411, 342, 633, 254, -529, -636, -126, 537, 559, -6, -601, -654, 127, 607, 464, -272, -616, -307, 268, 568, 288, -385, -612, -88, 438, 503, 109, -316, -514, -36, 340, 477, -23, -338, -327, 221, 500, 290, -136, -329, -283, 151, 528, 362, -68, -415, -230, 186, 568, 245, -331, -519, -162]
4089a62O21J18m70m94j87M53O20O6n62o30K14O15N39k63r29l07L50Q34J68m92
4109A02o53j97O72P01p0p82n46J55Q09M94k80q86l39M72Q29J82n71p48O8N73N80
4130E65n3o23n96K08P34L78k92n40m00K67O33K80l69n52j86L98O19m8l34m77j21
4151e09L59N31J54n83m22J10M10M63k22m12m24Q5N56M71k29m41n75L21O61J99
4171E03k26p04j01L47P72O4o34m78j62O03N78No21n87J46P36M42l01p97k45M64
4192a96P02K08n40o72j75P39O97n8q50m32J77O55N07l08p93l36M97O74K56n94
4212A58o08j49N49N26lm99m50P6N93M86k65n53l83K01N41L66k80o32j59L52M18
4233B85K42l39n03j10L20M05J18m61l88L7L57M43l5m53l81M4M83M12r5n64l39
$$ y = [-162, 459, 577, 107, -387, -574, -121, 499, 565, 3, -627, -413, 202, 741, 478, -451, -758, -408, 426, 594, 102, -551, -748, -76, 625, 555, -227, -773, -618, 191, 685, 405, -481, -820, -348, 481, 663, 92, -656, -588, -15, 565, 512, -111, -707, -499, 235, 613, 321, -219, -619, -352, 281, 561, 192, -360, -546, -148, 471, 423, 89, -388, -509, -150, 381, 535, -48, -470, -360, 50, 513, 291, -121, -545, -460, 96, 567, 338, -103, -678, -357, 304, 503, 277, -427, -528, -181, 591, 655, 21, -457, -619, -16, 562, 567, -54, -641, -495, 241, 683, 382, -415, -660, -196, 506, 714, 174, -498, -673, 66, 763, 705, -145, -577, -400, 255, 762, 454, -339, -675, -178, 496, 752, 158, -450, -599, -50, 476, 473, -26, -476, -400, 193, 679, 414, -139, -522, -321, 220, 586, 306, -326, -485, -133, 285, 527, 188, -315, -425, -105, 300, 418, -43, -431, -394, -37, 406, 371, -82, -463, -419, 64, 476, 381, -183, -522]
4254e22J64N33M44m21n48k14K98O81R7m24o69n7O40N31k6p07n61L13P22L23k83
4275C14p28l60M04P84J57m69p31k2N41P34j47p16l74K33N41M84l56p08k58M05
4295b72P24N7l54n32p6L34O05j8m30m67J12M76K84j71l52k77J68L36L35k18n09
4316b45j51K91M02P6k26m45n0L16L29J00m72k79L9L27L83l6l14n13K23L13M03
4337D71j13m23m17K85M24L32l72n31j70M65M93R8n74m27J6N76M46j04p09m09K81
4358c62O73K68l65n71k81N76M90Q3n16n52K4O15M53j84n50l57L04N37K72l37n00
4379b80j71L38N47J7m70l64J9M11L96k21m44j90J22M97K09k25l78k62K25L89J60
4400C25k52l42j30K83L31M8j19n79J8L53L62K2m38j64n8L04K72Q2m13m01J94M93
$$ y = [-522, -358, 175, 619, 198, -350, -564, -266, 415, 512, 88, -581, -638, 2, 533, 507, -200, -761, -448, 274, 597, 314, -414, -774, -370, 414, 571, 102, -629, -651, -110, 624, 477, -239, -613, -380, 161, 645, 289, -419, -677, -272, 452, 509, 155, -377, -453, -119, 486, 468, 38, -429, -317, 159, 443, 272, -80, -357, -189, 147, 482, 264, -245, -396, -105, 297, 373, 147, -298, -348, -32, 297, 397, -75, -354, -315, 12, 395, 359, 45, -468, -245, 68, 471, 358, -65, -482, -197, 227, 559, 187, -344, -514, -49, 444, 542, -32, -459, -443, 133, 579, 475, -234, -643, -362, 311, 579, 214, -357, -638, -62, 428, 511, -5, -557, -533, 82, 535, 351, -199, -556, -252, 285, 557, 220, -280, -451, -113, 434, 451, -19, -383, -364, 47, 443, 222, -222, -412, -290, 207, 416, 191, -187, -449, -224, 165, 325, 73, -269, -399, -116, 215, 263, 144, -435, -417, -64, 298, 320, -118, -282, -340, -36, 236, 318, -95, -496, -302, 191]
4422A91K33j41n65k87L67N54J72l44p00N2N57M83o5n54m65J43N78M04k56p36k69
4443f48M41O77J60n22n69r1O29M34k3n64m20J83N00M19k35n69l02K30O13K13k87
4464B69o25m6L85M95l8m19m59O4M72L51j18l89l43J40L20L57k96l53j51J60M34
4485B10L1j99k58k35K83L52J63k01n36o8M74K88N2m07m69K04M24K45J2m68l89
4506d92J41M94L24k12n60j47K79N49J98m29o22n1M18N96J4o49m13J74O15L70k73
4527C24o41l17N05N45R7m21n25p4N29L62J6n21m56K83N39L29k77n01k66K01N53
4548B84J76l54m30o9M25K32O6l71k69n4M13K83j8m54k72K19L40K62k48m05j54
4569c98K27K39K51j99l40j91K45N05J12k53m86n0L37K82J39m07l56lL41M12r1
$$ y = [191, 424, 283, -282, -569, -202, 352, 524, 180, -520, -468, 89, 572, 507, -47, -512, -369, 209, 613, 357, -379, -648, -207, 470, 630, 108, -461, -552, 77, 511, 488, -76, -496, -313, 187, 606, 371, -198, -500, -270, 343, 556, 269, -356, -402, -17, 478, 440, 21, -438, -374, 98, 449, 331, -58, -401, -261, 59, 416, 120, -233, -384, -224, 210, 241, 42, -216, -451, -168, 184, 347, 146, -390, -458, 16, 304, 356, -51, -520, -316, 108, 353, 365, -103, -492, -351, 143, 467, 255, -305, -452, -173, 376, 574, 145, -477, -528, -110, 486, 500, -149, -562, -388, 227, 597, 324, -317, -634, -129, 416, 513, 92, -433, -507, 22, 384, 400, -121, -577, -294, 245, 574, 297, -204, -470, -269, 284, 460, 106, -324, -393, 32, 264, 330, -41, -310, -364, 49, 332, 314, -140, -412, -193, 147, 409, 161, -244, -398, -171, 68, 319, 120, -220, -411, -166, 339, 451, 198, -288, -338, -1, 281, 420, 13, -343, -346, -5, 407, 316]
4590C16m76l43J55N71K52k33o03j51K97N30R7l67m03j39M39N38j15m88l49P2O86
4611B86K86l34m99l26M23N25J35l96n77J29L25N17j68l27m94J24N67K20k10m14
4631b08j39J70L96J21k41l96q2L64L06l3k84l44k8L71K59k7k38l13J25K21K65
4652B65r2l43j99J76L41J84k13l39k09L25K98J35l76j83k26L79L59J0k90m34R6
4673c36M63K55K9n06l33K32L85L06k13n54j61M02M82j1l98m33l0N48L41j50m50
4694a32l92L15M46K44l33m60k40M42N25m9k90m82J5L96M61j33l60l98J86N10L3
4715C04j97m45M6J38L83J09l00l65R8K62K03j12j42k44OK49L50j03m28r5J41K68
4737A26R1m5k91k26J32L22K14k09l69k5J92M18k1k37l97J4L05L25L7m37k42Q4
$$ y = [316, -160, -503, -348, 223, 475, 242, -361, -512, -215, 315, 412, 45, -358, -497, -58, 480, 365, -123, -472, -400, 286, 572, 238, -261, -587, -164, 361, 496, 100, -477, -348, -23, 494, 326, -1, -495, -371, 196, 416, 206, -208, -347, -177, 219, 340, 99, -297, -379, -15, 291, 258, -26, -370, -398, -27, 232, 205, -33, -346, -221, 0, 265, 173, -170, -369, -193, 148, 332, 119, -220, -429, -104, 194, 329, -47, -230, -456, -77, 282, 292, 2, -432, -336, 127, 382, 411, -95, -428, -196, 189, 495, 282, -272, -433, -31, 451, 440, 42, -391, -421, 127, 468, 318, -132, -524, -209, 237, 481, 148, -312, -552, -110, 415, 366, 76, -406, -391, 5, 466, 333, -27, -425, -239, 271, 304, 107, -338, -292, -154, 229, 338, 38, -327, -229, 33, 236, 124, -18, -262, -256, -7, 343, 240, -188, -283, -142, 126, 217, 172, -119, -345, -213, 109, 323, 114, -255, -280, -88, 330, 309, 72, -325, -311, -6, 319, 356, -81, -323, -239]
4759b39L65L31j77m52l06K72N80O4l28m75m6L64L25J05m47l77Q9L72M08k10m61
4780b43l80L81N00K73m08m04k57M06M96j51l38k61R6K93M49k27l80k83K05M52
4800B19J47k24l50j91M23K99l2j50m92R0K56L02l1l00m3j58K20K99Om09j65Q0
4822b04L48K22j43m15j32J98L30N9q6m12n8K74M03p1m00l39J61L13L50o8m51k95
4844d16P2M77K80j91m88j92L45M46K27m97m46m1N39L60q8m97l68J56M31L55k67
4865A97m25j00J24N68J15l34m84OL21L80l4l45m03J12L58L25j53m60j97K83L54
4886B08M5j93l60m7K07M56j18l06j59J3K37K07jk35k42k6M02M8J66m04r0J6L30
4909A54J62j42l59j43J20L76K57l14l23j46K69L35R6k58n22J10L38L23m8l62k87
$$ y = [-239, 126, 457, 280, -172, -478, -206, 374, 438, 110, -365, -411, -47, 278, 383, -64, -441, -352, 20, 428, 218, -243, -623, -242, 258, 531, 123, -281, -538, -132, 364, 213, -125, -386, -290, 3, 452, 225, -155, -438, -233, 219, 366, 142, -208, -399, 24, 323, 291, 141, -351, -261, -5, 297, 266, -34, -77, -235, -15, 284, 290, -119, -284, -204, 144, 366, 223, -192, -324, -126, 204, 263, 177, -235, -293, -19, 384, 313, -87, -426, -265, 48, 398, 330, -121, -416, -344, 133, 413, 222, -266, -458, -113, 333, 560, 63, -383, -424, 115, 475, 387, -110, -478, -322, 109, 464, 197, -228, -328, -204, 364, 479, 145, -339, -333, -12, 368, 334, -11, -414, -302, 56, 381, 228, -232, -429, -146, 208, 253, 60, -300, -347, -140, 316, 198, -108, -267, -254, -17, 190, 189, -46, -288, -314, 88, 136, 302, -102, -192, -176, 154, 316, 174, -185, -328, -208, 168, 425, 111, -212, -358, -89, 246, 342, 84, -438, -328, 10, 333, 285, -77, -364]
$$ [...]
8191b6
##END NTUPLES=NMR FID
##END=
