##TITLE=19F_TG-2244
 DMSO. 24 sc
 25.6.2019
##JCAMPDX= 6.0         $$ Bruker NMR JCAMP-DX V2.0
##DATA TYPE= NMR SPECTRUM
##DATA CLASS= NTUPLES
##ORIGIN= UXNMR, Bruker Analytische Messtechnik GmbH
##OWNER= root
$$ XWIN-NMR		Version 3.5
$$ Tue Jun 25 15:42:59 2019 Russian Standard Time (UT+4h)  she@DPX200
##.OBSERVE FREQUENCY= 188.290927
##.OBSERVE NUCLEUS= ^19F
##.ACQUISITION MODE= SIMULTANEOUS
##.ACQUISITION SCHEME= undefined
##.AVERAGES= 24
##.DIGITISER RES= 16
##SPECTROMETER/DATA SYSTEM= spect
##.PULSE SEQUENCE= zg
##.SOLVENT NAME= DMSO
##.SHIFT REFERENCE= (INTERNAL, DMSO, 0, 101.251)
##AUDIT TRAIL= $$ (NUMBER, WHEN, WHO, WHERE, WHAT)
$$ ##TITLE= Audit trail, XWIN-NMR		Version 3.5
$$ ##JCAMPDX= 5.01
$$ ##ORIGIN= Bruker BioSpin GmbH
$$ ##OWNER= she
$$ F:/spectra/data/she/nmr/f19/1/pdata/1/auditp.txt
$$ ##AUDIT TRAIL=  $$ (NUMBER, WHEN, WHO, WHERE, WHAT)
(   1,<2019-06-25 15:42:19.35 +0400>,<she>,<DPX200>,
      <created by zg, POWCHK disabled, PULCHK disabled
       configuration hash MD5:
       00 E9 B6 7A A2 85 ED C7 34 08 36 98 17 FE 4E 26
       data hash MD5: 64K
       46 BD 8D 7A FF 8F 41 91 C0 D0 C3 8F F2 37 E9 E9>)
(   2,<2019-06-25 15:42:21.76 +0400>,<she>,<DPX200>,
      <Start of raw data processing
       efp BC_mod = 2 LB = 1 FT_mod = 6 PKNL = 1 PHC0 = 1082.416 PHC1 = 38.35576 SI = 64K 
       data hash MD5: 64K
       19 D2 BC AA 5A AF CD 1E 20 BB 5F 37 09 93 45 48>)
(   3,<2019-06-25 15:42:38.21 +0400>,<she>,<DPX200>,
      <abs ABSG = 5 
       data hash MD5: 64K
       6D 10 45 8C B6 78 38 D2 A5 E8 A8 E4 04 2C 5F 54>)
$$ ##END=
$$ 
$$ hash MD5
$$ C8 94 DA A8 79 38 F7 A3 4B A2 C4 F6 B3 76 84 05
##$RELAX= 
##$RELAX= 
##$RELAX= 
##$RELAX= 
##$RELAX= 
##$RELAX= 
##$RELAX= 
##$RELAX= 
$$ Bruker specific parameters
$$ --------------------------
##$DU= <F:/spectra>
##$EXPNO= 1
##$NAME= <f19>
##$PROCNO= 1
##$TYPE= <nmr>
##$USER= <she>
##$AMP= (0..31)
100 100 100 100 100 100 100 100 100 100 100 100 100 100 100 100 100 100 
100 100 100 100 100 100 100 100 100 100 100 100 100 100 
##$AQSEQ= 0
##$AQ_mod= 1
##$AUNM= <au_zg>
##$AUTOPOS= <>
##$BF1= 188.310428
##$BF2= 200.13
##$BF3= 200.13
##$BF4= 200.13
##$BF5= 200.13
##$BF6= 200.13
##$BF7= 200.13
##$BF8= 200.13
##$BYTORDA= 1
##$CFDGTYP= 0
##$CFRGTYP= 5
##$CHEMSTR= <none>
##$CNST= (0..31)
1 1 145 1 1 1 1 1 1 1 1 1 1 1 1 1 1 1 1 1 1 1 1 1 1 1 1 1 1 1 1 1 
##$CPDPRG= <>
##$CPDPRG1= <>
##$CPDPRG2= <>
##$CPDPRG3= <>
##$CPDPRG4= <mlev>
##$CPDPRG5= <mlev>
##$CPDPRG6= <mlev>
##$CPDPRG7= <mlev>
##$CPDPRG8= <mlev>
##$CPDPRGB= <>
##$CPDPRGT= <>
##$D= (0..31)
0 1.3 0 0 0 0 0 0 0 0 0 0 0.25 0 0 0 0 0 0 0 0 0 0 0 0 0 0 0 0 0 0 0 
##$DATE= 1561462938
##$DBL= (0..7)
120 120 120 11 120 120 24 19 
##$DBP= (0..7)
150 150 150 150 150 150 150 150 
##$DBP07= 0
##$DBPNAM0= <>
##$DBPNAM1= <>
##$DBPNAM2= <>
##$DBPNAM3= <>
##$DBPNAM4= <>
##$DBPNAM5= <>
##$DBPNAM6= <>
##$DBPNAM7= <>
##$DBPOAL= (0..7)
0.5 0.5 0.5 0.5 0.5 0.5 0.5 0.5 
##$DBPOFFS= (0..7)
0 0 0 0 0 0 0 0 
##$DE= 6
##$DECBNUC= <off>
##$DECIM= 3
$$ [...]
##$SUBNAM3= <"">
##$SUBNAM4= <"">
##$SUBNAM5= <"">
##$SUBNAM6= <"">
##$SUBNAM7= <"">
##$SUBNAM8= <"">
##$SUBNAM9= <"">
##$SW= 251.107818259711
##$SWIBOX= (0..15)
0 1 0 0 0 0 0 0 0 0 0 0 0 0 0 0 
##$SW_h= 47281.3238770686
##$TD= 65536
##$TD0= 1
##$TE= 0
##$TE2= 300
##$TE3= 300
##$TEG= 300
##$TL= (0..7)
0 120 53 12 22 120 120 120 
##$TP= (0..7)
150 150 150 150 150 150 150 150 
##$TP07= 0
##$TPNAME0= <>
##$TPNAME1= <>
##$TPNAME2= <>
##$TPNAME3= <>
##$TPNAME4= <>
##$TPNAME5= <>
##$TPNAME6= <>
##$TPNAME7= <>
##$TPOAL= (0..7)
0.5 0.5 0.5 0.5 0.5 0.5 0.5 0.5 
##$TPOFFS= (0..7)
0 0 0 0 0 0 0 0 
##$TUNHIN= 0
##$TUNHOUT= 0
##$TUNXOUT= 0
##$USERA1= <user>
##$USERA2= <user>
##$USERA3= <user>
##$USERA4= <user>
##$USERA5= <user>
##$V9= 5
##$VALIST= <valist>
##$VCLIST= <CCCCCCCCCCCCCCC>
##$VD= 0
##$VDLIST= <DDDDDDDDDDDDDDD>
##$VPLIST= <PPPPPPPPPPPPPPP>
##$VTLIST= <TTTTTTTTTTTTTTT>
##$WBST= 1024
##$WBSW= 4
##$XGAIN= (0..3)
0 0 0 0 
##$XL= 0
##$YL= 0
##$YMAX_a= 10760
##$YMIN_a= -15514
##$ZGOPTNS= <>
##$ZL1= 120
##$ZL2= 120
##$ZL3= 120
##$ZL4= 120
##$ABSF1= 101.2514
##$ABSF2= -149.8503
##$ABSG= 5
##$ABSL= 3
##$ALPHA= 0
##$AQORDER= 0
##$ASSFAC= 0
##$ASSFACI= 0
##$ASSFACX= 0
##$ASSWID= 0
##$AUNMP= <proc_1d>
##$AZFE= 0.1
##$AZFW= 5
##$BCFW= 0
##$BC_mod= 2
##$BYTORDP= 0
##$COROFFS= 0
##$CY= -3
##$DATMOD= 1
##$DC= 0
##$DFILT= <>
##$DTYPP= 0
##$F1P= 0
##$F2P= 0
##$FCOR= 0.5
##$FTSIZE= 65536
##$FT_mod= 6
##$GAMMA= 0
##$GB= 0
##$INTBC= 1
##$INTSCL= 8.653935e-10
##$ISEN= 128
##$LB= 1
##$LEV0= 0
##$LPBIN= 0
##$MAXI= 10000
##$MC2= 0
##$MEAN= 0
##$ME_mod= 0
##$MI= 0.4277144
##$NCOEF= 0
##$NC_proc= -5
##$NLEV= 6
##$NOISF1= -61.99997
##$NOISF2= -62.99997
##$NSP= 0
##$NTH_PI= 0
##$NZP= 0
##$OFFSET= 101.2514
##$PC= 1
##$PHC0= 1082.416
##$PHC1= 38.35576
##$PH_mod= 1
##$PKNL= yes
##$PPARMOD= 0
##$PSCAL= 0
##$PSIGN= 0
##$REVERSE= no
##$SF= 188.29550247311
##$SI= 65536
##$SIGF1= -61
##$SIGF2= -65
##$SINO= 3.502647
##$SIOLD= 65536
##$SREGLST= <1H.CDCl3>
##$SSB= 0
##$STSI= 65536
##$STSR= 0
##$SW_p= 47281.3238770685
##$SYMM= 0
##$S_DEV= 0
##$TDeff= 65536
##$TDoff= 0
##$TI= <>
##$TILT= no
##$TM1= 0
##$TM2= 0
##$TOPLEV= 0
##$USERP1= <user>
##$USERP2= <user>
##$USERP3= <user>
##$USERP4= <user>
##$USERP5= <user>
##$WDW= 1
##$XDIM= 65536
##$YMAX_p= 366457090
##$YMIN_p= -2336178
$$ End of Bruker specific parameters
$$ ---------------------------------
##NTUPLES= NMR SPECTRUM
##VAR_NAME=  FREQUENCY,     SPECTRUM/REAL,   SPECTRUM/IMAG
##SYMBOL=    X,             R,               I
##VAR_TYPE=  INDEPENDENT,   DEPENDENT,       DEPENDENT
##VAR_FORM=  AFFN,          ASDF,            ASDF
##VAR_DIM=   65536,         65536,           65536
##UNITS=     HZ,            ARBITRARY UNITS, ARBITRARY UNITS
##FACTOR=    0.721466756344984, 1,           1
##FIRST=     19065.1839562469, 0,            0
##LAST=      -28216.1399208216, 0,           0
##MIN=       -28216.1399208216, -2336178,    0
##MAX=       19065.1839562469, 366457090,    0
$$ Real data points
##PAGE= N=1
##DATA TABLE= (X++(R..R)), XYDATA
$$ [...]
47731c79969K67047N14393J58778Q8429o86079m7402o6531m24460J34267J481
47721d40046l23261K16706k5293N79957j44544J48559j55030L66412k04201j74800
47711a55541O79817j68499n24254N7082M57930k26051N1143L85060K22512P50829
47701A530028j146256k08397L32028J56973p09679n17494K30758J562k65998J193260
47691E96785L76347q57112l41109l09496O58824r9846o34404J93042J142270P3159
47681G98460n35717m45486O08402J88812o17676K31916j50475K26186K81274l70885
47671B14811P8037r87558o0106P53977L2492L05722k0443K06737n50526p21884
47661g48741P8623j89652M397M4751K24124K62237m24436J70960O85543K74201
$$ y = [-379969, -112922, 401471, 560249, 648678, -37401, -84803, -151334, -575794, -441527, -440046, -763307, -546601, -571894, 8063, -136481, 12078, -142952, 223460, 19259, -155541, 524276, 355777, -168477, -111395, 346535, 120484, 171627, 556687, 779199, 1530028, 383772, 175375, 507403, 664376, -45303, -562797, -332039, -330477, -596475, 596785, 973132, 116020, -225089, -534585, 124239, 24393, -610011, -416969, 725301, 798460, 262743, -182743, 425659, 614471, -3205, 228711, 78236, 304422, 585696, 214811, 292848, -694710, -754816, -839, 31653, 337375, 316932, 523669, -26857, -748741, -670118, -859770, -855373, -810622, -586498, -324261, -748697, -577737, 107806, 382007]
47651C82007J35804m76626N75868l52022l65318p33031L03092J37627R8388l18959
47641f13170N67942L74591k69845q5850M12958k45348o62658l8201L7929J70463
47631c51189J33648j82636L6462m5791m40523L5461n5560O39092k06262j46229
47621e83527M07537n8635j04388l82539N17440K43971k11260R5595N81500o7731
47611D37963l93471p73751M85338Q51552O5032L42175m81414l12050Q00704N1418
47601A073496j025500p31930L83399K99152M41631l76711k98679J55604j0516
47592i0054m86296J06985O41866J66523j28359L89977n99110p96077K25494P43919
47582A74868l20815m96541j51960M00888N78193L55436P2187o7065J9858K25004
$$ y = [382007, 517811, 41185, 617053, 265031, -100287, -833318, -530226, -392599, -294211, -613170, -45228, 329363, 59518, -26332, 386626, 141278, -521380, -559581, -521652, -351189, -217541, -400177, -363715, -409506, -850029, -814568, -870128, -231036, -437298, -583527, -175990, -234625, -339013, -721552, -204112, 39859, -171401, -75806, 505694, 437963, 44492, -729259, -243921, 607631, 672663, 1014838, 533424, 221374, 1022078, 1073496, 47996, -683934, -300535, -1383, 440248, 63537, -235142, -79538, -90054, -576350, -469365, 172501, 339024, 210665, 600642, 1532, -794545, -569051, 174868, -145947, -642488, -794448, -393560, 184633, 540069, 612256, 545191, 565049, 790053]
47572G90053L40667q2552j171444j55746l36399l39286J036315M94493o51861
47563g5760J02650P03743L16563n32086j19106j59796k65505l88446j30044M49590
47553i8197M48333P62179O5424n49269m05081q8394k173M11683l70168K8259L34090
47542E36686l07167j057610P6162M54090k18770o12303O46001L56128o64594n33800
47532a325177M35149P06675l64270n08073P41767O7935N04613j16176m5143J62390
47522B59690j05969o28529K1516P06987N08836K08637n53923l11132j77101J48959
47512G7971k68088L56186l27789k33410k60702M19365N64273k96200L45310o8093
47502C08823m01003k51770K65368l02138L7971O80689K4370L43851j9037n88836
$$ y = [790053, 1130720, 1048168, -123276, -279022, -615421, -954707, 81608, 576101, -75760, 26890, 730633, 1047196, 515110, 396004, 236208, -29297, -417743, -547787, -98197, 350136, 1112315, 1177739, 628470, 223389, 134995, 132822, 544505, 174337, 202596, 536686, 229519, -828091, -751929, -297839, -516609, -1128912, -482911, -126783, -791377, -1325177, -890028, -183353, -547623, -1055696, -313929, -245994, 258619, 142443, 97300, 259690, 153721, -474808, -453292, 253695, 762531, 971168, 417245, 106113, -70988, 77971, -190117, 166069, -161720, -395130, -655832, -236467, 327806, 31606, 376916, 308823, -92180, -343950, -78582, -380720, -342749, 337940, 362310, 706161, 687124, 98288]
47492I8288m86519K95686K34427M02774K52624L36193r24556M17190m69368k31892
47482g5153j87235o42200J5895L69606l9387R1904O82064n82947o75553J35261
47472i07745J10736P52523R0349l21405j82460L3280J56631m68789P28973N32275
47462E24368J53359m78145p270M41239l72199k57102P8770j75189j45505K24794
47452a2880k26872n96348M06360M57901k27336M63386L11527o59436j18170J58496
47442d3372O19776k91072j38342k51341o78596N43595P84706q34400M74244J2580
47432A97778o04282K95324M28470Q34012L57078n54216m46638K92461r04826l98875
47422e03714N16603J2811o6113r1812q18721L5577Q01784K30305J27471k16474
$$ y = [98288, -388231, -92545, 141882, 544656, 797280, 1133473, 208917, 626107, 156739, -75153, -262388, -904588, -888693, -519087, -558474, -466570, 215494, -367453, -1043006, -907745, -797009, -44486, 45863, -275542, -458002, -424722, -268091, -736880, -7907, 524368, 677727, 199582, 192312, 633551, 261352, 4250, 83020, -92169, -237674, -12880, -239752, -836100, -429740, 28161, -199175, 264211, 575738, -83698, -201868, -43372, 576404, 285332, 146990, -104351, -782947, -239352, 545354, -289046, 185198, 197778, -406504, -111180, 317290, 1151302, 1508380, 954164, 507526, 799987, -104839, -503714, 12889, 25700, -40413, -132225, -950946, -915369, -113585, 116720, 244191, 27717]
47412B7717J54499j29873k52163m7435o82534L32677L0276L7397l48659l3747
47402i11845O36961P75397K0086J85290P8874l84165r06598J82391k58780q7534
47392f69923O94935J91335J09957q25480j02347L81560Q41524k20576k84977N5510
47382A71518k56225L16582l41009j97616O53013K05379j74011K91578l43118j58441
47372A67650J03763j09703J72973j46247m10331m03187k25646P41321M56008J05035
47362D51636l27575M13976p93292l6007P23023K65982j020587j68288q6881l17130
47352h95143M10593P36621k38944K00867k89359N8548K62391n21528O43544J04012
47342D71602P16595l47246n62833q1829k20179k2682J90319k30488l25839L11298
$$ y = [27717, 182216, 52343, -199820, -247255, -929789, -597112, -566836, -529439, -878098, -911845, -274884, 500513, 520599, 705889, 784763, 400598, -506000, -323609, -582389, -669923, 25012, 216347, 326304, -499176, -601523, -219963, 621561, 400985, 116008, 171518, -84707, 231875, -109134, -306750, 346263, 551642, 377631, 669209, 326091, 167650, 271413, 161710, 334683, 188436, -221895, -625082, -850728, -109407, 346601, 451636, 124061, 538037, -255255, -291262, 431761, 697743, -322844, -491132, -578013, -895143, -484550, 252071, 13127, 213994, -75365, -16817, 245574, -275954, 367590, 471602, 1188197, 840951, 278118, 196289, -23890, -46572, 143747, -86741, -412580, -101282]
47332a01282K97941l33920N93898k68585j335764J60115L25867J8343O70866L3251
47322F0730l30657R4855r1054k20812K14548J08182N1423M03928m00801O4496
47312d5162K62539k74833N8905P06232k45820P0745o55183l46884M14633k37528
47302b92356J20919r393j21456L09205n71171k49761R1098N19119M55022m32492
47292a81266k91342J79260j4813l82482P36665M7082q5566L8216p06025J22572
47282e37699K05389n9347k69796L35255P19903k09950M0776n20906N75628l39615
47272f0362o35382L95094o0465K65163K09695m30497P3875j65160l23897k08727
47262i40663M26586N51624L02169j40776o04055Q54447K86907l22420M83154o23809
$$ y = [-101282, 196659, -137261, 456637, 188052, -1147712, -987597, -661730, -643387, 27479, 60730, -269927, -175072, -266126, -486938, -272390, -164208, -112785, 291143, -109658, -45162, 217377, -57456, 1449, 707681, 461861, 532606, -122577, -469461, -54828, -292356, -171437, -180830, -302286, 6919, -564252, -814013, -722915, -203796, 251226, -181266, -472608, -293348, -308161, -690643, 46022, 93104, 7538, 45754, -660271, -537699, -332310, -391657, -661453, -326198, 393705, 183755, 224531, -296375, 279253, -60362, -695744, -300650, -361115, -95952, 113743, -316754, -242879, -408039, -731936, -940663, -514077, 37547, 339716, 198940, -405115, 449332, 736239, 413819, 896973, 273164]
47252B73164p75164l6936M52140J02225q7914l55236J00838N78877K7707l8075
47242B41626q18980L13152P10949q06868m84988j72464K42909N97269l0802N48566
47232C40369J06668P44752K52717n74285q91940k32807j88021L34858R41259M06170
47222A239740n72705m69333j29840L9025N58237l83452j54858k8758l48652J39291
47212a11305j98358K5209P88085n6646L20771N17784j071238l74825N44771N78077
47202I62325n54181n54961M04044J52998k81918o70871K67798M20231J93657K55346
47192E94468J58127J3636M46051m29703k58250n91430k38927n169J70636K87532
47182A46971K6859n00163j31279l13815J27790k579L82365N21147k11914K1054
$$ y = [273164, -502000, -538936, -86796, 15429, -72485, -427721, -326883, 251994, 279701, 241626, -577354, -264202, 446747, -360121, -845109, -1017573, -774664, -177395, -208197, 340369, 447037, 1191789, 1444506, 870221, -21719, -254526, -442547, -107689, 833570, 1239740, 667035, 197702, 67862, 106887, 665124, 281672, 126814, 98056, -250596, -111305, -309663, -284454, 503631, 446985, 767756, 1285540, 214302, -160523, 384248, 962325, 408144, -146817, 257227, 410225, 128307, -542564, -274766, 145465, 339122, 594468, 752595, 766231, 1212282, 782579, 524329, -67101, -306028, -311197, -140561, 146971, 173830, -326333, -457612, -771427, -643637, -646216, -263851, 257296, 45382, 66436]
47172F6436L1455M03343j50741J25007K25545k70315m76878M15085P2154k69440
47162A71651Q1841M46529J43167p40111N4863P01136n56454n15011K51891K9640
47152F9142N7483k45591m26470M30473k6945L3494K9309M91558K61539l52014
47142C21978o68375J29053J073294j23932l50953K14776R4033o11840m04565L84296
47132E7765j6564o2478K39424J80660L42257j2128l74950j62328J22770J04708
47122D19136k51138l61375J16604J27767K36921J15852l56303n47770O31673k37451
47112a06084o0160k8114j15259J69755O5494l8919N12279J18815o78931L92621
47102B31497L24171l13332k9892q94841K47656O2512O05797J074178n1186K37091
$$ y = [66436, 97891, 501234, 350493, 475500, 701045, 430730, -46148, 368937, 441091, 171651, 253492, 700021, 843188, 103077, 157940, 859076, 302622, -212389, 39502, 69142, 126625, -118966, -545436, -114963, -141908, -108414, -79105, 412453, 673992, 321978, -346397, -217344, 855950, 732018, 381065, 595841, 689874, 78034, -326531, 57765, 41201, -21277, 218147, 398807, 741064, 728936, 353986, 191658, 314428, 419136, 167998, -193377, -76773, 50994, 287915, 403767, 47464, -500306, 131367, -106084, -166244, -194358, -309617, -139862, -74368, -113287, 398992, 517807, -161124, 231497, 555668, 242336, 212444, -682397, -434741, -372229, 233568, 1307746, 1256560, 1493651]
47092A493651p35918l33436j89899l86450k97104N18357O40290q65328K5998O74929
47082E45090M9509q83714k77011R02192L33853j87290j23735k03844R9060M27059
47072F81169o7525M8708L93145k49822q64143J80204K36053k13320j99051n12209
47062e66791J57193J75322k79725p4514M19376L30973l27429K83648M56904r40449
47052c65492L2950N1902j25475M3643N30101J8324j37790J29765l33897L50038
47042A94069r01880L11499N50393K28217R1009l73976p9826M21350P6208k5869
47032D91194j41662j60947j10740K12734m64536j47299k16177m9243P02298P32032
47022H47654j009357M75342j77731n28418J029078P4619m36538J68364J40648
$$ y = [1493651, 757733, 424297, 234398, -152052, -449156, 69201, 709491, -155837, -129839, 545090, 594599, -289115, -566126, 336066, 669919, 482629, 358894, 155050, 254110, 681169, 613644, 662352, 1055497, 805675, -58468, 121736, 357789, 144469, -54582, -566791, -409598, -234276, -514001, -588515, -169139, 161834, -165595, 118053, 574957, -365492, -332542, -280640, -406115, -362472, 167629, 185953, 48163, 177928, -155969, 194069, -707811, -396312, 154081, 382298, 473307, 99331, 19505, 440855, 517063, 491194, 349532, 188585, 77845, 290579, -173957, -321256, -537433, -586676, 115622, 847654, -161703, 313639, 135908, -392510, 636568, 711187, 274649, 443013, 583661]
47013E83661O55088j017820o06767j00141M62335o25491K5430J52897N8469M18272
47003E933r0486P1307L29400K27403k98591J01729j48126N31005M05347l53665
46993G81256J29744m85628l31632j9879J79498r61612j60329M51686n28321K24674
46983g20543J127562M36232k07694l91489o4367M19202j51658L2062p39L61969
46973H40537o96142p84603j52536L76683l45185L44098J85830m77117J545l6424
46963g43314M4049L84604m47467O63355r7825P9042k78093j93578R10671R73243
46953A294687n91400n37780J31223j12179k53343L46571k93749J98544M16390
46944E98964l84209P0310l52925p6626J8270l07834N01471M04308n3300N54229
$$ y = [583661, 1238749, 220929, -385838, -485979, -23644, -649135, -623705, -470808, -412339, 5933, -84553, -13246, 316154, 543557, 244966, 346695, 198569, 729574, 1134921, 781256, 911000, 425372, 93740, 73861, 253359, -708253, -868582, -416896, -945217, -720543, 407019, 843251, 635557, 244068, 179701, 598903, 447245, 479307, 478568, 840537, 144395, -640208, -792744, -416061, -761246, -417148, -231318, -708435, -706890, -743314, -699265, -314661, -762128, -98773, -196598, -117556, -395649, -589227, 321444, 1294687, 703287, 165507, 296730, 184551, -68792, 277779, -15970, 182574, 598964, 214755, 285065, -67860, -144486, -126216, -434050, 67421, 471729, 418429, 972658]
46934I72658M04768J29179j123767j68305l36173J15758m3308N56023j81894l57539
46924c2600L77496O37122L00862n76096k86922l05328M98071o20772l61602P56790
46914C87021l32663m3942p28068M48630l78801N64804m588J26707K21002K73391
46904E33493L34623l98518q12884K90048M94410J67745M17699k61088p44849K09996
46894B30675n53923O01767R1805k94153j46251j82044J24580O77519M89094j056308
46884a7239M93021J3624L10509l6058n42301o59344M55463J05101n07973m0812
46874d26009j05114J33877O98823P9102o53769o62443L83295N00203n84800l97666
46864a034501J14659N11892L67353o86383L59425M64676M66291p449J05856l25532
$$ y = [972658, 1377426, 1506605, 382838, 214533, -121640, -5882, -49190, 506833, 324939, -32600, 344896, 982018, 1282880, 706784, 419862, 114534, 612605, -8167, -369769, 387021, 54358, 10416, -717652, -269022, -647823, -83019, -87607, 39100, 260102, 533493, 868116, 469598, -343286, -53238, 441172, 608917, 1026616, 765528, 20679, 230675, -323248, 278519, 370324, 76171, -70080, -252124, -127544, 549975, 1039069, -17239, 475782, 489406, 799915, 763857, 221556, -437788, 17675, 122776, -385197, -426009, -531123, -397246, 301577, 380679, -273090, -935533, -552238, -52035, -636835, -1034501, -919842, -407950, -40597, -726980, -367555, 97121, 563412, 555963, 661819, 336287]
46854C36287k91603q8268J9152R6743K18227K57455k8632o7710k57018M74380
46844F69013J6618j05532p66305j32141P84914j79404p13896J19588O4021J37279
46834a05845N65853p9069K63837J87004J94700o33270m12206n33271k0176M99142
46824g3301p3217k85207K76712k8748k33101l6209M44234J40587M73278l60536
46814B44492K24440j96304o32791r9039N64278p49998j07388M56039J124526m41964
46804C86291n62301L62011J52905q01643M18922K98429P783p83877j08290Q82311
46794B52541L51356j97903J2761m47126M61143J42528m87417M46788l03235r6763
46784A34673k28703j33770K89229j17128L59213L2921j39207L27415m23073j01306
$$ y = [336287, 44684, -43584, -24432, 72311, 290538, 547993, 519361, 451651, 194633, 669013, 685631, 580099, -186206, -318347, 466567, 287163, -426733, -307145, -243124, -105845, 460008, 380939, 644776, 831780, 1026480, 393210, -18996, -552267, -572443, -73301, -146518, -431725, -155013, -183761, -416862, -453071, -8837, 131750, 605028, 244492, 468932, 272628, -360163, -459202, 105076, -644922, -752310, -296271, 828255, 386291, -176010, 186001, 338906, -462737, -43815, 254614, 262397, -521480, -629770, 252541, 603897, 405994, 418755, -28371, 432772, 575300, 87883, 534671, 231436, 134673, -94030, -227800, 61429, -55699, 303514, 336435, 197228, 524643, 101570, 264]
46774B64n6945k97957J96096l23161J10744j27575L47787L99227J87075k33931
46764B01624q8328L25203m70678m50665Q03390O87873L98730q14046J52008m90117
46754B54994j028636L43575O42546Q8287m65279k41112k41747M28578J47047l61025
46744d32772l7403L04975n52813n0461R27848P0572j60691M6551J7733j92073
46734e8534O96326k1810L90037k84559l31455l13522O21517J48560j046553r136
46724b09129O12126k86180L20624K32331j62097r43356K58207Q08478Q09m35591
46714A96222K24601n91472J4443O77395j65890M4901o02405m44630J74208N25709
46704E3082k67119R7504K88193j91752L08045L57130p6601l65074j32386l43811
$$ y = [264, -56681, -354638, -158542, -481703, -370959, -498534, -150747, 248480, 435555, 201624, 113296, 438499, -32179, -482844, 320546, 1008419, 1407149, 593103, 745111, 254994, -773642, -430067, 212479, 300766, -164513, -405625, -647372, -218794, -71747, -432772, -470175, -165200, -718013, -768474, 159374, 229946, 69255, 115806, 133539, -58534, 637792, 615982, 1006019, 721460, 390005, 76483, 698000, 846560, -199993, -209129, 402997, 116817, 437441, 669772, 507675, -435681, -177474, 631004, 631813, 196222, 420823, -170649, -156206, 521189, 355299, 400200, -202205, -646835, -472627, 53082, -214037, -116533, 171660, -20092, 287953, 645083, 568482, 203408, 71022, -272789]
46694b72789p2596Q49732j22376l8092J27357j19115Q5255m54996n87987O44306
46684C8699J0245L95178Q55447L53571j379369j70176K95275n69382j64290N97597
46674B62795N42840O8965k41109m22380L29018l8293p73543P60373K9813l02213
46664B16266O2758j16116k18442K20969J9328k09773Q0857M23161K85239j60710
46654F03537R8879k85562r67957L35838J40512n56239m16017R07526J31290K57656
46644B49463Q82774O0915L97651o42115j25068n07879J354348L14528j231621
46635G52996j409411j21443O00530r9660l67529J45873K86931L93258R56946k11145
46625I27346r03934J73804O27888p24152m79447j11068q8554K93245R18798K92131
$$ y = [-272789, -345385, 504347, 381971, 343879, 471236, 352121, 437376, -17620, -605607, 38699, 48944, 444122, 1299569, 1653140, 273771, 103595, 398870, -170512, -334802, 262795, 805635, 874600, 633491, 211111, 540129, 501836, -271707, 488666, 518479, 216266, 279024, 162908, -55534, 165435, 184763, -25010, 55847, 479008, 764247, 603537, 702416, 416854, -551103, -215265, -74753, -630992, -1047009, -139483, -8193, 249463, 1132237, 1193152, 1590803, 948688, 823620, 315741, 1670089, 1984617, 752996, -656415, -777858, -177328, -276988, -644517, -498644, -211713, 181545, 1138491, 927346, 23412, 197216, 825104, 100952, -378495, -489563, -578117, -284872, 633926, 926057]
46615I26057M091n62849o00001J36616l31972J03400M81978N20199k40585L43824
46605G80758j52669j093231m694M88297M25074l15302n68668j16253K44028L43278
46595C0618l55169j87908L54455K14946J40664K26090K66085J2015o73593P8972
46585A07175j010064k09043k92289Q78665j07317q3513P27286K15350K63763J47554
46575F37567n73654J77874k57348l5956K15073O897l07572L32049k09445J23461
46565A08946j85774J4017M29728l77613N25111n82798k01692M26722O5520j29732
46555I2435L58898o1024r77383l7175N09178l50598J69331J49036P27637L21712
46545I02047n41240m7158o18896K49073L35226L41416L84408Q6135r71990l60003
$$ y = [926057, 930148, 367299, -232702, -96086, -428058, -324658, 157320, 677519, 436934, 780758, 628089, -465142, -469836, 18461, 443535, 128233, -440435, -556688, -312660, 30618, -324551, -512459, -158004, 56942, 197606, 423696, 689781, 701796, 28203, 107175, -902889, -1111932, -1404221, -525556, -632873, -716386, 10900, 226250, 490013, 637567, 63913, 241787, -15561, -51517, 163556, 170453, -137119, 194930, -14515, 108946, -76828, -62811, 366917, -10696, 514415, -68383, -270075, 156647, 222167, 92435, 451333, 390309, -587074, -624249, -115071, -465669, -296338, -147302, 580335, 902047, 360807, 313649, -305247, -56174, 279052, 620468, 1004876, 1091011, 119021, -240982]
46535b40982q06992l18414P08002Q45750r0362L84067M17791l32371m82299L95155
46525D79345J90875m20176q80390M565j54886L6165N42537N73827j00592N74327
46515H45597j71183p60029J7214o85107J232174k55126p27178J4052R70277L61882
46505H42573n05211l2833m060J60348L17390P70090p48288q17061J98117l86859
46495b05794O17364K84711k75584K49145k34799k12862l36177l34287j55235M49302
46485a54216J301752l54386j73268J97425l85961J11750o77423K07214K11860
46476B84747N55387j04658k57033J53609k73535k69966l12755L47767p49731Q5888
46466e40280P1292J17172N23376L00281M73028l22513r90603O7730M26261M80277
$$ y = [-240982, -1047974, -1366388, -658386, 187364, 97002, 481069, 898860, 566489, 84190, 479345, 670220, 250044, -630346, -625781, -780667, -744502, -201965, 371862, 271270, 845597, 674414, -85615, -68401, -753508, 478666, 223540, -503638, -489586, 480691, 842573, 337362, 304529, 300469, 460817, 778207, 1548297, 800009, -17052, 181065, -205794, 411570, 696281, 420697, 669842, 435043, 222181, -113996, -448283, -603518, -154216, 1147536, 793150, 619882, 817307, 431346, 543096, -134327, 72887, 284747, 840134, 735476, 478443, 632052, 358517, 88551, -224204, 123563, -626168, -540280, -468988, -351816, 171560, 471841, 944869, 622356, -368247, -300517, 125744, 606021]
46456F06021K78149k57565M03748o2132Q4058o98172m12867L95338O02357j269570
46446c30635L0193M90275m43834J82495K56894q2677l39078O08864j060783q638
46436f96924K25776M45129m1707m46196j1429K37285M53036N2797n67550k22471
46426e72254k48230M62974Q61662l15128m1359J31485l84810m00872k22762m56558
46416a185852n15724K55100Q15669J069040k07665r92227k21831L88601N95667
46407G78J45059l63139j52645Q63725R67118m10731o49093M19938k78045m89822
46397E3143l15201j06637P5415K2099K54021k12780j58659m52989J108878l0349
46387B36941o22073J59431M3400l21866K73313o8018Q5650L24299j62583N64369
$$ y = [606021, 884170, 626605, 1030353, 968221, 1052279, 354107, -58760, 336578, 938935, -330635, -300442, 189833, -254001, -71506, 185388, 102711, -236367, 372497, -688286, -696924, -471148, -26019, -67726, -513922, -525351, -288066, 164970, 217767, -349783, -572254, -820484, -357510, 504152, 189024, 147665, 279150, -105660, -506532, -729294, -1185852, -1701576, -1446476, -630807, 438233, 230568, -761659, -983490, -594889, 778, 145837, -217302, -369947, 493778, 1460896, 1050165, 401072, 821010, 542965, 53143, -262058, -368695, -293280, -271181, -17160, -229940, -388599, -841588, 267290, 236941, -385132, -225701, -182301, -504167, -230854, -298872, -213222, 111077, -51506, 512863]
46377E12863J87814j160677m3109R21370o7244R8931n53620m6118j01139k4242
46367b75171K44613r64479O53322J029214r05943q98594N79486M39293k72485
46358c70744n5548N09827k39356R35410l36520J39179N4513m66451K54121j58416
46348B66015l64010o4539P44123N7238k66239m79500m74840J85308m00057k01159
46338i97660J338692k1764o02394j17179o41262R85719p6449N167n37584J29519
46328e35195L46129Q1661J93698l46242K90761L03669O159m64236k9985L53052
46318A99471n88811J80576J59671k65255n66556K45961j19120K75640K46945m89780
46308g21258K19501N90718k95766m28854K756J149610n3699m66236O63783p59644
$$ y = [512863, 700677, -460000, -503109, 418261, 351017, 449948, -103672, -149790, -250929, -275171, -30558, -995037, -341715, 687499, -218444, -1117038, -537552, -98259, -370744, -426292, 83535, -155821, 779589, 443069, 582248, 636761, 170310, 424431, 266015, -97995, -162534, 581589, 638827, 372588, -106912, -581752, -396444, -796501, -997660, 341032, 319268, -283126, -400305, -1041567, -55848, -132297, -127130, -664714, -535195, -189066, -107405, 86293, -259949, 30812, 334481, 340640, -123596, -153581, 199471, -389340, -208764, -49093, -314348, -880904, -634943, -754063, -478423, -231478, -721258, -501757, 88961, -206805, -635659, -632903, 516707, 463008, -3228, 660555, -99089]
46298i9089j62589R6043J83928j01634l32020l92457J40567K3403l44990l87108
46288a375946M09077N41380K1114q27839J45339M69534L13247K05688p3840M09800
46278B37554l4437R22546k79881k56227O3384M54812N71894q89648K2846j8656
46268G94187j42065J07658l91668J59671k53153m82063k77100o0099K98387N05554
46258B59309J50468l86174l52640L8447j22036N28817l42167p71237Q8388N59559
46248c49266O76434M31934l80554q84925O23041K42861j35406N07532k14817m12742
46238A04092n63092l32134O49635M55468o6789J96942R60873l08235k30446m30254
46228D36060J62319K0380n86755R0170J24496j96280l38460L25213L88649p59995
$$ y = [-99089, -261678, -165635, 18293, -83341, -415361, -807818, -667251, -643848, -988838, -1375946, -966869, -425489, -404375, -1232214, -1086875, -617341, -304094, -98406, -172246, 237554, 203117, 1125663, 845782, 589555, 652939, 1107751, 1679645, 789997, 812843, 794187, 652122, 759780, 368112, 527783, 274630, -207433, -484533, -544632, -246245, 259309, 409777, 23603, -329037, -290590, -412626, 116191, -225976, -997213, -908825, -349266, 327168, 759102, 378548, -506377, 116664, 359525, 224119, 731651, 516834, 104092, -459000, -791134, -141499, 313969, 247180, 444122, 1404995, 1096760, 866314, 436060, 598379, 618759, 32004, 122174, 246670, 50390, -288070, 37143, 425792, -334203]
46218c34203M43288K66150l83735j63791k78350M33499l6916M16736Q89161o06881
46208F44958O11217l32540j464084M55222L47334m04085l53991n99745K44520
46199h51194N88673j41438J41752N86084p79633N6646M64084J40782n04807k61812
46189e60863M2933Q05183l36084N05879j42432J09979J70802L68849O74374r83808
46179F54812p77531J11659L02809K01151n15453J06208m94163K40706M30772l67542
46169a06572j0758Q14233K67685k07592P66m16063r99193J84154O73031n1028
46159A48663N34640p34299L03358L7542L46336m24555k98052k38400J10877n26253
46149g40143K62292K01037O78833O2559j002050M51335M24771M45408p17044m47577
$$ y = [-334203, 109085, 375235, -8500, -172291, -450641, -17142, -54058, 362678, 1251839, 644958, 1256175, 923635, -540449, -85227, 262107, -141978, -495969, -1095714, -851194, -262521, -403959, -262207, 323877, -455756, -399110, 64974, 205756, -299051, -560863, -517930, 287253, -48831, 457048, 314616, 424595, 595397, 964246, 1638620, 654812, -122719, -11060, 291749, 492900, -22553, 83655, -410508, -169802, 260970, -106572, -117330, 696903, 964588, 756996, 757762, 341699, -657494, -473340, 199691, 148663, 683303, -50996, 252362, 289904, 636240, 211685, -86367, -324767, -213890, -740143, -477851, -276814, 402019, 464578, -537472, -86137, 338634, 784042, 66998, -380579]
46139c80579R94261k46353m32102n1748P04772j046619m65813P50978j29951P2489
46129b30665n92628n97044L7033M63702P55212M7786O6450L31798M32018q48933
46119a35271r3157Q71882m01516n26712L28716j0600J17816j14178n40056m17436
46109i20512Q2614m744L06675K98273M79508j86390n01319o2283O48589K75527
46099D15938L26622L3368p4442L25423L97130j284420k02514N03860M63899L905
46089I08769n6111N1834p6039O0969J51974l65332N46742m62050j380369R8726
46079e20887O14614K80152L49660l94833n68337L71282L36221o45996K86518M95148
46069F03542n39704L35042O71830j145099m57902J166264k12333l15074J41984
$$ y = [-380579, 613682, 367329, -64773, -116521, 588251, -458368, -924181, -173203, -303154, -230665, -823293, -1420337, -1383304, -919602, -164390, -116604, -50154, 281644, 713662, -135271, -228428, 643454, 241938, -284774, 43942, 33342, 151158, 36980, -503076, -920512, -837898, -842642, -535967, -237694, 241814, 55424, -445895, -508178, 140411, 415938, 742560, 775928, 701486, 1026909, 1424039, 139619, -62895, 440965, 904864, 908769, 852658, 904492, 828453, 889422, 1041396, 676064, 1222806, 760756, -619613, -520887, 93727, 373879, 723539, 328706, -239631, 131651, 467872, -178124, 108394, 603542, 63838, 398880, 1070710, -74389, -532291, 633973, 421640, 106566, 248550]
46060B48550k09864l83602m46659M43172j58419L43052k99070L15224N70842N0480
46050D73706J57945j18768k45197k59000Q37369Q8437l9575j018506q50246N10065
46040d63770R3109k43834L95010Q91748l71044N10282o10491k31456J81715l43258
46030a91989L08302K04660m99633l56844L02332j34678l11658O33470J312538
46021A266500j73347n2975o83626m55086q3602n56163K12027K3860J078905l17989
46011B58504q06353k69876Q50988N58061k32868l86981K43174J53200q23570J12628
46001c43093P12693k46720L25600j27409l23797k02428j53621J38426L67004O18160
45991G64815l77723J22506n8821L86726J79191l68369k0917J79559q17320p4147
$$ y = [248550, 38686, -344916, -791575, -348403, -506822, -163770, -462840, -147616, 423226, 473706, 631651, 512883, 267686, 8686, 846055, 934492, 894917, -123589, -973835, -463770, -370661, -614495, -219485, 672263, 301219, 811501, 201010, -30446, 151269, -191989, 116313, 320973, -178660, -535504, -233172, -367850, -679508, -46038, 1266500, 1093153, 1040178, 356552, -98534, -182136, -738299, -526272, -502412, 576493, 258504, -547849, -817725, 33263, 591324, 358456, -28525, 214649, 367849, -455721, -343093, 369600, 122880, 448480, 321071, -2726, -205154, -358775, -220349, 146655, 764815, 387092, 509598, 450777, 837503, 1016694, 648325, 627408, 806967, -10353, -84500]
45981h4500n980k07019J09477k21251J11900L08091M02307o8863J63193l73366
45971A33989r3885r6526N7478P9903l26967K18837K26789q25972n92106P55100
45961d63360o9708r8422L63347O64211j63745p97553j9677N04109j25217j076565
45951a282580O46417j3280N3279J48839J2866L51434P909M8091L20595R2231K58347
45940F44148l40781k13240j58219j62673k68450j721j28387O14920O02190K94782
45930H82569j88855l8278p19042o4304q7670l75586N6304K78290L3238M82591
45920B59257J18177o0670k11078l6665J93356n3642k22128L81464K00218l92376
45910A75913p1669n62245O23797K07454l39050m05433L17929L41210q74277n44088
$$ y = [-84500, -90480, -297499, -188022, -409273, -297373, 10718, 413025, 344162, 507355, 133989, 40104, -56422, 1056, 80959, -246008, -27171, 199618, -626354, -1218460, -463360, -533068, -631490, -268143, 396068, 232323, -565230, -584907, -80798, -206015, -1282580, -636163, -649443, -596164, -447325, -434459, -83025, -75116, -27025, 293570, 385801, 644148, 303367, 90127, -68092, -230765, -499215, -500936, -629323, -14403, 587787, 882569, 693714, 655436, -63606, -127910, -215580, -591166, -534862, -256572, -223334, 259257, 377434, 316764, 105686, 69021, 262377, 208735, -13393, 368071, 568289, 175913, 104244, -458001, 165796, 373250, 34200, -371233, -53304, 287906, -586371, -1130459]
45900a130459m96181J174351J011494m27103n27173l09348Q44248M22620O0494
45891F22943J77999L31191r7356j93764n6730L11251q76072m46194j30717r1487
45881d48936N89162J40809l56049m38496L82053R4602J37376k17630r4512M66689
45871B55068j46873j55541N2227L44728J11811K14333J82937M0998K56837q8150
45861A068375m55581p04552j27884L72785p30626l72461O39017J16267K40406
45852D5746m86365Q033O8084M36783K28970L92256L04928j039642n09657M36629
45842a14235K60588J39083L85658J8089K19807J1410k17811n63044j22245K70025
45832B87325J17951q27645J08366L0580n67830J04500K6941J13283K35657N81934
$$ y = [-1130459, -1626640, -452289, 559205, 132102, -395071, -704419, 139829, 562449, 622943, 800942, 1132133, 1034777, 841013, 784283, 1095534, 219462, -226732, -357449, -448936, 140226, 281035, -75014, -513510, -131457, -36855, 100521, -117109, -211621, 255068, 108195, -47346, 4881, 349609, 461420, 675753, 858690, 899688, 1156525, 1068375, 612794, -91758, -219642, 153143, -577483, -949944, -310927, -194660, 45746, -440619, -432586, -364502, 72281, 301251, 693507, 998435, -41207, -550864, -114235, 146353, 285436, 671094, 689183, 908990, 920400, 702589, 139545, 17300, 287325, 405276, -422369, -314003, -283423, -851253, -746753, -719812, -606529, -370872, 211062]
45822B11062l54950j07243P49677n67059k10717j40557M04497j97636M30412l52031
45812a34545q55386O8859N04055N52289K91947n62131J45563O37073k62903m52047
45802f7226k46488K28748J065713m807r69373K53480K10709m2050j47361m28263
45792a46918M47120k61915N87553j28383l13955o0118n39613M25930n79690k14731
45782g84720j75350M54655K1725l36846Q03958n4468j49634o8503R2836m72316
45772f68663o81308K11453K00542J144235m8361j67611N82141L21899J3420o03975
45762C03772p09476M04873L1772l92050O03294r5854p68719N12466N6174n02864
45752e56612J70845L70222K69219j003173M34880J97865K32290q88519q2486N37585
$$ y = [211062, -143888, -251131, 498546, -68513, -279230, -419787, -15290, -212926, 217486, -134545, -989931, -921072, -417017, 135272, 427219, -134912, 10651, 647724, 384821, -67226, -313714, -84966, 980747, 975940, 6567, 260047, 470756, 428706, 281345, -146918, 300202, 38287, 625840, 497457, 183502, 123384, -416229, 9701, -569989, -784720, -960070, -505415, -483690, -820536, -16578, -71046, -220680, -289183, -196347, -668663, -1349971, -1138518, -937976, 206259, 157898, -9713, 572428, 894327, 907747, 303772, -405704, -831, 30941, -361109, 242185, 146331, -622388, -109922, -53748, -556612, -385767, -15545, 253674, -749499, -314619, -116754, 115536, -772983, -855469, -317884]
45742c17884k41464J61056J12091j2465k0786K7164L34827N5139J50980n73122
45732c24464O0998N53059O2892j62281L72809j49914j51922M41195j94489n91731
45722h3848k81599N4980j08097M47369J04561k51151k5017m43994M23677Q29620
45712F66501N42102p91571p54003o26157M58248O31575j07492o66676q7811K87694
45702d47590j16680J96482J08650L00625k10676q6859O22620N5886k38090j56850
45692B7518K45187K59593K23306M70248o93974j046780j73307J2356J67470K47211
45682b61172J40233K06591Q06936l77083n82414m6425j1437J53247P22351q1318
45672F69509l84343J28546Q30475K25284r16439l38203N35403J26526R361p25190
$$ y = [-317884, -559348, -398292, -286201, -298666, -319452, -292288, 42539, 97678, 248658, -324464, -263466, 289593, 352485, 190204, 563013, 413099, 261177, 702372, 507883, -83848, -365447, -310467, -418564, 28805, 133366, -117785, -142802, -586796, -163119, 666501, 1208603, 417032, -336971, -963128, -504880, 126695, 19203, -647473, -735284, -447590, -564270, -367788, -259138, 41487, -169189, -256048, 366572, 422458, 184368, 27518, 272705, 532298, 755604, 1225852, 531878, -514902, -688209, -675853, -508383, -261172, -120939, 85652, 892588, 515505, -66909, -113334, -124771, 28476, 750827, 669509, 285166, 413712, 1244187, 1469471, 553032, 214829, 750232, 876758, 886119, 160929]
45662A60929j90553j073492j26625Q24143M87034m95232R4847M59293O76590j64861
45652F52073r49471N28312R4671j78065K61156L04530l52741o96180K2179k1003
45642c34539J80715L97674j2527k29380L88671N46049N78546L7343p4843k3777
45632A453932m00757J93409k28678o61096j11864j9162R7358J17834m9068n55468
45622a63560M1721k34042N40135O11622O6397k41084n68959m2898L28886n5607
45612B82611o05514L57339O74631J17925o86440k5551j56501L36155O41207N13031
45602A448893j236653o19410L46850J32910o7093n12722P7844L90489m33034l69120
45592h41046K47406M7069J031430J7325n75315k11804j39760K10847o3532O04122
$$ y = [160929, -29624, -1103116, -1229741, -405598, 81436, -413796, -318949, 140344, 816934, 652073, -297398, 230914, 325585, 147520, 408676, 713206, 360465, -335715, -313536, -334539, -153824, 243850, 231323, 1943, 390614, 936663, 1515209, 1552552, 1477709, 1453932, 1053175, 1246584, 1017906, 356810, 244946, 225784, 323142, 440976, 391908, -163560, -121839, -355881, 184254, 795876, 862273, 621189, 52230, 9332, 338218, 282611, -322903, 34436, 709067, 826992, 140552, 115001, -41500, 294655, 935862, 1448893, 212240, -407170, -60320, 72590, 5497, -507225, -429381, -38892, -471926, -841046, -593640, -546571, 484859, 502184, -73131, -284935, -424695, -213848, -277380, 326742]
45582C26742m99024N75093o63181q5878j49727L60809J88826M92566n11965l27119
45572b92858J49017o0614k86270l2505K97027J09930M36572k51400J8196K18648
45562C05743J43831o63088o2226K08168J94454L45763J61512r5111l29136m24513
45552b14603J5701L04275J36710m1611J7853j16129K06373K08629m21386n90699
45542d94887q8907l83065K93580j39790J39171n21928O88082N4959n7161P7889
45532d32057N9429K74669q1942M89235k09601K15850P3113n49937o91524m12955
45522a265720M13394R13898R9126n12613j45699Q81982O49652o17524P3403N89877
45512A079776j63735k77474K37646k81961j71881K94140q4337n49934j59608k94276
$$ y = [326742, -172282, 402811, -260370, -346248, -495975, -135166, 53660, 546226, 34261, -292858, -143841, -204455, -490725, -523230, -226203, -116273, 320299, 68899, 87095, 305743, 449574, -213514, -275740, -67572, 126882, 472645, 634157, 539046, 209910, -214603, -198902, 105373, 242083, 200472, 218325, 102196, 308569, 517198, 95812, -494887, -583794, -966859, -673279, -813069, -673898, -1195826, -507744, -452785, -509946, -432057, -372628, -97959, -179901, 309334, 99733, 315583, 388696, -161241, -852765, -1265720, -852326, 61572, 160698, -351915, -497614, 384368, 1034020, 416496, 489899, 1079776, 916041, 638567, 876213, 594252, 422371, 716511, 632174, 82240, -77368, -371644]
45502c71644n17987O46823N20005j59458J65757M19914L33635K41244j70132j16917
45492I91240j13484n00093k12591p68925m02014N07004M29296J29797l1996N19464
45482E47698p07614n92521O240M95973L79711l05100k25299L50568J8943O60789
45472F29388J68188m0592n17188K47043K98097l24478J72710l02674l01164m1055
45462a1725j6620O1911J39107J3159n82135K12135O64510L67950k94982r86432
45452d33122q40116l00888M93463P46129K98937K71357K46003L96686N6176j14101
45442H20524l0635q04728l49883Q4934K08698J80524N12510m81615N1671L99794
45432E91794n51344O06069O94563n7966m63125j88441k77231m70600j2706j98390
$$ y = [-371644, -889631, -242808, 277197, 117739, 283496, 703410, 1037045, 1278289, 1108157, 991240, 877756, 377663, 165072, -603853, -1005867, -498863, -69567, 60230, 28234, 547698, -159916, -752437, -746197, -250224, 129487, -175613, -400912, -50344, -31401, 629388, 797576, 756984, 239796, 486839, 784936, 460458, 633168, 330494, 29330, -11725, -28345, 33566, 172673, 185832, -396303, -184168, 480342, 848292, 553310, -433122, -1273238, -1574126, -1080663, -334534, -35597, 235760, 481763, 878449, 934625, 820524, 789889, -14839, -364722, -279788, -71090, 109434, 621944, 140329, 192000, 591794, 40450, 646519, 1341082, 1283116, 819991, 631550, 354319, -116281, -128987, -327377]
45422c27377j18291L96299N86670J18563n3564j217166k08777P42463j08045N12135
45412C22910n55412k0213L84834j35571J07711k55178O16700j33832K09995o12842
45402g0898J13505R95337k98797Q4481r9881j77309m74960N9953K4412J1637k37438
45391f9958m75342L67124J382719J3968k04953J40675n08951j41005K90841k32769
45381E62349n4830p72407m83138Q69906R13721l51418o13160M11375M76984k07090
45371G52292l32631J52979n4339k86166J04457k80052n92671O02644l01945k45355
45361d80787P36226P09616n08615K81043O81662K78279r8205o13932j177983q7592
45351b80288J62183q10914J24280P6221l00406N23873M71928n86824L8983P92530
$$ y = [-327377, -445668, -49369, 537301, 655864, 602300, -614866, -823643, -81180, -189225, 322910, -232502, -252715, 132119, -3452, 104259, -150919, 465781, 331949, 541944, -70898, 42607, 1037944, 739147, 823628, 723747, 546438, 71478, 131431, 155843, 167480, -69958, -545300, -178176, 1204543, 1218511, 1013558, 1154233, 645282, 504277, 795118, 562349, 507519, -264888, -748026, 121880, 1035601, 684183, 71023, 482398, 959382, 752292, 419661, 572640, 518301, 232135, 336592, 56540, -536131, 66513, -235432, -480787, 255439, 965055, 456440, 737483, 1419145, 1697424, 1599219, 985287, -192696, -280288, -118105, -929019, -804739, -728518, -1028924, -505051, -33123, -619947, -580964, 211566]
45341B11566J48474o05783n47541m38678N27498K90197N65612k89625N79116L20801
45331G61637L42699J79224l49034p84737j33844K45239q17125N24486N08197L5804
45321E12546k61021o9204O05034P5675l55298N21301k46454l36136Q5432O2070
45311E93945o26112K39795N3878k88838O4391n47610l29904R8503N11038J16480
45301a14434l99811J299891K04519n21312l18584k04558J04014K75366L92592
45292G17683L44069o01760j99748k2551j70535K4816M8879l89908N92371m59897
45282a16581p9444O99892J89274j36413l03541M57915l99864L94956J20810m37886
45272C89118J40990l1259R2312j63836q97856N74060M65580o09159O82391K76165
$$ y = [211566, 360040, -245743, -793284, -1231962, -704464, -414267, 151345, -138280, 440836, 761637, 1104336, 1283560, 934526, 149789, 15945, 261184, -555941, -31455, 476742, 512546, 251525, 182321, 787355, 863030, 507732, 1029033, 782579, 446443, 531875, 593945, -32167, 207628, 261506, -27332, 37059, -510551, -840455, -741952, -230914, -114434, -514245, 785646, 990165, 468853, 150269, -54289, 49725, 325091, 717683, 1061752, 459992, 260244, 237693, 67158, 91974, 140853, -249055, 343316, -116581, -196025, 503867, 693141, 556728, 253187, 711102, 311238, 706194, 827004, 389118, 530108, 498849, 591161, 427325, -470531, 103529, 569109, -40050, 642341, 918506]
45262I18506o05245L69603o4420q57919j89362M85692r6373J65277M61066j65477
45252D21348P917P3621L8594M70265K23112K24235m62294k13885M67923m78124
45242G72712l84546k13313J18955l52578J38797K52929L89270o50018k18111l51390
45232d97293p24252R49770N32310O27071j77416p94331M48822J33810k76835L26946
45222E48602M7349M91237N48718m04978q45199j16764L36885j93644l70667O6575
45212A08114K80506M52599L86832o74019n72046K60268J16694j39758l59999J017027
45202H76218J25633l09310m16643k90794L34173l40310N74858j59687m71894n76518
45192f54274L74228K72685j67052l09749k4123J93325P8806L1751j035552j33920
$$ y = [918506, 313261, 682864, 618444, -239475, -428837, 56855, -39518, 125759, 586825, 421348, 429265, 502886, 541480, 1011745, 1234857, 1459092, 996798, 782913, 1250836, 772712, 388166, 174853, 293808, -58770, 80027, 332956, 722226, 72208, -145903, -497293, -1221545, -271775, 260535, 887606, 710190, -84141, 364681, 498491, 221656, 548602, 595951, 1087188, 1635906, 1230928, 385729, 268965, 605850, 412206, 41539, 108114, 388620, 841219, 1228051, 554032, -18014, 242254, 358948, 219190, -140809, 876218, 1001851, 692541, 275898, -14896, 319277, -21033, 553825, 394138, -77756, -654274, -280046, -7361, -174413, -484162, -508285, -314960, -236154, -204403, -1239955, -1373875]
45182a373875n0125J061793O08867j50384K35191n3317O12675j09354L4095o05439
45172B10127k74257Q60920n19627o20497R53441L99150J56516L91407j25312K30348
45162A662216o96391n92237r45265M49381R42546k14858n08311q8939L75868K41081
45152F25091r8899N03576k06172M6602K47422k50000n69544n17681j081N87579
45142C66893k11261j327228K39005P86807K28105N20879j05353p3968L35844N03310
45132A263033o89597k69028J09436l62382p9009j37581k43499Q94256Q92327m97435
45122H80521l5556m49097K80313m22868r10409M3458O23755K18678J33191j16645
45112B45341q85928n4447N11177J077124j95074n13867o06635m39124O55196l46183
$$ y = [-1373875, -1424000, -362207, 246660, 96276, 331467, 278150, 890825, 781471, 815566, 210127, -64130, 796790, 277163, -343334, 610107, 1009257, 1165773, 1557180, 1431868, 1662216, 965825, 373588, -571677, -122296, 820250, 605392, 97081, 8142, 384010, 625091, 526192, 1029768, 823596, 870198, 1117620, 867620, 298076, -219605, -220686, 366893, 155632, -1171596, -932591, -145784, 82321, 603200, 497847, 423879, 759723, 1263033, 573436, 304408, 413844, 51462, -27547, -165128, -408627, 485629, 1377956, 880521, 844965, 395868, 676181, 253313, -657096, -613638, 10117, 228795, 361986, 245341, -640587, -695034, -183857, 893267, 698193, 184326, -422309, -861433, -206237, -552420]
45102e52420L44671O73410k77175N32809k21774k89460P50373j79649j228321
45093d47536L93076N85770r92133M5560m89587L49007P00081o66832k04347K62372
45083d64569K73423m96413O42092P5428k2898O17867M53573L03313K55984o37940
45073I99860m23849k95154j71601O95775m7527p8276r46450j1412L5014J03525
45063a40095M34731L32543k06059J10180m38346M98654Q657n30942P9009O2424
45053B10756O5989j29644n29099k63505M08220p62072L55560L21403Q15348L9896
45043E32852k3564q61269n53732K37984N62403o897L70734o9085L42761o24187
45033i2000m04120N10040L08750n295J62023l45629k61286O15971J16525j49906
$$ y = [-552420, -207749, 465661, 188486, 721295, 499521, 210061, 960434, 780785, -447536, -54460, 531310, -460823, -415263, -904850, -555843, 144238, -522594, -726941, -464569, -191146, -687559, -45467, 29961, 7063, 624930, 1078503, 1381816, 1637800, 999860, 576011, 280857, 109256, 805031, 757504, 679228, -267222, -278634, -243620, -140095, 294636, 627179, 421120, 531300, 92954, 591608, 600265, 69323, 148332, 210756, 276745, 147101, -381998, -645503, -237283, -999355, -643795, -322392, 492956, 532852, 509288, -351981, -905713, -667729, -105326, -112223, 258511, 189426, 532187, -92000, -496120, 13920, 322670, 317375, 479398, 133769, -127517, 488454, 604979, 455073]
45023D55073k13649o61032m56343O7793K08134Q82966j45628r87385M70106M81370
45013A01405k0909P06156n39613J86722o5065k70186L31693J4624J4668m00138
45003E9357P4169n29486m79809O35444k87092r72841M6737N08532R72326k8912
44993a575o75675K26150L59878L09408q02692J09787J95909M31635Q32308K7699
44983A012832m96679K27079J48739L85795l78996l69289M7056m3045l34631J78299
44973C77160J85680K957O6536n84488J79506n49842L71144L8665J38784k64992
44963c8890O2964J99277o6271P54527l30897k18708k95160p84381M68594P0086
44953a78859j10582J19531L36609l05106K64056l77808n31494M29531M56741M81303
$$ y = [455073, 241424, -419608, -875951, -808158, -600024, 282942, 137314, -850071, -379965, 101405, 80496, 786652, 247039, 433761, 368696, 98510, 430203, 444827, 459495, 59357, 133526, -395960, -875769, -240325, -527417, -1500258, -1453521, -944989, 27337, -1575, -677250, -451100, -91222, 218186, -584506, -474719, -278810, 152825, 985133, 1012832, 516153, 743232, 891971, 1277766, 898770, 529481, 576537, 533492, 198861, 377160, 562840, 565797, 632333, 47845, 227351, -322491, 48653, 87318, 226102, -38890, 24074, 223351, 157080, 911607, 580710, 362002, 66842, -717539, -248945, -178859, -289441, -169910, 166699, -138407, 125649, -252159, -783653, -354122, 102619, 583922]
44943E83922J82681n59482r63590K14653K76826K7801O017j13380N25850P44962
44933I26260m22188p5949o66173P03051k46559Q7625O50798M31555n8167n82226
44923G48027l61809K15141o4414m4657k01358K10788N49355K66471r61710L90605
44913G46439P10757k57628l70764j49112L86274M8962k27148P36724R5778j16110
44903A604172J54919j39045J73640j22378N34972J30012o70683p93733J0944Q4861
44893I67681j73040k6853n50301J64647j01691j72852J61452l44785K67957K11453
44883D03668M9515L94542j51406o53580O86L79275m01598r0635L52243R25090
44873A207800P75983n59364l33123m08057P26586q7202k17395n61138k58K23032
$$ y = [583922, 766603, 207121, -756469, -541816, -264990, -237189, -231172, -344552, 181298, 926260, 504072, 428123, -238050, 465001, 218442, 306067, 956865, 1388420, 1330253, 748027, 386218, 601359, 536945, 492288, 290930, 501718, 1051073, 1317544, 355834, 746439, 1457196, 1199568, 828804, 679692, 1065966, 1114928, 887780, 1624504, 1720282, 1604172, 1759091, 1620046, 1793686, 1671308, 2206280, 2336292, 1665609, 871876, 882820, 967681, 794641, 767788, 217487, 382134, 280443, 107591, 269043, -75742, 192215, 403668, 453183, 847725, 696319, 42739, 43425, 422700, 21102, -69533, 282710, 1207800, 1983783, 1424419, 1091296, 683239, 1409825, 1322623, 1105228, 544090, 543832, 766864]
44863G66864K99416L20593o29541k73583L8517K89814J92278J00788p9839k42680
44853G82627Q44288M3116m99443m47373Q37316K47632k22527n10822o2929K76107
44843A287992J5826n710n69300J69041N69052j90896L53739J5964n22146R9651
44833A223213o53846K14335L82607k68085N04795J71709N71527j67250p58038
44824A220967n26108L6505P48047k86508L47935m91928N69927O559O72030k61420
44814B036006Q8639J75651O1318j04259M48193N21652j182532j77477Q56234O23159
44804C346584k89343l35387M84639O73932p11283o1624O27622q0338M77489l85228
44794C747063K99627Q23210N63449k42045Q22969R05764J251667R48614M28115
$$ y = [766864, 1066280, 1386873, 757332, 483749, 522266, 812080, 1004358, 1105146, 1025307, 782627, 1626915, 1670031, 1170588, 723215, 1560531, 1808163, 1585636, 1074814, 1011885, 1287992, 1303818, 1298108, 728808, 897849, 1466901, 1276005, 1629744, 1645708, 1123562, 1223213, 569367, 783702, 1166309, 898224, 1403019, 1574728, 2146255, 1979005, 1220967, 694859, 731364, 1479411, 1192903, 1540838, 1048910, 1618837, 1625396, 2297426, 2036006, 2124645, 2300296, 2361614, 2257355, 2705548, 3227200, 2044668, 1867191, 2723425, 3346584, 3057241, 2721854, 3206493, 3880425, 3169142, 3107518, 3735140, 3654802, 4132291, 3747063, 4046690, 4869900, 5433349, 5191304, 6014273, 6920037, 8171704, 9120318, 9548433]
44785I548433N57052q84506j92990R06285O02525M62134R45850J131857O54006
44776A3730646J180403J391724J852904K137184K793907K956375L426854L371744
44768C2841741N565586O872182Q124027J0972621J2524031J5735343K2033063
44761A14668594L0654056M1527585N3936315O1405243N0380404J3884893l1803175
44754C34653915n9559649o0523775m8719703l5164030k6026962j8929671j4990283
44747G0739842j2852191r897384p150730n721264n321864l842489k900218j502481
44739B1551221k720129k646049k269793j606620p95953j342964j035948o38869
44731H494896l17912n60097k82660j379706l18398m84260m50144p3099k69152
$$ y = [9548433, 10105485, 9220979, 9027989, 9934274, 10536799, 10998933, 11944783, 13076640, 13730646, 14911049, 16302773, 18155677, 20292861, 23086768, 26043143, 29469997, 32841741, 38407327, 45279509, 53403536, 64376157, 76900188, 92635531, 114668594, 145322650, 186850235, 240786550, 302191793, 352572197, 366457090, 334653915, 275094266, 214570491, 165850788, 130686758, 104659796, 85730125, 70739842, 57887651, 47990267, 40839537, 35118273, 29796409, 25953920, 23053702, 21551221, 18831092, 16185043, 13915250, 12308630, 11512677, 10169713, 9133765, 8494896, 8176984, 7616887, 7334227, 5954521, 5636123, 5151863, 4701719, 4628620, 4359468]
44722D359468O53033n56297m02600q674r4089L09328p63r59091n42576K69994
44712C027733q696R2786K26410j96200k64479j118720k69340L28968l47823R0113
44702A560752M92356N98500k52889L11244n91601o49859L01842l18816k96459
44693A155070p4440P18893k52030o62517j42593K3722K38393L19820q66187j046877
44683e88746N88688R31045j80558l18270l81888L68585k07103j06082O24731N69865
44673A300267j94267q26817J60364j62603L34616K09911l44044o43631o75306
44664h41510N81736O20467Q74895j72762j614140K52827Q23691m87017o09205
44655e71018L25814R85745j30425m67220O20243L05155j261907j11896M53401
$$ y = [4359468, 5012501, 4456204, 4053604, 4044930, 3950841, 4260169, 4259406, 3300315, 2757739, 3027733, 3019037, 3111823, 3338233, 3142033, 2877554, 1758834, 1489494, 1818462, 1470639, 1560752, 2053108, 2651608, 2398719, 2709963, 2118362, 1468503, 1770345, 1451529, 1155070, 1080630, 1799523, 1547493, 884976, 742383, 766105, 1004498, 1324318, 458131, -588746, -58, 930987, 750429, 432159, 50271, 418856, 211753, 105671, 730402, 1300267, 1106000, 279183, 439547, 276944, 611560, 821471, 477427, -166204, -841510, -259774, 360693, 1235588, 1062826, -551314, -298487, 525204, 38187, -571018, -245204, 740541, 610116, 142896, 763139, 1068294, -193613, -305509, 147892]
44646A47892K6723l91435L83492J39914J74586j22805p519K0502k873k42960K43626
44635C69143K2330O29618M19133m17602o34474J81091j89997j04529m9052L8632
44625B64293o1548l7033l11911j13519O47019k58606o71619n22618L81709R16924
44615B33091K03679o62149M24478J77520J69855n8334m3533J95926J56045K17447
44605A014025o50398j77892J45195L30459m06891j111292K05199M37791O17927
44596D04123j77133p22656R10066m3789m39564j0173K0370k3524n13706n935N83474
44585a8447L07030l67690j17912j39067L60009p2713k31670q5951m53046j57854
44575i77311m59324J82158M80890p1099N89700k27317k16902J63904l94190O89474
$$ y = [147892, 174615, -216820, 166672, 306586, 481172, 358367, 350848, 371350, 368477, 125517, 369143, 391473, 1021091, 1440224, 1022622, 388148, 569239, 379242, 274713, 225661, 264293, 202745, 165712, -146199, -259718, 387301, 128695, -542924, -1065542, -683833, 233091, 436770, -225379, 199099, 376619, 546474, 488140, 444607, 640533, 796578, 1014025, 363627, 185735, 330930, 661389, 254498, -856794, -651595, -213804, 404123, 226990, -495666, 414400, 370611, -68953, -79126, -58756, -82280, -595986, -601921, -18447, 288583, -79107, -197019, -336086, 23923, -48790, -280460, -366411, -819457, -977311, -1436635, -1254477, -773587, -844686, -254986, -482303, -699205, -535301, -929491, -240017]
44565b40017P91870K48800Q78433K9634r49680p60424m80691Q83703R34090j22247
44555A213471M24328R45138j206945n38195O63684L85295J331132o02294m85583
44546B130031j64834r29196j01580k82676k85780K7145R3304M9610l15664m72915
44536b52555N9957J53034j78468J66563k6338l11764o34014L66958N4261M76585
44526a25781M70318n91266J68039K1672P2434j01722k71788J78444N8085O06163
44516D84598j09943k60155k0343r038k4147j97022M66285r5002J38004N07480
44506H80717k06294l51594m36045R2777N58518K87546n52171m2891n57970K73151
44496e4256Q23298R2817n42916m93606J28750O2601L14783O06300J33032k90858
$$ y = [-240017, 551853, 800653, 1679086, 1708720, 759040, -1384, -482075, 401628, 1335718, 1213471, 1637799, 2582937, 1375992, 837797, 1501481, 1886776, 3217908, 2615614, 2130031, 1965197, 1036001, 934421, 651745, 365965, 393110, 486414, 536024, 220360, -252555, -192598, -39564, -218032, -51469, -77807, -389571, -1023585, -656627, -602366, -125781, 344537, -246729, -78690, -57018, 15416, -86306, -358094, -179650, -121565, 484598, 374655, 114500, 94157, 85119, 60972, -136050, 330235, 235233, 373237, 880717, 674423, 322829, -113216, -20439, 538079, 825625, 273454, 230563, -327407, -54256, 769042, 861859, 318943, -174663, -45913, 16688, 331471, 937771, 1070803, 779945]
44486G79945j232483j86869L17195N13702N64010M12508k63045L94315o54418
44477F44860j31648j04497K99360l77466k82185M0972L47708m5003k37985p33240
44467e79124J89471K5997M81569R58547n4521m86828p7621O8286M33612m60050
44457D99338l0709j81110J42585j19614p14809R5345J86879J47363K20817J86068
44447D32153K9337J55367n37561l70847J80174k52818P44457J78683l13908R1692
44437C36729K86149j68795k3090o30110m15543J57812P40416P8772n2342j93996
44427A16002M27452P3409l09238l88999O8782L33923K88385L8835K61831N34428
44417A444810m66688j255005j42668K37817k38235m5352N06808k62486o77355
$$ y = [779945, -452538, -639407, -322212, 191490, 755500, 1168008, 904963, 1299278, 644860, 513212, 408715, 708075, 330609, 48424, 89396, 437104, 392101, 154116, -579124, -389653, -363656, 117913, 1076460, 1021939, 535111, 457490, 525776, 959388, 499338, 468629, 287519, 430104, 310490, -404319, -308974, -122095, 25268, 246085, 432153, 461490, 616857, 79296, -291551, -111377, -364195, 380262, 558945, 245037, 336729, 622878, 454083, 430993, -199117, -614660, -456848, 283568, 362340, 309998, 116002, 543454, 616863, 307625, -81374, -12592, 321331, 609716, 648551, 910382, 1444810, 978122, -276883, -419551, -181734, -419969, -465321, 41487, -220999, -898354]
44408h98354O02155J74961m44216j52462n0977O59366K03781m05955k10597L55931
44398a66367m83378N63843N50742l35137m78507j12396J216718m29128o28072
44389c01682r3094K99626M11324m24628p77114N30398N39166L93501k54511p55064
44379d32078K86500k00198q1612l71718j8021O01457j20469L18769J55434l92779
44369b54715m59186O31448N26130M57522l56370o35589K13747m17047r13120O38007
44359e69173J098372J943o16485l46379L94751O03047K31749J68833k14992j10254
44349F41412m77578p95678n19174P56579Q13698l22492J45176k74886j24530j04033
44339b61506L52685L42887k65951K39446k95299k00088q01492J90361O8951M3207
$$ y = [-898354, -296199, -121238, -565454, -717916, -768893, -109527, 94254, -311701, -522298, -166367, -649745, -85902, 464840, 129703, -348804, -461200, 755518, 326390, -301682, -394776, -95150, 316174, -108454, -885568, -355170, 183996, 577497, 322986, -432078, -145578, -345776, -427388, -799106, -817127, -215670, -336139, -17370, 138064, -254715, -713901, -82453, 443677, 901199, 544829, -90760, 122987, -294060, -1207180, -569173, 529199, 531142, -85343, -431722, -36971, 566076, 797825, 966658, 751666, 641412, 163834, -631844, -1151018, -394439, 419259, 96767, 241943, -32943, -157473, -261506, 91179, 434066, 168115, 407561, 112262, -87826, -889318, -698957, -630006, -586799]
44329e86799L03207J80019N18076k639M85324K02530n30258k72356l30550J30445
44319I6999K66141M32081j08250J47761M49845q40522j89211m12741k50738J003735
44309E95100M25754n70372N500k85706l11013K70774L88108K43510k87879r29861
44299d56085m67132K82811M59636K04311r8372R49452L17505n16244n66950o86137
44289e77205L69151J88977l57445J71270j4802r36491Q96069N54323k49048J5258
44279F0057k3825K7595J77718l50585j92435j30089M24793M84730j93577Q6089
44269C70471k4726k12642L45270K26837m39049l4774L48990J78323k85953J78045
44259F50792k6551M39815q30505J12895n47102l02089J36736l40807K22818N63450
$$ y = [-586799, -283592, -103573, 414503, 411864, 897188, 1099718, 569460, 297104, -33446, 96999, 363140, 795221, 686971, 834732, 1284577, 444055, 254844, -157897, -408635, 595100, 1020854, 450482, 455982, 170276, -140737, 130037, 518145, 761655, 473776, -456085, -923217, -640406, -180770, 23541, -74831, 874621, 1192126, 675882, 108932, -577205, -208054, -19077, -376522, -205252, -220054, -1156545, -260476, 293847, 44799, 60057, 36232, 63827, 241545, -109040, -301475, -431564, -6771, 477959, 284382, 370471, 345745, 133103, 478373, 705210, 266161, 231387, 580377, 758700, 472747, 650792, 624241, 1064056, 233551, 346446, -200656, -502745, -366009, -706816, -483998, 79452]
44249G9452q60654j29562Q96180M72168p35111k27372P18262P68111P7414n95645
44239D63243n34170O34337R6963L3950l31505l03976l19181M94023J04674n26166
44229a87808M87797P93855K25189k89808j017771O61612N83947m39010n06668
44220C11335j27773j83717l94202m68764p6544O16759J33197J90375j75755K35692
44210F0603J58821K28123l7869J45359j62307q82954N23648P36243p46503j39850
44200a16686J18145J17031K88471k80140j076354N60225M5355n24207j72017L04366
44190g35811N77809M98321O93342j18807q19458q10505N5493j82695L50604O29515
44180A37808N48842L00772K40109q96512o19510L6294L07487l26404l56218P55167
$$ y = [79452, -781202, -910764, -14584, 457584, -277527, -504899, 213363, 981474, 1058888, 463243, -70927, 563410, 660373, 694323, 362818, 58842, -260339, 233684, 338358, -187808, 299989, 1093844, 1319033, 1029225, 11454, 673066, 1257013, 818003, 311335, 183562, -155, -394357, -863121, -939665, -322906, -189709, 666, -175089, 60603, 219424, 447547, 409678, 555037, 392730, -490224, 33424, 769667, 23164, -116686, 1459, 118490, 406961, 126821, -949533, -389308, -343953, -868160, -1040177, -735811, -158002, 340319, 1033661, 914854, 95396, -715109, -659616, -842311, -491707, 137808, 686650, 987422, 1227531, 331019, -288491, -252197, 55290, -271114, -627332, 127835]
44170A27835L04356m39417J0572O64636N6134n80722L0533L31475n37881l39564
44160c72043O9897L02041k18445l15022P55056M31431k74429O548k4274o9799
44150B90961o94516J35250N58260j25950l82311k2870Q20142L86061K62117j004012
44140B23132l09270j62366L44194K00718L65297P52794m01122J18967M4880N2460
44130A229684q7943o09855l26107J02781J6464r0686P6812l6807L98237j46022
44120E26558L13088O60365r72315p50415m10976Q9410L91402R640K5648K40149
44110A22554l97059n17680L08608j44176L65026R57771J21050j80315J18478K39721
44100I93978O43246q46357l70133j26174K36446L41058l81351n06713m60732O05796
$$ y = [127835, 432191, -7226, 3346, 667982, 724116, 143394, 173927, 505402, -32479, -372043, -302146, -105, -218550, -533572, 221484, 652915, 378486, 385034, 360760, 290961, -403555, -268305, 289955, 164005, -218306, -241176, 578966, 965027, 1227144, 223132, -86138, -248504, 95690, 296408, 661705, 1414499, 1013377, 1132344, 1177224, 1229684, 1141741, 531886, 205779, 308560, 325024, 234338, 311150, 274343, 672580, 526558, 839646, 1500011, 527696, -222719, -633695, -544285, -152883, -143243, -117595, 122554, -274505, -792185, -483577, -627753, -262727, 695044, 816094, 635779, 754257, 993978, 1637224, 790867, 420734, 294560, 531006, 872064, 490713, -16000, -476732, 129064]
44090A29064K34972m29905m51574L33749N02253J65054j40082r53240j68989J088546
44080C09848K02001l53950p6157J55891K05619N4659K0557l36282n2065m06025
44070b75904L61866L22687p21015l58943K5230O55179j21371k42701L8536N46309
44060B29873Q34870m03176l94292O749q63786l52859N5788L60759j15668M74258
44050a67484L59317q4625j76348j88315O25817J07417K65045J5774n19397l03072
44040f5871l70547N65408K88282L65648q84k86872l89974l98194N15586N00487
44030G23069p03219l07329L42647j50779P0758L42933m85380l09941P23493N78906
44020H25158j36828j22207m10281p11232N99141n955o0326J89231J26312k76889
$$ y = [129064, 364036, -65869, -517443, -183694, 318559, 483613, 343531, -609709, -778698, 309848, 511849, 157899, 81742, 237633, 443252, 497911, 518468, 182186, 130121, -275904, 85962, 408649, -312366, -671309, -646079, 9100, -112271, -354972, -316436, 229873, 1064743, 661567, 267275, 274024, -589762, -942621, -886833, -526074, -641742, -167484, 191833, 107208, -69140, -257455, 368362, 475779, 740824, 756598, 237201, -65871, -436418, 128990, 417272, 782920, 782036, 495164, 105190, -293004, 222582, 723069, 19850, -287479, 55168, -95611, -24853, 318080, -167300, -477241, 246252, 825158, 688330, 566123, 155842, -555390, 43751, 37796, -22530, 166701, 293013, 16124]
44010A6124N72083O92297M67166j07549j039159L5580l43480M87530M07840n64080
44000F24352n47434j36996m2051Q12064K19221n54950L7466J81008J12697k86732
43990D18645K86034M41632m55465p87458o11415J072914J95482j97722q4513m09812
43980a31678j5239J78780O50993r089r32553j18120N58374J08000j90364P0864
43970A69968k02574J86472l76567N69425M83173m67246l28394k25254o63394J72914
43960f81477N80808l52705j52158o64854m56749P59966N55311l93020j95158N17676
43950d82360J02848j51518N9430L70564n97607L43822P88633j4697J92280l45067
43940B66328r49365j59506P13722n6309N4121M61885M50118o57860l32102L65617
$$ y = [16124, 588207, 1280504, 1747670, 1640121, 600962, 636542, 293062, 780592, 1188432, 624352, 76918, -60078, -102129, 709935, 929156, 374206, 411672, 592680, 705377, 418645, 704679, 1146311, 690846, -96612, -708027, 364887, 560369, 362647, 278134, -131678, -146917, 31863, 682856, 673767, -258786, -376906, 181468, 289468, 99104, 169968, -32606, 153866, -222701, 346724, 829897, 362651, 34257, -190997, -854391, -681477, -100669, -453374, -605532, -1270386, -1727135, -967169, -411858, -804878, -1000036, -482360, -379512, -531030, -471600, -101036, -698643, -354821, 433812, 419115, 611395, 266328, -683037, -842543, -128821, -185130, -131009, 330876, 780994, 123134, -208968, 156649]
43930A56649K77998p45974L66335k10087k7969K07896k33048N24094J96136j66667
43920C45363K8636J7964o7460l97259L18244J79410p30973k70146K3532j85542
43910g38231K71031J337158L40735p84626o18791l38656K76936j15107K95786
43901g3765N53916J75387j24695n4785n19o8998L74394P5153r02152j92518M14135
43890A75553M09176n57397j38748J16432J02708k59374k03911L5804J69780K2416
43880a27561J50502R9190j32043P37974P32234j16567L59589j72170r7628m02984
43870A030536l63679m16757n80888M32530Q0506m3638K41570k386n17076K56903
43860A17621O70808l21567j23067K0982q8940j15345j74775N54177j42499P43920
$$ y = [156649, 434647, -311327, 55008, -155079, -183048, 24848, -208200, 315894, 512030, 345363, 373999, 391963, 324503, -72756, 245488, 424898, -306075, -576221, -552689, -738231, -467200, 869958, 1210693, 426067, -192724, -531380, -254444, -369551, -73765, 480151, 655538, 530843, 476058, 475539, 406541, 780935, 856088, -46064, -238582, 175553, 584729, 27332, -111416, 5016, 107724, -151650, -355561, -319757, -149977, -127561, 22941, 122131, -9912, 728062, 1460296, 1343729, 1703318, 1531148, 1433520, 1030536, 666857, 250100, -330788, 101742, 182248, 138610, 380180, 377794, -139282, 117621, 788429, 466862, 343795, 364777, 275837, 160492, -14283, 539894, 397395, 1141315]
43850A141315m60369L67246O54458m85227l84718j09979M76407j43086p02344
43841C53703L59017o3889p10797L51733n34760j28713J34207L87620N10798M41702
43831A100621k67214J1076k64039o82400K6877m81223K41417K48274J74192k75092
43821a67511L35624p0360L71837l96559L58139J12379n91710k63841O27980p146
43811C08832j067178P81381K68383n71797j96949N1171J193515j93456o4925q70
43801E08107L9394l67838m4109J17371N4613P1202p42903R37432O00793n30069
43791F43993j084040n28670J6866P61832O66900K12879k15784M02796j88751l55003
43781C33018m54915l77051K06073N06627J1314j14362n65401J19679K25926m2026
$$ y = [1141315, 680946, 1048192, 1702650, 1217423, 832705, 722726, 1199133, 1056047, 353703, 712720, 648831, -61966, 289767, -244993, -373706, -239499, 148121, 658919, 1100621, 833407, 844483, 580444, -101956, -75079, -556302, -314885, -66611, 107581, -167511, 168113, 97753, 469590, 73031, 431170, 543549, -48161, -312002, 315978, 308832, -758346, 23035, 291418, -280379, -477328, -426157, 767358, 573902, 508977, 508107, 547501, 179663, 135554, 252925, 307538, 378740, -364163, 573269, 1174062, 643993, -440047, -968717, -951851, -190019, 476881, 689760, 473976, 876772, 688021, 333018, -121897, -498948, -292875, 213752, 225066, 110704, -454697, -335018, -109092, -151118]
43771a51118J346213l70490j191888l9096p3142j94674j39J037798p2129k94334
43761b999L79545L224k70929m67805P51128M7757r0794M53725p6986o0969p68512
43750a03615m67024N8448k5237J29179n59277K94829R54072k78961N5251P39151
43740G96816p9448p78577l37611M68005J72861k04600K55120j47866r6182K62869
43730C11387L03400k00085o18403J7574R2400r3778k30924n16179R81313M43674
43720D90379j91828K16946L8522j34272o28140j4194L9382O2537O9691J75742
43710A24765j18454o75k7001j79100J20708M40536M54641r2304r8955K81277r68909
43699f3471J21409J66213o4078k70808L99251l78745k63448r47187P25149P26692
$$ y = [-151118, 1195095, 824605, -367283, -406379, -479521, -674195, -674334, 363464, 291335, -2999, 376546, 379770, 108841, -358964, 392164, 439921, 349127, 802852, 725866, 664897, -103615, -570639, -512191, -537428, -408249, -967526, -672697, 281375, 2414, 57665, 796816, 717368, -61209, -398820, 69185, 242046, 37446, 292566, 144700, 48518, 311387, 614787, 414702, -203701, -186127, -93727, -187505, -418429, -934608, 46705, 490379, 298551, 515497, 554019, 419747, -208393, -222587, -183205, -120668, -50977, 124765, 6311, 5636, -21365, -200465, -79757, 360779, 815420, 723116, 624161, 905438, -63471, 57938, 224151, 160073, -110735, 288516, -90229, -353677, -1300864, -575715, 150977]
43689A50977R7257N10002L6250j42605L68316k90022n08444l77129q8163k18733
43679d62294K28363M97971n87832n08802L06377N99281J04069p8287k80948P43125
43669E61023M13495r26648l01570K74678l04209J6073j81688Q9371K59841P1371
43659b8263L05412q1823O30097K03864p25888L58J24904k01751r6368o4723j08251
43648d2432j91018o30562m18631M11225O69063j40706K6017O4481M75128l3936
43638A88629m97577O85713K72290J82576j3986m66758M30533j51546r47776n26299
43628h44201k9013M44647L6400L85737J23722k17311p31686m93213J34317m34533
43618a625134M69434P00353k6999J05253N09312O40034k92170p05827n41264P56163
$$ y = [150977, 248234, 758236, 794486, 651881, 1020197, 730175, 221731, -155398, -243561, -462294, -233931, 264040, -323792, -832594, -526217, 73064, 177133, 98846, -182102, 561023, 974518, 47870, -253700, 20978, -283231, -267158, -448846, -359475, -99634, -28263, 277149, 195326, 825423, 1029287, 303399, 303757, 428661, 226910, 130542, 65819, -42432, -233450, -864012, -1282643, -871418, -202355, -343061, -317044, -252563, 222565, 188629, -308948, 376765, 649055, 831631, 817645, 350887, 781420, 629874, -317902, -844201, -873214, -428567, -392167, -6430, 117292, -100019, -831705, -1324918, -1190601, -1625134, -1155700, -455347, -482346, -377093, 132219, 772253, 480083, -225744, -767008, -10845]
43608a0845O08488J19163j190674p83138Q00524L37909k70170k48945m75020j90149
43598a302857K41737l5663O11690O41044N12135p63896L44160N13374o57729j05284
43588a289k21305p78764O98363R4781r08122l00116j24506O28347L89353j54622
43578f77880L66281K74072J33168l29019r24416K06963P65079o613J29540Q8111
43568B5286m17126M03250l26248O6414N36448K10054J66967o84449j59415M28645
43558B49826J4624n89903k8305o08996p73563m2468O98456K71824O73949p3370
43548b07926M63566l38682q6678k34278M01563J24962M97643L11123p73164K2140
43538A80269L34720j4365j24654j55562K54325j93515J32180K01564q6090j041586
$$ y = [-10845, 597643, 716806, -473868, -1257006, -456482, -118573, -388743, -637688, -1112708, -1302857, -1061120, -1096783, -485093, 155951, 668086, -95810, 248350, 761724, 103995, -1289, -222594, -1001358, -302995, -208214, -1116336, -1416452, -1540958, -912611, -523258, -677880, -311599, -37527, 95641, -233378, -1157794, -950831, -185752, -192365, -62825, 25286, -391840, 11410, -314838, -248424, 288024, 498078, 665045, -19404, -178819, 249826, 264450, -325453, -353758, -962754, -1736317, -1778785, -1080329, -808505, -134556, -207926, 255640, -83042, -169720, -403998, -2435, 122527, 620170, 931293, 158129, 180269, 514989, 500624, 375970, 220408, 474733, 281218, 413398, 614962, 528872, -512714]
43528e12714J80414N34048n62695p11357N84299o20893J00520j69R49837L30184
43518B71474m6443o62687k19150N53400j71704q0563k92294l4538N43773J21603
43508a7129O55021M35725n75031j071239Q23354K90338n69209j22055l99235j83279
43498g32739K73645M27128J34690K85915o15015K12306l08071P38574k48423L2333
43488B00343P96666k01526r13391N9104k3418j20247J10066M65383O96442P72813
43478A842235o45743n83873J25465L3317k00194j120717o85511K1537O70304O32896
43468H9716n06675m78186l22299N39864N8138k20445N6372L60393J14476J03269
43458b05377J64903N05241k11107l04659m96767j96764M61258L08017l18765m43175
$$ y = [-512714, -332300, 201748, -360947, -1072304, -488005, -1108898, -1008378, -1008547, -58710, 271474, 225031, -437656, -656806, -103406, -275110, -355673, -647967, -682505, -138732, -17129, 637892, 1073617, 498586, -572653, 250701, 541039, -28170, -150225, -549460, -732739, -459094, -31966, 102724, 388639, -226376, -14070, -322141, 416433, 168010, 200343, 997009, 795483, -117908, -58804, -82222, -202469, -92403, 372980, 1069422, 1842235, 1196492, 612619, 738084, 771401, 571207, -549510, -1235021, -1213484, -543180, 89716, -416959, -895145, -1217444, -677580, -619442, -839887, -783515, -423122, -308646, -205377, -40474, 464767, 253660, -50999, -547766, -744530, -283272, 24745, -294020, -737195]
43448g37195K09246L34697j78831m32463L93213N67282L46172p23868L76535k19755
43438f4967o25765l66735L69867L47016L65957n18798j04605L46109M47409J16775
43428C12263K08373j19442k9058N5521j23348K9923N63999R2053j85785k42253
43418E62246m08049M68901K81147j63254k84190L65673l90473K75259p0126J1761
43408F48895J72909L06140j71200m98572r04825k61601P24973L38681l34208O29488
43398F50680N76305l57892p97318K57872j54917k56451m60540L86597P74115J54825
43388G73276n78169k344l66925p13259q5093O33303P43378k79323m00446n18955
43378g94557L25903K92684L78101j12940P2300O7847j23929J54285m72588n92190
$$ y = [-737195, -527949, -193252, -372083, -804546, -411333, 155949, 502121, -221747, 154788, -64967, -690732, -1057467, -687600, -340584, 25373, -493425, -598030, -251921, 195488, 312263, 520636, 401194, 372136, 427657, 304309, 334232, 898231, 990284, 804499, 562246, 154197, 623098, 904245, 740991, 456801, 822474, 432001, 707260, 637134, 648895, 821804, 1127944, 956744, 458172, -446653, -708254, 16719, 355400, 21192, 650680, 1226985, 869093, 71775, 329647, 174730, -81721, -542261, -155664, 618451, 773276, 195107, 192763, -174162, -887421, -972514, -339211, 404167, 124844, -275602, -794557, -468654, -175970, 202131, 89191, 161491, 229338, 105409, 259694, -212894, -805084]
43368h05084J036580M13232l03497L72750m1760k37330M44027J35244q21214k59781
43358f6833K98671J10215q47572k45076P21884p6091k51162N24595J55349q41335
43348e17355k12446J096788P60289n31920n07750j05237O27059n6536r01704J09470
43338b39342Q14819L17261n66812l28205K4098L7715K63185K45298k98186P7481
43328C47312O81362N0028l31575j15993l17262j14473k04468M00753J35307l65665
43318A65326Q9689k42936n6328M76906j98772o14433k47430O84565L68742j45720
43308B79609L10307p2076L6975m39965n30155n7478K37417n4708k4528O30496
43298C15894k66742j21876O31919r4838L36839m69937N33417j28510n41258M93568
$$ y = [-805084, 231496, 644728, 341231, 713981, 672221, 434891, 878918, 1014162, 192948, -66833, 231838, 342053, -505519, -750595, -28711, -104802, -355964, 168631, 323980, -517355, -729801, 366987, 1127276, 595356, 87606, -17631, 609428, 552892, -348812, -239342, 575477, 892738, 325926, -2279, 21819, 59534, 322719, 568017, 269831, 347312, 1028674, 1078702, 747127, 631134, 313872, 199399, -5069, 395684, 530991, 165326, 255015, 12079, -44249, 432657, 233885, -380548, -627978, 56587, 425329, 279609, 589916, 517840, 554815, 114850, -415305, -472783, -235366, -290074, -314602, 315894, 49152, -72724, 559195, 464357, 801196, 331259, 864676, 736166, 194908, 688476]
43288F88476P79970K22558j656172o30216J97172j18767J195448m23278m04931
43279a49740K78686L86814l82164k0295M63215O11389j073094n82387L08834m03995
43269e62737K76927J61841l58650r3580J385443P38763n06278n48621K78957o00389
43259A71676p7229P2977M92547k8587m3422J42484k08657j70278K83695r4701
43249E40505l37968N36658m44929n78267R01828K57879n02691n14912N89561l59551
43239H8113l89930j23625O09186R0215P75442l62633m11030J08134J39471k76256
43229B47087l74564K06917N71924n86570l47219L26475P16246N2948l88221k15670
43219B09353j35855k50855J6178j71285l33271o2491K09960j30870L84150O9180
$$ y = [688476, 1468446, 1691004, 34832, -595384, -398212, -516979, 678469, 255191, -149740, 128946, 515760, 133596, 113301, 576516, 1187905, 114811, -467576, -158742, -562737, -285810, -123969, -482619, -576199, 809244, 1548007, 1041729, 493108, 772065, 171676, 94447, 167424, 659971, 631384, 587962, 730446, 521789, 351511, 635206, 540505, 202537, 739195, 294266, -284001, 617827, 875706, 373015, -141897, 447664, 88113, -301817, -425442, 183744, 273959, 1049401, 686768, 275738, 383872, 523343, 247087, -127477, 79440, 651364, 64794, -282425, 44050, 760296, 813244, 425023, 209353, 73498, -177357, -161179, -332464, -665735, -728226, -518266, -649136, -264986, -195806]
43209a95806n40707K77534P32498J79480q0014K90717k37100n78052m01802o25710
43199a178962P27632N48776j00794j07845m10606O85452J96221K98040l34934
43190C22980J61136r86642n92478R83920Q18118L09130l53292k00499q29984l20870
43180f88481p1062j21055p9240J78640M15667L47254j14507J26726P52929k0314
43170G26557o83684L52885l61660k15028N59807p06786J91925L52774N93711J03999
43160I14500K52222n08047L7191j041722q67983M78608O3114k58636N17286L02849
43150a10618J87422p07744n8782J21948K82600K50878K28379M16824n15964k36648
43140a41705q3692j80757J22799n966j47579j5898L97763R07984O07325n55332
$$ y = [-195806, -736513, -458979, 273519, 452999, 372985, 663702, 426602, -151450, -553252, -1178962, -451330, 97446, -3348, -111193, -521799, 163653, 359874, 657914, 322980, 484116, -502526, -1095004, -111084, 707034, 1016164, 662872, 462373, -367611, -688481, -759543, -880598, -959838, -781198, -365531, -18277, -132784, -6058, 746871, 726557, 42873, 395758, 34098, -180930, 378877, -327909, -135984, 216790, 810501, 914500, 1166722, 658675, 695866, -345856, -1213839, -735231, -672117, -930753, -413467, -110618, 76804, -630940, -689722, -567774, -285174, -34296, 194083, 610907, 94943, -141705, -225397, -406154, -283355, -289321, -436900, -452798, -55035, 852949, 1460274, 904942]
43130I04942p81568J39667N84426M4886j0431n37290J23667J02628k8242j52845
43120C89840k28385j48571J6968L89953J08211k13300O6565k94583R3582J6701
43110A96981j63380m02200J92236O88294K02730l40646l34228o08421N0861P13540
43100A95767K16257l7634m9395M41327L18112q16865p7090o10492J09664L18364
43090H015N13892m99963O9638K44723j11444L97920J24466l07400J05357l45050
43080B00154l62046n63799J74627J42134p6550K3063L64483l68975K25143Q50531
43070F08765m2425o36179J44961K03282p8602O85821o01049l21991K90339K47809
43060E00731o24018J39760J35992K90358K871o29981J69418k3032Q7431J41561
$$ y = [904942, 123374, 263041, 847467, 892353, 881922, 344632, 468299, 570927, 542685, 389840, 161455, 12884, 29852, 419805, 528016, 314716, 381281, 86698, 180280, 196981, 33601, -368599, -176363, 511931, 714661, 374015, 39787, -568634, -517773, 195767, 412024, 374390, 324995, 766322, 1084434, 267569, 190479, -420013, -310349, 8015, 521907, 21944, 91582, 336305, 224861, 622781, 747247, 439847, 545204, 200154, -161892, -725691, -551064, -408930, -485480, -462417, -97934, -466909, -241766, 608765, 566340, -69839, 75122, 278404, 199802, 885623, 284574, -37417, 252922, 500731, -123287, 16473, 152465, 442823, 445694, -184287, -14869, -37901, 49530, 191091]
43050A91091R88394J47070p51789m28498m57552m83736J50424K85866J43147j9419
43040b35002J17968j52714K93701L49888o55811O87345J97259l65156o23284j25546
43030e11352O02588J43123p37929j39690m83201N04063O61652m28007Q3745L0382
43020b74626l98618R9427L77633P27965L86481r8534l09934n9701p18618K31034
43010c7491J61163n7221N3221O36191j16713l06159M28988k37491K31116n01454
43000B54150M27368L47067r23699J57325p15790M04669m9250P8428O18184J66634
42990G65086J10423j154610q202O87254M65432l03242m02902l75337o5457M64199
42980A82644R6791K29379q41191N83429L60277P9117n46403K31622J89369J7110
$$ y = [191091, 1179485, 1326555, 574766, 146268, -311284, -795020, -644596, -358730, -215583, -235002, -117034, -269748, 23953, 373841, -281970, 405375, 602634, 237478, -385806, -511352, 91236, 234359, -503570, -643260, -1126461, -622398, 39254, -388753, -305008, -274626, -673244, -573817, -196184, 531781, 918262, 819728, 509794, 450093, -268525, -37491, 123672, 66451, 119672, 755863, 639150, 332991, 761979, 524488, 755604, 254150, 681518, 1028585, 104886, 262211, -453579, -48910, -98160, -19732, 598452, 765086, 875509, -279101, -287303, 399951, 865383, 562141, 159239, -216098, -281555, 182644, 279435, 508814, -332377, 251052, 611329, 690446, 144043, 375665, 565034, 582144]
42970E82144J23969P42370q0307m66892l95529L96752o70971p78698n26562J73043
42960i00681P81324J78123m03245j5981L60365K24491M4353k37875m19437R6288
42950b92275k33926l10117N892M39491j46621N15825O08010p88072J18491O45243
42940E61941J86055K53831j9696p68304l41700J31765M15692J42262n35088n0310
42930b3552M24594k7519l94018j0085L35248j37644j31115K61114N2308l17737
42920C1594l37626L36497n41853j09608P16607L20986k11822L65951l13745l15596
42910e8615P18831K02558m92238q97280m61345L85293P39764J91340o1868l23119
42900e6679K74606L53852m73873k25533J38056M91928M5453J04951K23733q48009
$$ y = [582144, 706113, 1448483, 1368176, 901284, 505755, 902507, 231536, -547162, -1073724, -900681, -119357, 58766, -344479, -360460, -95, 224396, 268749, 30874, -388563, -292275, -526201, -836318, -830426, -390935, -537556, -21731, 586279, -201793, -83302, 561941, 747996, 1001827, 982131, 213827, -127873, 3892, 419584, 561846, 26758, -23552, 401042, 373523, -20495, -30580, 304668, 167024, 35909, 297023, 349331, 31594, -306032, 30465, -511388, -620996, 95611, 416597, 204775, 570726, 256981, -58615, 660216, 862774, 370536, -526744, -988089, -602796, 136968, 328308, 266440, -56679, 217927, 571779, 97906, -127627, 10429, 502357, 547810, 652761, 876494, 28485]
42890B8485r2622j76077P75243K67418n05243L18687k12419q89778m75877K16807
42880g45376M37185J03646R65792N83264j009375j70308K82511j42662k17654
42871H7023J43211j01076p3789J00217K24300n90845m07332Q06015L16895n56822
42861e2203n98918L34810p9798n79423M19338J33098M1685l10000O6449J37824
42851d87138J45376P5361N72879n24038N4973r3452J98864Q40136K19602n72890
42841D29673P1785J72482j14795J99477k4781p01542j9856L24159l27857k92032
42831b83287k30823O75006J42111k16101R8135P66846o17805l44115J93298q9290
42821I3975m2343q33557l90916o7353K66126N94737K53120j10566o62129O39862
$$ y = [28485, -64137, -240214, 535029, 802447, 297204, 615891, 403472, -486306, -962183, -745376, -308191, -204545, 761247, 1344511, 335136, 164828, 447339, 304677, 87023, 230234, 129158, 55369, 155586, 379886, -210959, -618291, 187724, 504619, -52203, -651121, -316311, -396109, -975532, -556194, -423096, -381411, -691411, -624962, -487138, -341762, -266401, 306478, -217560, -162587, -256039, -57175, 782961, 1002563, 429673, 501458, 673940, 559145, 758622, 733841, 32299, 12443, 336602, 8745, -283287, -514110, 160896, 303007, 86906, 185041, 951887, 334082, -10033, 183265, 93975, 51632, -781925, -1172841, -1240194, -974068, -379331, -126211, -236777, -898906, -259044]
42811b59044N04569J32913q66652n01802j02098q3095L48176L53238K99067J19030
42801e5698O75476m30487N1569K98987J46661m92793K57707k10574j9278m8818
42791A72752J69268J90355o50596P07817o1698q29751l02709K49385O65533K25989
42781E36345j59932K58651l72438l37111O29767M23589K50294l28240q8811o48081
42771A64033l94303N79728q6872o61359k18837J274924J44703q39857o05474N62832
42761h0482k65973J82945K00322J48423p21748L80160l26733n13587O74455J41459
42751a80759L24116m79018k72052M24092L13823L01473p01916O38945O69524o83240
42741C54988q43028P57527l99597o98047j00441M65137L15810l14957K98362N53305
$$ y = [-259044, 245525, 378438, -488214, -990016, -1092114, -1175209, -827033, -473795, -174728, -55698, 619778, 189291, 240860, 539847, 686508, 193715, 451422, 240848, 221570, 172752, 342020, 532375, -118221, 589596, 527898, -301853, -604562, -355177, 310356, 536345, 376413, 635064, 262626, -74485, 555282, 978871, 1229165, 900925, 812114, 164033, -230270, 349458, 262586, -398773, -617610, 657314, 802017, -37840, -643314, -80482, -346455, -163510, 36812, 185235, -536513, -156353, -483086, -996673, -322218, -180759, 143357, -335661, -607713, -183621, 130202, 431675, -270241, 368704, 1038228, 354988, -488040, 269487, -130110, -828157, -928598, -463461, -147651, -462608, -164246, 389059]
42731C89059j92707l87391J92942m05202l72906K51613O05282j38238M44862o873
42721C80441o29407N0800Q08696N8805r8900l44223j5607Q3711p40186L05877
42711a39993N19017J94141o20627L15100m30811L86549O96625j69454l51323l27809
42701G1415l92444M08226K20104l12507m36258O49579j65505o03710o82708m2980
42691a286788J265271K76064l52132P70509L55410l45162p86707K9328j82876
42682b57083Q58250K49846j40948j55637M5286M23466j78417k23627M3242Q43461
42672A507839j086441n59010R80622l51874m93885l87139N46366p6035r4409j13967
42662a27933j212339K46931J449524K74156M15423J79433m80481K44564O2700
$$ y = [389059, 196352, -191039, 1903, -403299, -776205, -524592, 80690, -57548, 387314, 380441, -248966, -198166, 610530, 669335, 570435, 226212, 210605, 294316, -445870, -139993, 379024, 573165, -47462, 267638, -163173, 223376, 920001, 750547, 399224, 71415, -321029, 87197, 307301, -5206, -441464, 208115, 42610, -561100, -1243808, -1286788, -21517, 254547, -97585, 672924, 1028334, 683172, -103535, -74207, -257083, 601167, 851013, 710065, 554428, 599714, 1023180, 844763, 621136, 664378, 1507839, 421398, -137612, 843010, 491136, -2749, -389888, 156478, 80443, -13966, -127933, -1340272, -1093341, 356183, 630339, 1045762, 1225195, 744714, 989278, 1051978]
42653A051978m82715j008722K73213J94979m56787k50643L79575R25075k19741
42644D06212l18237m33837j98617l4374Q50079M19810n65409K13454J224145l92810
42634A170416k06137K2666o67108o2639o46650L73494K36664m23729J52595Q04540
42624G54112o15506n49993M92428n7960r8607m3264J89956j47416r3636N2319
42614a17567J67465Q6953l60846m1199P73003r37834n08949K67032k60618J80101
42604g52459L10098k94345m16972q55333J052072J278096N4585m84917M64371
42595C55196P2356k15954K09840L8991N16953P62178n99050l26241l94714o80324
42585b60769P4660K018J71234O59804J37255m12912M91249r51120J97456P09929
$$ y = [1051978, 569263, -439459, -166246, 28733, -428054, -678697, -299122, 625953, 406212, 87975, -345862, -544479, -578853, 271226, 691036, 125627, 339081, 1563226, 1170416, 964279, 986945, 319837, 257198, -389452, -15958, 220706, -203023, -50428, 754112, 138606, -411387, 81041, 23081, -75526, -118790, 71166, -76250, -169886, -117567, 49898, 136851, -223995, -265194, 507809, -430025, -938974, -671942, -932560, -752459, -442361, -736706, -1153678, -2009011, -956939, 321157, 375742, -109175, 355196, 427552, 211598, 421438, 460429, 977382, 1739560, 1140510, 814269, 419555, -260769, -186109, -184091, -12857, 646947, 784202, 371290, 862539, -88581, 108875, 818804]
42575H18804n86175q16181M4089M45736j34306M65500N6587o77539M47376J86903
42565B50794r280j86019q12262Q9745J16203m5456Q20871Q43021o50382n82750
42555a65515l16976o27247O8437K0813N98532Q09638P63502n23376J8826m0476
42545F06158l25982j98411j40660p2844N60900K69340j69361l29638O38790o93490
42535A44802j10167o56896k46352J326071J18260j58617m00188j3457L8480j26090
42525h4154j26333O55447O81505n59484q70788J88538M0229n02557Q05582j96715
42515C1270j61498j61994k6203L78623K65509m74227L29541N31707l07756J6646
42505D21618l17521K02988p87823l98008n88000M00713O65801L6391m93446q2156
$$ y = [818804, 232629, -583552, -539463, -93727, -228033, 237467, 294054, -383485, 63891, 250794, 241514, 55495, -756767, -667022, -550819, -596275, 224596, 1067617, 417235, -165515, -482491, -1109738, -1041301, -1020488, -421956, 387682, 1151184, 627808, 646634, 606158, 280176, 81765, -58895, -131739, 429161, 698501, 529140, 199502, 838292, 144802, 34635, -622261, -868613, 457458, 575718, 417101, 16913, 3456, 41936, -84154, -210487, 444960, 1126465, 566981, -303807, -115269, -75040, -577597, 227985, 31270, -130228, -292222, -318425, 60198, 325707, -148520, 181021, 712728, 404972, 421618, 104097, 307085, -480738, -878746, -1466746, -1066033, -400232, -363841, -857287, -939443]
42495i39443J093128R73405l87136K78839n88736l27140M13553l93789k47683
42486a25002K48397k02010r172Q60857k85779j75261K87090l51908l04017K53902
42476A97097k352Q1568j28569J4919L07911J1189N63328q19827k03425L285l20704
42465b95580N42038N7998r59165m42917Q32602J051j87989j27820j78754K77289
42455d81247N03987j52248K04553j97504n45872m16614k89819O39903j67089l30527
42445a232477O7548N91815M78465J34045M60790K35532p42794N64530M34006p00765
42435B90695l14776m725k1994J08284M49898N4420k205j39431j6674r40691L96890
42424a40309O33215N99175p35016j24479J99890o74537n7127k4738j9530o70804
$$ y = [-939443, 153685, 1127090, 739954, 1018793, 430057, 102917, 516470, 122681, -125002, 123395, -78615, -87787, 773070, 487291, 312030, 599120, 247212, -56805, 197097, 194745, 276313, 147744, 162663, 470574, 481763, 1045091, 225264, 21839, 25124, -295580, 246458, 304456, -654709, -1097626, -265024, -263973, -451962, -579782, -758536, -481247, 22740, -129508, 75045, -122459, -668331, -1084945, -1374764, -734861, -901950, -1232477, -1164929, -573114, -94649, 39396, 500186, 735718, -7076, 557454, 991460, 290695, -24081, -28806, -50800, 57484, 507382, 561802, 559597, 420166, 403492, -537199, -140309, 492906, 1092081, 357065, 232586, 432476, -242061, -299188, -323926, -343456, -1014260]
42414a014260M70134O74581L59317k48454J09959K20430l6812j05583j0000M7427
42404D66739k60835N29124o13704l31729R1960J228K22226k6169m84722P93287
42394C87405k24653L46092M6136n19951l18953N31081K6817o39476K67783N13107
42384D15388J45516K39512K13972l68251o05030l18763K91690J48985j51127m2869
42374c0977O3819P63432j78207m74365j30399M63778O21857o47356r50586j38240
42364f37244K06934L15934L40989q9480o8331j3171M10654j21105j24440l02036
42354h1296j59376R83444k80803K83827k51365q83542L10930N42502L58416k83728
42344E39009o74046l69812K12345l7060M06803L23598k59768k02369L68480J38214
$$ y = [-1014260, -544126, 130455, 489772, 241318, 351277, 571707, 534895, 429312, 419312, 466739, 205904, 735028, 121324, -210405, -118445, -117217, 105009, 78840, -405882, 387405, 162752, 508844, 554980, 35029, -283924, 247157, 273974, -365502, -97719, 415388, 560904, 800416, 1014388, 646137, 41107, -277656, 14034, 163019, 11892, -30977, 32842, 796274, 618067, 143702, 13303, 477081, 1098938, 451582, -499004, -637244, -430310, -114376, 226613, 137133, 68802, 55631, 466285, 345180, 220740, -81296, -240672, 742772, 461969, 745796, 494431, -389111, -78181, 464321, 822737, 539009, -135037, -504849, -292504, -329564, 77239, 400837, 141069, -61300, 307180, 445394]
42334D45394j097809j79595K739M89885R8967j71511M41705m38233O6856O63224
42324C21622j38355L98855j15063q2497j25771n49453N0976k62528O51861O23269
42314G72916q67741j62624K3536P83769O31499r7486L75402N47382n65167n33738
42304I07748k93974l19440n28733l05955K83214q1183p5298Q1670P99020O19144
42294A086213m38244l70483m73812r5069k47449O7823k57493k3070J23288Q8885
42284e39411J4240K68380J92025l70056L78952K28896l33959M06565k62698n52424
42274e69490L75421M80474p67059L79176L74447j56361k29240L05226k49608L57437
42264C00423K23782j35544J0500l40903n8819Q09876N54048K83775p02193m09486
$$ y = [445394, -652415, -832010, -829271, -339386, -240419, -411930, 29775, -408458, -341602, 321622, 183267, 582122, 467059, 384562, 258791, -290662, -239686, -502214, 149647, 772916, -94825, -257449, -233913, 549856, 1181355, 1083869, 1459271, 2006653, 1441486, 907748, 613774, 294334, -234399, -540354, -257140, -338323, -413621, -331951, 467069, 1086213, 647969, 277486, -196326, -291395, -538844, -471021, -728514, -751584, -628296, -539411, -525171, -256791, -64766, -434822, -55870, 173026, -160933, 245632, -17066, -569490, -194069, 286405, -480654, -101478, 272969, 116608, -112632, 192594, -57014, 300423, 524205, 388661, 399161, 58258, -561, 809315, 1363363, 1647138, 944945, 535459]
42254E35459L95232m4533k96067k86817J56987m03731j91407M5211L78323k44359
42244D4298l22901J96001j15561K14186K5311K30728J97780k69074K7219L18744
42234E46731N3146q86514o79064N63773L35849L92473L07111j82060L07746L91912
42224A151103n68947k52355O88470m08893J6197L5050p91987J07396L59206k26500
42214A08740L20993l92967j68936J60248j35864P0545j20213N1410l69720L93350
42204h2414R04253m97953K37267K30117Q66117p09092p14245k4684j52124m42662
42194c85420p88615n5799J117043m0099j44265n91947J84895J0448K28357m95782
42184i61184k56421L71091M27830n86729n36101N96414n69982L40332R67710q7686
$$ y = [535459, 930691, 886158, 590091, 303274, 460261, 56530, -134877, -89666, 288657, 44298, -278603, -82602, -198163, 16023, 41334, 272062, 469842, 200768, 227987, 546731, 599877, -286637, -965701, -401928, -66079, 326394, 633505, 451445, 759191, 1151103, 582156, 329801, 1018271, 609378, 625575, 660625, -131362, -23966, 335240, 108740, 429733, 36766, -132170, 28078, -107786, -37241, -157454, -106044, -475764, -82414, 821839, 323886, 561153, 791270, 1657387, 948295, 234050, 209366, 57242, -385420, -1174035, -1229834, -112791, -152890, -297155, -889102, -704207, -693759, -465402, -961184, -1217605, -846514, -418684, -1005413, -1541514, -945100, -1515082, -1174750, -207040, -294726]
42174b94726r29453n54323J287233L27265q826N62967j04411o90252j95648l63338
42164i63512r1563K43932L96211M87880K94963K12597m17588J12358L02759o89721
42154a11684K86316P10496n33465m1786l21593l71332j9421L5294P8283l58744
42144f47636q5771J97235K81364M08079l28107q20515L52688K87538R57244o08915
42134f796k76984P23555j89495m55322o541Q8883l54151L11249k08182j56374
42124e30158j62134P63901M68075K73377p35482l56036L08145M36010R8333K64387
42114H28418J4514q59804n81949k81433M64013O20849J15227j28466J07500n82931
42104b84062N09165k3383M1699L22574R0778q01906N09282r2126m35940k53677
$$ y = [-294726, -1224179, -1778502, -491269, -164004, -172830, 390137, 285726, -404526, -600174, -963512, -1055075, -811143, -414932, 72948, 367911, 580508, 162920, 275278, 578037, -111684, 174632, 885128, 351663, 309877, -11716, -383048, -402469, -367175, -288892, -647636, -733407, -536172, -254808, 153271, -174836, -995351, -642663, -355125, 602119, -6796, -283780, 439775, 250280, -205042, -211583, -122700, -476851, -165602, -373784, -530158, -692292, 71609, 539684, 813061, 77579, -278457, 29688, 465698, 564031, 828418, 842932, -16872, -598821, -880254, -416241, 204608, 319835, 191369, 298869, -284062, 225103, 201720, 243419, 565993, 656771, -145135, 364147, 272021, -163919, -417596]
42094d17596O40864O43861K5627n61181L54957K57141q62897l43733K17659N96623
42084E51325o77092l70468M82332j63663J72958R07700m85807j9005M43311K11741
42074A053332m3954p9175k45874J93797r92326K73373m7151l23419J69112o7806
42064a10091l12017K14093P46498m51916j09533N24276m41399k01355N41222j31535
42054B68243O5164O32899N35173o61519r48029j55675J88804K33559k785L5248
42044A91082j36448K7620l70303K15657N89136L05770N03314j1289q94059J7137
42034D37617L68308O8834m23881m87674o64205K88609R7274Q88575j10671K18071
42024F80857n70580j70617j86897K59223J45649l9359o8129J73177J56758o99179
$$ y = [-417596, 223268, 867129, 892756, 331575, 686532, 943673, 80776, -262957, -45298, 551325, -125767, -496235, -13903, -177566, -4608, 903092, 417285, 398280, 841591, 1053332, 1009378, 930203, 684329, 878126, -114200, 159173, 112022, -211397, -42285, -110091, -422108, -208015, 538483, 86567, -22966, 501310, 59911, -141444, 399778, 268243, 333407, 966306, 1501479, 839960, -108069, -263744, -74940, 158619, 155834, 191082, 54634, 82254, -288049, -72392, 516744, 822514, 1325828, 1314539, 420480, 437617, 805925, 874759, 450878, -36796, -701001, -412392, -315118, 573457, 462786, 680857, 110277, -60340, -247237, 11986, 157635, 118276, 50147, 223324, 380082, -319097]
42014c19097k22699P15847q4320n45984m80250P05827J77701N17457o5090n94609
42004a95217M48636j69040o74597M47369J7566L45282K22487r72453j174881M9455
41994a655393K79984P35970R53244k2649k73667o23013J72600O3852J08792N46492
41984B86212M16268p27818n81134Q10812k76825j85163N05663R1154n08078o68894
41974h37803P460L50547N09697k06519k36163N57764Q0112m1317k17750j861l79538
41963d15371j89137J94838k56797L8283K9084J40536m79475K63419N79518L86415
41953B91313N73780J8544k00710L86639o68325n63100o9870Q0617p51594l16792
41943a219498r780N09661Q08327k00415o0349J99526m03732O8106J65475k91223
$$ y = [-319097, -541796, 174051, 89731, -456253, -936503, -230676, -52975, 464482, 399392, -195217, 253419, 84379, -590218, -142849, -125283, 219999, 442486, -529967, -1704848, -1655393, -1375409, -639439, 313805, 291156, 17489, -605524, -432924, -369072, -260280, 286212, 702480, -25338, -606472, 204340, -72485, -257648, 248015, 339169, -168909, -837803, -830343, -479796, 29901, -176618, -412781, 144983, 225095, 183778, -33972, -35833, -415371, -604508, -409670, -666467, -628184, -599100, -458564, -938039, -674620, -95102, 291313, 865093, 883637, 682927, 1069566, 401241, -161859, -231729, -151112, -902706, -1219498, -1229278, -719617, 88710, -111705, -172054, 27472, -376260, -308154, -142679, -433902]
41933d33902o0821j42003L76823m89539L77098K61945O6905J84792L81867l62988
41923A60177l72234J01502j27608L13209O2769l89223k60042o854M11711J09015
41913B422j28234M86861k13323j00040P68659L73722L8991k52987o33535K06066
41903E48602n47007P790l21780O8311P42578O27209q5285p69518n79092o82227
41893i90419P35501j04393M28660J019748M65979q33861q17774q60946o755O43678
41883c20582O56498j12971j30780k58177Q43878L00725o03282J5625J21702O01329
41873A113965m1307o55204q21245J01797M77658K51224o31559L77802J343241
41864A516372q12451j38674M09310l83791Q3593q57468M12107L08634k08420j96871
$$ y = [-433902, -494723, -636726, -259903, -749442, -372344, -110399, -43494, 141298, 523165, 160177, -212057, -110555, -238163, 75046, 137815, -251408, -511450, -518304, -106593, 2422, -125812, 361049, 147726, 47686, 816345, 1190067, 1229058, 976071, 342536, 548602, 1595, 9385, -312395, -244084, 498494, 1125703, 1040418, 270900, -308192, -990419, -254918, -359311, 69349, 1089097, 1555076, 721215, -96559, -957505, -964260, -320582, 335916, 222945, 92165, -166012, 677866, 978591, 375309, 390934, 512636, 1113965, 1072658, 417454, -403791, -301994, 175664, 426888, -204671, 173131, 1516372, 703921, 565247, 974557, 590766, 674359, -183109, 228998, 537632, 329212, 132341]
41854A32341q11953l59050N57831M5938l2979N69603K16103N6417L93827o55146
41844A12932N75732M05130m32741j25121k46528j49058M05389L90907j65824q68754
41834i7936p24493m90489j37567J453245K09061l8939L83786J00624k98692n96965
41824b38365J26586K06837m51095k83754J03488N33301L23299j80475j53863N74422
41814E60381m29870j29537K21614k56315k5895L05644N25499j28753j96636K1678
41804D67810l47113l42242L09747m38593M65573K2040q13613j81982J106449O47387
41794H95463J80997K3889l56339p86656L12005l52077r6440K02065k98940q8855
41784c64888M80964L09679k76964Q7104K60771l21035j43083k48711m85805N53335
$$ y = [132341, -679612, -1038662, -480831, -434893, -467872, 101731, 317834, 374251, 768078, 112932, 688664, 1093794, 661053, 535932, 289404, 140346, 545735, 936642, 770818, -97936, -822429, -1312918, -1450485, 2760, 211821, 172882, 556668, 657292, 358600, -238365, -111779, 95058, -356037, -639791, -536303, -3002, 320297, 139822, -14041, 560381, 130511, 974, 222588, -33727, -59622, 246022, 771521, 642768, 446132, 467810, 120697, -221545, 88202, -350391, 115182, 137222, -676391, -858373, 248076, 895463, 1076460, 1100349, 744010, -42646, 269359, -82718, -179158, 22907, -276033, -364888, 116076, 425755, 148791, 235895, 496666, 175631, 32548, -216163, -701968, -148633]
41774a48633J31729k6656O99835J19178k23875p87736J0676L2606M93006J7560
$$ y = [-148633, -16904, -43560, 656275, 775453, 551578, -236158, -225482, -192876, 300130, 317690]
$$ [...]
##END NTUPLES=NMR SPECTRUM
##END=
