##TITLE=19F_TG-2238
 CDCl3. 24 sc
 13.3.2019
##JCAMPDX= 6.0         $$ Bruker NMR JCAMP-DX V2.0
##DATA TYPE= NMR SPECTRUM
##DATA CLASS= NTUPLES
##ORIGIN= UXNMR, Bruker Analytische Messtechnik GmbH
##OWNER= root
$$ XWIN-NMR		Version 3.5
$$ Wed Mar 13 14:29:41 2019 Russian Standard Time (UT+4h)  she@DPX200
##.OBSERVE FREQUENCY= 188.290927
##.OBSERVE NUCLEUS= ^19F
##.ACQUISITION MODE= SIMULTANEOUS
##.ACQUISITION SCHEME= undefined
##.AVERAGES= 24
##.DIGITISER RES= 16
##SPECTROMETER/DATA SYSTEM= spect
##.PULSE SEQUENCE= zg
##.SOLVENT NAME= DMSO
##.SHIFT REFERENCE= (INTERNAL, DMSO, 0, 98.3737)
##AUDIT TRAIL= $$ (NUMBER, WHEN, WHO, WHERE, WHAT)
$$ ##TITLE= Audit trail, XWIN-NMR		Version 3.5
$$ ##JCAMPDX= 5.01
$$ ##ORIGIN= Bruker BioSpin GmbH
$$ ##OWNER= she
$$ F:/spectra/data/she/nmr/f19/1/pdata/1/auditp.txt
$$ ##AUDIT TRAIL=  $$ (NUMBER, WHEN, WHO, WHERE, WHAT)
(   1,<2019-03-13 14:28:26.07 +0400>,<she>,<DPX200>,
      <created by zg, POWCHK disabled, PULCHK disabled
       configuration hash MD5:
       00 E9 B6 7A A2 85 ED C7 34 08 36 98 17 FE 4E 26
       data hash MD5: 64K
       F3 C4 E5 48 86 8F 21 EF F7 25 F1 9A 15 B0 D4 32>)
(   2,<2019-03-13 14:28:30.06 +0400>,<she>,<DPX200>,
      <Start of raw data processing
       efp BC_mod = 2 LB = 1 FT_mod = 6 PKNL = 1 PHC0 = 1485.235 PHC1 = 35.15593 SI = 64K 
       data hash MD5: 64K
       C0 6C 6B 2D C3 10 ED 7C BE C9 5C 85 28 6B FA 90>)
(   3,<2019-03-13 14:28:49.92 +0400>,<she>,<DPX200>,
      <pk PHC0 = 0.5601828 PHC1 = -6.399999 
       data hash MD5: 64K
       2D C0 A3 6B 23 23 91 B4 7D F6 E9 3B 37 C0 70 9A>)
(   4,<2019-03-13 14:28:53.35 +0400>,<she>,<DPX200>,
      <abs ABSG = 5 
       data hash MD5: 64K
       31 D9 AC 8F EA 2C AA 04 FB 99 A3 21 FD A3 0D CE>)
$$ ##END=
$$ 
$$ hash MD5
$$ F2 CC 61 12 D4 73 05 5C 1B D7 A0 8C 91 AB 73 58
##$RELAX= 
##$RELAX= 
##$RELAX= 
##$RELAX= 
##$RELAX= 
##$RELAX= 
##$RELAX= 
##$RELAX= 
$$ Bruker specific parameters
$$ --------------------------
##$DU= <F:/spectra>
##$EXPNO= 1
##$NAME= <f19>
##$PROCNO= 1
##$TYPE= <nmr>
##$USER= <she>
##$AMP= (0..31)
100 100 100 100 100 100 100 100 100 100 100 100 100 100 100 100 100 100 
100 100 100 100 100 100 100 100 100 100 100 100 100 100 
##$AQSEQ= 0
##$AQ_mod= 1
##$AUNM= <au_zg>
##$AUTOPOS= <>
##$BF1= 188.310428
##$BF2= 200.13
##$BF3= 200.13
##$BF4= 200.13
##$BF5= 200.13
##$BF6= 200.13
##$BF7= 200.13
##$BF8= 200.13
##$BYTORDA= 1
##$CFDGTYP= 0
##$CFRGTYP= 5
##$CHEMSTR= <none>
##$CNST= (0..31)
1 1 145 1 1 1 1 1 1 1 1 1 1 1 1 1 1 1 1 1 1 1 1 1 1 1 1 1 1 1 1 1 
##$CPDPRG= <>
##$CPDPRG1= <>
##$CPDPRG2= <>
##$CPDPRG3= <>
##$CPDPRG4= <mlev>
##$CPDPRG5= <mlev>
##$CPDPRG6= <mlev>
##$CPDPRG7= <mlev>
##$CPDPRG8= <mlev>
##$CPDPRGB= <>
##$CPDPRGT= <>
##$D= (0..31)
0 1.3 0 0 0 0 0 0 0 0 0 0 0.25 0 0 0 0 0 0 0 0 0 0 0 0 0 0 0 0 0 0 0 
##$DATE= 1552472905
##$DBL= (0..7)
120 120 120 11 120 120 24 19 
##$DBP= (0..7)
150 150 150 150 150 150 150 150 
##$DBP07= 0
##$DBPNAM0= <>
##$DBPNAM1= <>
##$DBPNAM2= <>
##$DBPNAM3= <>
$$ [...]
##$SUBNAM3= <"">
##$SUBNAM4= <"">
##$SUBNAM5= <"">
##$SUBNAM6= <"">
##$SUBNAM7= <"">
##$SUBNAM8= <"">
##$SUBNAM9= <"">
##$SW= 251.107818259711
##$SWIBOX= (0..15)
0 1 0 0 0 0 0 0 0 0 0 0 0 0 0 0 
##$SW_h= 47281.3238770686
##$TD= 65536
##$TD0= 1
##$TE= 0
##$TE2= 300
##$TE3= 300
##$TEG= 300
##$TL= (0..7)
0 120 53 12 22 120 120 120 
##$TP= (0..7)
150 150 150 150 150 150 150 150 
##$TP07= 0
##$TPNAME0= <>
##$TPNAME1= <>
##$TPNAME2= <>
##$TPNAME3= <>
##$TPNAME4= <>
##$TPNAME5= <>
##$TPNAME6= <>
##$TPNAME7= <>
##$TPOAL= (0..7)
0.5 0.5 0.5 0.5 0.5 0.5 0.5 0.5 
##$TPOFFS= (0..7)
0 0 0 0 0 0 0 0 
##$TUNHIN= 0
##$TUNHOUT= 0
##$TUNXOUT= 0
##$USERA1= <user>
##$USERA2= <user>
##$USERA3= <user>
##$USERA4= <user>
##$USERA5= <user>
##$V9= 5
##$VALIST= <valist>
##$VCLIST= <CCCCCCCCCCCCCCC>
##$VD= 0
##$VDLIST= <DDDDDDDDDDDDDDD>
##$VPLIST= <PPPPPPPPPPPPPPP>
##$VTLIST= <TTTTTTTTTTTTTTT>
##$WBST= 1024
##$WBSW= 4
##$XGAIN= (0..3)
0 0 0 0 
##$XL= 0
##$YL= 0
##$YMAX_a= 50881
##$YMIN_a= -32203
##$ZGOPTNS= <>
##$ZL1= 120
##$ZL2= 120
##$ZL3= 120
##$ZL4= 120
##$ABSF1= 98.37372
##$ABSF2= -152.7273
##$ABSG= 5
##$ABSL= 3
##$ALPHA= 0
##$AQORDER= 0
##$ASSFAC= 0
##$ASSFACI= 0
##$ASSFACX= 0
##$ASSWID= 0
##$AUNMP= <proc_1d>
##$AZFE= 0.1
##$AZFW= 5
##$BCFW= 0
##$BC_mod= 2
##$BYTORDP= 0
##$COROFFS= 0
##$CY= -3
##$DATMOD= 1
##$DC= 0
##$DFILT= <>
##$DTYPP= 0
##$F1P= 0
##$F2P= 0
##$FCOR= 0.5
##$FTSIZE= 65536
##$FT_mod= 6
##$GAMMA= 0
##$GB= 0
##$INTBC= 1
##$INTSCL= 8.653935e-10
##$ISEN= 128
##$LB= 1
##$LEV0= 0
##$LPBIN= 0
##$MAXI= 10000
##$MC2= 0
##$MEAN= 0
##$ME_mod= 0
##$MI= 0.4277144
##$NCOEF= 0
##$NC_proc= -4
##$NLEV= 6
##$NOISF1= -61.99997
##$NOISF2= -62.99997
##$NSP= 0
##$NTH_PI= 0
##$NZP= 0
##$OFFSET= 98.37372
##$PC= 1
##$PHC0= 1485.795
##$PHC1= 28.75593
##$PH_mod= 1
##$PKNL= yes
##$PPARMOD= 0
##$PSCAL= 0
##$PSIGN= 0
##$REVERSE= no
##$SF= 188.296044280273
##$SI= 65536
##$SIGF1= -61
##$SIGF2= -65
##$SINO= 3.502647
##$SIOLD= 65536
##$SREGLST= <1H.CDCl3>
##$SSB= 0
##$STSI= 65536
##$STSR= 0
##$SW_p= 47281.3238770685
##$SYMM= 0
##$S_DEV= 0
##$TDeff= 65536
##$TDoff= 0
##$TI= <>
##$TILT= no
##$TM1= 0
##$TM2= 0
##$TOPLEV= 0
##$USERP1= <user>
##$USERP2= <user>
##$USERP3= <user>
##$USERP4= <user>
##$USERP5= <user>
##$WDW= 1
##$XDIM= 65536
##$YMAX_p= 315857130
##$YMIN_p= -2381615
$$ End of Bruker specific parameters
$$ ---------------------------------
##NTUPLES= NMR SPECTRUM
##VAR_NAME=  FREQUENCY,     SPECTRUM/REAL,   SPECTRUM/IMAG
##SYMBOL=    X,             R,               I
##VAR_TYPE=  INDEPENDENT,   DEPENDENT,       DEPENDENT
##VAR_FORM=  AFFN,          ASDF,            ASDF
##VAR_DIM=   65536,         65536,           65536
##UNITS=     HZ,            ARBITRARY UNITS, ARBITRARY UNITS
##FACTOR=    0.721466756344984, 1,           1
##FIRST=     18523.3820098237, 0,            0
##LAST=      -28757.9418672448, 0,           0
##MIN=       -28757.9418672448, -2381615,    0
##MAX=       18523.3820098237, 315857130,    0
$$ Real data points
##PAGE= N=1
##DATA TABLE= (X++(R..R)), XYDATA
$$ [...]
47568a72225l44475m9870K57181P5509L49002J42186l99347J74366m7690j62130
$$ -172225 -516700 -566570 -309389 -233880 115122 257308 -142039 32327 -15363 -177493
47558a77493k55898O0318N06351j3950P1002k40165J1231J37331O4776l21236
$$ -177493 -433391 -373073 133278 119328 190330 -49835 -38604 98727 163503 -157733
47548a57733M3845l08423P0809Q234J73872k75826K65330J31533j54872q6385
$$ -157733 -113888 -422311 -351502 -343268 -169396 -445222 -179892 -48359 -203231 -289616
47538b89616K34572j0332N1483J67585j46237k5046l5563J83174j0647J21538
$$ -289616 -55044 -65376 -13893 153692 7455 -17591 -53154 130020 119373 240911
47528B40911Q0457n06797m18897k07351P54465L97184n19478l00339L42002o5480
$$ 240911 321368 -185429 -604326 -811677 -57212 339972 -179506 -479845 -137843 -203323
47518b03323j28664j0307K64862L07389K45150k95191q8432J42188J91283K27379
$$ -203323 -331987 -342294 -77432 229957 475107 179916 91484 233672 424955 652334
47508F52334k67144j61736Q3821M51591j04301q6225k38327P2965L0786j09413
$$ 652334 385190 223454 307275 758866 654565 568340 330013 402978 433764 324351
47498C24351j09300J24237k56049l56505J72750K74269p4149M4433J93476j0813
$$ 324351 215051 339288 83239 -273266 -100516 173753 99604 144037 337513 326700
47488C26700o5099k46019j13842J34427j86376k27328L86200J69550J81599j11326
$$ 326700 261601 15582 -98260 36167 -150209 -377537 8663 178213 359812 248486
47478B48486K73932k9791l19097k55093j75185q9386J153k79546K52692N48549
$$ 248486 522418 492627 173530 -81563 -256748 -346134 -344981 -624527 -371835 176714
47468A76714j72646N758m3816K00147j6109j71866j83361L88473k73855K9866
$$ 176714 4068 9826 -33990 166157 150048 -21818 -205179 183294 -90561 -60695
47458f0695J95538j88811n9160j17045J235K66327M83539m7717j36943l72310
$$ -60695 134843 -53968 -113128 -230173 -228938 37389 520928 473211 336268 -36042
47448c6042l04647n6480L15327K91430q7895m37610m8047K13329R1369o3203N9770
$$ -36042 -340689 -397169 -81842 209588 121693 -315917 -363964 -150635 -59266 -122469 -62699
47437f2699j34566p2272O2133L01826l318l79640k0526R4196J13583j43871j96177
$$ -62699 -197265 -269537 -207404 94422 91104 -288536 -309062 -214866 -101283 -245154 -441331
47426d41331j51257p80M39452L73084j73374m00071J51262L30373K45034J59604
$$ -441331 -592588 -593368 -153916 219168 45794 -354277 -203015 127358 372392 531996
47416E31996O3072j61885k042k31696j92720j86707K82885k0275m6978p6767p9625
$$ 531996 595068 433183 431141 199445 6725 -179982 102903 82628 35650 -41117 -120742
47405a20742K07153r0436p6719O0802l34473j07290R9961J88442M7700j01450
$$ -120742 86411 -4025 -80744 -19942 -354415 -461705 -361744 -173302 -125602 -227052
47395b27052N25182l15317l55620j8566k12948L05300K76960j16065K03136N6967
$$ -227052 298130 -17187 -372807 -391373 -604321 -299021 -22061 -138126 65010 121977
47385A21977J8215m69496j66593K53360K48074n5160k72640K76194J29103k37860
$$ 121977 140192 -329304 -495897 -242537 5537 -49623 -322263 -46069 83034 -154826
47375a54826K21580K60870l86857j59784J04914L0848J06403J54311J34788J24745
$$ -154826 66754 327624 -59233 -219017 -114103 -83255 23148 177459 312247 436992
47365D36992l87218j41756J57278j88103j27612J29502j02447J5251J69009K84167
$$ 436992 49774 -91982 65296 -122807 -250419 -120917 -223364 -208113 -39104 245063
47355B45063L25634l54023l2304K18977k61789j07139J26624L31007j49234k91359
$$ 245063 570697 216674 184370 403347 141558 34419 161043 492050 342816 51457
47345E1457j37367m6655K00494m1152K2835j95963J74488J39197k98107r6159
$$ 51457 -85910 -132565 67929 26777 49612 -146351 28137 167334 -130773 -226932
47335b26932L46975K40114l10383J91497K5093r6027L7070L07430m9259j45179
$$ -226932 120043 360157 49774 241271 266364 170337 207407 514837 465578 320399
47325C20399j92852l3622j61415q952k12312l8736K24187O8830M76654q7952n18680
$$ 320399 127547 93925 -67490 -76442 -288754 -327490 -103303 -34473 442181 354229 -164451
47314a64451J83507M2039m13644J80712k3977L30725N198k39777j72304j48364
$$ -164451 19056 61095 -352549 -171837 -195814 134911 140109 -99668 -271972 -420336
47304d20336M95168K87922L3270q2731k49757K43890j9309J29457K03546l06275
$$ -420336 74832 362754 396024 313293 63536 307426 288117 417574 621120 314845
47294C14845m59484N3207K73873l5991L8703q0843O2546P4830j09679l23182L33126
$$ 314845 -144639 -91432 182441 146450 185153 104310 166856 241686 132007 -191175 141951
47283A41951K69019J18474l692k43110l27731J69316k06776k37060M7089K44345
$$ 141951 410970 529444 525752 282642 -45089 124227 -82549 -319609 -272520 -28175
47273b8175J4391k09422j51546M30221j79860J43605J90832J77498J04291k88543
$$ -28175 -13784 -223206 -374752 55469 -124391 19214 210046 387544 491835 203292
47263B03292k66364r4879K21512r1563J4517m5201r5025k31976k8561R1101L07858
$$ 203292 -63072 -157951 63561 -28002 -13485 -58686 -153711 -385687 -414248 -323147 -15289
47252a5289J98105j10790p4085j17971Q9287k34192M7251Q7865l2396k8352j82018
$$ -15289 182816 72026 -2059 -120030 -30743 -264935 -217684 -129819 -162215 -190567 -372585
47241c72585R1320N3125L92944M22884n45207r4568K33526j187k30271j828L16267
$$ -372585 -281265 -228140 164804 587688 42481 -52087 181439 180252 -50019 -51847 264420
47230B64420K33604k42626l66631L1407o1422J91809q5264Q3879j08111P7097
$$ 264420 498024 255398 -111233 -79826 -141248 50561 -34703 49176 -58935 18162
47220A8162O25968j00339k42388k8347O9993m78874o5178M35504o6589L2795k35463
$$ 18162 644130 543791 301403 273056 343049 -135825 -201003 234501 167912 200707 -34756
47209c4756k70561l44002K42677L66934L09061J52845l03189L7833K42580m21546
$$ -34756 -305317 -649319 -406642 -39708 269353 422198 119009 156842 399422 -22124
47199b2124m5364J84503J30704K61353k28498j42877k42985K66184K24420k14875
$$ -22124 -67488 117015 247719 509072 280574 137697 -105288 160896 385316 170441
47189A70441j13723p8856j07452M20852L65032n06913m14227L07434r9664l83990
$$ 170441 56718 -22138 -129590 291262 656294 149381 -264846 42588 -57076 -441066
47179d41066K19857M08561m67433P679M60784L0741K13088l0701n17015Q7168
$$ -441066 -221209 187352 -280081 -272402 188382 219123 432211 401510 -115505 -28337
47169b8337J74994k88755j77165J00707K53801o2853j30931j2524o2085j0998
$$ -28337 146657 -142098 -319263 -218556 35245 -27608 -158539 -171063 -233148 -244146
47159b44146K07842R9199L61704L47345l98076N2287L47946j10750m83978r1994
$$ -244146 -36304 62895 424599 771944 373868 426155 774101 663351 179373 87379
47149H7379j63612K78177k85425k23426j74187R6170J22511j45532L77942O6579
$$ 87379 -76233 201944 -83481 -306907 -481094 -384924 -262413 -407945 -30003 36576
47139C6576n83451K26368L15022m1747k30771J50582L39916l02505K03662L40641
$$ 36576 -546875 -320507 -5485 -47232 -278003 -127421 212495 -90010 113652 454293
47129D54293L11220k29754k88157k86208l32840J9156K52549J08154L3128j81731
$$ 454293 765513 535759 247602 -38606 -371446 -352290 -99741 8413 41541 -140190
47119a40190R2613J62518M75322p4434j77646J23383k28395O1234K0501J16451
$$ -140190 -47577 114941 590263 515829 338183 461566 233171 294405 314906 431357
47109D31357K1624j03856J10845k00268L1866q1551j52569J6453O3377l81954
$$ 431357 452981 349125 459970 259702 291568 210017 57448 73901 137278 -244676
47099b44676j51871O27433K19097j47898k86456l2837r8401L49566O3011L79182
$$ -244676 -396547 230886 449983 302085 15629 -17208 -115609 233957 296968 676150
47089F76150j57599n73327L07447L03728j36406k63507l24611K49072K19977J34107
$$ 676150 518551 -54776 252671 556399 419993 156486 -168125 80947 300924 435031
47079D35031N4843n61874Q9359K85125L77814m88210m29101r8867j02772J04178
$$ 435031 489874 -72000 17359 302484 680298 192088 -237013 -335880 -438652 -334474
47069c34474K74838N0236K09693J02291k04362q1473L21943l38561K17365M10137
$$ -334474 -59636 -9400 200293 302584 98222 16749 338692 131 217496 627633
47059F27633j38718l32666k93340l28464K04687K44873R4899L77085K88475j40387
$$ 627633 488915 156249 -137091 -465555 -260868 -15995 78904 455989 744464 604077
47049F04077m48658J43603N90067j86587k99194m77323P4471L12393R0893j37253
$$ 604077 155419 299022 889089 702502 403308 -74015 456 312849 403742 266489
47039B66489m7217k16227k8960O2511N7218m2295K95655r4886j46929O1026l5991
$$ 266489 219272 3045 -25915 36596 93814 51519 347174 252288 105359 166385 130394
47028A30394J74867k76822l82735m7112q5513p6901K45494M27541p9470J86422
$$ 130394 305261 28439 -354296 -401408 -486921 -563822 -318328 109213 29743 216165
47018B16165n63724n00146J36684P2816K29208J93590L07489J57763L4231j59372
$$ 216165 -347559 -847705 -711021 -638205 -408997 -215407 92082 249845 284076 124704
47008A24704Q0729k89532J8139K68427o0772M764k86628j3717J50175j33471O5332
$$ 124704 205433 -84099 -65960 202467 141695 146459 -140169 -153886 -3711 -137182 -71850
46997g1850L08031J90859k75397l5806k129o0757j7430O4243P9840J08675K17054
$$ -71850 236181 427040 151643 115837 113708 52951 35521 99764 179604 288279 505333
46986E05333n48765m74429K74626M14885J62216j48362j48483j74093K02230r227
$$ 505333 -43432 -517861 -243235 171650 333866 185504 37021 -137072 65158 55931
46976E5931O8750k6964N5515J13231k79187l5161K66442k83141l73280J57795
$$ 55931 124681 97717 153232 266463 -12724 -47885 218557 -64584 -437864 -280069
46966b80069k17883M64313L93775k61935j42103K22169J01116L1959m7387K7075
$$ -280069 -497952 -33639 360136 98201 -43902 178267 279383 311342 263955 291030
46956B91030K02086p7178k3768J2157K0350j16469l6048K04943J8011k05799j58675
$$ 291030 493116 415938 392170 404327 424677 308208 272160 477103 495114 289315 130640
46945A30640p2620R0399R1372o0996j23686Q3999m09521k74918j31239L97445
$$ 130640 58020 148419 239791 178795 55109 139108 -270413 -545331 -676570 -279125
46935b79125o3403J41283l0476j2989j15796N52425o3055Q5589m2125L76339j16357
$$ -279125 -342528 -201245 -231721 -244710 -360506 191919 128864 214453 172328 548667 432310
46924D32310o20715N8574J07474k17472k1478L728p2043J76019L30100M41750
$$ 432310 -188405 -129831 -22357 -239829 -261307 -257579 -329622 -153603 176497 618247
46914F18247m5485k97134k45845j55929K91805k39688J12017p3365k7146J03726
$$ 618247 572762 275628 29783 -126146 165659 -74029 37988 -35377 -62523 41203
46904D1203K15306Q144n32513k07774Q2636K26294L00477m4268j9580k63784k1891
$$ 41203 256509 264653 -267860 -475634 -392998 -166704 133773 89505 69925 -193859 -215750
46893b15750J9756L57264K33152k50313n1523J59671q127o9540j27849k27029
$$ -215750 -195994 161270 394422 144109 92586 252257 244130 174590 46741 -180288
46883a80288L43165Q3511J8587j62938J07504J41328j44654j43029J78628J60296
$$ -180288 162877 246388 264975 102037 209541 350869 206215 63186 241814 402110
46873D02110O9105k53018o8110J06139P0443k61925K69375K76699l09516n4225
$$ 402110 471215 218197 150087 256226 326669 64744 334119 610818 301302 247077
46863B47077k0075j19208q50K54875j03364m39413K22068K08888q7533j4159k30135
$$ 247077 227002 107794 106944 361819 258455 -180958 41110 249998 162465 148306 -81829
46852h1829J25490J03028J8794J68953K26168m7451k52085R3023K73011P122l10827
$$ -81829 43661 146689 165483 334436 560604 513153 261068 354091 627102 634224 323397
46841C23397k62908j0053k38454q7296J33791j95483J88564K02846L04339l42729
$$ 323397 60489 50436 -188018 -275314 -141523 -337006 -148442 54404 358743 16014
46831A6014l44878P534m3601p7132L07652K79271M91185Q1908l53714n28098J18127
$$ 16014 -328864 -321330 -364931 -442063 -134411 144860 636045 717953 364239 -163859 -45732
46820d5732L53449J3428Q7526k08810N4806P7137j53647j82229P3419r62j06932
$$ -45732 307717 321145 408671 199861 254667 331804 178157 -4072 69347 68385 -38547
46809c8547K29455j90927K3599J63466j4558K11635p4078j13735K17605J74715
$$ -38547 190908 -19 23580 187046 172488 384123 310045 196310 413915 588630
46799E88630l43499n47322q8861L64996J91164J21035l39064J87370K92885n4408
$$ 588630 245131 -302191 -391052 -26056 165108 286143 -52921 134449 427334 372926
46789C72926k00466O3671k07201k7063J77204L7527l55692k09147K27764k0638
$$ 372926 172460 236131 28930 1867 179071 216598 -139094 -348241 -120477 -141115
46779a41115K39394J6019K3871J53487K95950k19960l7561m0932l45536O3288
$$ -141115 98279 114298 138169 291656 587606 367646 330085 289153 -56383 6905
46769F905k0017k19907K42387K16886K45450k21005p9967l46271J90409L08157
$$ 6905 -13112 -233019 9368 226254 471704 250699 170732 -175539 14870 323027
46759C23027k17724l29584p2629J45072M5799J69432M1425K2310j80672m13875
$$ 323027 105303 -224281 -296910 -151838 -106039 63393 104818 127128 -53544 -467419
46749d67419J86646K09082K467j68138Q2212J52962N5222j86841J70193p4453
$$ -467419 -280773 -71691 -69224 -237362 -155150 -2188 53034 -133807 36386 -38067
46739c8067j57780L2478J43787j05597L95640o689J55884j30536m47900K22742
$$ -38067 -195847 -163369 -19582 -125179 270461 263772 419656 289120 -158780 63962
46729F3962J28989j25508m31303M61770J54221l03522k29261O1182K76637J41996
$$ 63962 192951 67443 -363860 97910 252131 -51391 -280652 -219470 57167 199163
46719A99163J86560l05758J69653o3693J28429j86558j51750J01418L68243m71270
$$ 199163 385723 79965 249618 185925 314354 127796 -23954 77464 445707 -25563
46709b5563l2122k2880o0526n6373J74529Q5115j86380k81677j51632N5366P4584
$$ -25563 -57685 -80565 -141091 -197464 -22935 62180 -124200 -405877 -557509 -502143 -427559
46698d27559n995L19123P9681J8884k9196P7312J14674J34389j88653k4393j3713
$$ -427559 -433554 -114431 -34750 -15866 -45062 32250 146924 281313 92660 68267 54554
46687E4554l74398m9222P4623q9041L4940L762K07331O13963k76138k11086M03253
$$ 54554 -319844 -369066 -294443 -383484 -348544 -344782 -137451 476512 200374 -10712 392541
46676C92541l40229l27161L4747L01872K80123m46254p7507N77732l18042m95340
$$ 392541 52312 -274849 -240102 61770 341893 -104361 -181868 395864 77822 -417518
46666d17518J15385R1233l66385M15961J65839L96613j3369j980l67937j56112
$$ -417518 -302133 -210900 -577285 -161324 4515 401128 387759 385779 17842 -138270
46656a38270q1915P2036J02857J64801k34290n841J32934J6600r7437l77731J93920
$$ -138270 -220185 -148149 -45292 119509 -114781 -120622 12312 28912 -68525 -446256 -252336
46645b52336M4684k13006k53463l2228m740L61611J65169r8000p1736L74621L10270
$$ -252336 -207652 -420658 -674121 -706349 -711089 -349478 -184309 -282309 -354045 20576 330846
46634C30846q9611L3584l91298K7878L3921l10205j83837J17152K09416M70816
$$ 330846 241235 274819 -116479 -88601 -54680 -364885 -548722 -431570 -222154 248662
46624B48662k70299k37552j40218K13938k72772q4127L69316P1880K42228j44423
$$ 248662 -21637 -259189 -399407 -185469 -458241 -542368 -173052 -101172 141056 -3367
46614c367l21341M8053Q2382K64284r3388j41660N6732K17106M69122P2300j41300
$$ -3367 -324708 -276655 -194273 70011 -23377 -165037 -108305 108801 577923 650223 508923
46603E08923j94885k62343J82455M50612l79166m40683N6199J44688p7965N9580
$$ 508923 314038 51695 234150 684762 305596 -135087 -78888 65800 -12165 47415
46593D7415j31711l30621p0331K58810K94602j41959M80233k17760o37066L02967
$$ 47415 -84296 -414917 -485248 -226438 68164 -73795 406438 188678 -448388 -145421
46583a45421K29813K31492K32465m14217l04983k29995L47442K75124j89850Q2728
$$ -145421 84392 315884 548349 134132 -170851 -400846 -53404 221720 31870 114598
46573A14598M858l31410K33769K18513j12763O3001j6669j03735J85116K739m0309
$$ 114598 119456 -211954 21815 240328 127565 190566 173897 70162 255278 258017 217708
46562B17708p7910k9458M24963n16890k63691L53442j56268K31267J21796k0266
$$ 217708 139798 110340 535303 18413 -245278 108164 -48104 183163 304959 284693
46552B84693j43447k41203j21223L54135K81649l47089K3755R3882j1696q5822
$$ 284693 141246 -99957 -221180 132955 414604 67515 91270 185152 173456 87634
46542H7634k96366J80128n6493K10844K78170Q0663n94334P5299k1634o6635L36585
$$ 87634 -208732 -28604 -85097 125747 403917 484580 -109754 -34455 -56089 -122724 213861
46531B13861L75878l14701k29815J72731j15432o1909r8773K94314k12354m6993
$$ 213861 589739 275038 45223 217954 102522 40613 -58160 236154 23800 -23193
46521b3193q4831j7935M1906j62844L80453L60835j15726j13797M3161O4660j0434
$$ -23193 -108024 -125959 -84053 -246897 133556 494391 378665 264868 308029 372689 362255
46510C62255k61793p5125R1650m30904k7182K15941K02183k42347j29836k16774
$$ 362255 100462 25337 116987 -313917 -341099 -125158 77025 -165322 -295158 -511932
46500e11932J52832k05180K33136N09780J86318l09801k60273j4959K94010p6310
$$ -511932 -359100 -564280 -331144 178636 364954 55153 -205120 -220079 73931 -2379
46490b379L7762K42628K0359l2868j51483L22858l31053j05053M68207J76717
$$ -2379 35383 278011 298370 265502 114019 436877 105824 771 468978 645695
46480F45695l10867M3185J71181l00735j98806m43093k2240K70740J88992J17581
$$ 645695 334828 378013 549194 248459 49653 -393440 -415680 -144940 44052 161633
46470A61633J71261P3748J03274l09257p6976r92Q4952K88441J08752p6831k09878
$$ 161633 332894 406642 509916 200659 123683 122691 207643 496084 604836 528005 318127
46459C18127M04M2319m32600j84759n311M06948J02971j36394L63802r9646j61097
$$ 318127 318531 360850 -71750 -256509 -261820 145128 248099 111705 475507 375861 214764
46448B14764L26130j59979p1855j43855l53560j77818K73164N27147j70614j00139
$$ 214764 540894 380915 309060 165205 -188355 -366173 -93009 434138 263524 163385
46438A63385j5777j1846r3445k54080M24543J44899j23781k12610J0568j70092
$$ 163385 147608 135762 42317 -211763 212780 357679 233898 21288 31856 -138236
46428a38236J83941j31433L82190L16331j66171l48805m71146K41172j6221j49883
$$ -138236 45705 -85728 296462 612793 446622 97817 -373329 -132157 -148378 -298261
46418b98261k26661M01733K51064j43887L823j52033K55270K59762J08653l01606
$$ -298261 -524922 -123189 127875 -16012 -12189 -164222 91048 350810 459463 157857
46408A57857k10005n7299k77088K13071Q4316J68440o8790K34636j24620l77608
$$ 157857 -52148 -109447 -386535 -173464 -89148 79292 10502 245138 120518 -257090
46398b57090L49815J73101k26388K8388n0574K23284K82473j52329k5415R9395
$$ -257090 92725 265826 39438 67826 17252 240536 523009 370680 345265 444660
46388D44660o36206J84476K9259K63366q08K24282L72665k68228J4627l17731
$$ 444660 -191546 -7070 22189 285555 284747 509029 881694 613466 628093 310362
46378C10362p5485k15768m1678o1148N4038L17614j09870j72179k07794K11292
$$ 310362 234877 19109 -22569 -83717 -29679 287935 178065 5886 -201908 9384
46368I384N9649J11285Q8688o2264K41775m6049k4407k00747K00871l4985m20453
$$ 9384 69033 180318 269006 206742 448517 402468 378061 177314 378185 343200 -77253
46357g7253L06139l9836q6189J07319K33176k67884k16846J96068J19614j57276
$$ -77253 228886 189050 102861 210180 443356 175472 -41374 154694 274308 117032
46347A17032j14147l99377k12179J6085J12662M95705M5865k23571J61013N514
$$ 117032 2885 -396492 -608671 -592586 -479924 15781 61646 -161925 -912 4602
46337D602J7683J33793j37655J8996j78147k66655J59326J21406J79477j5268
$$ 4602 22285 156078 18423 37419 -140728 -407383 -248057 -126651 52826 37558
46327C7558K71890O1402j51419j38248l07389R7627L39489m4745J07556J87290
$$ 37558 309448 370850 219431 81183 -226206 -128579 210910 166165 273721 461011
46317D61011K3121K262J05171j83882R5188n48349l08533M61985N6777n1062n84
$$ 461011 484132 486394 591565 407683 502871 -45478 -354011 107974 164751 113689 113105
46306A13105K08742k06619P995K35411n739l89348k02070l5311n0219k1331J39753
$$ 113105 321847 115228 123223 358634 352895 -36453 -238523 -273834 -324053 -345384 -205631
46295b05631m4624K87166K03332N2255J06618n7215l67095n53963K03758M13903
$$ -205631 -250255 36911 240243 292498 399116 341901 -25194 -579157 -375399 38504
46285C8504r7701R2375j40031l5192O8677K02102L8503j53307O5986K40218J6153
$$ 38504 -59197 33178 -106853 -142045 -73368 128734 167237 13930 79916 320134 336287
46274C36287j73021J75101L15420k79990m09950J96096J56087m27340j447J15616
$$ 336287 163266 338367 653787 373797 -36153 159943 316030 -111310 -112757 2859
46264B859J40267J8031J43024j65176l82372j08952K48275J93493K83392k4560
$$ 2859 143126 161157 304181 139005 -243367 -352319 -104044 89449 372841 348281
46254C48281o3571N5225K60066K85816k41413n73127j14691K6170J80012J29766
$$ 348281 284710 339935 600001 885817 644404 71277 -43414 -17244 162768 292534
46244B92534L1616J59535M4003p2711m46744j10734J42572j59499K54191K9544
$$ 292534 324150 483685 527688 454977 8233 -102501 40071 -119428 134763 164307
46234A64307O9958m3294P462j27521p4500J21504j50492k1966J19924j19612K1099
$$ 164307 234265 190971 198433 70912 -3588 117916 -32576 -54542 65382 -54230 -33131
46223c3131L68224p0622k84586M60792K38891Q8175k94800l58064J49244K04408
$$ -33131 335093 264471 -20115 440677 679568 767743 472943 114879 264123 468531
46213D68531l93910M4256j96177m12321J70451J55128J64607K79013J39815J0822
$$ 468531 74621 118877 -77300 -489621 -319170 -164042 565 279578 419393 430215
46203D30215l7998J96235j00801J23993r2304k29321M7969j59473m05279J42054
$$ 430215 392217 588452 487651 611644 519340 290019 337988 178515 -226764 -84710
46193h4710l3487L32417R0707j30756l11889n045R4239L70411o8367k22691J28002
$$ -84710 -118197 214220 304927 174171 -137718 -142763 -48524 321887 253520 30829 158831
46182A58831J86413n6324L18053l0346l56034J57007J13755o0654l28339j99597
$$ 158831 345244 288920 606973 576627 220593 377600 491355 430701 102362 -97235
46172i7235K34665J60402J85589M7845q7660k92528J79331j35394P3732N3931
$$ -97235 137430 297832 483421 531266 443606 151078 330409 195015 268747 322678
46162C22678l20105j56389Q1652J24771j47895l1436J38482m39498j84609L89565
$$ 322678 2573 -153816 -72164 52607 -95288 -126724 11758 -427740 -612349 -222784
46152b22784K54824j58363l9951o5321R7919Q8416Q3932J92068n5058j77234j46077
$$ -222784 32040 -126323 -166274 -231595 -133676 -45260 38672 230740 175682 -1552 -147629
46141a47629K70994Q9026M2168q2182P9234M12714l50485k27984J52738M9216
$$ -147629 123365 212391 254559 172377 251611 664325 313840 85856 238594 287810
46131B87810L5760M2669l73586j00351K49672J42430R5398j43225m8521J41122
$$ 287810 323570 366239 -7347 -107698 141974 284404 379802 236577 188056 329178
46121C29178n51877k43303L44456m2916j64179m35429R3084K9320K33781L53484
$$ 329178 -222699 -466002 -121546 -164462 -328641 -764070 -670986 -641666 -407885 -54401
46111e4401K23073M2989K94203L0693m19631J92856J87305J3679j65008L6268
$$ -54401 168672 211661 505864 536557 116926 309782 497087 510766 345758 382026
46101C82026j72213J68266j59422m88065L42935J87561n19966k42846J14866P01105
$$ 382026 209813 378079 218657 -269408 73527 261088 -258878 -501724 -386858 314247
46091C14247l19625n00603K82853K99818p4880K09052r5891j44714j62345J66020
$$ 314247 -5378 -505981 -223128 76690 1810 210862 114971 -29743 -192088 -26068
46081b6068N0877J47567J38629K33326n87203o8779J15764J87061k61094K32565
$$ -26068 24809 172376 311005 544331 -42872 -111651 4113 191174 -69920 162645
46071A62645k26186m73310N53956J10240k45372j46360M4106k29502M37912o7166
$$ 162645 -63541 -536851 17105 127345 -118027 -264387 -220281 -449783 -11871 -79037
46061g9037K74798L60679l07082J24331R8080n52673J2514L13433k06262k9417
$$ -79037 195761 556440 249358 373689 471769 -80904 -68390 245043 38781 9364
46051I364n3395l8828j12258J30621j3206o2582K3438J62774K54648K352k91056
$$ 9364 -44031 -82859 -195117 -64496 -77702 -140284 -116846 45928 300576 302928 11872
46040A1872L7466M99592r7449k82000k2922J44130J04960K8552J85017J4346k53883
$$ 11872 49338 548930 451481 169481 146559 290689 395649 424201 609218 623564 369681
46029C69681R026k31284O4m4955O0999M14423l15755N8126j2464j54527K49119
$$ 369681 378707 147423 147487 102532 163531 577954 262199 320325 307861 153334 402453
46018D02453k57034l40676k18488K03076M48140r0461k38234m4575J2495P253
$$ 402453 145419 -195257 -413745 -210669 237471 147010 -91224 -135799 -123304 -116051
46008a16051j04163J21497j4205j99103R654L07033L14197R5749r7951j23597
$$ -116051 -220214 -98717 -112922 -312025 -302371 4662 318859 414608 316657 193060
45998A93060k91230p2870n5329J71453p6763j20924l5306L98750K2579J38233
$$ 193060 -98170 -171040 -226369 -54916 -131679 -252603 -287909 110841 133420 271653
45988B71653J84451j62113l04541J3454O6020K89110j00783l66140K4638q6095
$$ 271653 456104 293991 -10550 2904 68924 358034 257251 -108889 -84251 -170346
45978a70346L4778K55767k40360J10633J33414m58106k03245K7495K00412J4123
$$ -170346 -135568 120199 -120161 -9528 123886 -334220 -537465 -509970 -309558 -295435
45968b95435j26488K32544j17603j97939o0040M50002K11561k1538J99070k81297
$$ -295435 -421923 -189379 -306982 -504921 -564961 -114959 96602 75064 274134 -7163
45958g163R4380R7904j61213k29233j24629k14157J64807L45477J57167l54107
$$ -7163 87217 185121 23908 -205325 -329954 -544111 -379304 -33827 123340 -230767
45948b30767L17118Q05109p69948o57080K04413L27456J29116l16282o11j5580
$$ -230767 86351 891460 121512 -535568 -331155 -3699 125417 -190865 -191476 -207056
45938b07056K35526q842k13190N3445K19146l17308O5036o4125N6845J00335J43551
$$ -207056 28470 19628 -193562 -140117 79029 -238279 -173243 -237368 -180523 -80188 63363
45927F3363J10266m3364j36832R4458o9658j99677J08481K53538j01680N9487
$$ 63363 173629 130265 -6567 87891 18233 -181444 -72963 180575 78895 138382
45917A38382O7426m14066k84424O3651Q5346K14866O06963K87698k32970j95015
$$ 138382 205808 -208258 -492682 -429031 -343685 -128819 478144 765842 532872 337857
45907C37857J59225k60084k51689o1860k05937L84271m3978l81322J77203K48408
$$ 337857 497082 236998 -14691 -76551 -282488 101783 57805 -323517 -146314 102094
45897A02094j1563j2984m28862R072R5949R4068j20387o0279J91415J00281j43243
$$ 102094 90531 77547 -351315 -342243 -246294 -152226 -272613 -332892 -141477 -41196 -184439
45886a84439Q5822K22854M1536J2739j38686l70021j15474N12988K9442P6375
$$ -184439 -98617 124237 165773 178512 39826 -330195 -445669 67319 96761 173136
45876A73136K23363k90484l50997N2598p624j48301K27076k3982K36743N4491
$$ 173136 396499 106015 -244982 -192384 -200008 -348309 -121233 -145215 91528 146019
45866A46019J07544P4073K14498j59529K8364Q9487l68321M1594k2880J0047N6301
$$ 146019 253563 327636 542134 382605 410969 500456 132135 173729 150849 160896 217197
45855B17197j59899J88594l1250k57829j11018j55994L84771o7820l10109k59450
$$ 217197 57298 245892 214642 -43187 -154205 -310199 74572 6752 -303357 -562807
45845e62807M3707L52913L02926l2016L9371L15483J56383j11428l20787J92450
$$ -562807 -519100 -166187 136739 104723 144094 459577 615960 504532 183745 376195
45835C76195k75349j81677K90462j52972j36065L979J82587k5014K20419J49194
$$ 376195 100846 -80831 209631 56659 -79406 -75427 107160 82146 302565 451759
45825D51759r1931m8613R6433n9769j35834J01132k95108J05867O5591j55587
$$ 451759 359828 311215 407648 347879 212045 313177 18069 123936 189527 33940
45815C3940L0518j90476k67823K87995M81710o8739j79346m13081K37417L4327
$$ 33940 64458 -126018 -393841 -105846 375864 307125 127779 -285302 -47885 -13558
45805a3558K13268Q9802m33379p2571J21354M23469p8575l0400K52798m5299n44108
$$ -13558 199710 289512 -143867 -216438 -95084 328385 249810 219410 472208 426909 -117199
45794a17199j95446L02272o4715r8069m12341L15473K49984J15847K91764L79192
$$ -117199 -312645 -10373 -75088 -173157 -585498 -270025 -20041 95806 387570 766762
45784G66762l19664n58303j78500K61814J67954k43714k7116k7037j6942k23822
$$ 766762 447098 -111205 -289705 -27891 140063 -103651 -130767 -157804 -174746 -398568
45774c98568k47298K64191K29352M58635o9413m14359N7840M02402J27268l58311
$$ -398568 -645866 -381675 -152323 306312 236899 -177460 -119620 282782 410050 51739
45764E1739l54938L77169J33896J3962k58591J125q180K21525K6969j17936Q1821
$$ 51739 -303199 73970 207866 221828 -36763 -35638 -43818 177707 204676 86740 168561
45753A68561R6079m0956j01573k5057l52434j07026O0612N9259K84231k2685N4122
$$ 168561 264640 223684 122111 97054 -255380 -362406 -301794 -242535 41696 19011 73133
45742G3133m2K15162Q5552m8132J9081K04034L22760l47116j56353j00277R1542
$$ 73133 73091 288253 373805 325673 344754 548788 871548 524432 368079 267802 359344
45731C59344m0123j11086j53884k97881J09101J91403K22667l01401L1381J90250
$$ 359344 319221 208135 54251 -243630 -134529 56874 279541 -21860 9521 199771
45721A99771R7564j34327l29745J95186K43028k01825r8938m48668M28238K3614
$$ 199771 297335 163008 -166737 28449 271477 69652 -29286 -477954 -49716 -26102
45711b6102j07995O929J14710L14559m07287q1344J95839q0686K18428j30170
$$ -26102 -134097 -127168 -12458 302101 -105186 -186530 9309 -71377 147051 16881
45701A6881Q1859O2945J1328n891J54463m80780o2713J01797k06262K19059K04127
$$ 16881 98740 161685 173013 167122 321585 -159195 -221908 -120111 -326373 -107314 96813
45690I6813L02404L22178k46483l85507K9411j5926j62147J66371j75906j04808
$$ 96813 399217 721395 474912 89405 118816 102890 -59257 107114 -68792 -173600
45680a73600M59088k12417J6459p5462l79848J73018K29540O3920k16946R9179
$$ -173600 285488 73071 89530 14068 -365780 -192762 36778 100698 -116248 -17069
45670a7069K39518Q2356j24516Q9528K47949m3510J2683j48646q8928j47579m45203
$$ -17069 222449 304805 180289 269817 517766 474256 486939 338293 249365 101786 -343417
45659c43417j55093L15809k34670j25451J62209P7364o9038J83841J53551K19486
$$ -343417 -498510 -182701 -417371 -542822 -380613 -303249 -372287 -188446 -34895 184591
45649A84591l3717J83415N3472l1195J19706m342m7562k34418j70321J03894l7954
$$ 184591 150874 334289 387761 356566 476272 471930 424368 189950 19629 123523 85569
45638H5569m59349J86208j1343K19748K32887K196Q019j27828k87130l4768K2222
$$ 85569 -373780 -187572 -198915 20833 253720 255916 263935 136107 -151023 -185791 -163569
45627a63569M43979r5312l25018l7461L39366j03321j76126j57535K93866j65429
$$ -163569 280410 185098 -139920 -177381 161985 58664 -117462 -274997 18869 -146560
45617a46560k60683L38903N21805J61738l54127k60756M5054k46079J23649j33339
$$ -146560 -407243 -68340 453465 615203 261076 320 45374 -200705 -77056 -210395
45607b10395J67097p4742l13282M65077L29911j16167m86588j49210J17230K80617
$$ -210395 -43298 -118040 -431322 33755 363666 247499 -239089 -388299 -271069 9548
45597I548J31938J10656J75860n6881K40000j16065j27654p8524M4464K94407
$$ 9548 141486 252142 428002 371121 611121 495056 367402 288878 333342 627749
45587F27749M9448k41204k10687l8767Q2510J66927J82441k14729N4458o0835
$$ 627749 677197 435993 225306 186539 269049 435976 618417 403688 458146 397311
45577C97311k35334j03278k44432J77774M17333N0498m53101J9605K21007K20340
$$ 397311 161977 58699 -185733 -7959 409374 459872 6771 26376 247383 467723
45567D67723K5178l16515L54052n9910l94250J07278N514J65379o3894K9120N9548
$$ 467723 492901 176386 530438 470528 76278 183556 189070 354449 290555 319675 379223
45556C79223K23349R0277k21743n77194j73840J03987M7619j34696J49094k18237
$$ 379223 602572 692849 471106 -106088 -279928 -175941 -128322 -263018 -113924 -332161
45546c32161K18392J94168j27906M163j36512L81037l48577j91138J09187J79343
$$ -332161 -113769 80399 -47507 -43344 -179856 201181 -147396 -338534 -229347 -50004
45536e0004R3790K62071J32863j59726l62536j40709J48540K80140K55282m9480
$$ -50004 43786 305857 438720 278994 -83542 -224251 -75711 204429 459711 410231
45526D10231J61570k70835M0944j29046p6247K58829J94099m29850K22898j04150
$$ 410231 571801 300966 341910 212864 136617 395446 589545 159695 382593 278443
45516B78443K9291L39169k15643l72114q8466M08668j63338N2117K63111j47645
$$ 278443 307734 646903 431260 59146 -29320 379348 216010 268127 531238 383593
45506C83593m11321K57205N85791p2713m42216k03133j41373j28213N48971N9224
$$ 383593 -27728 229477 815268 742555 300339 97206 -44167 -172380 376591 435815
45496D35815j7567Q1547n07608j76403K39150L53597j26745m33045J83652M08070
$$ 435815 418248 499795 -7813 -184216 54934 408531 281786 -151259 32393 440463
45486D40463l04836j70137K72822j64607n422P2089l1161o9594K14796K2953k86247
$$ 440463 135627 -34510 238312 73705 68283 140372 109211 39617 254413 277366 -8881
45475h881O3799J1132k44047M11041P3496j60026J06801K51772J67478o9035l77330
$$ -8881 54918 66050 -177997 233044 306540 146514 253315 505087 672565 603530 226200
45464B26200j71039L4537K09193p6618k32329l41917L13358K33970J92900J17959
$$ 226200 55161 89698 298891 222273 -10056 -351973 -38615 195355 388255 506214
45454E06214O8587j23302m84217l20294N13209K09416j16607j64163J52994r4614
$$ 506214 574801 451499 -32718 -353012 160197 369613 253006 88843 241837 147223
45444A47223Q0707K29181j4012n24931K15877r2813J29756O43324j11458q4526
$$ 147223 227930 457111 443099 -81832 134045 41232 170988 814312 702854 618328
45434F18328j98650k33632K4507J64622j07221r0963J1987n7830p090r2171J63496
$$ 618328 419678 186046 210553 375175 267954 176991 188978 131148 124058 31887 195383
45423A95383M9957J87566K64903m05419j05521O3981P198l53957J50132L37267
$$ 195383 245340 432906 697809 292390 186869 250850 258048 -95909 54223 391490
45413C91490m21951j96540M34662k44640r8943L11429J14426O3317J08640m2034
$$ 391490 -30461 -227001 207661 -36979 -135922 175507 289933 353250 461890 419856
45403D19856k20999m5846j82842j85144r4408L86646q7159M7732P450j8308K7900
$$ 419856 198857 153011 -29831 -214975 -309383 77263 -9896 37836 45286 26978 54878
45392E4878J46498k0292k5433L4618j43063o415L90919k4027k32955k74719J41428
$$ 54878 201376 181084 155651 190269 47206 40791 431710 407683 174728 -99991 41437
45381D1437N55808K7568n71106j54282M04304k42674k32449K30921M7942o3683
$$ 41437 597245 624813 53707 -100575 303729 61055 -171394 59527 107469 43786
45371D3786j82637j21341J32285L69998j90669j32913R9936K37093k59146o5114
$$ 43786 -138851 -260192 -127907 242091 51422 -81491 18445 255538 -3608 -68722
45361f8722M5776o5577o271k32843R3104o9332L44488K79672j91367R6654n2903
$$ -68722 -22946 -88523 -94794 -327637 -234533 -303865 40623 320295 128928 225582 172679
45350A72679K2242j69601p5787L54389j26437p7038l3559l63276K65850M26638
$$ 172679 194921 25320 -50467 303922 177485 100447 66888 -296388 -30538 396100
45340C96100l79555n87L59486l24155l78139J86419L52640J92462j65482K12425
$$ 396100 16545 15958 375444 51289 -326850 -140431 212209 404671 239189 451614
45330D51614O3209r1636j08990M7680J7529l12735j35224m4532K33969N38061
$$ 451614 514823 423187 314197 361877 379406 66671 -68553 -113085 120884 658945
45320F58945J08370k97447o36029K03408L17856L6434O6142J37207k47060l23707
$$ 658945 767315 469868 -166161 37247 355103 391537 457679 594886 347826 24119
45310B4119J19634j48818o8096J27466K8583l45715M69207M67887J04258k65131
$$ 24119 143753 -5065 -73161 54305 82888 -262827 206380 674267 778525 513394
45300E13394l9957m4907j13335R8941N2464j29752m1902l38155J75631M22567
$$ 513394 473437 428530 315195 414136 466600 336848 294946 -43209 132422 554989
45290E54989n5708m06957k56106J71712k17592j90779K60878N271K98661M75596
$$ 554989 499281 92324 -163782 7930 -209662 -400441 -139563 -134292 164369 639965
45280F39965q0400N6416k93357o7140l47660R8891L52194J57232n1991m75426
$$ 639965 559565 615981 322624 255484 -92176 6715 358909 516141 464150 -11276
45270a1276o38754L4517K01858M73169O0203j19141J59600J14539k13088l86168
$$ -11276 -650030 -615513 -413655 59514 119717 576 160176 274715 61627 -324541
45260c24541K18013J29460J66712R0848K46909N7439n51497j32856j18696R3228
$$ -324541 -106528 22932 189644 280492 527401 584840 33343 -99513 -218209 -124981
45250a24981J917J73683m203K9769Q1363L0720K04024K58975j77342K6721l20534
$$ -124981 -123064 50619 46416 76185 157548 188268 392292 651267 473925 500646 180112
45239A80112r810L10378p5267k37670m25278N08700N81159o25173L2219K09608
$$ 180112 170302 480680 405413 167743 -257535 251165 832324 207151 239370 448978
45229D48978j20607l07112p3612J47274K63868p6127l96906L96014R9492p3955
$$ 448978 328371 21259 -52353 94921 358789 282662 -114244 281770 381262 307307
45219C07307J70933j49909J2475L8149o03870p4557N78783k59611J32328J9283
$$ 307307 478240 328331 340806 378955 -224915 -299472 279311 19700 152028 171311
45209A71311O0859k64678q3051k08491K82740J54985K42398j8349j02269K88351
$$ 171311 232170 -32508 -115559 -324050 -41310 113675 356073 337724 235455 523806
45199E23806J48222J51689k75248l11317K20086j78979j4022k68707J74969L56464
$$ 523806 672028 823717 548469 237152 457238 278259 264237 -4470 170499 526963
45189E26963j76918o2178p0084j44540k0308j92M2950K8059K32029J23642j0846
$$ 526963 350045 287867 217783 73243 52935 52743 95693 123752 355781 479423 468577
45178D68577N9564m59312l26884K98925N7525R3282L6620k22316k33975L87160
$$ 468577 528141 68829 -258055 40870 98395 191677 228297 5981 -227994 159166
45168A59166j88526j43223K63050J36575k30135J9474n1480j95987q8303M33977
$$ 159166 -29360 -172583 90467 227042 -3093 16381 -35099 -231086 -319389 114588
45158A14588L08414J8994k83042j18825j55360n46318M45046M30881j4186M42922
$$ 114588 423002 441996 158954 40129 -115231 -661549 -216503 214378 200192 643114
45148F43114l43227l88321J27573L14622K16928l05771M18819m2825k47102K2220
$$ 643114 299887 -88434 39139 353761 570689 264918 683737 640912 393810 416030
45138D16030k47272J33575L165p705l32714L81893k73912L1300o1754K21161J5300
$$ 416030 168758 302333 305498 297793 -34921 346972 73060 104360 42606 263767 279067
45127B79067m18947n9206K5839p8648J12855L56432p9616J31182m97718o5757
$$ 279067 -139880 -199086 -173247 -251895 -139040 217392 137776 268958 -228760 -294517
45117b94517N88153l93786M6866m623K20640J76104q9639j16264j25594j59735
$$ -294517 293636 -100150 -53284 -57907 162733 338837 249198 132934 7340 -152395
45107a52395M52751O18800O9296k08890l53830P6540k02556O4126K89145l34983
$$ -152395 300356 919156 988452 779562 425732 502272 299716 363842 652987 318004
45097C18004q1561j57305J39993P5528J8591j88286N1472J69134k53701L70509
$$ 318004 236443 79138 219131 294659 313250 124964 176436 345570 91869 462378
45087D62378l76466j25346J92339j25420Q8161k2993p5257k2451N45557L7688
$$ 462378 85912 -39434 152905 27485 115646 92653 17396 -5055 540502 578190
45077E78190j84775k03000J66677j27890j80062J50437P127N2663J8637m8139
$$ 578190 393415 190415 357092 229202 49140 199577 206704 259367 278004 229865
45067B29865M8571M98348k96912o20025K70942J92337n46452M4311K22931q4797
$$ 229865 278436 776784 479872 -140153 130789 323126 -223326 -179015 43916 -40881
45057d0881O7940J17627j05330j53052P4709j0027L37845j86484m63485N1284
$$ -40881 27059 144686 39356 -113696 -38987 -49014 288831 102347 -361138 -309854
45047c09854K55297K85202j45541O2041n8725k20745J23553K02980k12968k27400
$$ -309854 -54557 230645 85104 147145 88420 -132325 -8772 194208 -18760 -246160
45037b46160l8208j78657k06663O94773M53072j41137K44893q8147o9409J54199
$$ -246160 -284368 -463025 -669688 25085 478157 337020 581913 493766 424357 578556
45027E78556j70208r3223n8156K0040n2344Q0929K35802N8247k70396m49621k02105
$$ 578556 408348 315125 256969 277009 224665 305594 541396 599643 329247 -120374 -322479
45016c22479K85692J96981r2415j43211q1988J01789P39618J2349l10002L6727
$$ -322479 -36787 160194 67779 -75432 -157420 -55631 683987 696336 386334 423061
45006D23061m50708j22672K13941J37665O7910k2218j31281j27190Q8262J55251
$$ 423061 -27647 -150319 63622 201287 269197 246979 115698 -11492 76770 232021
44996B32021L98397j41582n61540j24831k52911J01115N79002L611j47892j57911
$$ 232021 630418 488836 -72704 -197535 -450446 -349331 229671 233282 85390 -72521
44986g2521K08817L19501j87786j43164P0002R906q6162j91577L2657L3846l43602
$$ -72521 136296 455797 268011 124847 194849 204755 118593 -72984 -40327 -6481 -350083
44975c50083M51797k31484K4959J57801j83418o9178K2517L97087L3921O9039
$$ -350083 101714 -129770 -104811 52990 -130428 -199606 -177089 219998 253919 322958
44965C22958Q9320J42849k65235l2154r3795M3180o735K58640m7086k45512L11390
$$ 322958 412278 555127 289892 257738 163943 207123 200388 459028 411942 166430 477820
44954D77820K74277K34539k61905q02155K45529J32444k41423p702r5687l68957
$$ 477820 752097 986636 724731 -77424 168105 300549 59126 51424 -44263 -413220
44944d13220K30439N56979j80465n1980N06036j72119O2082m7012j19528q3354
$$ -413220 -182781 374198 193733 141753 647789 475670 537752 490740 371212 287858
44934B87858J97284j23774J8219l96655L17394L7282k67170k8228j04085L78009
$$ 287858 485142 361368 379587 -17068 300326 337608 70438 42210 -61875 316134
44924C16134P0530R5381m1809J77761k99264K6927J35645J13954J71049J75401
$$ 316134 386664 482045 440236 617997 318733 345660 481305 595259 766308 941709
44914I41709k51991L295K1719l81053J00895k12954J930J61821J01671j24200
$$ 941709 689718 693013 714732 333679 434574 221620 223550 385371 487042 362842
44904C62842j4914j20801l440J86387k42835J61046K27874K62126l18030l71230
$$ 362842 347928 227127 223687 410074 167239 328285 556159 818285 500255 129025
44894A29025M5689O0407L21575k35194K08269J79333j72297J5750j42047j78750
$$ 129025 174714 235121 556696 321502 529771 709104 536807 552557 410510 231760
44884B31760K7982j8280j27012N0073K29181K03809R9596k24422k70007q2147
$$ 231760 259742 241462 114450 164523 393704 597513 697109 472687 202680 120533
44874A20533j62978Q4614N9285J5011j06347k3575N9578L11364J67080J45319
$$ 120533 -42445 42169 101454 116465 10118 -13457 46121 357485 524565 669884
44864F69884J88494q8838k16221j19215l9100J53561o3278j23759L44377J64101
$$ 669884 858378 769540 553319 434104 395004 548565 485287 361528 705905 870006
44854H70006n00284K59165o1105k1952M8531N8850J67077k62651j47258o1210
$$ 870006 369722 628887 567782 545830 594361 653211 820288 557637 410379 349169
44844C49169K98754k46131J01389J24408k16185n7412K78910l31809J84744K57319
$$ 349169 647923 401792 503181 627589 411404 353992 632902 301093 485837 743156
44834G43156J30303k68078k31790R0428N54467k51826n98913j43041k25826L85596
$$ 743156 873459 605381 373591 464019 1018486 766660 167747 24706 -201120 184476
44824A84476M30564J44648j38428j78910j65080q0714J93844j91138o6076L13897
$$ 184476 615040 759688 621260 442350 277270 196556 390400 199262 133186 447083
44814D47083R7682K37746p7852K96832k09413j42596j18035l2954j79442J70132
$$ 447083 544765 782511 704659 1001491 792078 649482 531447 498493 319051 489183
44804D89183L62480k58427j23721j01604K44412O5495l39459J33986M7916m6680
$$ 489183 851663 593236 469515 367911 612323 677818 338359 472345 520261 473581
44794D73581L88294p201q7344j68492N3591j09467K46851k86994L023J92355P0791
$$ 473581 861875 854674 767330 598838 652429 542962 789813 502819 505842 698197 768988
44783G68988k04023k192j86117o4267k41526j93758q9925L88812K77411p7783
$$ 768988 564965 562773 376656 312389 70863 -122895 -212820 175992 453403 375620
44773C75620J13879Q8050o1327m3892l69882K22372K38365j79813J40616n3752
$$ 375620 489499 577549 516222 472330 102448 324820 563185 383372 523988 470236
44763D70236k42863k8385K11041J22757j01905r7518q7592k0841Q8148k34064
$$ 470236 227373 198988 410029 532786 430881 333363 245771 224930 313078 79014
44753G9014j09397J22858l1599L6020L43908O15973Q8645M5849m11011l77457
$$ 79014 -30383 92475 60876 96896 440804 1056777 1145422 1191271 780260 402803
44743D02803L00768q6337j52307L23728q8899j22693n4096M33009N36689j78568
$$ 402803 703571 617234 464927 788655 699756 577063 522967 955976 1492665 1314097
44733A314097m04779j09139k56486j68527P02962R993l24797O0466K53361m4428
$$ 1314097 909318 800179 543693 375166 1078128 1088121 763324 823790 1077151 1032723
44723A032723l7330Q7541p8361j74302P3455m82786j70305M42042n04260r9525
$$ 1032723 995393 1082934 1004573 830271 903726 420940 250635 692677 188417 88892
44713H8892j32607L90101K30438M40801L77340k21260j69696q5738k68906p2053
$$ 88892 -43715 346386 576824 1017625 1394965 1173705 1004009 918271 649365 577312
44703E77312K7685m2116M6905M16737K25073n263j72332J104N3511J24104L58331
$$ 577312 604997 562881 609786 1026523 1251596 1246333 1074001 1075105 1128616 1252720 1611051
44692A611051o8679j64217L4044j1094J01184K56540P5935l5187o2628k0359k4190
$$ 1611051 1542372 1378155 1412199 1401105 1502289 1758829 1834764 1799577 1736949 1716590 1692400
44681A692400m8480q0167k74238l67614J32133j65608p5802J00199M01389P8033
$$ 1692400 1643920 1563753 1289515 921901 1054034 888426 812624 912823 1314212 1392245
44671A392245p5243o6221k18288O8685J44638k28131L12241O5305j35843j80932
$$ 1392245 1317002 1250781 1032493 1101178 1245816 1017685 1329926 1395231 1259388 1078456
44661A078456J6150J45437Q7203k39437K95540K75536k25613M1518M51075J27886
$$ 1078456 1094606 1240043 1327246 1087809 1383349 1658885 1433272 1474790 1925865 2053751
44651B053751l85515J94925J07829j24398L3986R156J79358R9134m6829n32754
$$ 2053751 1668236 1863161 1970990 1846592 1880578 1889734 2069092 2168226 2121397 1588643
44641A588643M21913L51368j52400L96996K02287J76727j07374K32419Q099j46762
$$ 1588643 2010556 2361924 2209524 2606520 2808807 2985534 2878160 3110579 3118678 2971916
44631B971916M14715J94096J49133L35017l77796k27803q6280J18386J11902k88609
$$ 2971916 3386631 3580727 3729860 4064877 3687081 3459278 3372998 3491384 3603286 3314677
44621C314677n19111J7474k9683L72280l08577k79557J06896k28482r789j26609
$$ 3314677 2795566 2813040 2783357 3155637 2847060 2567503 2674399 2445917 2436128 2309519
44611B309519k1435J53413J52437L1111l18586Q6708L77364k96470k15820K25675
$$ 2309519 2288084 2441497 2593934 2625045 2306459 2393167 2770531 2474061 2258241 2483916
44601B483916L83857K01265K96840K82567j10087r4275J39940O7391k59001l05283
$$ 2483916 2867773 3069038 3365878 3648445 3538358 3444083 3584023 3651414 3392413 3087130
44591C087130K49734M47987N5761M1465L43914J41933M7082j70843K04892K21549
$$ 3087130 3336864 3784851 3840612 3882077 4225991 4367924 4415006 4244163 4449055 4670604
44581D670604M60843O52419N2309j00837k906J38065J2468N9261j94665K64215
$$ 4670604 5131447 5783866 5836175 5735338 5732432 5870497 5882965 5942226 5747561 6011776
44571F011776L66883j4623l19079j17449J91760k85675q5493M79891L28230o7062
$$ 6011776 6378659 6364036 6044957 5927508 6119268 5833593 5748100 6227991 6556221 6489159
44561F489159m6857j72808K54648L86184K7485L37832O68173M18845p193n19449
$$ 6489159 6442302 6269494 6524142 6910326 6937811 7275643 7943816 8362661 8355468 7836019
44551G836019P474K30129J9823M72066K64929p0996j53527L52780N03928L30042
$$ 7836019 7843493 8073622 8093445 8565511 8830440 8759444 8605917 8958697 9462625 9792667
44541I792667J52727L78970K34760K9402N81766J047791L69573J33669N03925
$$ 9792667 9945394 10324364 10559124 10588526 11170292 12218083 12587656 12721325 13225250
44532A3225250O63070K11442j96795l04358J70829L04181O74880L23118J88235
$$ 13225250 13888320 14099762 13902967 13598609 13769438 14073619 14748499 15071617 15259852
44523A5259852k4128P51045Q307K56492J006065M80438P54817J076537J385146
$$ 15259852 15235724 15986769 15995076 16251568 17257633 17738071 18492888 19569425 20954571
44514B0954571R06726J335759J553990J341122J353389K140573K523927K619433
$$ 20954571 21861297 23197056 24751046 26092168 27445557 29586130 32110057 34729490
44506C4729490L222847L004164L582981L573427L486429L147643M406607N459500
$$ 34729490 37952337 40956501 44539482 48112909 51599338 54746981 59153588 64613088
44498F4613088O190064P166668Q019846R705724J1507512J3214280J5867726J9034008
$$ 64613088 70803152 77969820 85989666 95695390 107202902 120417182 136284908 155318916
44490A55318916K1808591K4126550K3191619J8806915J5013064J5060815J6340289
$$ 155318916 177127507 201254057 224445676 243252591 258265655 273326470 289666759
44483B89666759J5174622J0532389M83360j2655289k3155564k9302607l1625980
$$ 289666759 304841381 315373770 315857130 303201841 280046277 250743670 219117690
44476B19117690l0291215k6597860k2892511j9712044j6624451j3010953j0691133
$$ 219117690 188826475 162228615 139336104 119624060 102999609 89988656 79297523
44469G9297523r479564q253948o802862n354653m844956m503643l751636l129444
$$ 79297523 69817959 61564011 54761149 49406496 44561540 40057897 36306261 33176817
44461C3176817k791829j981815j737259j846031j533718j309718j241225r31514
$$ 33176817 30384988 28403173 26665914 24819883 23286165 21976447 20735222 19803708
44453A9803708r38206p44313r26531j057720r57404q07015m92170l63067m55122
$$ 19803708 18865502 18121189 17194658 16136938 15179534 14372519 13880349 13517282 13062160
44444A3062160m02889q23107n77632l50924m73153l87538o92324l27067n65570
$$ 13062160 12659271 11836164 11258532 10907608 10434455 10046917 9354593 9027526 8461956
44435H461956n12848j77636l63401n53592m99601L5860J29123J50981m19631n10689
$$ 8461956 7949108 7771472 7408071 6854479 6354878 6390738 6519861 6670842 6251211 5740522
44425E740522k16503L9591k38431k83326J6216k67476k13486o84791k59083J42565
$$ 5740522 5524019 5563610 5325179 5041853 5058069 4790593 4577107 3892316 3633233 3775798
44415C775798l388l06339l27046M1068j7330k84414l1366K07877k94315j00657
$$ 3775798 3772410 3466071 3139025 3180093 3162763 2878349 2846983 3054860 2760545 2659888
44405B659888k54522j3253K91407N3842L32655k80477j26222j1822O8755R76l04845
$$ 2659888 2405366 2392113 2683520 2737362 3070017 2789540 2663318 2651496 2720251 2721227 2416382
44394B416382J3011J90502Q3662l46807J44090j11840n84772L54675k9723k32974
$$ 2416382 2429393 2619895 2703557 2356750 2500840 2389000 1804228 2158903 2129180 1896206
44384A896206l2543k69210K45390K22621l31471j93963J24983j47524k24113L32393
$$ 1896206 1863663 1594453 1839843 2062464 1730993 1537030 1662013 1514489 1290376 1622769
44374A622769k29629l92097q4138L66178K06434k4976l04156j34220J38852M8133
$$ 1622769 1393140 1001043 916905 1283083 1489517 1464541 1160385 1026165 1165017 1213150
44364A213150L48862n6724l59364k50165j16158K02838K06754J81500q8382p45688
$$ 1213150 1562012 1505288 1145924 895759 779601 982439 1189193 1370693 1282311 536623
44354E36623J10506p3941l7655N3272K25090J49954J06770L53603P3546n81585
$$ 536623 647129 573188 535533 588805 813895 963849 1070619 1424222 1497768 916183
44344I16183L53344L7337l18592P6544J8748J41995J43441p7431n91631J90737
$$ 916183 1269527 1306864 988272 1064816 1083564 1225559 1369000 1291569 699938 890675
44334H90675J40309k29812k61356N19887K72223K26461k77092k23793j80733l23
$$ 890675 1030984 801172 539816 1059703 1331926 1558387 1281295 1057502 876769 876446
44324H76446R1069K77015k61538j71704M5963K6557J26030j15283r9304q5658
$$ 876446 967515 1244530 982992 811288 857251 883808 1009838 894555 795251 709593
44314G09593j293j35633J33880k0033q2037L06291j55329j1430K61259r383k03265
$$ 709593 708300 572667 706547 686514 604477 910768 755439 744009 1005268 995885 792620
44303G92620k23149j22462M34432k35718k49417j45811J46963L9727K66070N0016
$$ 792620 569471 447009 881441 645723 396306 250495 397458 437185 703255 753271
44293G53271o6148P683j36158L06527o2493j74942J80404J97015N15355J71775
$$ 753271 687123 694806 558648 865175 802682 627740 808144 1005159 1520514 1692289
44283A692289l07529k43379N44891J11031k45793k01044P9269o160J20730K76345
$$ 1692289 1384760 1141381 1686272 1797303 1551510 1350466 1429735 1423575 1544305 1820650
44273A820650k16624K35074J95836l32530m36600J1630n3913k41595k22771R2647
$$ 1820650 1604026 1839100 2034936 1702406 1265806 1277436 1223523 981928 759157 851804
44263H51804j29855m98463J67458J04507N5974L55795j31647j01199j07621n7702
$$ 851804 721949 223486 390944 495451 551425 907220 775573 674374 566753 509051
44253E09051K18189p0408K4423K01483j68868k30051j66435n2005M5775K63804
$$ 509051 727240 656832 681255 882738 713870 483819 317384 265379 311154 574958
44243E74958R9123J19808j60566j5773K66123j24255n96039k19695K13142L10908
$$ 574958 674081 793889 633323 617550 883673 759418 163379 -56316 156826 467734
44233D67734j0660P6945j35012K12344p5243n79430l7513K09540Q8492J46188
$$ 467734 457074 534019 399007 611351 536108 -43322 -80835 128705 217197 363385
44223C63385n4760k05360R0608K62205m77299Q0645p1718j13634J93228J92071
$$ 363385 308625 103265 193873 456078 -21221 59424 -12294 -125928 67300 259371
44213B59371L18736K45814K46821l39014j41251k02600j03127j507K194K54369
$$ 259371 578107 823921 1070742 731728 590477 387877 284750 283243 285437 539806
44203E39806k41184J0616P2949k01501J21160K43290m68808J25809L29324P2222
$$ 539806 298622 309238 382187 180686 301846 545136 76328 202137 531461 603683
44193F03683J72990k4329n5171r9941k07531o1191K51714J72651m67462n4376
$$ 603683 776673 752344 697173 597232 389701 328510 580224 752875 285413 231037
44183B31037Q266j11153j04428R8132J745J8994K1600N686j95005J3334K74655
$$ 231037 239303 128150 23722 121854 123599 142593 164193 169879 -25126 -11792 262863
44172B62863P2417m6602J46382N4471j4660L84376k38687k2523k47803L827j49082
$$ 262863 335280 288678 435060 489531 474871 859247 620560 598037 350234 354061 204979
44161B04979j53547L78393K0833J40997k9824n32708j56942j288L92905K00198
$$ 204979 51432 429825 450658 591655 561831 29123 -127819 -129107 263798 463996
44151D63996m5780p3343Q5933K01528j01055l42521N8589J92962n1805n2134J88241
$$ 463996 418216 344873 430806 632334 531279 188758 247347 440309 388504 336370 524611
44140E24611m73065O1884R7407J69854J32304m5116P8775l10594k128o82618j66997
$$ 524611 51546 113430 210837 380691 512995 467879 546654 236060 233932 -448686 -615683
44129f15683J97419L80748L85529K08418j60756k45978J9709p4147M023L68188
$$ -615683 -418264 -37516 348013 556431 395675 149697 169406 95259 99282 467470
44119D67470K51018m30830N3062m0748J0096K71936j74654m22120M2018L40367
$$ 467470 718488 287658 340720 299972 310068 582004 407350 -14770 27248 367615
44109C67615N27199j83640J3646J08487o49880m09473K73388N57123J0873l78527
$$ 367615 894814 711174 724820 833307 183427 -226046 47342 604465 615338 236811
44099B36811j26767L3011K50202J90853j05924j40089j35800r9108j74690J85456
$$ 236811 110044 143055 393257 584110 478186 338097 202297 103189 -71501 113955
44089A13955L34464j48133o3716K6852L55628m1776n39186k88148J6944J73209
$$ 113955 448419 300286 236570 263422 619050 577274 38088 -250060 -233116 -59907
44079e9907q5960K85551J08689j60047J71201M07131j89018j03525o2766j36052
$$ -59907 -145867 139684 248373 88326 259527 666658 477640 374115 311349 175297
44069A75297j66396L05689J27934K4518j7568O1686J87747J95941k16859k21486
$$ 175297 8901 314590 442524 467042 449474 511160 698907 894848 677989 456503
44059D56503L30310L4787m08578n59278J53354J42512K90084p9505m27307n13243
$$ 456503 786813 821600 413022 -146256 7098 149610 439694 360189 -67118 -580361
44049e80361J3122J12929L97366L73041l1010j42759P2878K16000K73235l00346
$$ -580361 -567239 -454310 -56944 316097 285087 142328 215206 431206 704441 404095
44039D04095K36412J77770j81130J5536k35301k54312q5299J09170j80184J5657
$$ 404095 640507 818277 637147 652683 417382 163070 77771 186941 6757 22414
44029B2414J83472j96803l13748J57800L55232J91882j95380L7850k74999m6602
$$ 22414 205886 9083 -304665 -146865 208367 400249 204869 242719 -32280 -78882
44019g8882J53912J39695K53118k32763J32333K56801m87378p7866P15455j67701
$$ -78882 75030 214725 467843 235080 367413 624214 136836 58970 774425 606724
44009F06724n27045p4739k91053J16210k48081J65405K07319q4263j1646K0263
$$ 606724 79679 4940 -286113 -169903 -417984 -252579 -45260 -129523 -141169 -120906
43999a20906J0790l29261L45716K37114n07771L6421K62598L73816L37606k26571
$$ -120906 -110116 -439377 -93661 143453 -364318 -327897 -65299 308517 646123 419552
43989D19552l34964K36932j09967K51512J11179J8530k51122l8107J37476l01271
$$ 419552 84588 321520 211553 463065 574244 592774 341652 303545 441021 139750
43979A39750K9891J89840r6030j85676r4444J15306K28195k69260L57026j56324
$$ 139750 169641 359481 263451 77775 -16669 98637 326832 57572 414598 258274
43969B58274n08136m65752P4118L82694N4672O7255j60059m9405Q32950K6791
$$ 258274 -249862 -715614 -641496 -258802 -204130 -136875 -296934 -346339 486611 513402
43959E13402k00135n071k07467J53351k02455o8923J05291K50488K35090j07935
$$ 513402 313267 308196 100729 254080 51625 -17298 87993 338481 573571 465636
43949D65636l31178l08776K25447K94880O3964j67797P04912k70610J0795J27901
$$ 465636 134458 -174318 51129 346009 409973 242176 947088 676478 687273 815174
43939H15174n45859l11828p516K14437K26720N0970K22666K7282j39471J68933
$$ 815174 269315 -42513 -50029 164408 391128 442098 664764 692046 552575 721508
43929G21508k19217k68903k31697L13177J09303l58145Q7172K74671J16021p42973
$$ 721508 502291 233388 1691 314868 424171 66026 153198 427869 543890 -199083
43919a99083l96460K23583n4587j6392L98833o8958J74435j04827L5094K25926
$$ -199083 -595543 -371960 -426547 -442939 -44106 -113064 61371 -43456 -8362 217564
43909B17564o5711p6086L439n49007P0647J5672N86120K51788k79037k24676L79284
$$ 217564 151853 75767 79206 -469801 -399154 -383482 202638 454426 175389 -49287 329997
43898C29997j11015l64197K73108J35824P8646M4348l53526j94804M4902M6559
$$ 329997 218982 -145215 127893 263717 342363 386711 33185 -161619 -116717 -70158
43888g0158J89516K83541j27087l54305K78176Q5363j7882l619j42852j65307
$$ -70158 119358 402899 275812 -78493 199683 285046 267164 263545 120693 -44614
43878d4614K7223P7701J93176J4954m1182J67769r1087p239J28019k86824K71651
$$ -44614 -17391 60310 253486 268440 227258 395027 303940 296701 424720 137896 409547
43867D09547J67360j22249l35163K9665k25042l2598K09837q5822o42371L33333
$$ 409547 576907 454658 119495 149160 -75882 -108480 101357 15535 -626836 -293503
43857b93503J27780P8436L57436J54591Q3902l86004k65043L03979Q0150l27503
$$ -293503 -165723 -87287 270149 424740 508642 122638 -142405 161574 241724 -85779
43847h5779l2219K46076J6712J31883K2482k64369j68361J16821J18187N7288
$$ -85779 -117998 128078 144790 276673 299155 34786 -133575 -16754 101433 158721
43837A58721M49383J05640m39139O3034l37873j55231J04091K99364K63778k2861
$$ 158721 608104 713744 274605 337639 -234 -155465 -51374 247990 511768 488907
43827D88907J32902o3199k29343l61544K85684M81575n6397m9856J59820l25411
$$ 488907 621809 558610 329267 -32277 253407 734982 678585 628729 788549 463138
43817D63138l9002R8883j77467n9468k34148K7989K55530l68716M02553p2684
$$ 463138 424136 523019 345552 286084 51936 79925 335455 -33261 369292 296608
43807B96608l44053r2779L43014L73551j62600r660j08280p3311j8490L6256K37010
$$ 296608 -47445 -140224 202790 576341 413741 404081 295801 222490 204000 240256 477266
43796D77266P0007j21030k25728j2887l18109J04646J50345Q7687l51654r041
$$ 477266 547273 426243 200515 187628 -130481 -25835 124510 212197 -139457 -148498
43786a48498K64027K32669j38970l70793j67920L04720K56426k68231P0567j1160
$$ -148498 115529 348198 209228 -161565 -329485 -24765 231661 -36570 33997 22837
43776B2837R2050l4187j82033L97699K66813k10239k64437J14532l03114K05337
$$ 22837 114887 80700 -101333 296366 563179 352940 88503 203035 -100079 105258
43766A05258l3187j93533O8256m6792j6371n0431k92588J89743N29713L57666
$$ 105258 72071 -121462 -53206 -99998 -116369 -166800 -459388 -269645 260068 617734
43756F17734L67j11685N7386M3017m08235k3252q4078j59153M1004L53836k82716
$$ 617734 618101 506416 563802 606819 198584 175332 91254 -67899 -26895 326941 44225
43745D4225m02461M96287L75898k47402L31696K42530o30702j9128L331k38470
$$ 44225 -358236 138051 513949 266547 598243 840773 210071 190943 194274 -44196
43735d4196m2173J23442M6043j38425R8397j37441l35973J73969L12370L6442
$$ -44196 -86369 37073 83116 -55309 43088 -94353 -430326 -256357 56013 92455
43725I2455j88107Q3474L41834n7077m87983J01476L17688J68021k71392O9584
$$ 92455 -95652 -12178 329656 272579 -215404 -113928 203760 371781 100389 169973
43715A69973J69108l43706l19267M18437K11652k19975K29466K51638l49781J41277
$$ 169973 339081 -4625 -323892 94545 306197 86222 315688 567326 217545 358822
43705C58822O9395l30277q9542n0630J95785r5686l08923N55752J36343l9047
$$ 358822 428217 97940 8398 -42232 153553 57867 -251056 304696 441039 401992
43695D01992l07684N6791J9610k5464j62387k40249j9411N01999J86128l38657
$$ 401992 94308 151099 170709 145245 -17142 -257391 -276802 225197 411325 72668
43685G2668k19166j74978r1367Q5889J94971L51169P9736j21894Q1753p745J1310
$$ 72668 -146498 -321476 -412843 -326954 -131983 219186 298922 177028 258781 251036 262346
43674B62346j20663l77378J29479K83127J18377j33139l86537J58870P1321k01593
$$ 262346 141683 -235695 -106216 176911 295288 162149 -224388 -65518 5803 -195790
43664a95790L23410l300k37322M4772K94558K33949l49217k23806J6984Q8330
$$ -195790 127620 124320 -113002 -68230 226328 460277 111060 -112746 -95762 -7432
43654g432N32406n32666j98946K98264J89494Q2232j45402m69889J22176K38931
$$ -7432 524974 -7692 -206638 91626 281120 363352 217950 -251939 -129763 109168
43644A09168R1454j10566R8399j18662K23038q2765j3517K52299m32866m00850
$$ 109168 200622 90056 188455 69793 292831 210066 196549 448848 15982 -384868
43634c84868J53213M98269l09908J38378k9618j75850j14169J32531j9303J06018
$$ -384868 -231655 266614 -43294 95084 65466 -110384 -224553 -92022 -111325 -5307
43624e307J52577L0455p287k17771L2822j09559l16396L8561N9631j02254P9187
$$ -5307 147270 177725 170438 -47333 -14511 -124070 -440466 -401905 -342274 -444528 -365341
43613c65341M53405O6444l10019j03301P4932L11691J33298k97992K89544k69837
$$ -365341 88064 154508 -155511 -258812 -183880 127811 261109 -36883 252661 -17176
43603a7176k03624O0437p955L94681O00709o2908o79904K3851J23011l3865J72240
$$ -17176 -220800 -160363 -168318 226363 827072 764164 84260 108111 231122 197257 369497
43592C69497J02718M4490P458j65625k75287J17685N749R0823J93546N73593l18834
$$ 369497 472215 516705 524163 358538 83251 200936 206685 297508 491054 1064647 745813
43581G45813n75875L4406K30037j02062K76615o2062k02837L06281M16240k92475
$$ 745813 169938 204344 434381 332319 608934 546872 344035 650316 1066556 774081
43571G74081l51894l07846k90266K95690J07628l05005O728L05548M0939n0961
$$ 774081 422187 114341 -175925 119765 227393 -77612 -70884 234664 275603 224642
43561B24642J56097j17186L1007q6467l11810M8288j09255m72292M15767N50319
$$ 224642 380739 263553 294560 208093 -103717 -55429 -164684 -636976 -221209 329110
43551C29110J9917r7551j56978j82421J74267M9560N9896k86048L42756K0595
$$ 329110 349027 251476 94498 -87923 86344 135904 195800 -90248 252508 273103
43541B73103l21544M7208J1876J53851K67711j50086k03709K30999J42611j54157
$$ 273103 -48441 -1233 10643 164494 432205 282119 78410 309409 452020 297863
43531B97863J55730k51005q8233m8470k81918o1415J95980J89458l28432M83470
$$ 297863 453593 202588 114355 65885 -216033 -277448 -81468 107990 -220442 263028
43521B63028K91814k40632M07370O7589m43891n63257J93638J21012J64479l41763
$$ 263028 554842 314210 721580 789169 345278 -217979 -24341 96671 261150 -80613
43511h0613r4318J45590K76065j11779j50443N9261j16550k71572o5800O17150
$$ -80613 -174931 -29341 246724 134945 -15498 43763 -72787 -344359 -410159 206991
43501B06991o6059l37939N0133K0728j50217m8089L71098N3328K4008j48068k163
$$ 206991 140932 -197007 -146874 -126146 -276363 -324452 46646 99974 123982 -24086 -26249
43490b6249k03520q4233r2004J96950M54229O5287J04081n10264k15269L71821
$$ -26249 -229769 -314002 -406006 -209056 245173 310460 414541 -95723 -310992 60829
43480F0829J9819m80529k44716M47505M29503K74779l13219j1287J15234K55887
$$ 60829 80648 -399881 -644597 -197092 232411 507190 193971 182684 297918 553805
43470E53805m228N54560k91631j141697L39083k92434k32433K98776J41689j20088
$$ 553805 549577 1104137 812506 -329191 9892 -282542 -514975 -216199 -74510 -194598
43460a94598j40282L28736Q2246k00260J7809J93181J31092l08842j1538k82390
$$ -194598 -334880 -6144 76102 -124158 -106349 86832 217924 -90918 -102456 -384846
43450c84846L15930L88936j74042O5403P2159j52028l2145k16840K2010J35213
$$ -384846 -68916 320020 145978 211381 283540 131512 99367 -117473 -95463 39750
43440C9750L75264j3066k03266N1228j28569k47423N105k4468L483M5972l5358
$$ 39750 415014 401948 198682 249910 121341 -126082 -120977 -145445 -141962 -95990 -131348
43429a31348j84733N60338J48842o15985j50703J63345L256m7549P0483R0096
$$ -131348 -316081 244257 393099 -222886 -373589 -210244 -206988 -254537 -184054 -93958
43419i3958N7433J40698l5681l02528J87085K64451o4315J596k73382L47822j81499
$$ -93958 -36525 104173 68492 -234036 -46951 217500 153185 154781 -118601 229221 47722
43408D7722m0328M01651o7083o0717K72697n3487j77298L24757j5999P0955j84720
$$ 47722 7394 409045 341962 281245 553942 500455 323157 647914 631915 702870 518150
43397E18150j31124o20917l61757l9953r767R4264O15744R4762j30178r7321l31628
$$ 518150 387026 -233891 -595648 -635601 -645368 -551104 64640 159402 29224 -68097 -399725
43386c99725J25797K68665J31963m35737J85220L88178J11378J4036j15122l18405
$$ -399725 -273928 -5263 126700 -309037 -123817 264361 375739 389775 274653 -43752
43376d3752K4521M15786n9575j28890j61149q5379K82176J32324j64496l48720
$$ -43752 -19231 396555 336980 208090 46941 -38438 243738 376062 211566 -137154
43366a37154k55005M61994N555Q5943j4903O2018M04130l16599K29453J54419
$$ -137154 -392159 69835 75390 161333 146430 208448 612578 295979 525432 679851
43356F79851j15645n74666J61822J24290K8291k49420K71424j25255P6154R37
$$ 679851 564206 -10460 151362 275652 303943 54523 325947 200692 276846 277783
43346B77783n01597K33329r1169J17327M7990j03724m8748L72046J14410j6321
$$ 277783 -223814 9515 -81654 35673 83663 -20061 -68809 303237 417647 401326
43336D01326m6655l25417l62217L18736M14719n7731j93577k85868O7145L97625
$$ 401326 354671 29254 -332963 -14227 400492 342761 149184 -136684 -69539 328086
43326C28086k75983l98956p8387J81840j31808L87693p0026j27242j08568Q1289
$$ 328086 52103 -346853 -425240 -243400 -375208 12485 -57541 -184783 -293351 -212062
43316b12062K93137l24997k41485j48742J45295M32917M60443M451k46034m75061
$$ -212062 81075 -243922 -485407 -634149 -488854 -55937 404506 408957 162923 -312138
43306c12138j53782K91010N50942J47051p4938K61828j50982o31315k22805M13971
$$ -312138 -465920 -174910 376032 523083 448145 709973 558991 -72324 -295129 118842
43296A18842K19587n23496M6901o1182J2757L81218M24374J4470l83793L12801
$$ 118842 338429 -185067 -138166 -199348 -186591 194627 619001 633471 249678 562479
43286E62479J33609p2929k61170m95892k2254l46571K06419L6241j20101K00187
$$ 562479 696088 623159 361989 -133903 -156157 -502728 -296309 -260068 -380169 -179982
43276a79982L92228N7112J58599k11218j07500Q5659K7063L89341K66336n57491
$$ -179982 212246 269358 427957 216739 109239 194898 221961 611302 877638 320147
43266C20147l25073J96770J03672j75311J64745J73506l4190l17083M4236R0516
$$ 320147 -4926 191844 295516 120205 284950 458456 424266 107183 151419 241935
43256B41935j86830j06968n2769K95167K50946J72637m1949o06585J83343k4449
$$ 241935 55105 -51863 -104632 190535 441481 614118 572169 -34416 148927 124478
43246A24478K13204R7247o6167k13250k46872k51726K51276o9484K22492M48601
$$ 124478 337682 434929 368762 155512 -91360 -343086 -91810 -161294 61198 509799
43236E09799k47311K15511J87007m67233r3455M21488J21771k97998K40409J65005
$$ 509799 262488 477999 665006 197773 104318 525806 647577 349579 589988 754993
43226G54993q4957o2299J77213m75273k22701k12480k6308N06105j73189L35719
$$ 754993 670036 607737 784950 309677 86976 -125504 -151812 354293 181104 516823
43216E16823J77463k67496o7758l69030K40940L86612j32393k56138j55093L2202
$$ 516823 694286 426790 359032 -9998 230942 617554 485161 229023 73930 106132
43206A06132k26024R8597P4162l03261J4900O7549L8624K04073k90446J70689
$$ 106132 -119892 -21295 52867 -250394 -235494 -167945 -129321 74752 -215694 -45005
43196d5005L11283l71699P2557l0092K80925M3477k65501j8608j48641J41098
$$ -45005 266278 -105421 -32864 -62956 217969 261446 -4055 -22663 -171304 -30206
43186c0206J47946j98723L18195j51769n23244O30168J17042m15825k70095L27670
$$ -30206 117740 -80983 237212 85443 -437801 192367 309409 -106416 -376511 -48841
43176d8841J35686J51936J36380l4756j10073N2853l14636n2458M85494O344j85958
$$ -48841 86845 238781 375161 340405 230332 283185 -31451 -83909 401585 407929 221971
43165B21971l3417j58491q5060K50485J51940K96643l9555p1283j01761j16312
$$ 221971 188554 30063 -54997 195488 347428 644071 604516 533233 431472 315160
43155C15160j48310K65333n1552L0540l01724l05805j32198L39414J89625n7939
$$ 315160 166850 432183 380631 411171 109447 -196358 -328556 10858 200483 142544
43145A42544K8726R1399k99897l06491K27056k7636O05397N00048k28268j84198
$$ 142544 171270 262669 -37228 -343719 -116663 -144299 461098 961146 732878 548680
43135E48680M3489l00579J86701K30942k41950l59564Q4096J50312m05831M9757
$$ 548680 592169 291590 478291 709233 467283 107719 191815 342127 -63704 -13947
43125a3947J46588J39377j78550m1061l9632J18063p9099j51244R528J8030L74824
$$ -13947 132641 272018 93468 52407 12775 130838 51739 -99505 -89977 -71947 302877
43114C02877k1693j90277L9747p4579n5532N25060j74503m8387l340l10646K8823
$$ 302877 281184 90907 130654 56075 543 525603 351100 302713 299373 -11273 17550
43103A7550Q7024K77762J0694k11077j93769L73287r1309l90582K5327J81756
$$ 17550 104574 382336 393030 181953 -11816 361471 270162 -120420 -95093 86663
43093H6663r2329N3758j21160M35413N8401J59841k34217l2831j18669j88047
$$ 86663 -5666 48092 -73068 362345 420746 580587 346370 313539 194870 6823
43083F823n4093J51602K97482k02393l3962k72130J02505P84706J01765n71632
$$ 6823 -47270 104332 401814 199421 165459 -106671 -4166 780540 882305 310673
43073C10673k64159p6391j7760J53870Q6693m2619k55950k23371l2800J11662
$$ 310673 46514 -29877 -47637 106233 192926 150307 -105643 -329014 -361814 -250152
43063b50152q1031L17234L4603K32167j41092K4465L00017J05924K67235m55408
$$ -250152 -331183 -13949 20654 252821 111729 136194 436211 542135 809370 353962
43053C53962m42194K3000M04893j23227K81870J019m25947K33154J16417j91586
$$ 353962 -88232 -65232 339661 216434 498304 499323 73376 306530 422947 231361
43043B31361l0733j93057P0842J07412m391m6234m5387J64960K31979j41303j04386
$$ 231361 200628 7571 78413 185825 181434 135200 89813 254773 486752 345449 241063
43032B41063P39296r8189k33753k68786K4168j89914r8413j55025P1258L68960
$$ 241063 980359 882170 648417 379631 403799 213885 115472 -39553 31705 400665
43022D00665j48247L8974j25414j14311Q254j17033Q3749M1295K20095K50483
$$ 400665 252418 291392 165978 51667 59921 -57112 26637 67932 288027 538510
43012E38510l90470p8399k65211n5812q0206J216O06330l4713K15930k79891j89390
$$ 538510 148040 69641 -195570 -251382 -331588 -330372 275958 241245 457175 177284 -12106
43001a2106J54766J5478N7973k11548N3289K36462J74182k94004J12704l85612
$$ -12106 142660 158138 216111 4563 57852 294314 468496 174492 287196 -98416
42991i8416j22413J71905K50120J1905k58695K56383o7101j00958K47438O3551
$$ -98416 -220829 -48924 201196 213101 -45594 210789 143688 42730 290168 353719
42981C53719l06622l63926M51619l0261j91322L5684l8379j97811L41472J56534
$$ 353719 47097 -316829 134790 104529 -86793 -51109 -89488 -287299 54173 210707
42971B10707k889m6884l7533K25020l20726L55070J55859j50543P0254j41689
$$ 210707 207818 160934 123401 348421 27695 382765 538624 388081 458335 316646
42961C16646J97920J72763R0810m0903l86016j20056j10520k0055J65643K23385
$$ 316646 514566 687329 778139 737236 351220 231164 120644 100589 266232 489617
42951D89617l6154J77403k83615p9897L94052k03868n58314m9124M9993L46001
$$ 489617 453463 630866 347251 267354 661406 457538 -100776 -149900 -99907 246094
42941B46094r7415j83735M40029j04152l53948N4308L14628K98595n1198K38922
$$ 246094 148679 -35056 404973 300821 -53127 1181 315809 614404 563206 802128
42931H02128k34731J09111j86487k09281l46909O7296n9761J20205m6820o2078
$$ 802128 567397 676508 490021 280740 -66169 1127 -58634 61571 14751 -47327
42921d7327K20666n1862J11777K46245j62147j16146m53828K0007K93273J39303
$$ -47327 173339 121477 233254 479499 317352 201206 -252622 -232615 60658 199961
42911A99961J83437P9377M10R1208j66324L3851j68417P9911R5936J8182n71439
$$ 199961 383398 462775 463185 554393 388069 421920 253503 333414 429350 447532 -123907
42900a23907k10252K31885L1160M560N2637j73623l729j60952j9502M23385k65945
$$ -123907 -334159 -102274 -71114 -66554 -13917 -187540 -191269 -352221 -371723 51662 -214283
42889b14283J83402J51738J6492j00180k25968j17913J48302j48364L4654L20850
$$ -214283 -30881 120857 137349 37169 -188799 -306712 -158410 -306774 -272120 48730
42879D8730K16260k52880r3436K55689Q2878J03116q307k60762n5263j68316l9455
$$ 48730 264990 12110 -81326 174363 257241 360357 352050 91288 36025 -132291 -171746
42868a71746Q1520K35160o5252j17158k51162q4036l723L23006j27145P6716R7105
$$ -171746 -90226 144934 79682 -37476 -288638 -372674 -376397 -53391 -180536 -103820 -6715
42857f715j31925J96356m453m4366K28869K07356k58754K60919J91493k37796
$$ -6715 -138640 57716 53263 8897 237766 445122 186368 447287 638780 400984
42847D00984n15992l0014M72501k95507Q1730K08748K07991k06128l16070Q4051
$$ 400984 -115008 -145022 327479 31972 113702 322450 530441 324313 8243 92294
42837I2294M43304m01254j66472J63132j91778j65432j99739O5400O0428o9916
$$ 92294 535598 134344 -32128 131004 -60774 -226206 -425945 -360545 -300117 -370033
42827c70033L5427M84649L10724J51955q0070q1259L2280j01717n0881K17960
$$ -370033 -334606 150043 460767 612722 532652 451393 483673 381956 331075 549035
42817E49035J90295k80693l10306p1189R2089K2437j72295o2126k03033K26492
$$ 549035 739330 458637 148331 77142 169231 191668 19373 -42753 -245786 -19294
42807a9294M7948K15704m91356j13568K27770K26864K70898j76070q7799J70923
$$ -19294 28654 244358 -246998 -360566 -132796 94068 364966 188896 101097 272020
42797B72020M06078k80390O0273k80113L5319M49318l98961k02517j58131m04480
$$ 272020 678098 397708 457981 177868 213187 662505 263544 61027 -97104 -501584
42787e01584M18731K63152m7321j75616K36835Q8102k29871r6276M94616j84584
$$ -501584 -82853 180299 132978 -42638 194197 282299 52428 -43848 450768 266184
42777B66184p9752j76354M42137L1039l27727j22464N0992m2064k55446j63039
$$ 266184 186432 10078 452215 483254 155527 33063 84055 41991 -213455 -376494
42767c76494K25926j14963J963J60083j12994j19808K49725K21945Q7152j6153
$$ -376494 -150568 -265531 -263568 -103485 -216479 -336287 -86562 135383 222535 206382
42757B06382l85532q5105J51675K10338l09169J67611J28381k69978K53210L71499
$$ 206382 -179150 -264255 -112580 97758 -211411 -43800 84581 -185397 67813 439312
42747D39312K07973r4478k51160j23186J99776m25976k28521O0633M4016K82701
$$ 439312 647285 552807 301647 178461 378237 -47739 -276260 -215627 -171611 111090
42737A11090j45743o4158j72388k20560J46263K40306L53771j02180j88469J20780
$$ 111090 -34653 -98811 -271199 -491759 -345496 -105190 248581 146401 -42068 78712
42727G8712J35408l64550j49994r715l3421J03260L97930J75675Q2476R8736j77332
$$ 78712 214120 -150430 -300424 -310139 -343560 -240300 157630 333305 415781 514517 337185
42716C37185K92432K02162m25739m44440j79894M18562o5736J56957p3134l69670
$$ 337185 629617 831779 406040 -38400 -218294 200268 134532 291489 218355 -151315
42706a51315k33325j36521k33602N5370K92337n916N2786K52271J8950J37693
$$ -151315 -384640 -521161 -754763 -699393 -407056 -412972 -360186 -107915 -88965 48728
42696D8728j77609l27861L67564L26217J96421m47095m39496j27598q8785R1291
$$ 48728 -128881 -456742 -89178 237039 433460 -13635 -453131 -580729 -669514 -578223
42686e78223L38820M3995L27240j62655N6311L35229o08483J50955J52518r1173
$$ -578223 -239403 -195408 131832 -30823 25488 360717 -247766 -96811 55707 -35466
42676c5466K77037J83102m059J36691m30747j29167P5728L97402l75666K2828
$$ -35466 241571 424673 420614 557305 126558 -2609 73119 470521 94855 117683
42666A17683K13847L9494M36632K5844o19234j62673K14180n1096l33554k50659
$$ 117683 331530 371024 807656 833500 214266 51593 265773 214677 -118877 -369536
42656c69536M32952J4848K4724j69676P1388J66504p8559K53955p2718l03344
$$ -369536 63416 78264 102988 -66688 4700 171204 92645 346600 273882 -29462
42646b9462j18661J06651k0564L59852J91808j1437n866l09682K00907R323J41622
$$ -29462 -148123 -41472 -62036 297816 489624 478187 472321 162639 363546 372869 514491
42635E14491j26802k53584K86419J32288k27350m34940K561j06837r6315J56177
$$ 514491 387689 134105 420524 552812 325462 -109478 -106917 -213754 -310069 -153892
42625a53892O76676l42869j15083k04500Q070K0180n9042M7601J35324j25815
$$ -153892 522784 179915 64832 -139668 -131598 -111418 -170460 -122859 12465 -113350
42615a13350j64059p5252K5107N27717N7934M6740j73310L34910R0742m05325
$$ -113350 -277409 -352661 -327554 200163 258097 304837 131527 466437 557179 151854
42605A51854J2990M45900j52788l40705M06529L6834k02768j7468Q6323l67215
$$ 151854 164844 610744 457956 117251 523780 560614 357846 340378 426701 59486
42595E9486j19723k1507J69024J67773j29729r7831j7281m6586P0384J00031M3405
$$ 59486 -60237 -81744 87280 255053 125324 27493 10212 -36374 34010 134041 177446
42584A77446o2174Q0559j13956K12272k8006k82872M0141k00549j1703J57026
$$ 177446 115272 195831 81875 294147 266141 -16731 23410 -177139 -188842 -31816
42574c1816r0685n9017J38017R4293j26890k56245k17359M0916m4016L36366L16121
$$ -31816 -122501 -181518 -43501 50792 -76098 -332343 -549702 -508786 -552802 -216436 99685
42563I9685J4598N4089l83031J12224j62772N73815M81114l51145j4118M0096
$$ 99685 114283 168372 -214659 -102435 -265207 308608 789722 438577 424459 464555
42553D64555l97997j46651j84225K20913R475N5966q5914l46299L4203L98734
$$ 464555 66558 -80093 -264318 -43405 -33930 22036 -63878 -410177 -375974 22760
42543B2760J35526j69945k1897J48220j17566l1755m734L36493N9237k16149m00721
$$ 22760 158286 -11659 -33556 114664 -2902 -34657 -39391 297102 356339 140190 -260531
42532b60531o1982K8702n05363J23487N40589l0354M87788r6936m41003j97851
$$ -260531 -322513 -293811 -799174 -675687 -135098 -165452 322336 225400 -215603 -413454
42522d13454L07423K78975j48650J88108r4619O1072l466J75630n8849k66548
$$ -413454 -106031 172944 24294 212402 117783 178855 175389 351019 292170 25622
42512B5622m97842L5554L37258j223j22702k6573N633j66652K95833p0177o19709
$$ 25622 -472220 -436666 -99408 -100631 -223333 -249906 -244273 -410925 -115092 -185269 -804978
42501h04978J73910o7434O26227O0821N2708N89074J45642l64647j60969L5971
$$ -804978 -631068 -698502 -72275 -11454 41254 630328 775970 411323 250354 286325
42491B86325j39138p5862N066l2557J83005J49861p9067m34498j64157j94736
$$ 286325 147187 71325 76391 43834 226839 376700 297633 -136865 -301022 -495758
42481d95758O8903K53892K35653l71740N12206J64876K0522R0090k19692j22852
$$ -495758 -426855 -172963 62690 -309050 203156 368032 388554 478644 258952 136100
42471A36100L2962o2380m8712l45635l7290J10823j97595N6113m0347k0989J70391
$$ 136100 169062 106682 57970 -287665 -324955 -214132 -411727 -355614 -395961 -416950 -246559
42460b46559K24941J84833J05194J66644k95004k38499p5488K54254K79082m744
$$ -246559 -21618 163215 268409 435053 140049 -98450 -173938 80316 359398 354654
42450C54654M4845K30114M0575p85970K23853K40291n18752j00199L23975L13435
$$ 354654 399499 629613 670188 -115782 108071 348362 -170390 -270589 53386 366821
42440C66821j20157O3964p1756n5151l47543K05926L9491k20713J10877k71529
$$ 366821 246664 310628 238872 183721 -163822 42104 81595 -139118 -28241 -299770
42430b99770l65365J20731J76627K19151l09715J44800j60426R5755K70062j64885
$$ -299770 -665135 -544404 -367777 -148626 -458341 -313541 -473967 -378212 -108150 -273035
42420b73035N9689K93283l17139L694M02924L4005Q4533j52508O1690l18832q9596
$$ -273035 -213346 79937 -237202 -233508 169416 203421 287954 135446 197136 -121696 -211292
42409b11292J09844k8217k9266k10151j04010M31103M9696K04371R1946L2548
$$ -211292 -101448 -129665 -158931 -369082 -473092 -41989 7707 212078 304024 336572
42399C36572j07190L46026L14383j94697l06823l48009J83273L36012k51664j69214
$$ 336572 229382 575408 889791 695094 388271 40262 223535 559547 307883 138669
42389A38669o1846K21249j84590J01681O8265O3436p8981k01748j22007l4169
$$ 138669 76823 298072 113482 215163 283428 346864 267883 66135 -55872 -90041
42379i0041J21907Q7780j72595L7338K03342m3677J77507j42628N4975K22949
$$ -90041 31866 119646 -52949 -15611 187731 144054 321561 178933 233908 456857
42369D56857m56981k95538J19374j01873J54222L89345J47679k0520j01353j05144
$$ 456857 -124 -295662 -176288 -278161 -123939 265406 413085 392565 291212 186068
42359A86068J13280Q5590M03229k96897J00197j2522l24767j84496K89045j09559
$$ 186068 299348 384938 788167 491270 591467 578945 254178 69682 358727 249168
42349B49168l38528K04286J92351K26557k43489j91180q9799O4968N27246J34971
$$ 249168 -89360 114926 307277 533834 290345 99165 9366 74334 601580 736551
42339G36551m61250J70528m02446p4016j16109J03056J57055p7696K7769O17911
$$ 736551 275301 445829 43383 -30633 -146742 -43686 113369 35673 63442 681353
42329F81353k19289l0901l81968k65793K57501L10000k30882m955k75073J49191
$$ 681353 462064 431163 49195 -216598 40903 350903 120021 115066 -160007 -10816
42319a0816k2043R3321K16987n09113J36408R9964J3163k06507k90372L40828
$$ -10816 -32859 60462 277449 -231664 -95256 4708 17871 -188636 -479008 -138180
42309a38180J05237k38854L55559J38911j10199o3290K65894j5405k34130j88847
$$ -138180 -32943 -271797 83762 222673 112474 49184 315078 299673 65543 -123304
42299a23304K17639p4312J36424J92695l71410J39292Q5292O6747j6503K9259
$$ -123304 94335 20023 156447 349142 -22268 117024 202316 269063 252560 281819
42289B81819M78726o9756o02398n03015K70982k91507K12980M81414n04072q1163
$$ 281819 760545 690789 88391 -414624 -143642 -435149 -222169 259245 -244827 -325990
42279c25990K21986Q3003J5811K70933J4863J73685j36243m9497k0493N6638p1779
$$ -325990 -104004 -21001 -5190 265743 280606 454291 318048 268551 248058 304696 232917
42268B32917j48292m6437j65477m6229M7651R5928J54352j89092K10740r5727
$$ 232917 84625 38188 -127289 -173518 -125867 -29939 124413 -64679 146061 50334
42258E0334J50433K02555j66560J32759j77967k59401k9024L84115k05868l82024
$$ 50334 200767 403322 236762 369521 191554 -67847 -96871 287244 81376 -300648
42248c00648n5870j2187N26900L1816j11123k46455J17971K26569j65541j03661
$$ -300648 -356518 -368705 158195 190011 78888 -167567 -49596 176973 11432 -92229
42238i2229J0686q0160J2773J07287k76448J64843L91176l8922l37686j01233
$$ -92229 -81543 -161703 -148930 -41643 -318091 -153248 237928 199006 -138680 -239913
42228b39913K55780K13159Q0091j65632n0722L883R2858m5521k22688J89411L48342
$$ -239913 15867 229026 309117 143485 92763 96646 189504 143983 -78705 110706 459048
42217D59048k50709k70911L1617j18504K78041J91654j28705J86413j01019J2703
$$ 459048 208339 -62572 -30955 -149459 128582 320236 191531 377944 276925 289628
42207B89628K9414o04794k03632L97675K83947o514k2881k23654R622R1615j14346
$$ 289628 319042 -285752 -489384 -91709 192238 185724 162843 -60811 -51189 40426 -73920
42196g3920q2345k4127L23995k82293L52473l59714J66651J00759m35478O68549
$$ -73920 -156265 -180392 143603 -138690 213783 -145931 20720 121479 -313999 354550
42186C54550j79691J43150k25505K63162L05681l93653j40710L30944m68389K6135
$$ 354550 174859 318009 92504 355666 661347 267694 126984 457928 -10461 15674
42176A5674n7608l52929j8246L37045j37068J32129m5616m7018L34415j06626
$$ 15674 -41934 -394863 -413109 -76064 -213132 -81003 -126619 -173637 160778 54152
42166E4152J28434L36204l59422k12237R0973J07409J58417j11412j59332M383
$$ 54152 182586 518790 159368 -52869 38104 145513 303930 192518 33186 37569
42156C7569l76893Q332P9123j31288O61108N32438n58383l29482J2985J17130
$$ 37569 -339324 -330992 -251869 -383157 277951 810389 252006 -77476 -64491 52639
42146E2639m16569k68413M44248K04553N08914k42622j03287O2698j87096l69130
$$ 52639 -363930 -632343 -188095 16458 525372 282750 179463 242161 55065 -314065
42136c14065M2892K83196L40269K3661j23261k71690K00806r9383J1461K36019
$$ -314065 -271173 12023 352292 375953 252692 -18998 181808 82425 93886 329905
42126C29905j55807l84471k01800M1424n1215R4904K96722J41450l19668J56519
$$ 329905 174098 -210373 -412173 -370749 -421964 -327060 -30338 111112 -208556 -52037
42116e2037j21216l64210J29276k4484J75879J50448J44479j13341j93575K52726
$$ -52037 -173253 -537463 -408187 -432671 -256792 -106344 38135 -75206 -268781 -16055
42106a6055K16618j35469N0857K2867O2532R4753k73137k35712m5806J98688J01498
$$ -16055 200563 65094 115951 138818 201350 296103 22966 -212746 -258552 -59864 41634
42095D1634l8018J58703L13559k94429o9685J9196r2981q5952k15121j34097j19776
$$ 41634 3616 162319 475878 181449 111764 130960 37979 -47973 -263094 -397191 -516967
42084e16967m8432J87390N21867q7895K45027J30728J79276j52507k10477j06195
$$ -516967 -565399 -378009 143858 55963 300990 431718 610994 458487 248010 141815
42074A41815k8451K6010R0434J02940j34539L59325j0074m57291K2647L54196
$$ 141815 113364 139374 229808 332748 198209 557534 547460 90169 112816 467012
42064D67012k39520l83094N7817N8076M2867l82908N6255K08912J53481m6812
$$ 467012 227492 -155602 -97785 -39709 3158 -379750 -323495 -114583 38898 -7914
42054g914O0348j57243k33645J69369L22254Q6083O9869o9855m01995m8817N21033
$$ -7914 52434 -104809 -338454 -169085 153169 239252 309121 239266 -162729 -211546 309487
42043C09487r2546l05208J83404J53561R2539J09297k55161j0582q9458p7092
$$ 309487 216941 -88267 95137 248698 341237 450534 195373 184791 95333 18241
42033A8241j35831K4742K06533O3560j04672J46429j23931J14258L54936K46968
$$ 18241 -117590 -92848 113685 177245 72573 219002 95071 209329 564265 811233
42023H11233o1172j53309n66711r1049K19314J51940L05654K6990j73651l34608
$$ 811233 750061 596752 30041 -61008 158306 310246 615900 642890 469239 134631
42013A34631j21334o68510O07460L71714j79073k29238o3212m811K35858K36764
$$ 134631 13297 -655213 -47753 323961 144888 -84350 -147562 -152373 83485 320249
42003C20249j67045M62344L06406m06717o02358k44083k61553J03304L44868j13576
$$ 320249 153204 615548 921954 515237 -87121 -331204 -592757 -489453 -144585 -258161
41993b58161m3323j84298M08035J7463j06339K39063M9494j16411N67267J38622
$$ -258161 -301484 -485782 -77747 -60284 -166623 72440 121934 5523 572790 711412
41983G11412J12866j6237n08099M6403J23108n6567J71864K25065m41595m21686
$$ 711412 824278 808041 299942 346345 469453 412886 584750 809815 368220 -53466
41973e3466K03853M27379j36116j28035j96955J14221L66381j17075j63791j66837
$$ -53466 150387 577766 441650 313615 116660 230881 597262 480187 316396 149559
41963A49559K26806l19260k92949o9674N41760M6346o28155O5008O0372R0812
$$ 149559 376365 57105 -235844 -305518 236242 282588 -345567 -280559 -220187 -129375
41953a29375K39968k72438K34536K04412o54190K29771L37597k14224Q3407J32212
$$ -129375 110593 -161845 72691 277103 -377087 -147316 190281 -23943 59464 191676
41943A91676k5018m06934j2784r9446j31463j09931K36689N10686k4971q2676
$$ 191676 166658 -240276 -253060 -352506 -483969 -593900 -357211 153475 128504 45828
41933D5828O4669R906l732l64067p9196r7842J05139M23299j49893J6991M62132
$$ 45828 110497 120403 116671 -247396 -326592 -424434 -319295 104004 -45889 -28898 433234
41922D33234k51158j22532K1236j61124L5099K86526k2003k40821k84217j39159
$$ 433234 182076 59544 80780 -80344 -45245 241281 219278 -21543 -305760 -444919
41912d44919L18901J87253j62395J60581O29495J15252l63491l98492l68641n9771
$$ -444919 -126018 61235 -101160 59421 688916 804168 440677 42185 -326456 -386227
41902c86227J78152M25066j32716J96384k65584j80642J02279J08090O0163m1765
$$ -386227 -208075 216991 84275 280659 15075 -165567 -63288 44802 104965 63200
41892F3200L36686l52088k35594j35345R7696L48578J70569k10495r3623n5467
$$ 63200 399886 47798 -187796 -323141 -225445 123133 293702 83207 -10416 -65883
41882f5883j05857j96580j1313j72509L56052K22197J89097n5098k51143L19804
$$ -65883 -171740 -368320 -379633 -552142 -196090 26107 215204 160106 -91037 228767
41872B28767j83865o7443L54684M6483k44153K82469J88328l87543l18848j50525
$$ 228767 44902 -22541 332143 378626 134473 416942 605270 217727 -101121 -251646
41862b51646M91531n15313j94649m1434k91901M13941K63282k69881M98220J36251
$$ -251646 239885 -275428 -470077 -511511 -803412 -389471 -126189 -396070 102150 238401
41852B38401K77606k99303k87035J09303j73156K83796K23235l0914J89980k16770
$$ 238401 516007 216704 -70331 38972 -134184 149612 372847 341933 531913 315143
41842C15143k96599L03471l1558j13623k52136k51764J60583L28825l28264J08572
$$ 315143 18544 322015 290457 176834 -75302 -327066 -166483 162342 -165922 -57350
41832e7350L567k35773J49224K49828j96532k95282k44424j4269M18738J23707
$$ -57350 -53783 -289556 -140332 109496 -87036 -382318 -626742 -641011 -222273 -98566
41822i8566L75405j4731N3999L90283p87706L569K02862k49669K60821K52260
$$ -98566 276839 262108 316107 706390 -81316 -77747 125115 -124554 136267 388527
41812C88527k39705j6427q0765J00076k62015O3097N12680M3559l59754j74403
$$ 388527 148822 132395 51630 151706 -110309 -47212 465468 509027 149273 -25130
41802b5130k36861K20924J34376M2282L1284l07949J82881K21100j10358K42211
$$ -25130 -261991 -41067 93309 135591 166875 -141074 41807 262907 152549 394760
41792C94760o8913j17038o7508L1008j07312j97375j12705N09464K3450N341J29388
$$ 394760 325847 208809 141301 172309 64997 -132378 -245083 264381 287831 293172 422560
41781D22560J07749j9267m79787j14849q7540K48942o44137k19827K63503J98432
$$ 422560 530309 511042 31255 -83594 -171134 77808 -566329 -786156 -522653 -324221
41771c24221R5978K60470L72074n9968m57729J60697Q8651j38498k31418N4300
$$ -324221 -228243 32227 404301 344333 -113396 47301 135952 -2546 -233964 -179664
41761a79664L11703m8270J7288j86832m52955o3264L63381O62184M2443o0391
$$ -179664 132039 83769 101057 -85775 -538730 -601994 -238613 423571 466014 405623
41751D05623j79655J94560k31326M3738J65998k50684K84616l18262j61427J94745
$$ 405623 225968 420528 189202 232940 398938 148254 432870 114608 -46819 147926
41741A47926N9625r3911M28095k2446k27285k27634m07655J54352Q3599R3920
$$ 147926 207551 113640 541735 519289 292004 64370 -343285 -188933 -105334 -11414
41731a1414K86869n9460N3667K17811O4228j30615j43190l64091o93991M13197
$$ -11414 275455 215995 269662 487473 551701 421086 277896 -86195 -780186 -366989
41721c66989L12756k27438j77484K81354L52944J29293j55213m1283k44045J79492
$$ -366989 -54233 -281671 -459155 -177801 175143 304436 149223 107940 -136105 43387
41711D3387L25308J3945P3890k46954l50609M68848j97841k95881j27798j61379
$$ 43387 368695 382640 456530 209576 -141033 327815 129974 -165907 -293705 -455084
41701d55084k52136K67987M2556J6006M96005O4601K3319j44060j25830j49570
$$ -455084 -707220 -439233 -396677 -380671 115334 179935 203254 59194 -66636 -216206
41691b16206q3864J39939L13080J87902k32168j00883J08052k4627M6957J29444
$$ -216206 -300070 -160131 152949 340851 108683 7800 115852 91225 138182 267626
41681B67626j08386l2439k01226k19300j25145J35869L98972L74023j2176k68605
$$ 267626 159240 126801 -74425 -293725 -418870 -283001 115971 489994 477818 209213
41671B09213J46893M8034j76972m47578M46867L51777L3842R4012j8380l36011
$$ 209213 356106 404140 227168 -220410 226457 578234 612076 706088 687708 351697
41661C51697k15538k25835k9963K56354O7719J61702j2747L2089m8647l11577
$$ 351697 136159 -89676 -119639 136715 204434 366136 353389 385478 336831 25254
41651B5254J1799k64707L65041N6833J75963j78437J14189R7455j74117o3795
$$ 25254 37053 -227654 137387 194220 370183 191746 305935 403390 229273 165478
41641A65478k57663J49823M78998J3830l91328m12702M19182P2886k8684L8442
$$ 165478 -92185 57638 536636 550466 159138 -253564 165618 238504 209820 248262
41631B48262J60083l95355n4528M63820q1226K28234M04156k62748m69726k32348
$$ 248262 408345 12990 -41538 422282 341056 569290 973446 710698 240972 8624
41621H624J77114O4570j5907j84352k60508k3947k53306N36154k58037k75348
$$ 8624 185738 250308 234401 50049 -210459 -234406 -487712 48442 -209595 -484943
41611d84943L90784J46783J74653q8352j69004L0092J15644K73223j17961J38911
$$ -484943 -94159 52624 227277 138925 -30079 13 115657 388880 270919 409830
41601D09830Q9098m11380j10614M08098k44513J40707O1311j63854L06746j56646
$$ 409830 498928 87548 -23066 385032 140519 281226 342537 178683 485429 328783
41591C28783m56646K38604J5974K15487O0652m05578k10127l3780J66287J81156
$$ 328783 -127863 110741 126715 342202 402854 -2724 -212851 -246631 -80344 100812
41581A00812K73574J08059o07929K02754N94K9311J43756l60489k26877P0242
$$ 100812 374386 482445 -125484 77270 77864 107175 250931 -109558 -336435 -266193
41571b66193O8473k01979m0567K36490J02966o2205J49239J42158J84192K05174
$$ -266193 -197720 -399699 -440266 -203776 -100810 -163015 -13776 128382 312574 517748
41561E17748N6312l65021k80543J91733n2691K04106l06224q1563J55027L11384
$$ 517748 574060 209039 -71504 120229 67538 271644 -34580 -116143 38884 350268
41551C50268K35667P5708m71844K8486l3236N4961l72758J26297J74475j57491
$$ 350268 585935 661643 189799 218285 185049 240010 -132748 -6451 168024 10533
41541A0533J97222o4876k64862L02439M9322L04447J927j90001j54939l57835
$$ 10533 207755 142879 -121983 180456 229778 534225 536152 346151 191212 -166623
41531a66623j41400J90348r625J05320K2403k32546m30636N2656K36246j7823
$$ -166623 -308023 -117675 -127300 -21980 423 -232123 -662759 -610103 -373857 -391680
41521c91680J30701l22306L99119M47908l55994l08707j41049J13289J45711k45047
$$ -391680 -260979 -583285 -184166 263742 -92252 -400959 -542008 -428719 -283008 -528055
41511e28055R161J39044L27629j44975j01892m1488J11407o3291R5648o9836N0127
$$ -528055 -518894 -379850 -52221 -197196 -299088 -340576 -229169 -292460 -196812 -266648 -216521
41500b16521J54692m7747m6982k770K10220K53820l04273l5928L80876J57333
$$ -216521 -61829 -109576 -156558 -159328 50892 304712 439 -35489 345387 502720
41490E02720J33540n90367K23983J3759k28101l11265K62211L68013k1574J82724
$$ 502720 636260 45893 269876 283635 55534 -255731 6480 374493 352919 535643
41480E35643r3705l14223M1622P8105l36739J31147J92032k50389k2571N39079
$$ 535643 441938 127715 169337 247442 -89297 41850 233882 -16507 -39078 500001
41470E00001m414m82868K30167J42099R1001N688M4845j48024n49942j73239n5964
$$ 500001 495587 12719 242886 384985 475986 481674 526519 378495 -171447 -344686 -400650
41459d00650j7406K4917j14518J17009L32858j25271J77260K12684K0803l32468
$$ -400650 -418056 -393139 -507657 -390648 -57790 -183061 -5801 206883 227686 -104782
41449a04782n7986J1171K25999L6229P3088k94500l66719j31771L72349K33753
$$ -104782 -162768 -151597 74402 110631 183719 -110781 -477500 -609271 -236922 -3169
41439c169K44340L93086m44730j38117P9654J98595k69546j54995L7921k06639
$$ -3169 241171 634257 189527 51410 131064 329659 60113 -94882 -56961 -263600
41429b63600j54931J75253L82029p2903k85235J35638J55057j41192k83679L96493
$$ -263600 -418531 -243278 138751 65848 -219387 -83749 71308 -69884 -353563 42930
41419D2930L85927K94467j50329J5897o8441j93920l31397J46064K8708l28144
$$ 42930 428857 723324 572995 588892 520451 326531 -4866 141198 169906 -158238
$$ [...]
##END NTUPLES=NMR SPECTRUM
##END=
