##TITLE=19F_TG-2237
 DMSO. 24 sc
 4.3.2019
##JCAMPDX= 6.0         $$ Bruker NMR JCAMP-DX V2.0
##DATA TYPE= NMR SPECTRUM
##DATA CLASS= NTUPLES
##ORIGIN= UXNMR, Bruker Analytische Messtechnik GmbH
##OWNER= root
$$ XWIN-NMR		Version 3.5
$$ Mon Mar  4 16:25:59 2019 Russian Standard Time (UT+4h)  she@DPX200
##.OBSERVE FREQUENCY= 188.290927
##.OBSERVE NUCLEUS= ^19F
##.ACQUISITION MODE= SIMULTANEOUS
##.ACQUISITION SCHEME= undefined
##.AVERAGES= 24
##.DIGITISER RES= 16
##SPECTROMETER/DATA SYSTEM= spect
##.PULSE SEQUENCE= zg
##.SOLVENT NAME= DMSO
##.SHIFT REFERENCE= (INTERNAL, DMSO, 0, 98.3737)
##AUDIT TRAIL= $$ (NUMBER, WHEN, WHO, WHERE, WHAT)
$$ ##TITLE= Audit trail, XWIN-NMR		Version 3.5
$$ ##JCAMPDX= 5.01
$$ ##ORIGIN= Bruker BioSpin GmbH
$$ ##OWNER= she
$$ F:/spectra/data/she/nmr/f19/1/pdata/1/auditp.txt
$$ ##AUDIT TRAIL=  $$ (NUMBER, WHEN, WHO, WHERE, WHAT)
(   1,<2019-03-04 16:24:59.96 +0400>,<she>,<DPX200>,
      <created by zg, POWCHK disabled, PULCHK disabled
       configuration hash MD5:
       00 E9 B6 7A A2 85 ED C7 34 08 36 98 17 FE 4E 26
       data hash MD5: 64K
       41 1C A1 E5 A3 28 C0 D7 93 3D 99 B2 38 5C A6 AF>)
(   2,<2019-03-04 16:25:05.51 +0400>,<she>,<DPX200>,
      <Start of raw data processing
       efp BC_mod = 2 LB = 1 FT_mod = 6 PKNL = 1 PHC0 = 1675.127 PHC1 = 42.15593 SI = 64K 
       data hash MD5: 64K
       91 34 F2 F6 B0 4E D4 44 91 AC 93 4F FB 7C EE C6>)
(   3,<2019-03-04 16:25:22.03 +0400>,<she>,<DPX200>,
      <pk PHC0 = -124.1509 PHC1 = -22.8 
       data hash MD5: 64K
       EE 6B 62 07 00 8A 78 A1 7E 39 E9 1E 36 26 1B 89>)
(   4,<2019-03-04 16:25:25.34 +0400>,<she>,<DPX200>,
      <abs ABSG = 5 
       data hash MD5: 64K
       11 96 7B 3A 37 E0 93 B3 8B FD AD 90 DA B0 C7 14>)
(   5,<2019-03-04 16:25:37.39 +0400>,<she>,<DPX200>,
      <abs ABSG = 5 
       data hash MD5: 64K
       5D D8 D7 B4 B1 01 84 59 92 36 7F 61 59 A0 49 EB>)
$$ ##END=
$$ 
$$ hash MD5
$$ F1 7A FC 45 19 B0 02 E8 EF E6 70 9A D2 3E E6 40
##$RELAX= 
##$RELAX= 
##$RELAX= 
##$RELAX= 
##$RELAX= 
##$RELAX= 
##$RELAX= 
##$RELAX= 
$$ Bruker specific parameters
$$ --------------------------
##$DU= <F:/spectra>
##$EXPNO= 1
##$NAME= <f19>
##$PROCNO= 1
##$TYPE= <nmr>
##$USER= <she>
##$AMP= (0..31)
100 100 100 100 100 100 100 100 100 100 100 100 100 100 100 100 100 100 
100 100 100 100 100 100 100 100 100 100 100 100 100 100 
##$AQSEQ= 0
##$AQ_mod= 1
##$AUNM= <au_zg>
##$AUTOPOS= <>
##$BF1= 188.310428
##$BF2= 200.13
##$BF3= 200.13
##$BF4= 200.13
##$BF5= 200.13
##$BF6= 200.13
##$BF7= 200.13
##$BF8= 200.13
##$BYTORDA= 1
##$CFDGTYP= 0
##$CFRGTYP= 5
##$CHEMSTR= <none>
##$CNST= (0..31)
1 1 145 1 1 1 1 1 1 1 1 1 1 1 1 1 1 1 1 1 1 1 1 1 1 1 1 1 1 1 1 1 
##$CPDPRG= <>
##$CPDPRG1= <>
##$CPDPRG2= <>
##$CPDPRG3= <>
##$CPDPRG4= <mlev>
##$CPDPRG5= <mlev>
##$CPDPRG6= <mlev>
##$CPDPRG7= <mlev>
##$CPDPRG8= <mlev>
##$CPDPRGB= <>
##$CPDPRGT= <>
##$D= (0..31)
0 1.3 0 0 0 0 0 0 0 0 0 0 0.25 0 0 0 0 0 0 0 0 0 0 0 0 0 0 0 0 0 0 0 
##$DATE= 1551702299
##$DBL= (0..7)
$$ [...]
##$SUBNAM3= <"">
##$SUBNAM4= <"">
##$SUBNAM5= <"">
##$SUBNAM6= <"">
##$SUBNAM7= <"">
##$SUBNAM8= <"">
##$SUBNAM9= <"">
##$SW= 251.107818259711
##$SWIBOX= (0..15)
0 1 0 0 0 0 0 0 0 0 0 0 0 0 0 0 
##$SW_h= 47281.3238770686
##$TD= 65536
##$TD0= 1
##$TE= 0
##$TE2= 300
##$TE3= 300
##$TEG= 300
##$TL= (0..7)
0 120 53 12 22 120 120 120 
##$TP= (0..7)
150 150 150 150 150 150 150 150 
##$TP07= 0
##$TPNAME0= <>
##$TPNAME1= <>
##$TPNAME2= <>
##$TPNAME3= <>
##$TPNAME4= <>
##$TPNAME5= <>
##$TPNAME6= <>
##$TPNAME7= <>
##$TPOAL= (0..7)
0.5 0.5 0.5 0.5 0.5 0.5 0.5 0.5 
##$TPOFFS= (0..7)
0 0 0 0 0 0 0 0 
##$TUNHIN= 0
##$TUNHOUT= 0
##$TUNXOUT= 0
##$USERA1= <user>
##$USERA2= <user>
##$USERA3= <user>
##$USERA4= <user>
##$USERA5= <user>
##$V9= 5
##$VALIST= <valist>
##$VCLIST= <CCCCCCCCCCCCCCC>
##$VD= 0
##$VDLIST= <DDDDDDDDDDDDDDD>
##$VPLIST= <PPPPPPPPPPPPPPP>
##$VTLIST= <TTTTTTTTTTTTTTT>
##$WBST= 1024
##$WBSW= 4
##$XGAIN= (0..3)
0 0 0 0 
##$XL= 0
##$YL= 0
##$YMAX_a= 49514
##$YMIN_a= -125193
##$ZGOPTNS= <>
##$ZL1= 120
##$ZL2= 120
##$ZL3= 120
##$ZL4= 120
##$ABSF1= 98.37372
##$ABSF2= -152.7273
##$ABSG= 5
##$ABSL= 3
##$ALPHA= 0
##$AQORDER= 0
##$ASSFAC= 0
##$ASSFACI= 0
##$ASSFACX= 0
##$ASSWID= 0
##$AUNMP= <proc_1d>
##$AZFE= 0.1
##$AZFW= 5
##$BCFW= 0
##$BC_mod= 2
##$BYTORDP= 0
##$COROFFS= 0
##$CY= -3
##$DATMOD= 1
##$DC= 0
##$DFILT= <>
##$DTYPP= 0
##$F1P= 0
##$F2P= 0
##$FCOR= 0.5
##$FTSIZE= 65536
##$FT_mod= 6
##$GAMMA= 0
##$GB= 0
##$INTBC= 1
##$INTSCL= 8.653935e-10
##$ISEN= 128
##$LB= 1
##$LEV0= 0
##$LPBIN= 0
##$MAXI= 10000
##$MC2= 0
##$MEAN= 0
##$ME_mod= 0
##$MI= 0.4277144
##$NCOEF= 0
##$NC_proc= -8
##$NLEV= 6
##$NOISF1= -61.99997
##$NOISF2= -62.99997
##$NSP= 0
##$NTH_PI= 0
##$NZP= 0
##$OFFSET= 98.37372
##$PC= 1
##$PHC0= 1550.976
##$PHC1= 19.35593
##$PH_mod= 1
##$PKNL= yes
##$PPARMOD= 0
##$PSCAL= 0
##$PSIGN= 0
##$REVERSE= no
##$SF= 188.296044280273
##$SI= 65536
##$SIGF1= -61
##$SIGF2= -65
##$SINO= 3.502647
##$SIOLD= 65536
##$SREGLST= <1H.CDCl3>
##$SSB= 0
##$STSI= 65536
##$STSR= 0
##$SW_p= 47281.3238770685
##$SYMM= 0
##$S_DEV= 0
##$TDeff= 65536
##$TDoff= 0
##$TI= <>
##$TILT= no
##$TM1= 0
##$TM2= 0
##$TOPLEV= 0
##$USERP1= <user>
##$USERP2= <user>
##$USERP3= <user>
##$USERP4= <user>
##$USERP5= <user>
##$WDW= 1
##$XDIM= 65536
##$YMAX_p= 432995020
##$YMIN_p= -54041142
$$ End of Bruker specific parameters
$$ ---------------------------------
##NTUPLES= NMR SPECTRUM
##VAR_NAME=  FREQUENCY,     SPECTRUM/REAL,   SPECTRUM/IMAG
##SYMBOL=    X,             R,               I
##VAR_TYPE=  INDEPENDENT,   DEPENDENT,       DEPENDENT
##VAR_FORM=  AFFN,          ASDF,            ASDF
##VAR_DIM=   65536,         65536,           65536
##UNITS=     HZ,            ARBITRARY UNITS, ARBITRARY UNITS
##FACTOR=    0.721466756344984, 1,           1
##FIRST=     18523.3820098237, 0,            0
##LAST=      -28757.9418672448, 0,           0
##MIN=       -28757.9418672448, -54041142,   0
##MAX=       18523.3820098237, 432995020,    0
$$ Real data points
##PAGE= N=1
##DATA TABLE= (X++(R..R)), XYDATA
$$ [...]
44013 3089951 -2591168 388400 572846 -912391 -2011395 -3733490 -3162295 -4913279
44005 -4913279 1197456 -4381295 -301456 4936812 4292742 7849075 9806016 10130166
43997 10130166 4658385 3119659 -1350442 7870 5375358 3965449 1623516 9785733
43989 9785733 3125629 4052154 5397488 1261746 3260637 4160314 2662315 -2389247
43981 -2389247 967220 4620636 2339129 -3141886 437522 4762091 2530255 5679509
43973 5679509 5651184 1171686 -5498561 -7526069 -470149 1976552 1728187 8211674 6177473
43964 6177473 4093598 -5238816 -6872921 1449837 -772234 5122141 5676349 4339500
43956 4339500 6791987 4420890 840258 5466079 12193780 10110028 5214848 4294105
43948 4294105 4822470 1510858 577268 7843428 10756962 15151758 15649087 12759707 6555415
43939 6555415 10779514 10005189 4630486 6832468 7804151 7523735 8083435 10271156 6895849
43930 6895849 -723477 -3965836 -6298513 -153284 4996717 4446946 8171430 9087915
43922 9087915 789369 -1771931 2525202 5087668 9778488 5123846 1896098 -4399732
43914 -4399732 -1722486 -1393156 -1900727 696841 8153393 4568033 3261443 6633867
43906 6633867 10980245 3652250 5667623 6213036 3806779 3412130 4282993 -1453265 -6274308
43897 -6274308 -12178223 -11120419 -4693455 -3887051 -4745893 2359455 1206414 3036854
43889 3036854 4256367 6144021 3609732 4054314 1630390 3998607 4644664 1337608
43881 1337608 -1969626 497556 7234112 9741871 4345562 -3928051 -4280445 -735943
43873 -735943 306228 2129721 8191576 10249667 3767976 3787384 1597116 -1872609 3934453
43864 3934453 539107 1503913 -1147177 -4293321 -1454993 10412177 5378749 4314250
43856 4314250 8410726 11595501 7843269 7001763 3658471 3456006 1349513 -2743197
43848 -2743197 2622987 5418553 2271522 5324808 7470420 5528626 -3864815 -1011563
43840 -1011563 5246647 7704108 10880552 7570662 1468695 -2536826 -1054182 -1991829
43832 -1991829 6750945 4711057 1527825 2311413 3411181 -1867773 -3004553 -119350
43824 -119350 5292954 11089662 14602266 9791643 1242678 1724123 3445481 -717302
43816 -717302 3323936 4217206 40328 5813739 8538383 8157923 4432467 4345777 6495046
43807 6495046 1121284 -5562611 -5498117 3107235 10638619 11625045 13064633 7848971 5613873
43798 5613873 10770015 8437765 9040093 4956785 -3035878 -418346 4343280 2521278
43790 2521278 1008036 7904741 6292351 907426 -2614118 -875704 53752 -1779126
43782 -1779126 -4355058 -9343888 -5053469 2288522 4740828 6363719 6009050 6810808
43774 6810808 6868336 7003365 10716773 9797406 10096331 9456735 401048 666295 4725331
43765 4725331 6530868 4139337 7839295 5210843 3146684 7251025 8649371 8146855
43757 8146855 10514402 5598531 3668947 -122678 2413546 5555788 8535344 8268279
43749 8268279 10300495 10377392 4735584 -1211131 3202397 5918636 706114 348152 1136837
43740 1136837 -1866210 -529333 -345675 4928447 5479188 3733510 6483644 3471135
43732 3471135 7181065 4766586 3858984 1526701 4128531 1598724 2139867 -2420325
43724 -2420325 -2988736 2471618 2564917 -2727705 -3222595 3254944 1694031 320625 -4167115
43715 -4167115 1075184 4230368 6298379 2098201 1906476 -1098828 -2237273 -412723
43707 -412723 6932973 4149699 3015899 1743212 4314311 10200787 7024164 2346992
43699 2346992 4290075 11069819 2307338 -2372574 788702 5321122 9788917 4430560
43691 4430560 -1671200 -2192829 5406797 11541486 5150285 2687757 535546 2186197
43683 2186197 2051768 -5660099 -4017748 -1067884 -1930456 2534412 3054774 -1739514 -4847562
43674 -4847562 -3238163 -4889336 -3111598 2794964 4610075 -69191 -1898109 1426147
43666 1426147 8275404 2719129 -6116403 -120885 12231385 9260881 5066640 5792854
43658 5792854 3505396 2587655 673432 4826800 7192614 5286237 -435423 -1680646
43650 -1680646 -3975989 -2665003 2181609 -640485 -650716 4195874 -4863742 -4095886 -1164667
43641 -1164667 -1436528 -2149597 2920217 6672761 9864123 8773192 4234429 4929441 5243845
43632 5243845 793511 -467798 3152835 191281 5081176 6545357 12352791 8077282
43624 8077282 -3218776 -4234259 -3720058 1151137 3587736 2444986 -2578182 1544699
43616 1544699 4617699 7073209 11209799 10201303 14306435 18878089 10783170 6312238
43608 6312238 7825108 6231878 6734459 1450866 6384122 13172575 6785868 8719363
43600 8719363 9747377 8502394 8090562 713623 -854159 2897387 4982444 4856108
43592 4856108 4335344 5015616 3394746 -1435377 -6186673 2694621 5691538 8292519
43584 8292519 14647836 17434238 11180260 7337004 -1205610 2796249 6384050 12227209
43576 12227209 16234729 13253787 -2667609 -7099491 -637073 3841689 5121279 2866592
43568 2866592 -3430287 6298359 9191423 -1627029 -460771 -1141632 187914 3187562
43560 3187562 8816839 13682557 5266142 1776984 69290 -1132142 3549746 2912802
43552 2912802 4752325 5551191 4084110 2815614 1761685 3989981 10279106 8476976
43544 8476976 2581469 3321264 4488746 3167625 8479605 2149386 2128733 4337477 7611580
43535 7611580 6147129 5047315 10171517 9616465 7378199 1889212 1878881 6217805 10017410
43526 10017410 6717469 3868828 5279012 2154273 2650379 -120871 2454495 6830747
43518 6830747 8055236 9135669 3761982 6440001 9977283 9266568 5016876 5548724
43510 5548724 7028060 3876635 7442336 2947995 4255654 10868860 11301493 7328347
43502 7328347 7026625 7137111 4052176 2100696 6582001 4944030 3223265 2768687 6424999
43493 6424999 417754 -3368808 -5784266 -4696387 -2370179 -6007785 -803037 5204967
43485 5204967 3759661 4377040 5301816 4357205 -2015790 -1432632 1425231 4811070 229137
43476 229137 -2606814 -2829958 3959293 7824714 14989479 25762039 14704261 9438790
43468 9438790 13205281 6183335 5587161 -1488609 -612216 3400680 4164222 7017305 7693383
43459 7693383 3984688 4184659 4200613 1666733 -661258 7633153 9404529 13299287 12366533
43450 12366533 6933998 7933358 5032674 6410838 6631768 8388550 13536198 5479890
43442 5479890 4836425 8089864 7097269 -735761 6122696 10506389 9724438 4576107 5972107
43433 5972107 3241554 1309824 2724351 1140024 5052726 6819807 9747373 12349575
43425 12349575 12559355 18836367 9580158 1105943 -3109377 1699160 4417496 6404144
43417 6404144 243893 -1691661 -1283516 -3942700 -2536193 -2031 -3309218 -4862408
43409 -4862408 897411 -1688577 -2573427 -5698338 -6333593 -1244791 -71784 3793536
43401 3793536 3522664 6346292 7220803 11581688 13877829 14787866 10252167 -3532315
43393 -3532315 -4279299 1062559 4572553 1321101 3087477 3495620 -2947273 -945203
43385 -945203 6121791 6205324 -3476713 -6506200 151743 11772603 5243912 -3433340
43377 -3433340 994976 -7710009 -5294208 -2710838 6767185 2496408 -1967668 1006821
43369 1006821 6267602 5737091 11970488 8691594 6329934 7619093 4487795 225640
43361 225640 -497211 -4704685 -8167629 869773 2404909 653945 -1568640 -3482035
43353 -3482035 1414482 4919306 -5016496 -4653732 5799592 10798435 8525704 4884246
43345 4884246 5382135 1865212 3578031 5885073 4655419 1464360 -3317261 -2844223
43337 -2844223 4423262 4171681 -3066817 2786152 -4205378 -2628397 2037331 1130910
43329 1130910 2537816 6894850 11102605 2615125 -151230 8659530 15869611 8366567
43321 8366567 1065298 3857504 8634209 7991842 5508743 8403237 3930841 4484620
43313 4484620 5204118 7027083 9895366 5912367 9826018 12603757 5701487 3329525
43305 3329525 7180112 3101479 1373331 -219755 3858896 6439064 -641902 -378868
43297 -378868 2340002 11148880 13126642 8049125 6630873 6338346 1828912 7741488
43289 7741488 5225388 7518873 5464896 6410637 6006009 1531006 -2205031 -326623
43281 -326623 5107700 2611120 -1767439 -2332205 2846676 2499675 10186894 11009835 3487548
43272 3487548 1900106 5624670 6592391 14060406 15970453 11201733 8007334 13435769
43264 13435769 7518331 2721797 -2725304 -4782732 1042356 2831111 7149019 10420520
43256 10420520 9157610 5549519 5044078 9882819 8323743 3441981 1778705 -1028133
43248 -1028133 -1122112 6248386 7443789 4963426 6780389 3569634 5740466 8220769
43240 8220769 6966197 9443614 6437582 2713328 1607758 8351708 8539215 9864852
43232 9864852 7756440 6126735 5892041 3866189 4196415 14422443 12787858 3606681
43224 3606681 5227811 4973504 8102410 7330440 -274815 6750059 8808978 9602670 3531547
43215 3531547 3908934 4531782 3417040 1524808 798658 -512693 -1112532 -3327031 374877
43206 374877 5115881 5178897 6742082 4525640 7820854 7398732 5160650 7314211 9010921
43197 9010921 596321 5542987 7502088 2268226 3517612 3931540 1703361 -5597798
43189 -5597798 -2407188 1474520 32084 6645357 7138427 2014786 -800788 2980064
43181 2980064 1724672 854338 4453755 686214 -5778268 -6054837 -1779113 -641356
43173 -641356 1408195 -2089972 -1319971 -3255161 393606 6761348 7660655 2803160 7715680
43164 7715680 6630426 2076229 7067554 8869803 5003906 5710145 1786387 5763353
43156 5763353 4812757 -359584 7090073 6318378 -908564 3700342 -1786296 -2925845
43148 -2925845 1779997 1430498 5199870 -2462424 -3346320 -91609 -1845988 6784055
43140 6784055 5708541 474820 5494534 5922342 488423 3188896 76434 2853082
43132 2853082 14018781 5758267 5222034 9931015 5809138 3675989 3713855 661208
43124 661208 2635200 7356472 8450915 8335266 1807446 4384110 6870809 5286765
43116 5286765 2748234 4136171 1341355 4187623 5048757 5058916 7568779 692568 4277594
43107 4277594 -2969361 -6046103 2629179 9927668 6165413 -1903066 -4049672 -614016
43099 -614016 1858499 3472794 872854 -1875159 5730257 7847238 8342604 10455954
43091 10455954 3875286 1651368 518440 -3591595 -1897134 2971892 5261067 4685310
43083 4685310 8874387 3119625 -496163 459203 5228373 6109201 7921231 13889624
43075 13889624 13460602 11039201 8520427 8799328 8440013 1930662 1672258 3913640 3468285
43066 3468285 1332896 5472301 9327918 5505447 1913966 1747092 -5364486 -12287856
43058 -12287856 -5258760 -1879432 -5479862 -4459647 1945360 2487559 2965671 4159165
43050 4159165 -331233 -1383843 1748467 3889240 2153220 2538266 7429063 7319753
43042 7319753 3416651 7068686 8677495 5469196 9330306 13416569 7491598 -884884
43034 -884884 274296 1714865 5536131 6520125 1981196 -5845216 -7341261 -8327398 -5067233
43025 -5067233 2831384 3095289 -3423080 -7682754 -7636189 -9413566 -9481961 -6620330 -1846213
43016 -1846213 -3774640 -1714880 768432 4968251 5613173 1977009 4726095 5786635
43008 5786635 1209725 5901378 3841559 4476390 7891051 7471662 8205810 10026417 4655367
42999 4655367 -1425568 5623193 6986824 8334190 5596311 738806 2990051 -79332
42991 -79332 3345866 3093366 2680487 4595364 2761064 4666083 -1258913 -2184819 1565716
42982 1565716 743621 4795897 3368629 1723867 10897506 20139180 12537662 9268137
42974 9268137 14510004 15822308 13530449 10913673 9151052 3625641 7634614 9894406
42966 9894406 4974481 3930244 6498846 6374295 2677323 1540568 2407434 2780039 -514658
42957 -514658 7877879 1227163 -178430 3269510 3121697 5209404 1958643 55828
42949 55828 -257583 3497486 6203505 8829623 12992426 10587237 9671939 10237728 11467791
42940 11467791 5193163 1946884 4108423 1153326 -3275769 -3621033 1273723 850216
42932 850216 4146479 5846830 5323362 -2588480 4253075 2140504 3511577 7346180
42924 7346180 7956585 7837522 943071 7803186 5362647 5581821 8906420 10029335 12316672
42915 12316672 13945468 7272640 6124399 3860683 5716051 13132708 15492484 13722630
42907 13722630 4247814 464651 -3468351 -9378007 1005763 5481018 10515241 13784996
42899 13784996 6683223 828515 3939816 1666148 3694063 6088892 8796302 6157453
42891 6157453 2521235 656181 573774 4891624 3073825 -1113030 446799 2134758
42883 2134758 4581968 8478294 9475959 8040374 -1198040 5903798 7294870 9148151
42875 9148151 10355920 13721938 10623625 6194760 3668948 593026 -3505742 5479585
42867 5479585 7968555 8502026 5347186 7109609 6112334 2900484 4273468 14229247
42859 14229247 9770228 4518389 1075210 4781895 5464358 2369736 3839653 4829791
42851 4829791 1312354 6109279 7073290 -1764247 2155094 9141829 4895756 -2999417
42843 -2999417 211520 3356907 8253955 8073396 5791800 4841395 4893684 8016035 1478358
42834 1478358 -884915 -488164 -543212 -1317655 1199715 3589637 2419800 -1004993 6524389
42825 6524389 254453 -1130803 -3127910 -1796693 -2888781 -1479516 4329306 5542670
42817 5542670 -394251 -414588 2042178 6036927 7977956 6009377 -217762 -1046946 1729027
42808 1729027 2110309 5380756 2776215 4689545 6356069 9859924 -596416 5056322
42800 5056322 4139088 10064003 11408659 10714203 5036301 6678832 6425081 3551108 6021604
42791 6021604 11267940 12038641 119532 2048686 6098032 4812449 2307181 1544856
42783 1544856 2429427 5926539 605588 3960727 6308045 4863255 235061 3951962
42775 3951962 2167446 1920848 7118728 12105368 8820838 -1456967 -7106658 -3859450
42767 -3859450 -3538285 -675211 -728499 1576089 5224039 9358578 3241108 -607236 -646484
42758 -646484 -5097560 -4162650 -3361330 6389044 1281711 2647671 3408384 1360517 4836420
42749 4836420 7063325 10570047 6616689 2873689 2764069 6628397 8263730 9435533
42741 9435533 9412725 7020966 1301258 5764356 -2156829 -1133364 124147 -3222298
42733 -3222298 -3260838 2419284 5087076 6147957 10692310 7532535 7523336 5293430 7970465
42724 7970465 5707162 3439942 4670993 -2763171 -2183078 2602987 -216948 3096636
42716 3096636 3687813 3469440 3660014 1135989 -4902766 -6805366 -345707 2172229 6800495
42707 6800495 4661811 -1400687 -6320275 -2025582 5962406 8752700 9671530 3647984
42699 3647984 -591400 -2472631 3844332 1803883 9026846 10485237 9416236 8544227
42691 8544227 8381520 9738115 4512865 9940084 13644940 11186557 4126354 5299833
42683 5299833 12886927 7965999 822941 3216317 3430558 2361327 -1103088 -986138
42675 -986138 8599717 8917264 4698501 9258933 8864984 3955659 4865109 9303482 6461187
42666 6461187 5094604 1253834 3678472 328943 -910265 145080 1428482 2696922
42658 2696922 3356373 3636141 11538393 13756506 6553437 4992579 12110225 16660842
42650 16660842 8935066 3656161 -272594 2175540 2202309 478439 -968824 5527451
42642 5527451 2243649 8822630 4960640 4713854 -2179729 7754 1812032 5221924
42634 5221924 2479553 4908822 6040761 4401411 16488915 19183554 11804274 6356271
42626 6356271 7508558 11106676 4946727 -4600173 4010911 4231064 -2412000 -1818195
42618 -1818195 -5062935 -3584462 198285 4667929 7397695 6162925 9719033 8145271
42610 8145271 4469072 8677820 4754912 1243903 1712082 9083932 4233840 -3662906
42602 -3662906 -1040956 -4467646 -5187270 1141741 4721754 6921886 6955311 3263784 1774225
42593 1774225 -108852 2832102 2654832 -6051142 -953552 7037346 4965865 6565842
42585 6565842 5907761 5453071 4714646 2506074 -627498 5379901 11026129 6062949 11207105
42576 11207105 5696139 3282168 4867399 4504036 7148647 7560822 14850904 13994943
42568 13994943 11672704 9909185 6510698 -3957384 -4201084 765614 1319282 -107167
42560 -107167 -2139344 -1137858 1636435 -2712766 4132505 9756124 6208078 -1970693
42552 -1970693 -2136481 6150666 10251095 9062596 9508815 4438808 568497 2486928
42544 2486928 3669372 9649763 11795586 8577629 917531 -165029 -2724072 5779796
42536 5779796 8917418 5851927 1602657 3147991 7224460 9370256 9093712 13727159
42528 13727159 7827170 3168836 321639 -2812413 499588 542621 -1172019 7102807
42520 7102807 10214065 3920662 1844129 3536254 2406850 -2956690 4619045 7049028
42512 7049028 5643809 -117717 -1211380 -261687 6182521 8199153 13216211 9619964
42504 9619964 4609232 8057028 4076266 5504867 4231335 10524072 6872880 3785848
42496 3785848 8536471 13186414 5476274 -4240806 1434930 11082873 17651323 13493628
42488 13493628 11166797 8038235 3481325 5100308 1701768 -4638391 -7841054 -8216688
42480 -8216688 2536548 11423856 10294697 6831933 3221428 4603307 5348130 5283492
42472 5283492 8301074 7612924 6203960 4043032 595066 2413692 8450636 6889761
42464 6889761 204590 -65436 3759221 2448575 6143209 15287717 12854637 13285089
42456 13285089 14787259 10426892 8472321 10663550 7433743 5586337 6192803 10201077
42448 10201077 7706786 6308115 3656509 -3312357 -3427111 -2806223 2942173 959305
42440 959305 -2052895 -844167 7167409 4963140 4988479 -1163873 -8067795 -3150945 1116271
42431 1116271 3793407 3701723 974848 5625909 10974889 6874739 -5271259 -9644613
42423 -9644613 -4883277 -2039835 213584 2695186 2074635 -114794 -633777 2937156
42415 2937156 -1753551 -149436 1827834 3635639 -3056647 588752 4793319 3806018
42407 3806018 4253036 4559539 7239742 10672103 1422913 3602095 -119951 -921837 -2451882
42398 -2451882 -3292833 -945869 282031 -1463369 -2737459 -851038 -2026336 301460
42390 301460 8132684 6687022 140742 5516726 5522504 9356176 9919145 6313808 12310680
42381 12310680 9231938 9854643 9438760 4383468 2622186 -1182144 -3716870 -3976308
42373 -3976308 2905013 12459992 14620095 12514715 11572995 10584835 6052217 310263
42365 310263 -2124054 -6485291 -616221 -3881856 -8463607 -4623594 -3212899 -7673895
42357 -7673895 -4879020 6387480 8172250 8584505 7777995 3391073 -3083522 -5847688
42349 -5847688 -1580012 2851300 3491300 -1357521 -3483023 -1210820 7910958 13302649
42341 13302649 6374127 6350134 4317804 64711 3157392 3657980 3946445 1573737 4431960
42332 4431960 1524227 -1211313 1209201 1589301 7523454 9851143 4663586 5772120
42324 5772120 12172975 5613456 1687745 5599795 3794033 3268900 8351353 5997121
42316 5997121 11211381 9911536 -1105215 -1397073 -763971 1533334 -437310 -628764
42308 -628764 3101310 -1627960 -484824 6484813 2144502 2757234 5964600 6335064 9524635
42299 9524635 4495045 -243350 -208624 920610 1778890 2650646 2184577 -3443820 -2452722
42290 -2452722 611157 5727992 4807924 7708594 6550129 1158213 -1060402 -2918028
42282 -2918028 -3288594 -1674540 5934180 4260874 608316 9652600 6743033 4085219
42274 4085219 5557238 9145058 5965207 3114230 3367374 1871186 -1606493 85470
42266 85470 3046791 3707128 3516308 510047 2296177 3030919 9148844 11171797 6308686
42257 6308686 6922673 11369807 8225278 12914477 10036396 3511567 6586779 9308468
42249 9308468 1075741 1667794 4993359 3890488 4247508 -5121239 -15434667 -11431688
42241 -11431688 -5326186 -5115492 -78510 2105857 -3327739 -508953 3173699 3981758
42233 3981758 3234456 -101262 4850256 9508576 9281699 5119532 2079811 -4214698
42225 -4214698 -7938879 1106210 3813325 3919667 4643177 6903929 8548437 3414348
42217 3414348 -1545596 -4812959 -1953900 2012442 3610544 2816207 5349354 5432467 -768497
42208 -768497 -1268127 1602042 -4109806 -5812222 708819 1539488 4832260 4661541 3883166
42199 3883166 9031548 6157558 -241261 144325 -97151 -486751 2136061 7876591 10613068
42190 10613068 4620087 -3322132 3419837 9881493 8614396 6866586 9441796 5438226
42182 5438226 5840205 7944418 2156137 -3754404 -2610691 -849534 2294334 -4273366
42174 -4273366 -6642156 43148 2159622 2311780 5493471 6910576 4469974 9202833
42166 9202833 2985673 440864 6893286 13802989 7639778 2994420 5995829 3915243
42158 3915243 3998978 9072097 7704236 6545271 12313306 4144598 -3363604 3023840
42150 3023840 3514532 -5085915 -10249070 -3708977 -3149582 -5706493 -5772213 -3628767 -1896472
42141 -1896472 -1112775 3869255 6652422 10786703 9941206 2475235 1233143 324563 5690055
42132 5690055 9620107 7311969 6384039 3225489 -950833 -2671792 1391359 527577
42124 527577 7106464 10842981 4830054 6984252 4739295 -654547 5883300 8389638
42116 8389638 7010982 1299465 1627049 5085681 9275106 11060689 5248734 9425337
42108 9425337 13084022 15759091 14787860 8009026 6153324 3232973 6516472 11359167
42100 11359167 8874822 7051864 9067543 6749347 4980915 8608425 2685427 2124720
42092 2124720 2606911 8526706 10081358 6745573 2487351 5591781 6142507 3228899
42084 3228899 -2249535 -1825523 -4814189 1367820 2338472 4090201 1200180 2382816
42076 2382816 8326081 11794181 4537701 -7158024 -4530613 2254662 5207417 4574077
42068 4574077 3465918 6381818 6122722 8544490 5151133 3294346 5434622 13330797
42060 13330797 16495960 17684034 11585871 1261432 4075038 7817945 8311723 6627782
42052 6627782 9660807 10834647 4603946 4417749 5578463 9977222 11642991 6301506
42044 6301506 6985647 -15874 -286951 1899221 425666 2116741 -2690093 -7391352
42036 -7391352 -4230255 -11014072 -12388683 -9407211 -2808134 -5845644 -2257957 282711
42028 282711 -5484067 -3048729 -1468304 419730 5886435 -2564481 -8085401 202879
42020 202879 3160289 378879 3173751 4318010 7475092 5994451 4942849 4753431
42012 4753431 3819386 1988004 -1732511 3679303 4391722 2185029 1516080 -2089698 736434
42003 736434 1402246 2907338 1293349 5718905 8463339 6523400 8388587 -20027
41995 -20027 -9209 -791943 4062670 5402984 4731776 5275392 3028889 7538389 3704340
41986 3704340 1201634 2558703 2868004 5329218 3850175 2349962 7828646 13412443
41978 13412443 3976145 6664693 10699227 10296715 7016678 2528566 4723568 3317436
41970 3317436 667916 3803552 3066200 1629810 5127646 1225284 3218495 -440106
41962 -440106 1066990 5796433 5853654 8340145 588946 -1312080 -2504114 2851788 7708410
41953 7708410 14559730 13111709 14566378 17530921 9644523 3199500 1546838 1845258
41945 1845258 88843 1522287 -2592258 -1171387 5396652 2035375 788107 -1208092
41937 -1208092 926210 -1092131 821399 3565970 1790300 2302620 -3123434 -5233523
41929 -5233523 -893762 2780938 1021483 5092931 7978314 5556734 5192715 5288553 9555365
41920 9555365 11282104 7089912 2132571 4766961 5517555 1842447 -2467547 4040943
41912 4040943 12400589 21674487 17157823 7727572 -1508012 -3997822 226650 498560
41904 498560 -6947184 -4615445 2896887 3283896 4078027 5463910 5657223 6244606 10349686
41895 10349686 10889208 9965634 8207709 5972105 -2167390 4240861 9121041 7942768
41887 7942768 13275859 14505307 18275723 20344020 8869808 2779054 3909477 7517817
41879 7517817 7721515 1607530 -539083 9164088 21042375 15497262 6331123 3825689
41871 3825689 6341256 12373199 13527460 10080724 2350609 2765865 3666234 5620957
41863 5620957 5021121 3841564 -1027345 1831461 7376131 2201977 2502141 3925245
41855 3925245 4828817 9264830 4929370 814887 6387561 1218004 2438194 4093815
41847 4093815 2062444 1752548 9151571 10812925 12103678 10194133 630167 -5832686
41839 -5832686 -1883412 5925039 2734996 1327062 5076822 -2637939 -9121864 8112
41831 8112 5746023 4918437 4177406 1777758 -766280 844346 6295790 678310 1975317
41822 1975317 -961731 -203329 -3586914 -3459394 -1591415 -2010061 -3622791 3407837 5801381
41813 5801381 5316057 3930651 -2254267 148504 -432043 4264418 8971405 4450827
41805 4450827 -3130569 -7375514 1655862 6179032 6035724 7612802 7060479 7341423 6583759
41796 6583759 2502569 -14016 129976 -3996057 -2012941 -2747438 -413491 5150517
41788 5150517 7502621 4304992 -649087 -2041159 378079 -1779827 -6529579 -7049549
41780 -7049549 5131186 5186850 -6189190 -1601251 -1583870 -4027217 -1424951 4158345
41772 4158345 3873129 5978185 6925051 1355705 809248 574175 3170802 3327766 6327906
41763 6327906 9082290 3288663 5909158 6234396 13145304 9036685 11583066 11275741
41755 11275741 8391623 3326302 -450479 2362216 3159669 2620965 6193334 7884489
41747 7884489 6419818 6986435 -341080 -3393406 -3478705 -3678383 -2157196 4972099 2135610
41738 2135610 2281245 2979430 4337146 8085114 -1252089 -3105384 2007587 2992188 3296168
41729 3296168 2980286 -297078 -2276500 -6065389 -3339579 2678906 3754667 -616970
41721 -616970 665530 4442755 111107 2290836 -1626117 -870158 9046063 12722465
41713 12722465 8003315 298747 -2127540 2761403 325767 -225887 -5538584 -3132062
41705 -3132062 -1899599 -3085853 2627603 4133748 832370 5119479 9364157 4043886
41697 4043886 5044699 10495845 -228524 -6753538 -4353175 -3210087 1921761 1103647
41689 1103647 -4788547 -6443330 -5530143 -3668675 -4823496 96199 6922741 14038818
41681 14038818 12212070 9283831 8920020 4857059 2311075 1226975 -2059253 1976849
41673 1976849 6809029 9271297 5153788 4061159 2644163 5980192 8538380 4669261
41665 4669261 1733987 987423 2092687 238648 1630254 8950073 8203715 3631815
41657 3631815 -1582007 -6125892 -12395600 -5290215 7984619 7833655 5790642 -1589003
41649 -1589003 2770823 6202767 -1737783 2196774 9137944 11539858 8659052 2012065
41641 2012065 8013571 5654498 2898734 3216380 6102067 9361859 2213251 -1401035
41633 -1401035 2492552 6377232 2073956 -2501001 2363928 5574294 5821238 6195197
41625 6195197 2362735 1371664 274470 6385049 9690645 5290064 1966149 -2539958
41617 -2539958 -2084597 4272069 4315324 2026079 3557991 5585802 5431697 2541006 4736919
41608 4736919 2426310 620784 7653259 9372726 8239634 9967580 12797201 8343553
41600 8343553 9792299 7774778 11849333 12114487 8453255 5900798 4676182 5037212
41592 5037212 7947518 14079568 12704248 10912037 4960154 2022707 -964650 2881202
41584 2881202 6060197 7457434 9862588 13835885 12768538 5319996 3792952 7650869
41576 7650869 7934327 -1950026 3496404 1376070 855273 -2442375 -2516510 -2313721 149693
41567 149693 5353742 5883758 3020315 7760088 -1193586 -5640055 -3788647 -5644195
41559 -5644195 -2720360 762015 275596 -2486603 3973853 9784652 7163920 2046256
41551 2046256 240322 1921097 432574 2817535 391287 5017870 8961411 10673344
41543 10673344 8878977 8128844 9274906 13390396 9279266 3046169 -1058514 -5565141
41535 -5565141 -2244573 -817802 3175962 7054944 2919366 1030015 -820201 1401900
41527 1401900 8241202 10332499 7028407 1308368 909220 2539358 10089707 7015366
41519 7015366 2946238 1409513 -4009871 -10305809 -8672573 -3954322 3275040 3584122
41511 3584122 6511925 9686196 7983240 7600090 9187945 5535858 6980881 5882883
41503 5882883 8169717 9352339 1878554 5200482 1885808 2084771 8583736 14385028
41495 14385028 15387524 12238881 11728495 8702090 4451765 5463365 9556552 8371708
41487 8371708 -769318 -1641182 -3124547 -2748079 6484362 4353946 -2936828 -1204840
41479 -1204840 389148 -7479279 -9258710 4672853 12143051 8123540 3787315 3481799
41471 3481799 6818159 8706923 13444068 8364181 6474442 7770700 8682762 3992411
41463 3992411 -5334884 -9638357 -2861208 1361961 5330529 5863193 1288453 -2948775
41455 -2948775 -4388171 1140662 5862039 268491 -1421908 -10202684 -5020573 3596873
41447 3596873 4635908 6045457 3388603 -800153 1745295 2941352 -5019686 -2861271
41439 -2861271 4611869 6268671 1119237 144149 -4847684 -2020321 4141165 3163805
41431 3163805 -1258890 -5386246 367544 -3364641 -3645065 -7936685 -3979432 -2277371
41423 -2277371 5116029 7029687 3405293 1292151 -1323420 1235138 2572320 85409
41415 85409 64497 -870032 4436098 7346884 6791832 5870218 4651762 -2188121 412811
41406 412811 5306729 3585924 6638412 9154661 11510702 10731078 9863525 9264660 9819625
41397 9819625 10743329 8299303 532976 -6396694 3221 7990957 10386331 10574026
41389 10574026 9947222 9661856 7397528 10239336 5192732 3134327 6632615 7111577
41381 7111577 -1991641 -10801973 -9567457 122871 2842232 5570967 6486893 8720176
41373 8720176 3807093 -2583929 6266481 6244927 1548656 -568847 -4467648 440684
41365 440684 1792605 625265 -1997214 -8242110 -2823928 5202542 12552525 13901658
41357 13901658 5521041 2770817 6523567 5453508 2540798 8800952 -495302 -5297750
41349 -5297750 3969641 1436004 -4601388 -5756 3977437 2198513 -1564076 122372
41341 122372 3925874 4271557 6001973 7386527 8883950 15461254 10543072 -1104458
41333 -1104458 -7516731 -10222730 -5678683 -4017643 978400 4762569 5578007 7294824
41325 7294824 2225017 623642 -648951 2568294 8690170 2361382 1844309 5814806
41317 5814806 7020679 794833 491748 1622324 -2674350 536069 2112973 -2564778
41309 -2564778 4879242 1355356 -2017692 5874376 16561886 11939900 10374176 8811653
41301 8811653 7475748 4283153 10718972 8502776 -189670 526430 3442485 4817992
41293 4817992 5652672 2283665 3059200 2857979 -1902478 -1633707 -950304 -4209137 -5934395
41284 -5934395 -4755084 -5248591 -4629906 -2315272 -807756 -1277065 -3240203 4829975 5601240
41275 5601240 2306756 820362 -846548 -1662606 -2604340 -1771919 -871376 4704388 876154
41266 876154 -759353 4201401 8639311 6895058 11515743 5612174 1674717 1139872
41258 1139872 -801396 4233549 2057536 -5640507 1727823 2523035 4748624 1899185
41250 1899185 -1214579 -1744318 -6512803 -5417427 -2002722 -1097646 6580885 7935146
41242 7935146 8400770 8415023 8505044 6999853 5477172 6510107 8988214 8688672 7012229
41233 7012229 7911023 9708412 1147366 3277764 3950745 4017796 3858679 12280185 11967492
41224 11967492 8985562 11065894 11416875 7634949 8301759 11477114 4500971 3832010
41216 3832010 3680694 4026517 5748874 1213385 2747104 2852534 3803080 5128392 5852853
41207 5852853 4511178 7728069 6305470 4458327 10556805 3729325 1767470 6056126
41199 6056126 2237322 -1935133 -6043302 -3183957 -6120240 -1016819 5512195 9270419
41191 9270419 9798912 9023219 9941115 6847438 4479048 4689201 -509697 -624219 5148048
41182 5148048 9252284 6988808 3925170 3340763 4382563 1228240 1342475 2015049 105429
41173 105429 2798244 9131897 3567698 4347277 8642429 7983669 10726061 8553544 9448125
41164 9448125 7533468 4289094 2643740 10066660 16681478 12182224 5430274 4075945
41156 4075945 2270904 1351989 -4660944 -5092661 -3283050 -1050 3394254 1986687
41148 1986687 1840490 5795119 8324563 6524769 3889444 3176906 5983185 4590082
41140 4590082 -516378 2896010 -1816936 -571130 -1694574 -4210714 2919882 9285205
41132 9285205 14747206 7406762 4662365 8753112 6584111 11661255 9623070 7969915
41124 7969915 483693 -3038574 872399 2755437 5713794 6365858 7762088 4594661
41116 4594661 3037889 9902049 6627574 -640227 -3332573 -1658838 6033690 6881048
41108 6881048 185032 -5193669 774683 3649418 7958994 15236445 15582770 7343890
41100 7343890 -657697 2753695 -1350134 1629444 11234515 7951649 5921482 4646750
41092 4646750 939001 -3280388 2171787 7740690 11116496 6699417 5537761 12270468
41084 12270468 9980094 8478971 6529993 2677568 3450346 2461743 5809254 1412169
41076 1412169 -5790828 -4951648 2662006 10334162 7736216 8058276 11390994 6168901
41068 6168901 5493611 -1639532 -1167640 7442338 5838519 5922566 1627154 -65438 1616807
41059 1616807 2038887 11962737 12658444 13000672 11047276 5490529 3747071 -1284898 -7837889
41050 -7837889 -7947012 -3749870 2242315 4112398 9840877 11303789 7114659 7927367
41042 7927367 7288918 1948673 2256808 4598519 898256 2031502 2944349 -364759 2660878
41033 2660878 -536912 -4378344 2260087 9523784 8326722 4381901 -3043327 2245034
41025 2245034 8209555 6935062 10483947 10429798 7067145 3344559 -2712016 4083079
41017 4083079 7131151 7972962 8294837 -1236041 4716008 123309 -1157752 -1536793 274905
41008 274905 4679349 3063890 8672405 4807195 -42587 6958800 12508748 7362317
41000 7362317 -6851546 -821688 -4638619 -6633250 -1136000 1003406 3125792 6841539
40992 6841539 2322741 7005547 9980914 10678896 5946428 3619126 2865589 1328013
40984 1328013 3929338 7660426 6895682 4766878 3955554 3915805 9039742 4900048 3064532
40975 3064532 846259 -3668859 -826526 -1631765 -1581265 -4010178 -2510500 4333925 3375380
40966 3375380 5387734 4480501 1911358 6568888 9883525 6879182 5309398 5163322
40958 5163322 9272799 -472680 -549584 -2805851 -2317790 -5106689 -234549 4518854 2320841
40949 2320841 3716294 3671749 2665698 4359316 8166441 2591438 5350556 8833120
40941 8833120 8529497 9597729 11953171 9899044 4979345 -991731 1930652 6584806
40933 6584806 3453841 4850358 10432394 5414692 2036437 6676667 3919927 -1414534
40925 -1414534 -81512 553690 10171180 11747697 6102395 8645649 454305 2049168
40917 2049168 8592518 5786534 5455370 4619060 3861977 -1516376 -1385452 2877427 6989640
40908 6989640 7760994 3504864 353369 3591038 3152875 6118898 10885991 4715366
40900 4715366 -57506 -500287 -5831178 -6289147 -1983109 -541893 2224320 1510668 -1690588
40891 -1690588 -183544 427514 -518017 599189 1264826 8054211 8691107 5054418 2173563
40882 2173563 7860335 5084899 -2514872 -8900737 -6277876 1650810 9332840 7554267
40874 7554267 841736 5773 2770953 4767449 3020969 541433 -6914343 -2171422
40866 -2171422 -341643 1537738 3892392 8739999 4677795 -3292248 -5016848 13703
40858 13703 836869 661768 -2734882 1538973 6379508 4618278 148407 3359683 7553281
40849 7553281 4490505 5909517 5479211 8883070 8874690 8772517 2923987 4136924 913373
40840 913373 2318435 473538 -642206 2308043 5026772 9230235 5312791 9055161
40832 9055161 8776583 2521332 3978286 3561050 7744591 8946992 8691415 9616252 10826994
40823 10826994 7226573 -2572349 -7493127 -4218759 -1320060 4891446 970163 1636701
40815 1636701 708524 6947659 7851259 4811384 3609674 1587252 2376398 1676241 -1459892
40806 -1459892 -246682 2685591 473723 -2658341 -5731319 -6502397 -1470596 2348065
40798 2348065 -834726 82126 5752985 7338919 3998173 7301380 3301112 347337
40790 347337 2013761 2502658 3897334 3765687 998234 3178566 3381448 -1974509 -2805509
40781 -2805509 5061418 14443341 10154491 8529329 5305022 5581035 4985736 381302
40773 381302 -416131 -237343 -1727387 -500156 5957616 1707778 -651150 6229160 7005525
40764 7005525 3554247 3641328 9171887 -223698 -501497 -2359706 6245192 9169978 4689567
40755 4689567 4444822 1106391 1525103 -76581 -889398 -2462826 -6931669 -234594 9208296
40746 9208296 9697514 3838763 4507629 5187462 -605674 11379968 13765076 13971907 8793251
40737 8793251 1087672 4497964 3320778 -5052741 -8277250 -6040108 -1683516 -4093984
40729 -4093984 -3013683 -6792415 -3759305 -900352 4926485 5622655 6266968 6391942 7825468
40720 7825468 6008330 8096177 5322126 2705111 238770 233869 6024674 7355039 1041976
40711 1041976 3299402 15117926 18506714 19411139 6914110 4349108 -858581 -594579
40703 -594579 -2082839 -2273564 5631556 4331216 6474164 1444211 4003298 3163593 947167
40694 947167 -4358291 2016635 1514922 6453959 10027845 3558382 2597712 4407501 -1717147
40685 -1717147 -2616774 4148737 1493783 464162 4237676 2596508 1130266 5438486
40677 5438486 2215533 2583066 5758797 3760737 3863219 -275705 564464 1733373 -2642691
40668 -2642691 1346516 5205187 6330259 9002643 -808480 -3193750 5985770 8336735
40660 8336735 7512656 2503498 -491086 -3037900 -7005535 -6523679 -2787124 640040
40652 640040 1646453 8180079 4113682 -1367011 5005622 4780350 -3428662 4128391
40644 4128391 12774518 4297314 2399137 3094249 7745481 5497513 443000 3811519
40636 3811519 3609849 -73353 -9071933 -8858516 -5263056 160571 524519 -333939 3297026
40627 3297026 7385563 10280885 10722736 8521862 -447482 -6260496 -2623551 2402577
40619 2402577 4569838 8792313 8936147 7370402 8295669 10870716 2142543 2668411 3693573
40610 3693573 6777741 7428371 1246484 406791 -4313137 1472420 1955690 1261390 608514
40601 608514 4218497 11427134 15726812 14278582 5955587 -1099094 -105509 3860256
40593 3860256 4109862 9653540 1716652 -2894067 383510 8806845 5749397 8532658
40585 8532658 8619522 4924120 12443645 8849022 1680073 -522460 -2498755 5543785
40577 5543785 10000816 7237819 9908004 8677500 7315326 11117017 10009310 9261147
40569 9261147 11065585 12849715 14629721 11887280 10492671 8672370 6218405 5013090
40561 5013090 9776298 8116136 -1128604 -412363 9109655 8963037 4916289 3019976
40553 3019976 -472736 2411501 5255947 5888838 7906731 -4709399 -4820712 4750717
40545 4750717 4347660 4873720 9187347 9684380 10347377 5132938 2726628 7721079 8917337
40536 8917337 8149962 10318215 6431953 8333601 14052647 11481573 10430883 4740595
40528 4740595 3991797 7710481 9631816 7378643 8920153 9843092 6692042 8298148
40520 8298148 4549565 -1484663 19140 2801190 8315062 8318627 7615955 2532235 4344083
40511 4344083 4683547 9338595 12326998 9747222 13240181 11756110 3050297 -3532278
40503 -3532278 -1147921 2606794 2173103 -1355931 -856381 488596 53269 -441731 1566345
40494 1566345 2545820 3981625 2508028 2515953 2892931 -1732398 -8156978 -5091201 5320812
40485 5320812 6916985 3362658 5229787 -191997 -1437959 -801882 -4069073 -764136
40477 -764136 -2755266 -2921411 -763991 -7659282 -7612261 -1865741 684688 7433085 6696268
40468 6696268 -1153002 -2088586 1459667 3690729 1134742 3543917 8126747 12505926
40460 12505926 16834806 20167625 11197229 6551503 2920030 1673760 1946494 5938207
40452 5938207 3672301 6577786 8929094 8156977 4911904 1400092 -7060594 -4312771
40444 -4312771 -339465 -847376 -5071633 -7503301 -9784179 -7847703 -4932517 -4338401
40436 -4338401 2695169 5983784 6047574 -1334043 -5510786 -7531326 -5653203 -4183434
40428 -4183434 -1699077 3827150 10094932 10349127 6507965 6943251 5425921 6077906 5828086
40419 5828086 11496643 10220825 12018441 10318130 10730765 13488003 12636817 4336150
40411 4336150 8199977 9081859 7716326 2131539 -2337862 2422104 3754748 3792137 5158233
40402 5158233 2118238 4023793 8583558 2389604 9254670 17278514 10367440 7589084
40394 7589084 6680941 5750555 2396133 -3789751 355454 8181824 9362966 11444688
40386 11444688 -370217 -2048302 1335942 3357211 2705747 -744897 2315609 1664649
40378 1664649 -343152 -1726020 -7261229 -2408466 2047175 6360220 2382784 1693307
40370 1693307 913587 -191123 2356919 10256937 5114068 -480756 -198860 4465462
40362 4465462 5148227 -768505 -1016495 2355190 4450526 713685 -2225462 -8721624
40354 -8721624 -10246464 -9556480 -7302517 1168779 707791 -1242769 -4265131 3187089
40346 3187089 -682140 -6027112 -1683615 -1278798 -4467023 -1697639 3504482 2431428
40338 2431428 12763471 12851285 8073430 2803230 9065385 4768495 2645588 4607922
40330 4607922 15378627 17288189 8761475 2609088 1083404 11079233 6261148 4612862
40322 4612862 4992294 3634556 5870761 1738009 2663273 5181176 1790191 -250933
40314 -250933 5906556 12063704 12934879 13828234 8295896 50115 1411219 -3278204 -3227384
40305 -3227384 280384 1206548 3405422 6584434 1293542 3936288 6528541 4096059
40297 4096059 2758157 -1316584 -1282015 -6417334 -5127366 -2822249 -2974968 -697595 191191
40288 191191 2209450 -1575203 -10037543 -6515149 -8544936 -8503679 -382546 5659771 4851067
40279 4851067 7557248 7556072 7615966 10724939 10673553 10751975 8388181 5622585 3433704
40270 3433704 4548540 5059053 5445345 1903958 115135 -4886567 -3557098 -4461335 -1321844
40261 -1321844 -1293401 596198 3986729 -3346860 -1617707 5238038 6829202 995873
40253 995873 5060751 520066 187802 496865 -2625388 824416 2662895 6795745 198991
40244 198991 1891799 -1399726 2620648 4910266 9611560 9330416 10724331 4520672
40236 4520672 3754162 7052106 4340242 4007775 4060215 777073 3896784 4687299 9542322
40227 9542322 11985451 9566547 11282914 7191489 -3570968 -1198941 3783791 6451216
40219 6451216 176719 -830883 6985609 3054580 1609838 5000092 2682965 -6117573
40211 -6117573 -7481519 3109301 1680269 385194 8617183 6897387 10181522 8711003
40203 8711003 8249538 6746510 8965145 12631315 13970955 13738260 5785959 3982122
40195 3982122 1928351 7309211 8662321 5446380 7030007 1426867 2715013 6144902
40187 6144902 3107768 8411011 8377475 454792 -4538138 2970111 7515237 8192705 3968219
40178 3968219 4800965 1871832 1437492 9501274 15722881 9442511 1622639 935366 6929861
40169 6929861 11284371 10540846 4420657 3625323 -672273 -452683 3395102 1056782 1269256
40160 1269256 3561203 4330207 3715385 6015300 4313294 11233597 13317452 6844766
40152 6844766 32712 -1470659 6351762 6904689 3315503 3210847 8448220 6183576
40144 6183576 12650019 8528615 4822296 2267533 3538457 9874548 12932809 16671742
40136 16671742 9404167 6101944 9414299 14672927 9422023 8875911 8435493 8918831
40128 8918831 1663569 -340804 6551566 882769 3850641 8551985 6809951 6835341
40120 6835341 4809287 2687930 5373765 8168287 7650511 6761100 10162464 12163929
40112 12163929 11868463 3281104 4301913 4048785 7081396 -5502497 -6838908 -674785
40104 -674785 262840 2030980 493862 -4412720 -2162465 1284702 3998460 4626190 1352247
40095 1352247 2791101 6567761 3392933 7130992 2635911 -1775922 -101309 1440531
40087 1440531 6214746 4170435 1287603 4346886 5580656 5497199 3783637 347369
40079 347369 -1304827 4937419 7659418 8227276 12472172 13013751 8617092 8670947 12658943
40070 12658943 9067805 8056217 153837 3335973 9752085 9950957 13434839 6540038
40062 6540038 5992093 9592751 3551589 2443375 10618543 10078559 11124499 7945878
40054 7945878 3759325 -1580931 -111558 5139674 3884806 5285164 9710173 3686931
40046 3686931 8464454 7949189 4621128 14883976 10770474 6873992 7464083 4079426
40038 4079426 3025847 2096008 3129341 -3218196 -3270187 3801451 6398399 8695634 13906700
40029 13906700 9577791 3588935 5687757 2502798 3138517 8980761 8490172 11177049
40021 11177049 12788152 10233312 11800371 11735409 11491757 7474176 9187422 8790568 8947173
40012 8947173 5516220 4644471 7364528 14463312 12421991 9339255 12617741 10036042
40004 10036042 1136138 -1653330 -1475940 -5617029 -4510678 -2682439 4233646 7681573
39996 7681573 5577936 2927314 4597258 3519118 4599828 6280268 2299382 4207613
39988 4207613 8373068 9290156 3313370 8176679 12114590 8653548 3728501 4037721
39980 4037721 5762324 -7605619 -6630419 -2233249 -486624 9256283 13401941 11021325
39972 11021325 10180835 7632198 5837490 2041817 808843 7937806 6432552 5557344
39964 5557344 7694310 9865262 12146080 5723693 -870013 2479086 209575 -4081074
39956 -4081074 -560994 3598509 6961499 6344351 5669402 8217351 8211380 5480208 4078975
39947 4078975 7415676 5131490 5623408 6002385 3351300 4085545 3835081 10037249 15363754
39938 15363754 8419738 6792628 11364771 7189849 4816027 5919254 6424667 -1263102
39930 -1263102 -1381195 5687057 5707588 6843093 7389539 2496490 5565030 629733 67373
39921 67373 5336235 9086451 14467739 16235598 15934831 15264079 14023985 5903813 2971994
39912 2971994 4612908 3652296 -2633017 -4478477 -2008007 -1669496 -5178002 -3062239
39904 -3062239 1970964 -30990 2736635 6024141 4293863 7447619 7610741 9280095
39896 9280095 5777862 -683113 4008785 9596970 6617058 11060886 8977912 11941746
39888 11941746 16027879 12258413 8748469 14315835 13898016 9395413 11788380 12183388
39880 12183388 9672147 -426961 -2943792 3071260 3176392 10883313 8163593 16195375
39872 16195375 15687937 12301278 9028727 8146228 4097393 4615151 3027488 7775754
39864 7775754 6274920 7415806 10446211 12015290 7756834 -383033 1126958 8440722
39856 8440722 10853876 6842286 6688228 9946361 2624791 2472021 4182182 7419934
39848 7419934 4495940 3119100 -3432434 -3309867 4600763 4759714 10502918 5446713
39840 5446713 7248052 11645518 7849383 9672296 6690410 6415976 1176268 -2106529
39832 -2106529 -6170468 -6044385 1872229 8583985 6961689 -5044060 -3228108 5367619
39824 5367619 3596339 781908 5292721 5617877 2407250 1411524 -6108594 -4661008
39816 -4661008 -6215293 -5430567 -885446 2290271 6155829 6800162 1441500 -2397338
39808 -2397338 -843626 4425249 1025204 5240788 5314159 11041353 10886248 8566152 6786801
39799 6786801 6006229 4680186 4030547 2716090 4504150 8445896 5533808 5855762 6091964
39790 6091964 3398501 6712982 11611466 9769895 15930211 19325529 16882482 14261215
39782 14261215 12376719 9754482 7353334 1331496 -6747217 -7675001 2400716 5806667
39774 5806667 2355133 8630070 6957152 5203972 9960866 12899906 6145751 3612662
39766 3612662 -856387 746658 8221134 6473080 6045594 8155759 8693363 8868778 9598709
39757 9598709 7879647 13382697 11157894 5535848 9510622 5847148 3223697 6604421
39749 6604421 6708634 4726547 6767653 6861465 4058435 12262059 13164227 14136956 11123546
39740 11123546 8830660 10930311 5404902 7341838 14388021 11838831 15781400 11796645
39732 11796645 -239476 3988239 8728992 4182330 7689925 4020123 3601435 8884558
39724 8884558 6511342 2175308 4366194 3141219 -1405020 7709581 6257746 9942739
39716 9942739 17114750 15945037 16018202 13086079 11811366 14878717 14648788 17019713 6083471
39707 6083471 2503818 5398118 8152590 13109758 10890129 10189394 12436459 14884415
39699 14884415 10889663 6063509 3847581 11651663 6674787 11770039 9183806 11750792
39691 11750792 15283280 15962595 14139282 5845574 4873917 7005956 8738916 7045952
39683 7045952 2866650 5865110 -713017 146389 9567968 8148550 4045250 5260130
39675 5260130 9460425 6144347 5057877 5235117 11089732 14870785 12402680 8728657
39667 8728657 8280461 7268606 5187978 824686 4803081 2586769 3181785 9966558
39659 9966558 10242598 3252218 5482435 10320675 8650906 9737314 6516215 14770433
39651 14770433 20129335 20810273 11046093 7132807 3586066 7037166 8773904 8105856
39643 8105856 3725004 4406949 11879414 15543813 14706222 12067455 7373422 7832964 10880298
39634 10880298 13475778 18324729 14063185 6376952 193238 6179163 10162430 15007953
39626 15007953 12661087 1314633 10079586 11437205 9342816 12875461 7818911 2115102
39618 2115102 15421178 18246816 8527552 9681972 6130264 4542709 9266482 9299779
39610 9299779 16385720 9988397 8894118 7241561 10149799 16364098 15673122 12151424
39602 12151424 17310158 12434845 10583261 4141796 6038826 3951083 3930079 5657496
39594 5657496 9149111 10403285 14636976 16843297 19875918 21265448 18394350 20522173
39586 20522173 22650696 16953110 14979729 12524731 12083774 19786184 20462246 11422449
39578 11422449 11618351 8857768 5112175 8427113 13637783 16086402 14687694 16504906
39570 16504906 14756720 16075953 14855239 14497983 11233546 12485629 19439669 27295143
39562 27295143 20096766 10905756 15360574 21947087 14895391 15843167 23278905 15758270
39554 15758270 9450918 9807788 17162988 26774784 23540647 19251069 20377953 14409105
39546 14409105 14131376 23506770 26700723 24377229 23505891 24864651 24843218 31236729 27659582
39537 27659582 25835151 25923547 21470895 19944839 21092065 21775195 26310908 25471197 21043071
39528 21043071 20114515 18102226 19272807 13497792 17003326 18859729 23676699 24998261
39520 24998261 16631353 19675518 28611503 23252059 19267800 20298593 21192409 24126486
39512 24126486 24009690 16335194 21914161 19655382 16667471 23398692 22808500 25735916
39504 25735916 29259657 30957557 23484690 22210308 29540323 20390092 15133767 21756991
39496 21756991 25495594 39653478 39329830 39190136 40435732 38815800 38597794 28494001
39488 28494001 17305216 23663406 30643044 34208598 29469209 25367871 34149928 31414632
39480 31414632 27256348 29514044 31572323 30496735 30055206 29334241 27515163 32490839
39472 32490839 30846368 26547224 24984719 29097268 29825985 25477972 24072866 28701365
39464 28701365 31881684 34111409 37711652 36971748 31321413 31271069 27708802 27229058 31645563
39455 31645563 29713895 34511621 35030285 33890357 33515256 32627369 24871233 26538864
39447 26538864 32848782 36383527 37215010 44522613 47050934 45216075 40880955 44487473
39439 44487473 43429541 42529397 47613966 41947985 47324508 41789874 47431641 49263192
39431 49263192 47948147 39110458 39765868 49159424 45000742 47607144 52412725 54250191
39423 54250191 51577751 53800048 52863730 50219483 50983649 46609878 48451443 52350829
39415 52350829 54294790 58478014 58581886 60421160 60025895 59304934 57726914 63639568
39407 63639568 64968768 64456968 68159245 66670925 65831514 68293735 73558081 75103126
39399 75103126 83142897 88270711 85945765 81743104 86847308 88068563 90831892 87259093
39391 87259093 90421196 85154667 85465162 96083794 103763696 109522708 109325744 118038588
39383 118038588 123428012 118648964 117198711 131439495 139505326 133227204 133766147 130046097
39375 130046097 141681000 151668248 153476169 159130879 165901811 172436667 177841048 184254980
39367 184254980 183301627 191462091 198090502 194698597 196593099 205215801 221279432 223311247
39359 223311247 225264663 241412877 256129725 271252390 278021587 283454937 294008520
39352 294008520 305104796 319762430 332525311 343979278 362083306 374935745 389323481
39345 389323481 403904099 414484804 425189618 430940287 428750737 429138184 424437056 419602436
39337 419602436 421203101 417077787 412566144 405408498 397018975 388620915 379074295 369543495
39329 369543495 366566307 359606660 345990951 336825006 335759570 332241821 335028200 329530763
39321 329530763 320800382 315920293 312906024 312533766 296528656 287251791 276742239 267266565
39313 267266565 259328673 257279344 256155063 253104437 242260007 226251106 218910823 205945980
39305 205945980 207121717 202998822 193472725 188507212 180046189 172490131 160760007 152722892
39297 152722892 153412664 149529020 136548513 120383478 107419446 107402664 101200429 96793151
39289 96793151 81955456 74516651 67848226 63897528 60149222 55991710 55074751 46961665
39281 46961665 40950665 38150204 35181482 31989675 35516426 35140500 36815144 33680534
39273 33680534 25744318 25061781 25500773 21923117 18971361 18685507 25678725 26340827 25195624
39264 25195624 25260872 29192131 31466266 26459362 28501018 22651520 18866855 20506910
39256 20506910 25431850 20863839 17383858 16266156 16254610 16768378 20354578 22321674
39248 22321674 23120832 24066926 19760338 17124981 25253160 21713251 16733440 16035230
39240 16035230 14931664 11366814 10523824 9408696 16296218 19826769 18865238 18809771 14672964
39231 14672964 3751512 630099 13277925 16382525 12082299 7432870 11305043 12202549
39223 12202549 14098601 18564419 17604242 12286717 12221399 12848339 13835794 5179935 7684854
39214 7684854 7659629 11993364 10654551 12084742 15946330 10639901 6606991 8742310
39206 8742310 12217093 14605695 12790644 14444614 12366167 10560592 9740771 19188536
39198 19188536 11750192 6608559 9609075 16344187 13279207 7391950 5389375 6244452
39190 6244452 8115471 9125420 12420568 6941600 11163725 13761708 17149684 19098563
39182 19098563 14817113 7645908 7747985 20234303 17681291 8105619 7069198 11572057
39174 11572057 10957311 9033816 2058177 4578656 9860361 7599240 8324987 10545515
39166 10545515 4372853 -1357518 -619077 3304891 8291809 9408345 8272633 10368191
39158 10368191 6008888 4883015 12145002 10403659 7579429 6451824 3032444 -1150891
39150 -1150891 -4401436 3476779 8172444 3841713 6405842 1442109 -315233 -2068084
39142 -2068084 3664883 9951114 7858458 -519396 247652 8560051 10333389 14515917
39134 14515917 11524443 8072817 6445337 570627 4256245 6301209 11291856 8168372
39126 8168372 2304971 10053384 2120784 4722850 12084974 10741902 12428925 10966405
39118 10966405 6887151 165038 1249909 1896426 6356148 12642115 8314473 6013098
39110 6013098 4236285 -803810 789474 9077002 12633578 11800853 8171898 5413870
39102 5413870 3096454 6898995 2970696 4613033 6732226 7702959 10797743 9412260
39094 9412260 4784439 13064851 7790454 1224806 -8027871 -5823586 -97251 -6755004
39086 -6755004 -5630826 -7017821 -7637039 -1294551 8280110 7067519 6073980 5473958 11325164
39077 11325164 9932086 6035213 4907378 3934779 984646 1068306 1610907 827432 7484348
39068 7484348 7278076 4598157 10024226 1584652 4953707 5019297 -2600749 -1982414 502278
39059 502278 -2894712 -7417869 2039004 4491164 4778850 2674495 2623312 6938949 10535376
39050 10535376 9299543 6009335 6726856 9517192 5262102 3604289 7715430 10196844
39042 10196844 10148975 5905673 7073029 4232925 5950334 5646383 8103304 13612595
39034 13612595 8175169 3595168 3139600 5410074 5288812 3118935 -389744 -460327 6026586
39025 6026586 10617197 7297059 4768438 9848739 7662964 2884515 8321998 6587001
39017 6587001 8366473 14522383 7123472 5181035 2445635 4597470 15630674 15694616
39009 15694616 17545311 8123279 6707804 13394155 14843378 10279140 11350057 15517936
39001 15517936 10668813 2071552 2146180 1384966 5352275 6453918 2160327 4356707
38993 4356707 5109340 4173460 10270454 8939248 -3004597 2115890 7595696 5032131
38985 5032131 1966499 6222718 4309904 5791119 5802631 6284009 12345436 9618761 6626222
38976 6626222 776962 -8599829 -8146738 -5189976 1834803 2688649 5662110 5715158 -5163590
38967 -5163590 -1555642 6150128 8454584 8252759 2034666 2718736 2285972 2976040 7434658
38958 7434658 7066570 5316250 11970405 7325077 -615027 -3376384 -7624321 -1818224
38950 -1818224 10570578 8520963 3288705 -894033 4879325 6428954 8988187 5444846
38942 5444846 6311826 12183278 13416468 9501317 12566870 12900554 11177906 7577934
38934 7577934 12669570 9682347 4754353 4549162 4263790 3496844 -624197 2416016 3475137
38925 3475137 101236 4414455 7519365 6163400 8871399 9086954 785163 7093486
38917 7093486 11684917 9587697 536375 -5483536 -2259854 1399955 205777 -4507759
38909 -4507759 -2487075 667915 1800901 7835541 8394029 6699430 -3814301 -1085346
38901 -1085346 6214665 12837576 12457606 9905818 8215695 9496721 5527332 4557377
38893 4557377 12269531 12408552 16018365 17295641 10777043 8648528 9584242 5098707
38885 5098707 297469 423689 6964852 8090599 10835095 3567769 9388177 10732602
38877 10732602 17906867 20094092 15779179 11955332 9166463 8714314 8712571 3433198 -1942124
38868 -1942124 1576427 1477382 -1610824 2335335 7561994 8233637 10977250 13370046 8555989
38859 8555989 11606955 8554727 9888391 9965137 16809730 13719571 9803579 10291091 3091460
38850 3091460 416246 1830797 1131258 -22436 5477688 6145628 3265932 2472618 29247
38841 29247 4251885 4729984 1753332 -2094187 -1227286 414428 -2532204 1849694 1761429
38832 1761429 2150792 3085859 -2686751 -5521865 -614584 10942634 6777389 8067663
38824 8067663 9903591 6394690 5313391 12356976 11950927 3862967 -589015 1224726
38816 1224726 4295498 6330945 12878711 11675413 8219456 6585048 12392349 11333339
38808 11333339 10632424 12249204 14533914 10801497 8379679 16955365 9690169 5240699
38800 5240699 9353649 7408053 2939914 1721384 3177889 301203 344697 1825253
38792 1825253 2753337 1413891 -879471 -160785 2885795 2943760 2710512 2791030 -5145650
38783 -5145650 -6212616 -4221257 540560 2408660 1263850 5038934 3144803 2095426
38775 2095426 10300896 10369624 6079217 5651222 3306473 4246796 4242462 9989396 12228276
38766 12228276 11274359 6574820 2001809 7367776 -2444217 -1196222 4179155 6914579
38758 6914579 4481355 2025633 -330146 1925177 9460451 14266710 11631481 2748015
38750 2748015 -3402360 5711113 13156555 8738559 4221198 4038290 7423478 10298786
38742 10298786 6442759 4243877 4534720 4066977 3456603 6317381 8086884 8047041 3200677
38733 3200677 2918497 4366362 5130474 2374722 8335723 9208259 6111152 111740 -1990809
38724 -1990809 2069266 -3926744 -1458740 4311426 6975014 3540840 10530014 17435799
38716 17435799 12483761 8732329 2460549 2921064 7203597 6975754 413145 2889078
38708 2889078 919126 2343952 4783644 -3877550 -182849 163371 -2914244 4833774
38700 4833774 1830158 253505 4236049 6308181 8724451 11089059 9028872 6041276
38692 6041276 7943143 8777689 4321499 3926779 7938939 10096843 9652152 2601522 -3467690
38683 -3467690 -1690359 7106590 7285660 8174644 8496468 8989244 5054869 7410937 3673767
38674 3673767 4030471 8653176 9375554 3173368 -1855643 395612 8653396 12090009
38666 12090009 10352681 3346307 2371004 2554039 2693221 -719454 -1709433 -422744 8152685
38657 8152685 2728621 -2367568 3274878 6270917 2247742 2876725 7323092 8358307
38649 8358307 2611216 2061865 6281203 11209970 9998413 9422064 12751516 11816710 14129108
38640 14129108 6752666 4330426 -531079 -717459 -1740175 -2484002 3532708 3765854
38632 3765854 6658944 6183008 2797919 1427594 6538107 11209947 8669806 4663162
38624 4663162 3863425 -4394120 -3543349 3996071 5030143 -1236733 3407197 1982301
38616 1982301 7224825 10813214 6720190 5962022 4491655 371738 -1002182 -1896822
38608 -1896822 3720328 -188103 4053691 7365066 6681253 4151606 2030956 4352944
38600 4352944 3955617 1869066 1665980 5273220 5640221 4342350 4012269 796111 3534216
38591 3534216 5721386 10031993 7738258 6024997 2692744 -3529838 -7820814 -6611911
38583 -6611911 4752127 4712521 5172009 257416 -2124267 2563788 6568258 6570846 6976526
38574 6976526 3062487 4834276 7621831 3273876 10595739 14367575 1363080 2192572
38566 2192572 3088761 2846269 -2441806 4817205 13005903 9065101 7378468 4756337
38558 4756337 4591584 6540583 1655034 3317209 2757413 8414989 2297971 5211990
38550 5211990 8999312 13047239 6547873 1355172 -706193 1782068 9224202 6305673
38542 6305673 4488524 4523920 7473004 8961621 8267603 -621354 -1271445 2356245 4158842
38533 4158842 271046 -1665977 -6566746 -4815355 2478431 3518160 393667 3141016
38525 3141016 -2789870 -4695765 -1210562 3748090 943047 4842269 -892433 -529897
38517 -529897 924587 -265217 -1348405 -3929032 1787742 939249 3047607 9636519
38509 9636519 10853048 8784959 2130510 3052726 1638557 -19609 5018501 4589154
38501 4589154 2088591 3755251 3709490 6512036 7273872 4274771 4734701 3909947 -3393805
38492 -3393805 -3406164 1827038 2286887 -158475 5756086 8323093 4166103 -3024773 683400
38483 683400 5907553 4736022 -1117242 -2555219 3996024 8733943 6012856 11453334
38475 11453334 5941393 -21947 -636441 5362728 6882486 8963684 3176963 1756924
38467 1756924 1694977 770479 -368216 3111729 2895 -237533 3888775 5266749 4168860
38458 4168860 4901851 8568878 277989 2173398 2589774 8584736 12262804 11899954 7804055
38449 7804055 4672997 -2097391 -9298487 -2497073 -2400184 1843388 -2546912 -4979958
38441 -4979958 849318 -3086378 -1342051 10023096 11260220 7852474 275966 6613803
38433 6613803 2387078 -3101017 -1862244 -2680765 -5786813 2447713 5793159 4983944
38425 4983944 1449306 2138195 -2332804 -4727298 1040221 3002575 1616768 2770975
38417 2770975 4701849 6037351 3363095 2108948 8277992 15170371 16379629 14425797
38409 14425797 14765487 3564059 590873 -1099051 444060 6449857 2260441 -1127317
38401 -1127317 -5253695 -4861648 -6815580 -4438319 -1694603 -995830 3370588 5717278
38393 5717278 7756444 1491470 -336468 3635294 -83277 -12335428 -9487578 -1078046
38385 -1078046 3366726 5139523 1442374 -2123311 -3836245 -9239399 -10854380 -9966171
38377 -9966171 -9400417 -1330941 1844634 726908 -3028513 -3760968 -436557 -1454126
38369 -1454126 63147 1725778 6108648 4854580 -2497766 -6670300 -1547564 177655
38361 177655 1356821 2259337 7361318 5121876 -2264910 -6531078 -5308390 -5593059 353795
38352 353795 -61855 7823592 7413126 5974327 9035373 9841911 4421563 1185565 -1139723
38343 -1139723 -5113456 -2193063 -3644350 -5977434 -4705728 -5803166 -3049755 3717002
38335 3717002 6244590 7917124 10225635 6990785 3872688 4327524 8502266 7611141
38327 7611141 4828787 9139240 20204658 22530998 14453861 11684876 10041677 7189277
38319 7189277 -444179 -8266149 -9038480 -2113513 -434474 -4575853 -4214691 -2969648
38311 -2969648 -1706357 1866780 915394 -5902194 -10294361 -6320793 3940547 7522958
38303 7522958 8670228 4963935 3837094 2928424 3808729 430247 -1055680 5092796
38295 5092796 3699293 6624610 10715179 2843891 7332588 6529273 11703435 12867281
38287 12867281 7199922 6608776 10762928 11582234 14622432 8859397 5492942 11745773
38279 11745773 9234303 5328579 -530380 -1402903 1766067 3694631 6911717 13328093
38271 13328093 14305776 10290118 5717934 9992836 16407876 10182478 8828817 12024524
38263 12024524 9002776 5396943 6098677 6150295 2410780 2593820 4838307 1518449 9503956
38254 9503956 11639985 6847603 3953935 5927503 -108986 -2948386 -2945230 -2054947 5618983
38245 5618983 8985390 6299886 -1454850 142879 9403396 12318196 9880061 7580111
38237 7580111 3604002 2321607 3811999 2869518 -1528833 -893846 10902919 2733668
38229 2733668 -7442121 -9269836 -5607964 -259987 -4567912 -9176560 -1299452 -6614185
38221 -6614185 -88021 2647568 805529 -4523553 -2334745 -3595212 -2079672 -4210167
38213 -4210167 -6035275 -7089375 -7925032 -8868551 -2588141 5373537 272325 1343538
38205 1343538 334186 -5628517 -8838838 -5852055 -1018316 1419527 829233 2081250
38197 2081250 1172430 -3206663 -1197032 4607750 9922049 535487 -2190220 6828989
38189 6828989 10354005 11473936 7909308 8266861 5833703 2626761 791850 6388721
38181 6388721 12851941 8397532 -722875 -1544135 -3641194 -4450626 -4795744 -4416973 -1718849
38172 -1718849 7699519 6624234 5053478 -329681 -1678639 1546611 6923698 9879090
38164 9879090 10169534 10061771 11040447 10518714 9726349 15233549 13171383 6704304 618565
38155 618565 -1309178 4869712 7980304 3830272 6422027 12937807 9313434 7402224
38147 7402224 7247786 1281295 6948272 2047247 790998 414952 -1315254 -1566731 -2836470
38138 -2836470 1334798 2786970 2984624 2076304 9824187 4646459 772651 363180 3956181
38129 3956181 6675108 12662115 13816701 7983701 8339248 5734681 -1685001 147459
38121 147459 5484129 -598971 1600196 5396119 3792543 5802273 8892462 11650806
38113 11650806 8723251 1939726 6234199 7680868 5253684 7913465 6485366 1671644
38105 1671644 8036572 11881741 4308504 4053056 1401322 6923606 11146135 3708953
38097 3708953 3474330 -394660 -4105874 -2987215 -5411408 -3600252 -2139680 -8286792
38089 -8286792 -1609733 -1997567 522338 3355590 -587469 -1559680 -6655346 -1597861
38081 -1597861 -379755 -4948257 -241025 2777664 4381113 13322265 14166082 9392727
38073 9392727 1823274 -1639808 -774468 -3952099 -3757757 -2265090 -853890 -2777205
38065 -2777205 -4677830 -2300200 4589627 1569573 1938763 5407297 6965616 7069433
38057 7069433 14347485 10997012 6858169 8761498 2126668 -4794229 144468 8418814
38049 8418814 4919850 3913147 9519882 7317747 5866107 5768438 7222813 4213383
38041 4213383 7323311 5088047 2425631 4387883 8035103 6285060 6281515 1039573 323479
38032 323479 5506587 4816518 11851792 11755021 7719313 7172538 9396700 7803338 441351
38023 441351 -2279635 950897 -912004 7231920 8876586 9548125 7243968 4820080
38015 4820080 8352294 10723597 6957535 181807 4973947 5186298 5962361 6463011 2632258
38006 2632258 5118327 -441837 -583670 8029100 10796224 16000460 9382171 9901307
37998 9901307 12281575 7967039 3125634 8579710 5081439 4937865 2135922 2889000
37990 2889000 6921463 9911039 6211143 1121537 3246972 2536326 790526 3013163
37982 3013163 1934950 2938901 391021 -2000874 -4684788 -1058042 1701236 1741412
37974 1741412 274857 -35116 -4322339 -4232542 -10109897 -10905164 -3779570 1287639 -3377221
37965 -3377221 -39507 8364123 5588068 7412446 7966412 4244013 -4263375 -8489945
37957 -8489945 -5320119 2563659 -1563821 -8078776 -8411647 -15081000 -6339980 -182597
37949 -182597 5522233 6335662 4712450 -274807 3925294 2495300 3856959 4384704 3903690
37940 3903690 2212727 3746756 5800662 6374075 4813759 4122468 2434912 3186682 550493
37931 550493 3291458 8729625 4792554 5880853 5105447 13911284 13687048 14878311 12418268
37922 12418268 7501425 5212148 7560102 8843666 2794842 3175331 8924316 7149474
37914 7149474 -2184668 -4016104 5000227 2084854 -383985 -36398 -191092 -6064237
37906 -6064237 -7575367 -1920969 5754066 5791865 13960887 13581358 13151417 12858488 11415746
37897 11415746 8979532 2193598 56473 2754830 6677770 10318645 4652970 599342
37889 599342 7342609 5106199 2292334 5428041 9939237 11987127 6983579 8429354
37881 8429354 11845167 13716297 12597059 14697056 10188686 12626157 8181835 9736060
37873 9736060 9298911 9042485 9729777 11752307 9016080 7618139 2976666 1526488 5484779
37864 5484779 11177095 6514180 6743908 -4773276 -7198972 1134783 8377203 9099386
37856 9099386 10704683 7114795 12203342 11683800 11703264 6753166 -2599291 5512322 11251675
37847 11251675 6533181 -1973883 -3133931 2239080 -1319410 1920306 8404883 2526776
37839 2526776 4333374 8241682 4188740 987184 -614644 -4300311 -7096116 -123953
37831 -123953 541985 -2365570 5439213 -602772 -1760088 1746875 -367984 -3032271
37823 -3032271 -6024413 -7290708 -7431472 -2350877 2680585 8659909 8652797 -1616092 -7563942
37814 -7563942 -11479136 -6445206 -10417482 -1674894 21147 -3428461 1319363 3769320
37806 3769320 4895191 2533892 -3564852 -2920895 -5010650 -12637436 -5471782 3200191
37798 3200191 4881771 11108743 7560337 3441356 96343 -934495 200143 -4866835
37790 -4866835 -4940517 -1465044 -3762243 -6529547 -2432000 505591 -3153742 290799
37782 290799 805700 5675365 6125777 3199392 5454141 -2407180 1320781 -1216696 -2577800
37773 -2577800 1759783 1602918 177108 1622724 5354584 11884523 5553896 -1504999
37765 -1504999 -1936188 -647966 -134773 -1671574 -2484510 9758345 4017815 663488
37757 663488 3115910 3119957 2015241 1849336 2532316 3662075 9121567 7899046 -1775697
37748 -1775697 -4067124 902482 5742331 6637257 5323 -1010050 -2732245 1245752
37740 1245752 7293783 12647059 6941921 -3394085 -2826185 -3245858 5823765 5228687
37732 5228687 4213182 -1428178 -67585 3388167 5848070 -384510 -63383 496991
37724 496991 -2944857 2830497 3137024 1145542 -1327481 646585 2411447 4291671
37716 4291671 2195094 3780073 830904 -2069346 -5993495 -5354919 -2609926 -10731497
37708 -10731497 -7783519 -497340 -159746 9079633 12860596 9099400 3882837 -3739159
37700 -3739159 -3712530 2248777 -992075 7953684 1769724 1361383 606177 -8081108 -3441233
37691 -3441233 -4779029 -315502 4676919 2947089 -107912 1101062 7238678 1541260
37683 1541260 -2740889 1905279 4232552 5315702 5678644 6155202 5097077 9456162
37675 9456162 9298946 2456660 5260482 6714781 10639236 7314075 1325675 991828
37667 991828 -3538048 -4189411 -3657592 -4112577 -3260723 -5798550 -4004102 -6918982 3215082
37658 3215082 10679493 9705636 3892320 -130316 2381088 5093129 5418656 3235853
37650 3235853 -2400388 2329548 3020306 4976187 -5779044 -6530244 -2108296 2924794
37642 2924794 -808296 1821571 2739959 -4556114 -9243926 -8389898 -2643233 2532526
37634 2532526 -1149058 -1213341 -697325 -4073526 -2382955 -2001110 -2387061 -10166820 -7071713
37625 -7071713 -2145266 392184 1425298 6127759 7531273 3578102 2088670 6897724
37617 6897724 9580182 5308501 11154159 10845216 4894954 5500953 3103580 -1717691
37609 -1717691 -6325988 -4106482 -763158 2872223 3973667 3531394 964757 12983981
37601 12983981 10482659 2199105 2194446 2819771 -1067243 93300 -323521 466607 -911057
37592 -911057 -6842021 -11059424 -4112319 2572484 3621924 -925169 -1035804 2964917
37584 2964917 10057836 13763117 12752695 6267642 -5206539 -3605969 -4532610 -2774340
37576 -2774340 857441 2196078 -2988869 -3744741 -6871672 -906063 3348166 1767170
37568 1767170 1644461 -3576661 545841 2745907 -2138153 -7582773 -4899124 -940645
37560 -940645 497752 3907247 39141 3138784 8088944 7462667 15271615 10311429
37552 10311429 6579964 3478321 2551501 1656230 -4405628 -1221401 1128044 3063769
37544 3063769 3305241 1749500 2801636 2762587 3589140 4435613 -1496228 -4864768 3381738
37535 3381738 3155108 2623829 6193200 11123226 6941932 2748366 3605070 4431984 3975820
37526 3975820 5499336 7412719 9137373 6151629 3310823 5447602 7254951 5175967
37518 5175967 14142122 4832308 2047083 3810406 3444163 6660602 12289323 13300310
37510 13300310 3773234 4352143 7694360 2205651 1122194 3574769 4169534 451677
37502 451677 6245206 7112063 10081353 881201 -6525380 -1311656 527511 1047071 -2327619
37493 -2327619 -4811741 634875 -1035383 -4136595 296288 1553511 4218819 6418255
37485 6418255 971783 -6256370 -1427793 5674913 7962107 -1452062 -4441545 173728
37477 173728 998298 6473492 5281981 -558696 1714315 9542664 11425027 5936411
37469 5936411 4318153 4067486 -4979662 -6113327 -4288207 -4499563 -2417486 -8726074
37461 -8726074 -16903186 -9629608 -281176 -1329445 -266946 3554853 1328557 -2311901
37453 -2311901 -1544380 949427 200164 -883821 -1360689 3792434 9635928 5046526 3193404
37444 3193404 3039015 5756257 8193892 6752609 6266627 11606284 13737305 14362793 12813471
37435 12813471 11074312 12937052 12949515 8779616 11953287 5240116 3519814 11192037
37427 11192037 9803219 13062410 9041705 6832834 8540253 8097267 -1133186 3781902
37419 3781902 7740345 2288692 5055389 3465772 143932 3236545 8176765 5387451
37411 5387451 566679 -5453019 -4637343 382668 3529314 11030555 5037108 -510965
37403 -510965 -2800836 -1296115 516595 4832023 7845106 5717665 5080880 -1781565
37395 -1781565 -9497515 -4241228 -9549586 -9238162 -4511937 -2306683 336519 5410242
37387 5410242 8649355 1445950 447661 -1812024 -5282289 -3953724 -3506772 -2402856
37379 -2402856 -10522696 -7562761 -1654624 -784262 4739205 4137336 8746975 11519011
37371 11519011 3842002 5895073 1429302 4934002 6936410 6008423 5540820 1002711
37363 1002711 4774396 755743 -6837409 -6916671 -3448288 -1480902 1198592 -2570860
37355 -2570860 -4633895 1099959 -4905445 -5250372 -8032259 -1348665 1583647 3127713
37347 3127713 6967321 12078057 12706346 9816898 13107752 6681174 4292744 6581517
37339 6581517 2513329 -300336 -1205596 -5033987 -4909584 -3918859 -8883066 -6966941 1299204
37330 1299204 3623610 2441845 -2372153 1465998 1095040 4230775 5369988 1027138
37322 1027138 -2243180 -5652088 -10710935 -5364709 -2160320 327450 -5620788 -8594688
37314 -8594688 -5104185 1447514 9277038 -1219911 -2288699 1616048 3725056 7715085
37306 7715085 5381022 2797169 -634582 -568904 -483645 -617659 -1752994 -4748911 437316
37297 437316 -4996472 2549752 8341561 3768415 -673931 -5171189 2543341 5248908
37289 5248908 1528806 -3390978 -5155172 5958998 4200877 1011085 -2292373 1582858
37281 1582858 6841586 7361191 7270839 5798168 1950192 2400367 8225123 7260723 2695113
37272 2695113 -1989530 -2333625 -4137381 -476482 -434694 -1458709 -1624100 3119068 4306392
37263 4306392 6634154 4365879 6774207 5516033 4334373 -763332 3957484 1125287
37255 1125287 2052549 9004943 13171382 9477925 -226631 -3447777 -772658 -5101334
37247 -5101334 -3031240 3980695 3805829 3323107 1249055 2016836 294735 5995485 8202975
37238 8202975 10248561 6320494 4750266 8864990 3473048 2894804 6575293 6333376
37230 6333376 4606837 7776766 4591673 1828120 896683 1884281 3808630 5765089
37222 5765089 -1094385 4067972 4851806 4270813 925276 2884605 3881512 2762068 8936639
37213 8936639 5155048 2583643 2226308 -1658478 -3648226 -2789333 97696 -1111850
37205 -1111850 4503880 6653476 6779788 3472390 2469627 3678228 745722 2067356
37197 2067356 1396903 984467 6046427 167506 -630645 -3741760 -2152726 -3233132 -3293755
37188 -3293755 -2788840 -2815933 -8501502 -2831723 4295207 351559 7936971 9033237 4902395
37179 4902395 7949419 6601301 -2852696 -1459572 680701 305969 5493897 1430526
37171 1430526 -3596033 7663685 12554773 9473348 4480045 2591656 2868450 76130
37163 76130 -2266391 4213576 8365628 1236224 -3278625 -2027491 4340956 3755570 5978734
37154 5978734 3057798 203442 1311926 -2668499 -3307705 -7059847 1248677 7794643
37146 7794643 3722266 4878814 9464863 4076284 4597548 5435256 -1294771 2189729
37138 2189729 4514324 7574760 7952011 5917660 4651860 3265521 8237118 5306769
37130 5306769 904372 -1560607 1687654 1386441 -9623937 -5609357 -2157647 2495848
37122 2495848 -1492890 -4694486 -6132297 -5693291 -8731626 -11713956 -10950045 -7281969
37114 -7281969 -2331301 -2691151 -917978 -4857258 -7590395 -6024337 165005 5716141
37106 5716141 8629754 2938686 -2670504 -1521987 840345 3689007 3302151 3799091
37098 3799091 5556335 7156356 2931843 3515293 5810187 1950029 4425676 5288178
37090 5288178 2396683 1288001 -2808637 -5127010 -5212216 -898127 5934553 8544980
37082 8544980 6227471 5944787 11907211 11682220 8554382 3960524 -638672 -3421339
37074 -3421339 -2531269 4290322 904213 4188292 -313584 1168808 5205219 691720
37066 691720 -4020555 3681869 2353152 6798084 5184306 -5069234 -5886141 -5396881
37058 -5396881 137835 -937291 -2964219 1399495 -1564997 3855280 3384693 2315983
37050 2315983 5516290 6679130 6499086 3202248 5321954 4959732 4508284 1279276 2829916
37041 2829916 1836504 987849 -4993674 -9494594 -1064458 8977254 8749501 6679964
37033 6679964 2537307 1281344 -8138987 -16153861 -12993414 -5724799 1526825 5811480
37025 5811480 9353156 7397260 -144915 3071303 11594510 875401 -6649463 1575785
37017 1575785 4811426 -48824 -2494787 -33353 2709636 11283724 6759540 -4212504
37009 -4212504 -6456980 -3136413 3517502 1257040 3036126 -347350 1689466 2267916
37001 2267916 1859540 4106989 5219205 353340 -8331748 -8408199 4533004 10101902
36993 10101902 4415327 6281079 8416980 6699697 4284799 -3825908 -60149 7477069
36985 7477069 9228628 14700603 17950993 12526154 3779375 -1991242 -3284268 -2137927
36977 -2137927 -5239088 -14007600 -7612800 -1588128 347258 6049239 4674287 2774115
36969 2774115 6723109 3633691 4446585 11807818 11704053 11842646 1471054 3896439
36961 3896439 9051745 -619663 -3609833 -2559814 1421455 6779269 9754340 10381197
36953 10381197 6287595 3944958 6298369 3168143 1434750 1193375 -282680 6640962
36945 6640962 5757874 -3483357 -4980324 3307058 5001951 7182882 4264349 -9243058
36937 -9243058 -8466816 -3150961 -2820194 1959582 5787929 4031135 2616610 2533293 3235262
36928 3235262 6955763 8019891 9103879 3417804 -5189656 -5841116 -5457324 -981615
36920 -981615 -1181209 3452686 3919848 578715 2889305 -189693 -2764671 -6206890 -4246333
36911 -4246333 843670 5580157 3428915 5112066 2570308 2730547 -28226 1252733
36903 1252733 1973908 -1976097 -1252892 10475879 4610680 1881191 4660538 3806067
36895 3806067 2555051 503713 3848324 6883520 5592907 2392001 -1764557 3474848
36887 3474848 4817403 6670671 5979645 4645166 -2507326 -7498339 -3616151 -3771031
36879 -3771031 -6345512 -5620355 -2388787 -4940621 -8355824 -4646184 -2695040 1322716
36871 1322716 1883975 2728142 -738812 -1783887 -3595675 -1765388 -8584333 -8512291 -3284155
36862 -3284155 -6898735 -4438144 9156629 10329039 968586 2346288 7328492 4926882
36854 4926882 1402992 1179675 4576957 -1485000 -5023394 -5455035 -2122135 -854090
36846 -854090 3179070 4570980 3075803 6538878 7004959 7052875 10281276 7910407 387925
36837 387925 -2205565 -5073018 -5770132 -4278118 -2955410 -1192461 -3013661 -650401
36829 -650401 -3319423 1396794 8494733 -1647099 -3955782 527261 -717232 -2757024
36821 -2757024 6312457 4287139 -789786 2293732 2977261 6883987 6975224 9428942 12838445
36812 12838445 9177642 356625 -8053939 -4819593 -6325902 -7538013 -667820 1067981
36804 1067981 2962125 7487294 -1523510 -4237819 3693252 3179633 5387798 5964988
36796 5964988 1286335 4326266 7074341 6640183 6979493 3877003 6357151 4467091
36788 4467091 195885 4681061 3823890 6553570 3931019 5169729 2592675 -1939621
36780 -1939621 2273625 8786640 9562389 9598719 6172820 7241176 506355 429854 -2525915
36771 -2525915 871532 -195257 -1649231 -719637 -7538532 -5400768 1198747 605584
36763 605584 -2913281 -999940 470118 1644392 -1032141 -4031673 -6553132 -6309450
36755 -6309450 -108905 2354466 2692562 40507 -2878533 -2226007 -3563134 -4880352
36747 -4880352 -6402027 -1233897 -1507386 3650171 -306317 -4521936 318892 -2156214
36739 -2156214 6893826 8332496 1548356 -967931 485649 -3186152 -1738883 -3272157
36731 -3272157 -4666108 -2140942 2195225 400300 5573506 3575114 -1066868 -382616
36723 -382616 -2955821 1826114 3426436 754073 3092302 -1388431 2827320 6394605
36715 6394605 1972752 3196631 1964931 1572925 -1036513 1630125 -694932 -695969 7670030
36706 7670030 8158897 5223565 6853662 1803285 440075 -3400208 1269758 1306679 4069231
36697 4069231 3866565 2012794 -2898406 1744271 5339956 10200972 12856123 15180002
36689 15180002 13019119 12085091 9887864 5106549 3090963 5070521 9859605 5598894
36681 5598894 3548602 1758704 2995994 6434424 3610729 4740876 2186871 8452804
36673 8452804 16274088 13399247 14491046 10164716 3238463 3429266 3003363 -1931391
36665 -1931391 -2250959 -584435 -1012222 -2677079 1489384 5789019 2766180 7221257
36657 7221257 7619287 542995 -1227092 -2355922 -4038901 2089190 827063 57913
36649 57913 -707137 2928274 895613 7524834 5185462 2831802 2057668 5009226 5831206
36640 5831206 1574178 1383573 7473205 6848417 2164068 -903394 -6241301 -9914139
36632 -9914139 -1884734 626627 -703349 -2682429 -11328014 -12612140 -7999889 -6291833
36624 -6291833 -7953397 -1720046 1118686 488316 5187590 8416819 4178367 -430513
36616 -430513 400176 -122979 3344148 5146645 199607 -3494220 -12528948 -9043829 265621
36607 265621 4622550 3237579 5466992 7064502 5997351 8743771 7417673 6354501
36599 6354501 -831686 1110204 2822447 -415109 -2049135 240944 -3736560 -8493138
36591 -8493138 -7976094 -6350694 1370635 -828564 -2964398 578547 -7225092 -4375747
36583 -4375747 -920306 1022640 1253035 3814786 8434167 8969484 9039402 5568210 6855620
36574 6855620 9747677 816263 136132 -460608 -3288008 -1768882 366764 -3120851
36566 -3120851 -4527348 -7500811 -6503422 -617856 5847819 262942 -4467396 -6116829
36558 -6116829 -5110289 1632524 -616040 -4634559 316839 6233908 5813172 2899953
36550 2899953 6468420 10193664 3796474 2111800 -3726726 -4542191 207136 6751116
36542 6751116 9524078 10508503 11113875 799259 2472147 2340799 -3531851 1324191
36534 1324191 2253968 5499081 8397571 17038591 13583440 6389931 -399442 -2625307
36526 -2625307 3441417 1266308 -6516065 -1817651 1021714 3352206 -184652 -701380
36518 -701380 -5842143 -7100420 -6614502 -3361369 3359993 8358690 1141492 -2512569
36510 -2512569 -219128 -2239073 -2899304 -715019 -3450074 -2805205 -182375 5265838
36502 5265838 -150741 -2543896 334332 3583435 6250802 7489140 7781419 7632669
36494 7632669 2421177 4410016 12033430 10254455 2611076 6441185 1785210 3343916
36486 3343916 833266 -4257463 -1655753 -2894458 -3217782 -2203840 1119491 369788
36478 369788 -7616689 -6210164 -2807430 -68617 8399226 6955512 -113943 1747229
36470 1747229 4553149 -2808958 -6366633 -4454761 -6443239 -19170 2316720 -1283566
36462 -1283566 4485051 6339592 2105715 3770627 -1416533 5328863 9004781 1398185
36454 1398185 5189372 6296658 2392112 -2890617 -7978736 -1512029 5563159 4947306
36446 4947306 6616143 173234 -1959089 5092075 -91697 -4083837 -6625280 -13191507
36438 -13191507 -7527622 5057690 1385152 -3567743 -622280 2512910 3460647 3245448
36430 3245448 7118346 4178689 2777192 5899364 8398866 9816161 8122672 3068642
36422 3068642 2418829 3595678 -1376435 2661384 -551630 -3116707 370688 5631720
36414 5631720 2209337 1677189 3359417 4284383 7045248 8126360 5197562 5252187 8982202
36405 8982202 4319769 -566295 1055209 229840 798511 919793 -4956062 -7358687 -3200123
36396 -3200123 -4933686 -10157002 -5611522 -4293185 -6142169 275408 1860551 3411662
36388 3411662 6553498 -156562 2916775 3765888 397444 5041362 3964496 5349249
36380 5349249 8540563 5414736 8934605 5088553 -2903930 -7279213 -9111933 39828
36372 39828 4561368 6663201 2799498 -2540617 -757485 -1218422 -5130062 -6240326 -4936217
36363 -4936217 -45683 2524833 11244646 11017283 1933125 232214 239689 2212788 1127205
36354 1127205 -1282351 2753871 4857712 5645479 3048209 -3324918 1446593 6630034
36346 6630034 5294373 2185180 -4992887 -12368545 -7167571 3451356 4844884 10801542
36338 10801542 6555184 224237 -616340 -2746531 -3642265 -4265352 -7411186 -9172780
36330 -9172780 -2388780 5729817 5263405 -770517 -809977 -985797 -1199330 -3767247 -629384
36321 -629384 -1581067 -3956774 -981949 268028 -1825689 -4667800 -732238 5196405
36313 5196405 7159934 4601187 616216 3569071 8524180 3744911 2867664 -1072427
36305 -1072427 -2209675 71900 -471746 715080 1227677 -1704714 -4455827 -5756059
36297 -5756059 -5637598 -6029577 -5677592 -5341726 -4668470 -908927 -1291268 -3964508 -7394933
36288 -7394933 -7553543 3685273 4583683 3103193 482140 2505860 -4061187 -7390367
36280 -7390367 -4441887 -781448 1169867 8698030 13724027 11304656 -230592 -13591737
36272 -13591737 -9771140 -1640118 1015519 -1325313 3631958 7781402 5441495 3959689
36264 3959689 3893612 1349858 192324 -6293055 -2796044 8148756 464092 -4464680
36256 -4464680 -2114720 -2360504 -2148530 387673 -2414519 -5037344 -2143947 -4579632
36248 -4579632 -11038917 -7183342 -4931784 -3345468 -2996754 686492 -3900341 -7496694
36240 -7496694 -7144120 -8048541 -4839685 -2676762 -69334 3240490 -1048856 3702723
36232 3702723 1274175 3010660 5215054 -127617 -3244053 -8279376 -5527535 591468
36224 591468 669787 2938681 2651645 -5324644 -4037775 7512306 6526728 -803847 -6976322
36215 -6976322 -976527 820704 -1733031 -3448269 -5142583 -81217 8641831 7114241
36207 7114241 5596631 5274463 5572897 9571070 4523093 5446553 3185 -4722622 -4887484
36198 -4887484 2158219 3512222 9325032 12843091 13476010 6422998 -1545552 -4733469
36190 -4733469 -5207525 -2399486 -2777110 -3433863 -7255723 -5097870 2019637 -3824034 -3568383
36181 -3568383 -986834 1952875 1770584 3160300 616700 3611991 3683114 -1166509 1436887
36172 1436887 -2891188 -5878199 -3329251 -683484 -304775 5827390 6139412 4867430
36164 4867430 -1918761 -175232 2646852 3249690 7296135 6993680 8964126 5115128
36156 5115128 -2121091 -3492920 2360681 7135994 3573808 3380474 4958987 4140242
36148 4140242 3902766 7127575 2614830 -3018387 -10995928 -13114700 -10103019 -2863404
36140 -2863404 2252220 1077557 -557012 453681 -2463535 -3518636 -7106907 -7971991
36132 -7971991 -4510618 -4244764 1511168 4357374 5852160 1441112 -5833403 -9490859
36124 -9490859 -3935703 -3453628 4247270 6006926 1200017 -3787115 6422882 8076725
36116 8076725 1777455 659332 3643757 -400247 -6158803 -4693770 -2436830 4414418
36108 4414418 3621820 2691867 2772711 870218 8733797 11884963 7535348 2484285 3000815
36099 3000815 1974124 2299020 -4832056 -3947925 99723 -516087 -4450558 544337 4863691
36090 4863691 -3218531 -9445692 -11111574 -4313603 3149828 5931580 7931800 1070637
36082 1070637 -1029329 -73875 -2860134 -6206368 -10981549 -5240181 2859432 7508364
36074 7508364 7416093 652731 1151713 -2053819 -1530339 4999476 4867396 7201223 3340445
36065 3340445 4153511 4427705 -285428 2449425 21021 -4062213 -8255317 -9729868
36057 -9729868 -7169607 -6572677 -3896834 4290216 7418659 8322588 5608808 7289904
36049 7289904 626680 -4305009 -588499 -2755475 -3639532 -6235668 -3481669 -4870274
36041 -4870274 -5720634 -3978446 -391236 962231 2473242 848686 3293611 6890037
36033 6890037 -1391097 -662014 -591912 -4837203 -6904359 -5774356 857647 2099294 1685501
36024 1685501 2015913 8801112 9512225 3186693 1384763 5379603 -1548635 -2153207 -2993266
36015 -2993266 299933 6081465 2875246 4622370 6173958 4687417 -3416365 -1942132
36007 -1942132 728179 -415664 -1996033 2469597 2776055 -306981 -5211095 -8189286
35999 -8189286 -10225140 -12498721 -8437661 -1952886 -3291379 -1690328 1485069 2681716
35991 2681716 2797489 3969895 1006692 -6036270 -3874224 3625037 2896834 899201
35983 899201 2204703 -852171 -842738 -1029473 7891438 2770465 -573513 -1509208 -4058606
35974 -4058606 3846306 1572565 -644838 -2105304 3287954 -7118249 -13128073 -10858093
35966 -10858093 -4929469 3649912 4234062 -945527 1909151 5961521 -1043952 -2876096
35958 -2876096 -2648486 475484 5039948 5551508 492947 -2922893 5511370 12450156
35950 12450156 12670090 5491868 741093 -347923 -117948 -2345163 -5443666 -8666188
35942 -8666188 -6248617 -5565928 -3577437 -1913634 2269034 5938065 1801394 553480
35934 553480 -127378 1736571 7124138 2878042 4587764 6190397 8342146 6595662
35926 6595662 657178 -9396381 -7146192 -1321655 2620445 -643608 805106 6373299
35918 6373299 1920208 2189582 5357898 1636748 4499597 8206492 6168983 8105845
35910 8105845 519571 -953389 3991727 7226487 8809738 7744306 4280226 783211
35902 783211 305687 3542432 -3442557 -4207330 -3587669 -1622611 2458965 -1883923 -2869716
35893 -2869716 1145901 2024090 -306719 -8109219 -4072715 -1835791 -1211068 -2282601
35885 -2282601 -1747404 3112141 -1685918 7454832 11722804 11714734 9902564 4940146 4063726
35876 4063726 523952 3227590 706173 2917844 4887416 -2776381 4095376 716760
35868 716760 -5322930 -4833610 -2208778 5893422 8400338 8861439 3047830 -5380902 -2410443
35859 -2410443 -2628642 2846237 -930617 -4267959 -1751153 5388493 6668903 902305
35851 902305 -3037783 -8428203 136723 -357868 -3538735 -2190804 -4559983 -3003566
35843 -3003566 -1161202 -3597400 -408224 -4076723 -3181382 -3686129 -743203 2204206
35835 2204206 -2068852 -842000 -5417276 -11681619 -5800489 -352176 -3644522 -2641089
35827 -2641089 3540890 5017456 -2228106 668992 419704 4876240 6908216 6051640
35819 6051640 2057180 -1216253 6572930 4862497 -934776 2988057 6281338 468014
35811 468014 -3336400 -5886482 -12275634 -8490564 -4407852 -4340380 2121558 14730000
35803 14730000 9614519 6528118 4386484 -543722 6204738 3209717 7039617 1520250
35795 1520250 -772747 -4793576 -1066946 4242107 4164699 6361138 6452708 769460 795708
35786 795708 1373623 -3876526 -4681210 -4591000 -8150685 -9481951 -9809742 -1314235 284110
35777 284110 -2650834 -667417 -1334854 2791132 8773256 7167351 1800386 -167697
35769 -167697 3710683 4665609 254399 1791845 7557479 2066057 -12610627 -16420642
35761 -16420642 -14567163 -10867218 -6373428 -1262539 160784 5665 -1085797 -905440
35753 -905440 -865859 186583 4842558 4966453 2432378 7354368 -2444648 -10022288 -8140325
35744 -8140325 -6628315 -9943615 -13115367 -7177305 -3346621 46370 276888 -2637550
35736 -2637550 -2103963 -837917 -2247118 -2067025 6752146 1781646 2228871 8989590 11028784
35727 11028784 10074903 3893855 1979529 470973 -64940 -8028977 -9702532 -5119892
35719 -5119892 -7553336 -4521724 -1106105 -2192289 -3262343 3122201 2153976 -3155744
35711 -3155744 -11455440 -7664918 1241095 4405539 1451816 -3949621 -1063966 -1474201
35703 -1474201 742340 -5760232 -7445828 -6792273 -8795247 -8434069 -5807634 1090245
35695 1090245 4413545 823220 -4727468 -345344 584216 1742250 1192108 669043 3554295
35686 3554295 -1014893 -2863750 -2536533 -5729088 -9742687 -9520775 -4272163 1540921
35678 1540921 4937442 7516860 5826839 2491317 339095 -2359766 281904 55222
35670 55222 3991111 8238858 -1830901 -3326789 -3488208 -4065714 -1164131 1729291 8085836
35661 8085836 -890597 225375 3897056 2871862 421279 2577036 6983750 7259281
35653 7259281 7239331 4165174 823077 -6415982 -1749316 -1102843 546923 583987 1055070
35644 1055070 1095902 878655 -1952808 3870499 9408456 -1969998 -8875159 1468305
35636 1468305 3742953 193917 1913451 1116447 -2083926 3093158 8953328 7272533
35628 7272533 185145 -6038640 -8298078 64281 2282525 4686317 2162486 -9392431
35620 -9392431 -11034529 -4713784 -1303190 -1211595 3614587 3775064 3752426 6614091 2169761
35611 2169761 821987 -287044 -8384557 -8363609 -494550 5651686 2791709 2920114 4801055
35602 4801055 895881 -3655448 -10873315 -7408513 -7982811 -7703882 -4284158 -1350003
35594 -1350003 2081579 4652425 5600170 554104 -4521953 -16267056 -21056937 -8170365
35586 -8170365 1494544 185068 5524864 488228 -10346583 -10913205 -6260923 -5449914
35578 -5449914 -1315049 2143827 4459532 4723480 4869500 3492561 -1234587 -5397410
35570 -5397410 -3809528 -2826298 -9013190 -9039942 -3458903 -4737726 -5726823 -14432842 -2236986
35561 -2236986 1718463 587114 4253702 294089 1286804 16898 3078435 5792878
35553 5792878 -716863 -5475664 -8152957 -3517331 -296731 2505198 880417 3076752
35545 3076752 2541844 -690891 -315566 -634089 -7315018 -4940074 2191014 9159803 9654608
35536 9654608 3188885 -6603145 -8573091 -3644542 -1156215 3539942 5361818 4242028
35528 4242028 1904926 -5756542 -4563016 -2594795 -1274035 4002526 7782201 4691184
35520 4691184 2482872 2444275 4114887 -4190459 -3704284 1513192 1244781 -4428017 -11842481
35511 -11842481 -6961937 1502573 317793 -7343308 -5425761 -4847367 -244792 -4011186
35503 -4011186 -5875167 -1720576 -4230298 -4509621 -7159705 -16082583 -17985672 -6523952
35495 -6523952 -2222307 -370329 4719817 -672388 58369 7006863 8045262 2739564
35487 2739564 5519412 3414206 3441352 -2342062 -1797590 3215464 7228190 8473580 -1184228
35478 -1184228 1101570 6695026 560407 3326988 602766 2466976 1214351 1371099
35470 1371099 2568349 -820470 -5256231 -3292602 -4107901 2418470 4990756 3478157
35462 3478157 6741732 10311751 8588568 7880557 5561903 2087389 1873837 -3506615
35454 -3506615 -2166115 -4760572 448610 5974071 762055 1270473 5908250 9453240
35446 9453240 903401 -5667243 -3672431 -1859001 -8921758 -9569514 -3369294 4642810
35438 4642810 6988910 -985155 -5154684 -8225900 -4377461 3428947 -170879 -2137926
35430 -2137926 -358306 5112120 1460952 -6842494 -4055869 -70771 6321722 5097666
35422 5097666 7258254 -3627555 -6544261 -3238473 -6985979 -6742566 -3196770 199896
35414 199896 6289017 5739234 5637288 5988278 4889950 4132778 1576477 3249369 9171707
35405 9171707 10190197 5235317 3856012 3563229 -2382353 -5557576 -2605399 338610
35397 338610 126391 -6939478 -2734135 1355727 -77331 5212138 3265892 3355913 4215637
35388 4215637 3185602 -1001605 -776503 -2179557 -1587711 5859470 6624591 7921579 8307651
35379 8307651 1619201 -2760009 797529 876788 2061994 10442675 6549467 -2548793
35371 -2548793 -3806503 2974486 1246836 1287147 -282321 -9127853 864859 570074 -4938766
35362 -4938766 -6618453 -1790019 6203616 10246319 8745434 3775360 -2549556 969487
35354 969487 3028751 3243017 215786 -4411417 -800425 2401591 -1147136 -660085 779587
35345 779587 263482 -4826271 -862520 256714 -5959812 -11057102 -12604251 -5526370
35337 -5526370 -1171250 1773364 1815098 2238407 -2528824 -9249996 -1326639 7901068 11673172
35328 11673172 10398809 9535307 4018163 4408649 4676609 -4549461 33427 5172207
35320 5172207 3006118 1568838 1386572 -1529444 -324357 -2536184 -5919798 -6917032
35312 -6917032 -3336653 -2914135 1799306 -915796 -3899230 -6136872 -7508122 1141671
35304 1141671 4219090 1032804 -3597998 -4298600 -806455 -6246457 -1852532 -2047051
35296 -2047051 -6395001 -6534285 -10641486 -4276219 5227621 8990504 9576313 11713771
35288 11713771 6868347 1999048 -1008303 -6274941 -7514404 -6415476 -6674714 -2060514
35280 -2060514 -1375732 -2249923 -4800935 -10778462 -10308747 -14431953 -9646308 -2916680 -6651317
35271 -6651317 -786642 5756214 -1374172 -152810 2765156 4784823 2628539 -5998172
35263 -5998172 -1721251 3300398 2815971 6947244 3433995 124352 -3823651 -1987266
35255 -1987266 4054435 3696510 -1585522 4888090 1286374 -5108915 -1701368 -2418064
35247 -2418064 -2032388 1855267 3330822 5720833 4315542 1571931 -5341190 -5774333
35239 -5774333 399368 -1733356 715352 1277587 -747996 -4725979 -7714825 -6779197
35231 -6779197 -832343 2082791 -3559623 5069176 5396081 6641400 -463748 1452409
35223 1452409 5324987 4004480 -93232 -2416259 1573594 -1588195 -806665 -11723414
35215 -11723414 -7083215 -8804530 -5439272 -3277493 -4984266 -10854323 -6604884 -5570339
35207 -5570339 -5139215 -4704117 -2560243 -1926710 -2684656 -4720080 2223140 6776392 10347767
35198 10347767 2631083 -4095895 -4112505 975721 -3211510 2413756 6725564 -1767307
35190 -1767307 -463485 -1208225 -4524999 -4805478 2633504 -821423 -1728845 -1036401 -4149128
35181 -4149128 -5021589 466462 1492812 -781358 -74509 -453407 -6804018 -739715 8765557
35172 8765557 10741347 10805505 1744415 -191612 4597699 7344981 1955508 -2625917
35164 -2625917 2766096 -2006007 -7549617 -2123961 -8478255 -10329632 -9990917 -5164214
35156 -5164214 -5775437 -8346923 -6738231 -4039522 -1558778 -2353167 -502584 -3273012
35148 -3273012 4162467 -298409 -782103 -4313161 -1484463 -73452 -4235462 -2024677
35140 -2024677 24498 2524658 1879901 -4845908 -6476687 -8049171 -4326744 4409705
35132 4409705 -1389843 -4636812 -3273134 828172 -4131788 -6081637 -2534912 -1906322
35124 -1906322 -6848584 -5776418 -841737 -952151 -2784563 3132696 7872978 9717476
35116 9717476 8198644 6620571 1387631 -3573820 -5011072 -4784770 3756245 1541406
35108 1541406 -4428999 -7609874 -7962633 -5162062 -2119573 1944631 -827509 -2926991
35100 -2926991 -373285 -1827041 -6453724 -1557071 2462583 2666797 6253296 1368459
35092 1368459 -2345954 4351905 2720014 47934 -1111281 3473238 3398412 -910654
35084 -910654 -1752701 -797419 -4697272 -3081351 2615853 340042 -2710044 1772983 3404236
35075 3404236 3440072 2195825 -742595 868783 -1143840 -1735331 -1131137 -1114622 -7841839
35066 -7841839 -6235189 -5046487 -3941032 -5471427 -4231499 -1443072 -6407524 -4922865
35058 -4922865 -5940283 -13764736 -19902904 -4355167 -3591348 -4231694 -3251568 -3966374 -6334922
35049 -6334922 -1287135 1540349 4451333 3026757 2281149 5643037 1960307 -6902007
35041 -6902007 -4116396 -2464531 -599134 -3291344 -3021803 2977258 4869258 3373132
35033 3373132 -2217155 -4855647 -1954165 -5043998 -10330395 -7091611 -3503658 -3762415
35025 -3762415 373016 4709562 -3174782 -3569720 -4333156 -6903 -1526489 -6310563
35017 -6310563 -3309607 -2712078 -11013146 -7783879 2266537 6171490 6208065 2189993
35009 2189993 2505502 1559902 -3042578 19658 6509342 662813 -5314459 -2318225
35001 -2318225 804203 7479925 8671248 12453592 11299638 -3514448 -7363244 -3073263
34993 -3073263 -3949713 -6561804 -3427281 -3116186 1511362 -2970444 -7289190 4555812
34985 4555812 2733649 1510330 816143 3714485 14503872 10849735 1419562 -500738
34977 -500738 -542870 3705909 5208368 1199742 1370163 -849512 2232001 2939566 -3260922
34968 -3260922 -3049375 -1505735 -165946 305641 -2659169 -1272524 1858142 -7039573
34960 -7039573 654127 522644 2244622 3363261 7385429 8961541 10812155 6600847
34952 6600847 -584251 -3120386 -3353180 -8989635 -3916223 -2227029 794779 2824572
34944 2824572 4184853 646228 -4722493 -5546217 -4653514 -1660860 3105139 2708314 -2527985
34935 -2527985 -336224 -4874383 -49130 -647805 -523596 -2953797 -5966818 330895
34927 330895 -3071976 -3435554 -4468421 -2777589 2129785 696718 1980121 2881399 -2269897
34918 -2269897 2505276 5466446 1415248 1513369 480660 -8417126 -3947987 -2386999
34910 -2386999 -633356 -7226480 -11061526 -11508922 -2223045 4410038 1312283 -2922239
34902 -2922239 -8285568 -10694134 -12734278 -1540735 1613750 -3777418 -2748863 -475972
34894 -475972 -2556799 1304327 -96017 -1635988 2844608 -600187 -2061479 -369956
34886 -369956 70830 2795106 -2519941 -3088195 -438817 3935542 5914089 397127 -3485847
34877 -3485847 -6800420 -2629996 1577897 -3026366 -3206963 -3796963 1711262 5844355
34869 5844355 120920 -4053763 -1923151 -77155 -3580794 -399424 8848680 3643905
34861 3643905 1831719 -3515560 -743274 -963342 -4638893 -192500 -1138986 -3076008
34853 -3076008 -5109459 -2002114 1842519 1684892 779163 -9497612 -5478833 -1763521
34845 -1763521 2991806 8982856 7332202 -1753178 -5610750 -6850313 872454 -8153220
34837 -8153220 -8391369 -1468374 2703226 5753255 7842677 -788193 -2491212 -1262006
34829 -1262006 3020149 5600772 -648873 -4735812 -3421056 -3169217 -2960061 -6089920
34821 -6089920 -4552568 -781110 3333142 5793504 4845409 1749689 3041360 4838913
34813 4838913 30728 -2111987 -772697 -3124220 -3503598 1622148 -3025316 -6526468
34805 -6526468 268777 10793276 12115621 8186214 1231571 4373198 9602775 4949728
34797 4949728 6395283 -100500 157925 4705353 2472159 1737636 3946138 3140946 1782241
34788 1782241 1887969 -51029 -6872162 -7577219 -1080146 201617 -1467459 -581802 -998449
34779 -998449 2501702 -2712385 -228098 -912817 -307884 291986 -4971375 -3135665 -4752044
34770 -4752044 -2971643 -7488309 -7674533 -6285387 816770 1100002 -4672634 -11133910
34762 -11133910 -788301 109718 2677265 5666036 6071921 2608382 -1008228 -191720
34754 -191720 1700208 -684232 740208 1610718 -2165333 393155 -2439099 -439614
34746 -439614 7500258 1038166 -7093930 -18631984 -10160402 -3190153 1166213 5060624
34738 5060624 -448041 -579597 -5163191 -1964496 3385290 1447595 -4254913 -2624273
34730 -2624273 -1427609 -3175852 -842423 3066548 7953908 4967183 5602051 8037116
34722 8037116 7042938 1050488 -12006966 -9329511 -6373207 -4886212 -12429573 -17304766
34714 -17304766 -8425048 -10106692 -11442134 -8960142 -2519278 -5258271 -282476 2319957
34706 2319957 4970098 3900921 -1314656 -1035860 2407767 2358184 3782455 5215859 5124319
34697 5124319 6217750 7545380 602061 -5248278 -3817552 -5765046 -1609491 2221001
34689 2221001 2325276 11640202 9930107 -3245382 -6683163 -6066844 3316425 2523888
34681 2523888 4634147 3634120 2169332 -2164560 -5655425 1722634 2367560 4629350
34673 4629350 10979779 -1155955 1630787 3371272 -3985111 2531592 -2468342 -8553180
34665 -8553180 2733948 11449936 5210719 -1912617 1788517 -3115725 -5330739 -3373907
34657 -3373907 -2617635 -2426926 628187 -2649866 -853159 1091031 -2522458 -5267224
$$ [...]
##END NTUPLES=NMR SPECTRUM
##END=
