##TITLE=19F_TG-2110-C
 CDCl3. 24 sc
 27.6.2019
##JCAMPDX= 6.0         $$ Bruker NMR JCAMP-DX V2.0
##DATA TYPE= NMR SPECTRUM
##DATA CLASS= NTUPLES
##ORIGIN= UXNMR, Bruker Analytische Messtechnik GmbH
##OWNER= root
$$ XWIN-NMR		Version 3.5
$$ Thu Jun 27 14:41:54 2019 Russian Standard Time (UT+4h)  she@DPX200
##.OBSERVE FREQUENCY= 188.290927
##.OBSERVE NUCLEUS= ^19F
##.ACQUISITION MODE= SIMULTANEOUS
##.ACQUISITION SCHEME= undefined
##.AVERAGES= 24
##.DIGITISER RES= 16
##SPECTROMETER/DATA SYSTEM= spect
##.PULSE SEQUENCE= zg
##.SOLVENT NAME= DMSO
##.SHIFT REFERENCE= (INTERNAL, DMSO, 0, 101.251)
##AUDIT TRAIL= $$ (NUMBER, WHEN, WHO, WHERE, WHAT)
$$ ##TITLE= Audit trail, XWIN-NMR		Version 3.5
$$ ##JCAMPDX= 5.01
$$ ##ORIGIN= Bruker BioSpin GmbH
$$ ##OWNER= she
$$ F:/spectra/data/she/nmr/f19/1/pdata/1/auditp.txt
$$ ##AUDIT TRAIL=  $$ (NUMBER, WHEN, WHO, WHERE, WHAT)
(   1,<2019-06-27 14:40:35.07 +0400>,<she>,<DPX200>,
      <created by zg, POWCHK disabled, PULCHK disabled
       configuration hash MD5:
       00 E9 B6 7A A2 85 ED C7 34 08 36 98 17 FE 4E 26
       data hash MD5: 64K
       AE 9F E5 8B 7D 95 51 94 AA 9D 63 BE 15 46 C5 FD>)
(   2,<2019-06-27 14:40:56.54 +0400>,<she>,<DPX200>,
      <Start of raw data processing
       efp BC_mod = 2 LB = 1 FT_mod = 6 PKNL = 1 PHC0 = 1113.18 PHC1 = 38.35576 SI = 64K 
       data hash MD5: 64K
       55 EB D1 22 D5 FA FF FF 9C 80 3A 6C 23 BA BB CC>)
(   3,<2019-06-27 14:41:07.67 +0400>,<she>,<DPX200>,
      <pk PHC0 = -8.107439 PHC1 = 0 
       data hash MD5: 64K
       1E A5 18 C9 DE 2B BA 54 28 D1 AA A4 34 66 3B 5E>)
(   4,<2019-06-27 14:41:10.06 +0400>,<she>,<DPX200>,
      <abs ABSG = 5 
       data hash MD5: 64K
       2C 80 8B 22 69 DA D0 5E 99 5F 9B 5F 39 DD 88 FE>)
(   5,<2019-06-27 14:41:31.87 +0400>,<she>,<DPX200>,
      <pk PHC0 = -1.602845 PHC1 = 0 
       data hash MD5: 64K
       38 23 E6 4C AF 9B 9F 0C B0 C6 11 56 57 ED 65 10>)
$$ ##END=
$$ 
$$ hash MD5
$$ 6B 75 B6 D6 8D 6A F1 C1 7E E1 20 87 CE AD FE 75
##$RELAX= 
##$RELAX= 
##$RELAX= 
##$RELAX= 
##$RELAX= 
##$RELAX= 
##$RELAX= 
##$RELAX= 
$$ Bruker specific parameters
$$ --------------------------
##$DU= <F:/spectra>
##$EXPNO= 1
##$NAME= <f19>
##$PROCNO= 1
##$TYPE= <nmr>
##$USER= <she>
##$AMP= (0..31)
100 100 100 100 100 100 100 100 100 100 100 100 100 100 100 100 100 100 
100 100 100 100 100 100 100 100 100 100 100 100 100 100 
##$AQSEQ= 0
##$AQ_mod= 1
##$AUNM= <au_zg>
##$AUTOPOS= <>
##$BF1= 188.310428
##$BF2= 200.13
##$BF3= 200.13
##$BF4= 200.13
##$BF5= 200.13
##$BF6= 200.13
##$BF7= 200.13
##$BF8= 200.13
##$BYTORDA= 1
##$CFDGTYP= 0
##$CFRGTYP= 5
##$CHEMSTR= <none>
##$CNST= (0..31)
1 1 145 1 1 1 1 1 1 1 1 1 1 1 1 1 1 1 1 1 1 1 1 1 1 1 1 1 1 1 1 1 
##$CPDPRG= <>
##$CPDPRG1= <>
##$CPDPRG2= <>
##$CPDPRG3= <>
##$CPDPRG4= <mlev>
##$CPDPRG5= <mlev>
##$CPDPRG6= <mlev>
##$CPDPRG7= <mlev>
##$CPDPRG8= <mlev>
##$CPDPRGB= <>
##$CPDPRGT= <>
##$D= (0..31)
0 1.3 0 0 0 0 0 0 0 0 0 0 0.25 0 0 0 0 0 0 0 0 0 0 0 0 0 0 0 0 0 0 0 
##$DATE= 1561632034
$$ [...]
##$SUBNAM3= <"">
##$SUBNAM4= <"">
##$SUBNAM5= <"">
##$SUBNAM6= <"">
##$SUBNAM7= <"">
##$SUBNAM8= <"">
##$SUBNAM9= <"">
##$SW= 251.107818259711
##$SWIBOX= (0..15)
0 1 0 0 0 0 0 0 0 0 0 0 0 0 0 0 
##$SW_h= 47281.3238770686
##$TD= 65536
##$TD0= 1
##$TE= 0
##$TE2= 300
##$TE3= 300
##$TEG= 300
##$TL= (0..7)
0 120 53 12 22 120 120 120 
##$TP= (0..7)
150 150 150 150 150 150 150 150 
##$TP07= 0
##$TPNAME0= <>
##$TPNAME1= <>
##$TPNAME2= <>
##$TPNAME3= <>
##$TPNAME4= <>
##$TPNAME5= <>
##$TPNAME6= <>
##$TPNAME7= <>
##$TPOAL= (0..7)
0.5 0.5 0.5 0.5 0.5 0.5 0.5 0.5 
##$TPOFFS= (0..7)
0 0 0 0 0 0 0 0 
##$TUNHIN= 0
##$TUNHOUT= 0
##$TUNXOUT= 0
##$USERA1= <user>
##$USERA2= <user>
##$USERA3= <user>
##$USERA4= <user>
##$USERA5= <user>
##$V9= 5
##$VALIST= <valist>
##$VCLIST= <CCCCCCCCCCCCCCC>
##$VD= 0
##$VDLIST= <DDDDDDDDDDDDDDD>
##$VPLIST= <PPPPPPPPPPPPPPP>
##$VTLIST= <TTTTTTTTTTTTTTT>
##$WBST= 1024
##$WBSW= 4
##$XGAIN= (0..3)
0 0 0 0 
##$XL= 0
##$YL= 0
##$YMAX_a= 31349
##$YMIN_a= -45748
##$ZGOPTNS= <>
##$ZL1= 120
##$ZL2= 120
##$ZL3= 120
##$ZL4= 120
##$ABSF1= 101.2514
##$ABSF2= -149.8503
##$ABSG= 5
##$ABSL= 3
##$ALPHA= 0
##$AQORDER= 0
##$ASSFAC= 0
##$ASSFACI= 0
##$ASSFACX= 0
##$ASSWID= 0
##$AUNMP= <proc_1d>
##$AZFE= 0.1
##$AZFW= 5
##$BCFW= 0
##$BC_mod= 2
##$BYTORDP= 0
##$COROFFS= 0
##$CY= -3
##$DATMOD= 1
##$DC= 0
##$DFILT= <>
##$DTYPP= 0
##$F1P= 0
##$F2P= 0
##$FCOR= 0.5
##$FTSIZE= 65536
##$FT_mod= 6
##$GAMMA= 0
##$GB= 0
##$INTBC= 1
##$INTSCL= 8.653935e-10
##$ISEN= 128
##$LB= 1
##$LEV0= 0
##$LPBIN= 0
##$MAXI= 10000
##$MC2= 0
##$MEAN= 0
##$ME_mod= 0
##$MI= 0.4277144
##$NCOEF= 0
##$NC_proc= -3
##$NLEV= 6
##$NOISF1= -61.99997
##$NOISF2= -62.99997
##$NSP= 0
##$NTH_PI= 0
##$NZP= 0
##$OFFSET= 101.2514
##$PC= 1
##$PHC0= 1103.47
##$PHC1= 38.35576
##$PH_mod= 1
##$PKNL= yes
##$PPARMOD= 0
##$PSCAL= 0
##$PSIGN= 0
##$REVERSE= no
##$SF= 188.29550247311
##$SI= 65536
##$SIGF1= -61
##$SIGF2= -65
##$SINO= 3.502647
##$SIOLD= 65536
##$SREGLST= <1H.CDCl3>
##$SSB= 0
##$STSI= 65536
##$STSR= 0
##$SW_p= 47281.3238770685
##$SYMM= 0
##$S_DEV= 0
##$TDeff= 65536
##$TDoff= 0
##$TI= <>
##$TILT= no
##$TM1= 0
##$TM2= 0
##$TOPLEV= 0
##$USERP1= <user>
##$USERP2= <user>
##$USERP3= <user>
##$USERP4= <user>
##$USERP5= <user>
##$WDW= 1
##$XDIM= 65536
##$YMAX_p= 295843395
##$YMIN_p= -656794
$$ End of Bruker specific parameters
$$ ---------------------------------
##NTUPLES= NMR SPECTRUM
##VAR_NAME=  FREQUENCY,     SPECTRUM/REAL,   SPECTRUM/IMAG
##SYMBOL=    X,             R,               I
##VAR_TYPE=  INDEPENDENT,   DEPENDENT,       DEPENDENT
##VAR_FORM=  AFFN,          ASDF,            ASDF
##VAR_DIM=   65536,         65536,           65536
##UNITS=     HZ,            ARBITRARY UNITS, ARBITRARY UNITS
##FACTOR=    0.721466756344984, 1,           1
##FIRST=     19065.1839562469, 0,            0
##LAST=      -28216.1399208216, 0,           0
##MIN=       -28216.1399208216, -656794,     0
##MAX=       19065.1839562469, 295843395,    0
$$ Real data points
##PAGE= N=1
##DATA TABLE= (X++(R..R)), XYDATA
$$ [...]
30079A12068n2270j61839l7462j6100n980J27725J29597j47604k4699j94995q883
$$ 112068 59798 -102041 -139503 -155603 -161583 -33858 95739 -51865 -76564 -271559 -280442
30068b80442O7470J58151l1823L5797j0299j3569k8862p5577R6289j54623Q7938
$$ -280442 -212972 -54821 -86644 -50847 -61146 -74715 -103577 -179154 -82865 -237488 -149550
30057a49550J19632L8320m5508j27679r4170n6392j40455J24123J95797k547j8985
$$ -149550 -29918 8402 -37106 -164785 -258955 -315347 -455802 -331679 -135882 -138429 -157414
30046a57414O6157p6473k01267Q7463l6540m1827J80235J20303r6960N052J10952
$$ -157414 -91257 -167730 -368997 -281534 -318074 -359901 -179666 -59363 -156323 -151271 -40319
30035d0319J16610L1308n8889k15879J2690K313R9211M5197p9j31352j367J48388
$$ -40319 76291 107599 48710 -167169 -154479 -152166 -52955 -7758 -7837 -139189 -140556 7832
30023G832J13120j22430O6586O5916r2697j47161j50725J82100J21354J1303J17340
$$ 7832 120952 -1478 65108 131024 38327 -108834 -259559 -77459 43895 55198 172538
30012A72538j74196M7013q253l05711Q6147J42517j39726p2856k35755O2679K55291
$$ 172538 -1658 45355 37102 -268609 -182462 -39945 -179671 -252527 -488282 -425603 -170312
30001a70312J68817r9225q9546K13576K3804m2852L438n3157o3774l7028J2174
$$ -170312 -1495 -100720 -190266 23310 47114 4262 7700 -45457 -109231 -146259 -134085
29990a34085J37847j24224k66575J57985K44349R2313j75740l7695k1002j21824
$$ -134085 3762 -120462 -387037 -229052 15297 107610 -68130 -105825 -126827 -248651
29980b48651p3941l5852J08894J10354J5098j22344N6048R8362P3093j67196J11370
$$ -248651 -322592 -358444 -249550 -139196 -124098 -246442 -190394 -92032 -18939 -186135 -74765
29969g4765l732J01239p0933r6628L3165R0326O3430J08813j51638j96412j00390
$$ -74765 -78497 22742 -48191 -144819 -111654 -21328 42102 150915 -723 -197135 -297525
29958b97525P8847L20553j30863R6127j0073p5872k6561L3759Q0422M6903r6179
$$ -297525 -218678 101875 -28988 67139 57066 -18806 -45367 -11608 68814 115717 19538
29947A9538j67776M3290L8284j03715q6966N5334n4208p9146Q6939K48752N1031
$$ 19538 -148238 -104948 -66664 -170379 -257345 -202011 -256219 -335365 -248426 326 51357
29936E1357r7488K428l0871L5059J6935J08133m4736Q740k2104j23163l9509Q3279
$$ 51357 -46131 -43703 -74574 -39515 -22580 85553 40817 49557 27453 -95710 -135219 -51940
29924e1940P8130j95343n1709J84712n2530n4791p4640N4869M0198r7986j7054
$$ -51940 26190 -169153 -220862 -36150 -88680 -143471 -218111 -163242 -123044 -221030 -238084
29913b38084M0791r6691J78138J34289p1716o7756j46152r4454Q11K01096K3704
$$ -238084 -197293 -293984 -115846 18443 -53273 -121029 -267181 -361635 -360824 -159728 -136024
29902a36024q2597j8404M4562m9734N3134Q5362o2147N1058J32308j82920n5901
$$ -136024 -218621 -237025 -192463 -242197 -189063 -103701 -165848 -114790 17518 -165402 -221303
29891b21303o636J81450k0737q2351J25434J8219r8442j27140j17569k4973K09357
$$ -221303 -227939 -46489 -67226 -149577 -24143 -5924 -104366 -231506 -349075 -374048 -164691
29880a64691l8859m557l0109K7126j5017j21871Q6967J30158r8216N52P0101P0733
$$ -164691 -203550 -208107 -238216 -211090 -226107 -347978 -261011 -130853 -229069 -228517 -158416 -87683
29868h7683l7008j44771r7795J37632N8578j34559J65287j0598q3696l3002J92209
$$ -87683 -124691 -269462 -367257 -229625 -171047 -305606 -140319 -150917 -234613 -267615 -75406
29857g5406J06562J27605q2026q365L4837L9846k5071j26520k4738n8423j4856
$$ -75406 31156 158761 76735 68370 103207 143053 117982 -8538 -33276 -91699 -106555
29846a06555J12675j83084j34939J48782m0067J4424L8645J50j52704J51168N3257
$$ -106555 6120 -176964 -311903 -163121 -203188 -188764 -150119 -149969 -302673 -151505 -98248
29835i8248p8093J70613k22424L8860K23028M890L4710j83152j90037K0734j00764
$$ -98248 -176341 -5728 -228152 -189292 33736 38626 73336 -109816 -299853 -279119 -379883
29824c79883M5983q5047m0238J36177O0748K40251p6299J3713j2913o7603j7049
$$ -379883 -333900 -418947 -459185 -323008 -262260 -22009 -98308 -84595 -97508 -165111 -182160
29813a82160N924o9149P7914O4090m1227j20789M9625J56896j46524J91050J10188
$$ -182160 -176236 -245385 -167471 -103381 -144608 -265397 -215772 -58876 -205400 -14350 95838
29802I5838N5973j4983Q0233P5939o0562j92109p6556M7128j1538j70421L16458
$$ 95838 151811 136828 217061 293000 232438 40329 -36227 10901 -637 -171058 145400
29791A45400j81509J10884J1367k5800j68760J37204J54990o8504k21927N9181
$$ 145400 -36109 74775 86142 60342 -108418 28786 183776 115272 -106655 -47474
29781d7474j15094j43509P9949R3131N0406J39621k890R5492l9135k31434M7436
$$ -47474 -162568 -306077 -226128 -132997 -82591 57030 54140 149632 110497 -120937 -73501
29770g3501j7740n2243J11243l8957o5500P0569l3374O4515r0869J04954o2363
$$ -73501 -91241 -143484 -32241 -71198 -136698 -66129 -99503 -34988 -125857 -20903 -83266
29759h3266m0382r5498j46983O4661l3641P6511J89607j20053j94663m925K85330
$$ -83266 -123648 -219146 -366129 -301468 -335109 -258598 -68991 -189044 -383707 -388632 -103302
29748a03302m7228j35570N0718K3633J03348r5693o7604L4813J01317J23180m0967
$$ -103302 -150530 -286100 -235382 -211749 -108401 -204094 -271698 -236885 -135568 -12388 -53355
29737e3355o975j08157Q791K45753P4641j51871j62314j19199J27230L184l432
$$ -53355 -60330 -168487 -159696 86057 160698 8827 -153487 -272686 -145456 -142272 -145704
29726a45704J66490j9206O2149l3738n9859J96069j98790j28146J34402j8844
$$ -145704 20786 1580 63729 29991 -29868 166201 -32589 -160735 -26333 -45177
29716d5177j44052M02J30245N9682j32939j45895O1759J88963K4194L5784m66
$$ -45177 -189229 -188827 -58582 1100 -131839 -277734 -215975 -27012 -2818 32966 32500
29705C2500j71449Q4796n2782r2201p5767K65009J04181k42392n2139J10568n2322
$$ 32500 -138949 -54153 -106935 -199136 -274903 -9894 94287 -148105 -200244 -89676 -141998
29694a41998R8140j88415j02609j4850K4632J00631o016k7213N2604j7099Q4000
$$ -141998 -43858 -232273 -334882 -349732 -325100 -224469 -230485 -257698 -205094 -222193 -138193
29683a38193J4959j41230j04552N6578m0081N6072J50402L6542J5282n0003p566
$$ -138193 -123234 -264464 -369016 -312438 -352519 -296447 -146045 -109503 -94221 -144224 -151790
29672a51790o8178p5027R0900J51280K5559K0306j02464j38362M5629j40685M6076
$$ -151790 -219968 -294995 -204095 -52815 -27256 -6950 -109414 -247776 -202147 -342832 -296756
29661b96756J62729J6029K0874K06526r3077p6553m2261P5167J11632J16608m5845
$$ -296756 -134027 -117998 -97124 109402 16325 -60228 -102489 -27322 84310 200918 155073
29650A55073n3901q3335j2500P4146l4882M7428j81618M1634N3149k31622R1887
$$ 155073 101172 17837 5337 79483 44601 92029 -89589 -47955 5194 -226428 -134541
29639a34541N9477l7142O3774j51573L34J64089k67309l5030N7626J1840j7928
$$ -134541 -75064 -112206 -48432 -200005 -199671 -35582 -302891 -337921 -280295 -268455 -286383
29628b86383o4831j04402J54474J93176O3723k50689j35458K72032O1084n7377
$$ -286383 -351214 -455616 -301142 -107966 -44243 -294932 -430390 -158358 -97274 -154651
29618a54651L3073Q2562J09706k6909p7733k39075L3541P6774l7387L0366J19346
$$ -154651 -121578 -39016 70690 43781 -33952 -273027 -239486 -162712 -200099 -169733 -50387
29607e0387J69364Q5074K9176J13462j85586k88135o372r5145K00968r308j17814
$$ -50387 118977 204051 233227 346689 161103 -127032 -133404 -228549 -27581 -36889 -154703
29596a54703K585j50583j77420J46119n194J550l3122J14388j34883K9412K26500
$$ -154703 -152118 -302701 -480121 -334002 -339196 -337646 -370768 -256380 -391263 -361851 -135351
29585a35351J68559O9536p8340m7246m0927O0119q9644j8947n2508K6514J36297
$$ -135351 33208 102744 24404 -22842 -63769 -3650 -93294 -112241 -164749 -138235 -1938
29574a938K28294p7788k37511o6086Q0983J79752m7500k32825j50419K53480J7111
$$ -1938 226356 148568 -88943 -155029 -74046 105706 58206 -174619 -325038 -71558 -54447
29563e4447R2016P6476j12509O7759J7449j84870j15867R85j47175j7394J44718
$$ -54447 37569 114045 1536 69295 86744 -98126 -213993 -213008 -360183 -377577 -232859
29552b32859l9192q2914N3505j0562J67806K55478j95305j8167N8530L7341j28296
$$ -232859 -272051 -354965 -301460 -312022 -144216 111262 -84043 -102210 -43680 -6339 -134635
29541a34635J6697R0952L198J04856O8141j57484O6609r9227j65648n7625K06131
$$ -134635 -117938 -26986 -23788 81068 149209 -8275 58334 -40893 -206541 -264166 -58035
29530e8035Q0788j13724m1847K0454m1497J20676q1870q1398m9803J37660j46109
$$ -58035 22753 -90971 -132818 -112364 -153861 -33185 -115055 -196453 -246256 -108596 -254705
29519b54705k9793j00489J44414Q8980p8325j62460J9616K07428M3645J74233
$$ -254705 -284498 -384987 -240573 -151593 -229918 -392378 -372762 -165334 -121689 52544
29509E2544J07988k17869n9184l2883o8339L647N4158P4774o0962l5892J61063
$$ 52544 160532 -57337 -116521 -149404 -217743 -214096 -159938 -85164 -146126 -182018 -20955
29498b0955k56630o7375Q0483N0119o3982k0822j6738P4918J45051P5205M019
$$ -20955 -277585 -344960 -264477 -214358 -278340 -299162 -315900 -240982 -95931 -20726 -16707
29487a6707n3568j12646q1564J179O7862q2430O6056P1516j20454K6011K03040
$$ -16707 -70275 -182921 -264485 -263306 -195444 -277874 -211818 -140302 -260756 -234745 -31705
29476c1705k9858J0778q971O6620j16988r5653l6795L0470k2531k0005j3289K39849
$$ -31705 -61563 -50785 -59756 6864 -110124 -205777 -242572 -212102 -234633 -254638 -267927 -28078
29464b8078K93579l5546j76771j25889P2401m9697r8427M1753J00665J7263O9841
$$ -28078 265501 229955 53184 -72705 -304 -50001 -148428 -106675 -6010 11253 81094
29453H1094K32427N5939p4675k58502r8108j27114P0272L4131p9993j11581j2671
$$ 81094 313521 369460 294785 36283 -61825 -188939 -118667 -84536 -164529 -276110 -288781
29442b88781J29614J39145O2005L5338J40332k01102j06200P0606j66710O0688
$$ -288781 -159167 -20022 41983 77321 217653 16551 -89649 -19043 -185753 -125065
29432a25065p1869j01124M2078O5362J86790M6731K6025j43580j03359L50120
$$ -125065 -196934 -298058 -255980 -190618 -3828 42903 68928 -74652 -178011 172109
29422A72109j05603j08492j52748p1598l5513J31508P7552k8524P7350M6198J55025
$$ 172109 66506 -41986 -194734 -266332 -301845 -170337 -92785 -121309 -43959 2239 157264
29411A57264j28105r2051K1124l3564j09032J15106R987J0572J51359k5900j32695
$$ 157264 29159 -62892 -41768 -75332 -184364 -69258 -59271 -48699 102660 76760 -55935
29400e5935k1120r5771o0563L0820j67513k8643P9628J12193j130j16029J21143
$$ -55935 -77055 -172826 -233389 -202569 -370082 -398725 -319097 -206904 -208034 -324063 -202920
29389b02920J13731R7687J20087k23242o3215P5332P073j21206j97967R6473J21730
$$ -202920 -89189 8498 128585 -94657 -157872 -82540 -75467 -196673 -394640 -298167 -176437
29378a76437Q1497j40545j76859J5569P0490j373Q9624P4428j61311J20616l2624
$$ -176437 -94940 -235485 -412344 -396775 -326285 -327658 -238034 -163606 -324917 -204301 -236925
29367b36925j48196J42839R2224Q8060K12594N8783k2338j98317l30744N7382
$$ -236925 -385121 -242282 -150058 -61998 150596 209379 187041 -11276 -342020 -284638
29357b84638R5896n6834J30084J6623p5230O1350K1151q0970k2606r534m8193
$$ -284638 -188742 -245576 -115492 -98869 -174099 -112749 -91598 -172568 -195174 -204708 -252901
29346b52901J16447K3496J06798j66485N3077L0083M7332Q2468j06260J08229
$$ -252901 -136454 -112958 -6160 -172645 -119568 -89485 -42153 40315 -65945 42284
29336D2284j06860j83491L3910P8663J20087j26897L890r8533r0372Q560K14941
$$ 42284 -64576 -248067 -214157 -135494 -15407 -142304 -138414 -236947 -327319 -318759 -103818
29325a03818j0483m6288j6661J00428P0686k210J00279j15828j8302r487K4823
$$ -103818 -114301 -160589 -177250 -76822 -6136 -8346 91933 -23895 -42197 -51684 -26861
29314b6861j69314J31586K0515M2882O9419j24596j9375j16626m4074N1815J43554
$$ -26861 -196175 -64589 -44074 -1192 68227 -56369 -75744 -192370 -236444 -184629 -41075
29303d1075R4387n4601O4134j5958j8407L5360P1312J7091M0305n1825R5197p9826
$$ -41075 53312 -1289 62845 46887 28480 63840 135152 152243 192548 140723 235920 156094
29291A56094m4862J63192M3331j372k08399l9175r4971j34643q9006k1360m4023
$$ 156094 111232 274424 317755 316383 107984 68809 -26162 -160805 -249811 -271171 -315194
29280c15194K99782p2166J9918J51748J1061k22843J11368K03135k37199L4954
$$ -315194 -15412 -87578 -67660 84088 95149 -127694 -16326 186809 -50390 -15436
29270a5436J8616o4155J85800m9427k6509l0927j18258J25746M9231o5182o2700
$$ -15436 3180 -60975 124825 75398 48889 17962 -100296 25450 74681 9499 -53201
29259e3201j66115p415J36500o6287k2330J14325J1148q6568N9754P57j56771
$$ -53201 -219316 -226731 -90231 -156518 -178848 -64523 -53375 -139943 -80189 -79432 -236203
29248b36203P585K06628k5046q2904L3415N8158j6472M4002o7918j90673n7420
$$ -236203 -228618 -21990 -47036 -129940 -96525 -38367 -54839 -10837 -78755 -269428 -326848
29237c26848J93158o2618R0983M5411o6641J28262j98478j05451J03543q2810
$$ -326848 -133690 -196308 -105325 -59914 -126555 1707 -196771 -302222 -198679 -281489
29227b81489L9252Q1933J28563l0821P9093J81647L4053l13286k22354L0216J37734
$$ -281489 -242237 -160304 -31741 -62562 16531 198178 232231 -81055 -303409 -273193 -135459
29216a35459p7793M3416J79455p6280j69267j74048J02676j39000k9091Q7710
$$ -135459 -213252 -169836 9619 -66661 -235928 -409976 -307300 -446300 -475391 -387681
29206c87681J46384P71L1503R2205k952j02160J87455K00574R1919l2765o1904
$$ -387681 -241297 -240526 -209023 -116818 -119770 -221930 -34475 166099 258018 225253 163349
29195A63349k01881k00552J4940K2787r3940K65756J26869L3584j42405j29182
$$ 163349 -38532 -239084 -224144 -201357 -295297 -29541 97328 130912 -11493 -140675
29185a40675O3992j35189k9467K049J94449J35765k52205n1625O3097O8078K28353
$$ -140675 -76683 -211872 -241339 -239290 -44841 90924 -161281 -212906 -149809 -81731 146622
29174A46622P5555L8316l05161j75201K12834q6491j73310L4201O5920K3236j37802
$$ 146622 222177 260493 -44668 -219869 -7035 -93526 -266836 -232635 -166715 -143479 -281281
29163b81281M9011j5073k2954M5705J83466Q1178O0231J87615l64737j10278K55262
$$ -281281 -232270 -247343 -270297 -224592 -41126 40052 100283 287898 -76839 -187117 68145
29152F8145r6708q3278r5792K21429K68500Q72P6711l52123p4105k2188J63907
$$ 68145 -28563 -111841 -207633 13796 282296 283168 359879 7756 -66349 -88537 75370
29141G5370Q2639j57948M1135L5271k08215j37622M5478Q0831K8193n4465J42407
$$ 75370 158009 61 41196 76467 -131748 -269370 -223892 -143061 -114868 -169333 -26926
29130b6926Q8343j6721j3489L3756R1782k04983k0756J97701J52943q0443k69417
$$ -26926 61417 44696 31207 64963 156745 -48238 -68994 128707 281650 201207 -68210
29119f8210o0300R7928N2718J64486j43661j15066j53573r6176J813r2082k7695
$$ -68210 -128510 -30582 22136 186622 42961 -72105 -225678 -321854 -320041 -412123 -439818
29108d39818l7591J85128J65461j52608N3317j53903R6740J80255K30019N8970
$$ -439818 -477409 -292281 -126820 -279428 -226111 -380014 -283274 -103019 127000 185970
29098A85970k9484j65463k0754j7844j37844J40827O4448o1893J2955j81439P575
$$ 185970 156486 -8977 -29731 -47575 -185419 -44592 19856 -42037 -29082 -210521 -202946
29087b02946J1850j030J2179Q8625j34697j02043O7214Q7813K7599J27761P7406
$$ -202946 -191096 -192126 -179947 -91322 -226019 -328062 -260848 -173035 -145436 -17675 59731
29076E9731N2819j79474m1398J22510K11756k7282k57393O5898j30607j08998
$$ 59731 112550 -66924 -108322 14188 225944 198662 -58731 7167 -123440 -232438
29066b32438J40302J71749q5162j82997Q325j21937Q1850O218J63416J28359P0418
$$ -232438 -92136 79613 -5549 -188546 -180221 -302158 -220308 -214090 -50674 77685 148103
29055A48103j32035k6475K8571J5101j54310o4648M8057p570N8640l5314K22724
$$ 148103 16068 -10407 18164 33265 -121045 -185693 -137636 -145206 -86566 -121880 100844
29044A00844p3047p6058j2128m4332Q5578j99893j77333J69607m7540k3644J58053
$$ 100844 27797 -48261 -60389 -104721 -19143 -219036 -396369 -226762 -274302 -297946 -139893
29033a39893J27358j41328k9688j89912j60170K41284K53853j1393j7204p343
$$ -139893 -12535 -153863 -183551 -373463 -533633 -292349 -38496 -49889 -67093 -74436
29023g4436q3204Q1654o8877k5276n1645O5703k7965N7504R5636k0420l5076j13492
$$ -74436 -157640 -75986 -144863 -170139 -221784 -156081 -184046 -126542 -30906 -51326 -86402 -199894
29011a99894n0513n8055J57231k0683Q5447j96609L7855R0849m7108K56389J6567
$$ -199894 -250407 -308462 -151231 -171914 -86467 -283076 -245221 -154372 -201480 54909 71476
29000G1476j64988k06597O2773J55668J50668K21256j48774j83719J66152L3369
$$ 71476 -93512 -300109 -237336 -81668 69000 290256 141482 -42237 123915 157284
28990A57284k82851L1795M0061N2712J01441j29939k98J17750j9313j47367J51938
$$ 157284 -125567 -93772 -53711 -999 100442 -29497 -29795 87955 68642 -78725 73213
28979G3213j6115j43276Q1684J47300j22756J55125j6957j41711k6076J7276p5883
$$ 73213 57098 -86178 -4494 142806 20050 175175 158218 16507 -9569 7707 -68176
28968f8176k24448J04289L40748o428k70361K8023q8959j6225j69375j58344O6853
$$ -68176 -292624 -188335 152413 145985 -124376 -96353 -185312 -201537 -370912 -529256 -462403
28957d62403J09417J28711N7022k66836K42596J55700k79027j33300K5283J33246
$$ -462403 -352986 -224275 -167253 -434089 -191493 -35793 -314820 -448120 -422837 -289591
28947b89591J57184Q2493Q5264Q9877P3743k32868n4721m0887J36092j14925o7239
$$ -289591 -132407 -49914 35350 125227 198970 -33898 -88619 -129506 6586 -108339 -175578
28936a75578J77050l73524J55924J21794M1769J39280j42539k1905q1451j02314
$$ -175578 1472 -372052 -216128 -94334 -52565 86715 -55824 -77729 -159180 -261494
28926b61494n4271L33244j27313q6468K02391p3392q2660k4139m603K68085J53103
$$ -261494 -315765 17479 -109834 -196302 6089 -67303 -149963 -174102 -178705 89380 242483
28915B42483j20032k78584j19121R7289j21827P5382J26234P7163O143l2567j0696
$$ 242483 122451 -156133 -275254 -177965 -299792 -224410 -98176 -21013 -14870 -47437 -58133
28904e8133k8175p6158r7151m3109J13342J40871J46807J60405o5831j29334j01528
$$ -58133 -86308 -162466 -259617 -302726 -189384 -48513 98294 258699 192868 63534 -37994
28893c7994P0481r369o4715K4331O2155j1718K3639p8175N6674r7925j85430J46533
$$ -37994 32487 23118 -41597 -17266 44889 33171 56810 -21365 35309 -62616 -248046 -101513
28881a01513L946j00562M4806m9788p3898J8249J89582M5780o5845j1117P7812
$$ -101513 -97567 -198129 -153323 -203111 -277009 -258760 -69178 -23398 -89243 -100360 -22548
28870b2548j32308M2672j37378O0341P4856P5465K4833n7746p3004o4479j12965
$$ -22548 -154856 -112184 -249562 -189221 -114365 -38900 -14067 -71813 -144817 -209296 -322261
28859c22261K4486N4793J61117m7156J36983n7204k4472m7913m8856Q3112m5165
$$ -322261 -297775 -242982 -81865 -129021 7962 -49242 -73714 -121627 -170483 -87371 -132536
28848a32536J1475L2182P7550K9487j83070l4320p8217O3936J34289m2012j76178
$$ -132536 -121061 -88879 -11329 18158 -164912 -199232 -277449 -213513 -79224 -121236 -297414
28837b97414j34932J20558K30557N4225r5802Q9480J0950p6057n4832Q9960N1660
$$ -297414 -432346 -311788 -81231 -27006 -122808 -33328 -22378 -98435 -153267 -63307 -11647
28826a1647r4415p0755K4215J31643L03392k04992j43655r4053R4901J19657J18526
$$ -11647 -106062 -176817 -152602 -20959 282433 77441 -66214 -160267 -65366 54291 172817
28815A72817m505o3758k26537j22069P2043P4835p4456J52761N1033M2422j4869
$$ 172817 168312 104554 -121983 -244052 -172009 -97174 -171630 -18869 32164 74586 59717
28804E9717k77817L2222R2146j49560j05550K22926Q0762m9006j70872J18921
$$ 59717 -218100 -185878 -93732 -243292 -348842 -125916 -45154 -94160 -265032 -146111
28794a46111J66794j03734O501N7038k8450q0683L1558J21800P6418j8569k4981
$$ -146111 20683 -83051 -76550 -19512 -47962 -128645 -97087 24713 101131 82562 57581
28783E7581L1178n436o8173O4655J71507K928K6151j80937r6853O4674j32953
$$ 57581 88759 83323 15150 79805 251312 254240 280391 99454 2601 67275 -65678
28772f5678M386k6312J11224J27688j92772j25881R8509k39226N9370N0678j02734
$$ -65678 -61292 -87604 23620 151308 -41464 -167345 -68836 -308062 -248692 -198014 -300748
28761c00748J15553J82276q265m6647Q0629q2168j51465n3279n1090K5923K41864
$$ -300748 -185195 -2919 -11184 -57831 22798 -59370 -210835 -264114 -315204 -289281 -47417
28750d7417q8327J52570j7347k0313l9770j05251n2401r7254J47991J58122j19105
$$ -47417 -135744 16826 -521 -20834 -60604 -165855 -218256 -315510 -167519 -9397 -128502
28739a28502L5725m0580j09346j03713Q3725J03393J49902M4166J08343l39660
$$ -128502 -92777 -133357 -242703 -346416 -262691 -159298 -9396 34770 143113 -196547
28729a96547j10098R6030N6247L9731j0775q4708M2772r9869K4978K22300p4243
$$ -196547 -306645 -210615 -154368 -114637 -125412 -210120 -167348 -267217 -242239 -19939 -94182
28718i4182j5366k5619r6559k03771j3813K16986l9201Q119R9512m6804J8687
$$ -94182 -109548 -135167 -231726 -435497 -449310 -232324 -271525 -263406 -163894 -210698 -192011
28707a92011K11573J9037p1543M4189p2199n8550j78731J59566r131j55110o5797
$$ -192011 19562 38599 -32944 11245 -60954 -119504 -298235 -138669 -147800 -302910 -368707
28696c68707L1146J31936J07128J983k2473j00737j29888R9578N3475k325o2174
$$ -368707 -337561 -205625 -98497 -96514 -118987 -219724 -349612 -250034 -196559 -198884 -261058
28685b61058N8415J49380p2856l6084P1983m061J70832l2894J0840R822l28125
$$ -261058 -202643 -53263 -126119 -162203 -90220 -94281 76551 43657 54497 64319 -263806
28674b63806j12016J93106K7326J5056L0261k24285P26K36810J24519j17814j86122
$$ -263806 -375822 -182716 -155390 -140334 -110073 -334358 -333632 -96822 27697 -90117 -276239
28663b76239O7436j2838O0403N518p7147J7852J01684j39702o7901R2626K02092
$$ -276239 -208803 -221641 -161238 -155720 -232867 -215015 -113331 -253033 -320934 -228308 -26216
28652b6216q9122j31039J67056P9934q534j01199l6164O0074L2140j73365J48097
$$ -26216 -115338 -246377 -79321 613 -7921 -109120 -145284 -85210 -53070 -226435 -78338
28641g8338K0487M9260n5620j62974j9317N6835p79n3645L58j44811M859K40019
$$ -78338 -57851 -8591 -64211 -227185 -246502 -189667 -190446 -244091 -243733 -388544 -383685 -143666
28629a43666r5796k914p1969L6559P8654o2749K1705J76133j7060Q3954q2154
$$ -143666 -239462 -242376 -314345 -277786 -199132 -261881 -240176 -64043 -81103 2851 -79303
28618g9303p5764q7985P4723M0586r6465k5403J84767r311J25765j12333k52103
$$ -79303 -155067 -243052 -168329 -127743 -224208 -249611 -64844 -74155 51610 -60723 -312826
28607c12826J46379r4337n1672M4142K10031K4571k5815k8079j18080n55J48330
$$ -312826 -166447 -260784 -312456 -268314 -58283 -33712 -59527 -87606 -205686 -206241 -57911
28596e7911l1858o9727K8702R1450q0941q6669Q8768J52032n6706j71249R5872
$$ -57911 -89769 -159496 -130794 -39344 -120285 -206954 -118186 33846 -22860 -194109 -98237
28585i8237J19588K2682j36104j09044O400P486J92685Q4160j37624k05806R2101
$$ -98237 21351 44033 -92071 -201115 -194715 -187229 5456 89616 -48008 -253814 -161713
28574a61713O9403j47009m7089J44600L2730j998l827l5355j20614Q2591J09203
$$ -161713 -92310 -239319 -286408 -141808 -109078 -111076 -114903 -150258 -270872 -188281 -79078
28563g9078k8293k4590j3404J72387J07738r1460j16786n3478j20310R9147J5901
$$ -79078 -107371 -131961 -145365 27022 134760 43300 -73486 -126964 -247274 -148127 -132226
28552a32226j5356r8959P5337J39939q4505j0906n0780j22483m6957n5833J595
$$ -132226 -147582 -246541 -171204 -31265 -115770 -126676 -177456 -299939 -346896 -402729 -401134
28541d01134Q8728J21241J45477j38614k9792J95912q4045k56060O4398j29728
$$ -401134 -312406 -191165 -45688 -184302 -214094 -18182 -102227 -358287 -293889 -423617
28531d23617K27813J15252L6880j11301m78j0405K8734J54580N1407j17681k3304
$$ -423617 -195804 -80552 -43672 -154973 -155451 -165856 -137122 17458 68865 -48816 -72120
28520g2120j54015L7133K08571N2370j59601k19981J86404K6988j58229j74522
$$ -72120 -226135 -189002 19569 71939 -87662 -307643 -121239 -94251 -252480 -427002
28510d27002K11377K45224m493j8330k2516n7379J18122K7888J21373q9745o7106
$$ -427002 -215625 29599 25106 6776 -15740 -73119 45003 72891 194264 104519 37413
28499C7413r7829m769L6043J76131K29409m0531j94857j99350j17014L7627j45082
$$ 37413 -60416 -65185 -29142 146989 376398 335867 141010 -58340 -175354 -137727 -282809
28488b82809P5183L4757J3027r8058J16697J9845n0495J31508j02592l2716j55042
$$ -282809 -207626 -172869 -159842 -257900 -141203 -121358 -171853 -40345 -142937 -175653 -330695
28477c30695O6802R6849m8060q0698k5534J20277P5631q9175p7947J12615J05320
$$ -330695 -263893 -167044 -215104 -295802 -321336 -201059 -125428 -214603 -292550 -179935 -74615
28466g4615Q4338j35191j46738q4840J04088K47780P474l4834k0363O9659L3190
$$ -74615 9723 -125468 -272206 -357046 -252958 -5178 2296 -32538 -52901 16758 49948
28455D9948j0309M3926N226j1475o3947J30838j07707j79925J85982N4635K0798
$$ 49948 39639 83565 88791 77316 13369 144207 36500 -143425 42557 97192 117990
28444A17990n3630q7292j48798n65Q2932j40290j2901J07686J12303K8536j37832
$$ 117990 64360 -22932 -171730 -172295 -89363 -229653 -242554 -134868 -22565 5971 -131861
28433a31861O7588K05065j70312j29696n415L91121q1294l80807n5278R2697q4763
$$ -131861 -64273 140792 -29520 -159216 -164631 226490 145196 -235611 -290889 -198192 -282955
28422b82955K2037M9711N6728j01376q4792J65045j11746L8982R4233J73298p6504
$$ -282955 -260918 -211207 -154479 -255855 -340647 -175602 -287348 -248366 -154133 19165 -57339
28411e7339J23409L0556j56613J6042q586J2189K5158r5325q360M1296N3596j43758
$$ -57339 66070 96626 -59987 -43945 -52531 -40342 -15184 -110509 -118869 -77573 -23977 -167735
28399a67735m7328J45734r9379J57398k0912j31127K7839m8517j1552K10414K72986
$$ -167735 -215063 -69329 -168708 -11310 -32222 -163349 -135510 -184027 -195579 14835 287821
28388B87821k21911k53619J28260Q8709j86300J40414K9828j12439J17904j00970
$$ 287821 65910 -187709 -59449 29260 -157040 -16626 13202 -99237 18667 -82303
28378h2303q6971L2667R4327J8459p9359k44271N0604P569m7179J11596n5784
$$ -82303 -169274 -136607 -42280 -23821 -103180 -347451 -296847 -289278 -336457 -224861 -280645
28367b80645k1078N1152R0447L1107q6021k6755J01003M7028j38267r2688Q6644
$$ -280645 -301723 -250571 -160124 -129017 -215038 -241793 -140790 -93762 -232029 -324717 -238073
28356b38073j6479n505J40940o9575R3046j0311j33850o5151J49710J97520j5883
$$ -238073 -254552 -260057 -119117 -188692 -95646 -105957 -239807 -304958 -155248 42272 26389
28345B6389J07041J33500j23014k20481j02306L23571p295N854R6252M0416j45587
$$ 26389 133430 266930 143916 -76565 -178871 144700 137405 143259 239511 279927 134340
28334A34340j49662J4068j74239L5581m1914K7026j01609q1679J35834J19876
$$ 134340 -15322 -1254 -175493 -139912 -181826 -154800 -256409 -338088 -202254 -82378
28324h2378M0645m2905m7866j34685N7817N2906Q9941R6671j0071j63711p6786
$$ -82378 -41733 -84638 -132504 -267189 -209372 -156466 -66525 30146 20075 -143636 -220422
28313b20422r9111J54036P119N2807O930K3797k9757K1546l0763p2011r2212J458
$$ -220422 -319533 -165497 -158378 -105571 -98641 -74844 -104601 -83055 -113818 -185829 -278041 -276583
28301b76583J67575l4179o8075o7416j83487M1806J00303K03230M7212L7781J2888
$$ -276583 -109008 -143187 -211262 -278678 -462165 -420359 -320056 -116826 -69614 -31833 -18945
28290a8945J39929J1875j80688k9923k096L5474L8778o7257j5354K26152j03105
$$ -18945 120984 132859 -47829 -77752 -79848 -44374 -5596 -72853 -88207 137945 34840
28279C4840j21833k2408l8220l0194J46909r9698Q0331R2085j35481m7008o2712
$$ 34840 -86993 -109401 -147621 -177815 -30906 -130604 -50273 41812 -93669 -140677 -203389
28268b03389N9978L00164n7350k8155o3530j59542N5735M8906O9867j32308Q7977
$$ -203389 -143411 156753 99403 71248 7718 -151824 -96089 -47183 22684 -109624 -21647
28257b1647K9469j12872q7180K07253K18630j17779J9769l1545r3718k9978j68889
$$ -21647 7822 -105050 -192230 15023 233653 115874 135643 104098 10380 -19598 -188487
28246a88487M5158j09614j99474R0792R3578J03163K40603p4182J9867K5860k56598
$$ -188487 -143329 -252943 -452417 -361625 -268047 -164884 75719 1537 21404 47264 -209334
28235b09334O9377J95654J11648O6586o7981n709o4740k23179m1426J45292q4251
$$ -209334 -139957 55697 167345 233931 165950 160241 95501 -127678 -169104 -23812 -108063
28224a08063j18210n0888j16577J26812O9597Q2130K0914k10723R535J79899m4390
$$ -108063 -226273 -277161 -393738 -266926 -197329 -115199 -94285 -305008 -295473 -115574 -159964
28213a59964K9388l2295p0960J18343j58735k3706k9873J3530J11178J3008n0689
$$ -159964 -130576 -162871 -233831 -115488 -274223 -297929 -327802 -314272 -203094 -190086 -240775
28202b40775Q8663l3497p8583J37799q7268o3164N0489J09682J06945j9757N953
$$ -240775 -152112 -185609 -264192 -126393 -213661 -276825 -226336 -116654 -9709 -29466 -23513
28191b3513J54803M8204k03218J2376J27568L4164p5047j85132j04645J07332
$$ -23513 131290 179494 -23724 -11348 116220 150384 75337 -109795 -214440 -107108
28181a07108M2056O2412j31972n0107J99363l7027L8620J15418j43324k3650J27855
$$ -107108 -65052 -2640 -134612 -184719 14644 -22383 16237 131655 -11669 -35319 92536
28170I2536k6336O1288k5961k85078O7277J28629j01813J5056o8787P7600O2428
$$ 92536 66200 127488 101527 -183551 -116274 12355 -89458 -74402 -143189 -65589 -3161
28159c161J88866j5199k18887l7159J85125p9351o3285n422j22336n015J58550
$$ -3161 185705 170506 -48381 -85540 99585 20234 -43051 -48473 -170809 -175824 -17274
28148a7274L888m8127l9348j03839l5454k2529j0354P9787J7645Q1653M4502L1575
$$ -17274 -13386 -61513 -100861 -204700 -240154 -262683 -273037 -193250 -175605 -93952 -49450 -17875
28136a7875K4347N2751K1541J50893j15226j40725p3789j29202J80246M5549j21389
$$ -17875 6472 59223 80764 231657 116431 -24294 -98083 -227285 -47039 -1490 -122879
28125a22879j52762O7168j60753J02990K04216K18138j13214j98221J4655n3702
$$ -122879 -275641 -208473 -369226 -266236 -62020 156118 42904 -155317 -140662 -194364
28115a94364J0982N7689J9496k3045N3728j56877L6891J2058N7712O8712J0781
$$ -194364 -183382 -125693 -106197 -129242 -75514 -232391 -195500 -183442 -125730 -57018 -46237
28104d6237J1227j62964n0427m4162J18975o8024j4757J73083k3396r8672J53598
$$ -46237 -35010 -197974 -248401 -292563 -173588 -241612 -256369 -83286 -106682 -205354 -51756
28093e1756J51269n5622j30272M0261L3280m3253J13563j9723M004j21510j9166
$$ -51756 99513 43891 -86381 -46120 -12840 -56093 57470 37747 41751 -79759 -98925
28082i8925m394K9081l8300J40481O2292j9346O3948J08552l5710q4015j16530
$$ -98925 -103319 -74238 -112538 27943 90235 70889 134837 243389 207679 123664 7134
28071G134J7336K5417r3007j89369n1245k6888J34369m3567k9009J44685Q5320
$$ 7134 24470 49887 -43120 -232489 -283734 -310622 -176253 -219820 -248829 -104144 -18824
28060a8824j40068j26624L22630P8181j0288N7525J82388R4954l26527k88203
$$ -18824 -158892 -285516 37114 115295 105007 162532 344920 439874 113347 -174856
28050a74856R17J69996j17064J67556Q9173l68041j50379j6135K57531J03884
$$ -174856 -173939 -3943 -121007 46549 135722 -232319 -382698 -398833 -141302 -37418
28040c7418j12165l6436L07319k9751j31131o3789J6832J06937N7877j82974M7562
$$ -37418 -149583 -186019 121300 91549 -39582 -103371 -86539 20398 78275 -104699 -57137
28029e7137n9386p2708K76464r8511j52848j04814J15154O6869q1706k25750N6489
$$ -57137 -116523 -189231 87233 -11278 -164126 -268940 -153786 -86917 -168623 -394373 -337884
28018c37884k3685K15742M5487k1279Q2868m3753K425M6503R3881j0889j03887
$$ -337884 -361569 -145827 -100340 -121619 -38751 -82504 -80079 -33576 60305 49416 -54471
28007e4471M4755p3304j34444k27270k7174j8252J32535J05257J28054L6954j8642
$$ -54471 -9716 -83020 -217464 -444734 -471908 -490160 -357625 -252368 -124314 -87360 -106002
27996a06002j1451j56856m5927J38792j27181L7538J10598J9402K2168q2052Q4844
$$ -106002 -117453 -274309 -320236 -181444 -308625 -271087 -160489 -141087 -118919 -200971 -116127
27985a16127k6195k0646o6152K4251k3056Q6493O6680J8214L5641L13274k9610
$$ -116127 -142322 -162968 -229120 -204869 -227925 -141432 -74752 -56538 -20897 292377 262767
27974B62767j26918K4249j11534L0309M7831j1165l1937J9517j37171K0225J09772
$$ 262767 135849 160098 48564 78873 126704 115539 83602 103119 -34052 -13827 95945
27963I5945p4599j28925M3720O5214o5985r877N9320J008j39077Q7969P7026R0373
$$ 95945 21346 -107579 -63859 1355 -64630 -74507 -15187 -14179 -153256 -65287 11739 102112
27951A02112n7003p4215j0670J62316R2618j25135j59790P2287J65777o4356j29707
$$ 102112 45109 -29106 -39776 122540 215158 90023 -69767 2520 168297 103941 -25766
27940b5766q1763n5207R9867J9327K3435k13301L6861J15941Q1465J04811k69930
$$ -25766 -107529 -162736 -62869 -43542 -20107 -233408 -196547 -80606 859 105670 -164260
27929a64260Q7084M997r174j4634J07777j35216r9886P8402M1555q496l9689M0659
$$ -164260 -77176 -72179 -81353 -95987 11790 -123426 -223312 -144910 -103355 -111851 -151540 -110881
27917a10881R7199o7309J5877O5336j29068k3822J471R0179L2876K8514r6693
$$ -110881 -13682 -80991 -65114 222 -128846 -152668 -151197 -61018 -28142 372 -96321
27906i6321L770K44631R2610R689n7048k01451l991J08759j02960K136L6206r7347
$$ -96321 -92551 152080 244690 254379 197331 -4120 -8111 100648 -2312 -176 36030 -61317
27894f1317J74355j48404q6000J49607O0476m8982o5982j28647K06049j2715j45297
$$ -61317 113038 -35366 -121366 28241 88717 39735 -26247 -154894 51155 38440 -106857
27883a06857J4768L963M3609M3259M5478L406O8000n4247j79476L4238K863l3285
$$ -106857 -92089 -88126 -44517 -1258 44220 47626 115626 61379 -118097 -83859 -80996 -114281
27871a14281k4318O4909M1142Q3811Q9382m2945O909L9181J83905o0170q1179
$$ -114281 -138599 -73690 -32548 51263 140645 97700 104609 143790 327695 267525 186346
27860A86346k19975p0782Q0228p1141j40308J00475l5486j57751M4643K82539
$$ 186346 -33629 -104411 -24183 -95324 -235632 -135157 -170643 -328394 -283751 -1212
27850a212J72565O6382M9728j97519R0935j30839o3701K4516l04536L2530K46589
$$ -1212 171353 237735 287463 89944 180879 50040 -13661 10855 -293681 -261151 -14562
27839a4562M9116N0047k2769J2901J29154q4155N1666J27385m5849j70966n8542
$$ -14562 34554 84601 61832 74733 203887 119732 171398 298783 252934 81968 23426
27828B3426J18308k6250l2953J74217j8634J7305J53369k07896j60671K3232J0011
$$ 23426 141734 115484 82531 256748 238114 255419 408788 200892 40221 63453 73464
27817G3464j24924R2348J81727j24463k97583O5104r4550o6899j2888K8286J08811
$$ 73464 -51460 40888 222615 98152 -199431 -134327 -228877 -295776 -308664 -280378 -171567
27806a71567K47337q482k6891j14897j72094J09227J28168M0424r9314l8170L39269
$$ -171567 75770 67288 40397 -74500 -246594 -137367 -9199 31225 -68089 -106259 233010
27795B33010j37645k44022M5291J78087J10001j3534r3975q7682j9867Q8483P5570
$$ 233010 95365 -148657 -103366 74721 184722 171188 77213 -10469 -30336 58147 133717
27784A33717Q1301M8050l35642J32020J83057r5905l6131N0352L3054j07943p066
$$ 133717 215018 263068 -72574 59446 242503 146598 110467 160819 193873 85930 78864
27773G8864N1661o1952K5382M8408N9232j53927o8333l313N5588P1633j07775
$$ 78864 130525 68573 93955 142363 201595 47668 -20665 -23978 31610 103243 -4532
27762d532m6775j42031J66620J1039Q2375n4676J15822j40876j33871Q8665k3635
$$ -4532 -51307 -193338 -26718 -15679 66696 12020 127842 -13034 -146905 -58240 -81875
27751h1875q5697m5152Q2270L2731r3207l4015O5765O1560K25791k4054j30388
$$ -81875 -167572 -212724 -130454 -97723 -190930 -224945 -159180 -97620 128171 104117 -26271
27740b6271p9231m1582J384Q2372j30150O7321K743j18483N7300J70579N6934
$$ -26271 -105502 -147084 -145700 -63328 -193478 -126157 -123414 -241897 -184597 -14018 42916
27729D2916k47154L4065P5886r109L4957j31130l7761O9278K32214o9653n5683
$$ 42916 -204238 -170173 -94287 -103396 -68439 -199569 -237330 -168052 64162 -5491 -61174
27718f1174P1481J07755j45682k2649J54697J0545p223K393k22441j31695J25938
$$ -61174 10307 118062 -27620 -50269 104428 114973 107750 110143 -112298 -243993 -118055
27707a18055j36282Q9475N6322K7229o165J64044L6827k02783n0628O5056J39352
$$ -118055 -254337 -164862 -108540 -81311 -87476 76568 113395 -89388 -140016 -74960 64392
27696F4392K2462j20860j03089o4627p5113J10205J18537j32176k40523J67190
$$ 64392 86854 -34006 -137095 -201722 -276835 -166630 -48093 -180269 -420792 -253602
27686b53602J36927J76624J05362j43835j20006o5776P5454K81402j1687j15450
$$ -253602 -116675 59949 165311 21476 -98530 -164306 -88852 192550 180863 65413
27676F5413j71783J06614j3032L4068j12630J0428N7926n9321k87793J75678J82869
$$ 65413 -106370 244 -12788 21280 -91350 -80922 -22996 -82317 -370110 -194432 -11563
27665a1563q9117j90188r1829j7309P2655P2085K2017M1860M487J16236M0347
$$ -11563 -100680 -290868 -382697 -400006 -327351 -255266 -233249 -191389 -186902 -70666 -30319
27654c0319k1635o8673j56660N2933J99978J47618k81010j73577Q9551R4388l5408
$$ -30319 -51954 -120627 -277287 -224354 -24376 123242 -157768 -331345 -241794 -147406 -182814
27643a82814j22532R4957k5498N5956K3724L2886J02653j16452J07083m2039o8237
$$ -182814 -305346 -210389 -235887 -179931 -156207 -123321 -20668 -137120 -30037 -72076 -140313
27632a40313l203l0531J24723l1303m620L6640r2282P1119k56885j9358J78854
$$ -140313 -143516 -174047 -49324 -80627 -85247 -48607 -140889 -69770 -326655 -346013 -167159
27621a67159Q3915j2173n0179j5224M7037j09916J33744R8687J17065k1357j87011
$$ -167159 -83244 -95417 -145596 -160820 -113783 -223699 -89955 8732 125797 104440 -82571
27610h2571j14381j5801j04158J26120M9656j45780K16144P0281j8198j53832
$$ -82571 -196952 -212753 -316911 -190791 -141135 -286915 -70771 -490 -18688 -172520
27600a72520O6875L7249R7049r8811k18215n7501L4347K95612j85726r6987J54452
$$ -172520 -105645 -68396 28653 -70158 -288373 -345874 -311527 -15915 -201641 -298628 -144176
27589a44176J78469N8702n7631l9846j18778l3934r25J41239m605j8461J40404
$$ -144176 34293 92995 35364 -4482 -123260 -157194 -158119 -16880 -21485 -39946 100458
27578A00458j5155r4423m0455j61023P3589R6598r8254M7960K4259j36863P6565
$$ 100458 85303 -9120 -49575 -210598 -137009 -40411 -138665 -90705 -66446 -203309 -126744
27567a26744Q3428J12164M5776m6649J27531K5447k24898k04427l8819j6727Q7966
$$ -126744 -43316 68848 114624 67975 195506 220953 -3945 -208372 -247191 -263918 -175952
27556a75952Q8425O5212R9051q6771O2498j03136K3070j2357M8034J25497p9088
$$ -175952 -87527 -22315 76736 -10035 52463 -50673 -27603 -39960 8074 133571 54483
27545E4483n3967j93562Q6402J28684m6160j84182j17183k6990J29481K42067
$$ 54483 516 -193046 -106644 22040 -24120 -208302 -325485 -352475 -222994 19073
27535A9073Q8625j15576K7782j9284j06953J5600k0743p6043m9878o3447J95291
$$ 19073 107698 -7878 19904 620 -106333 -90733 -111476 -187519 -237397 -300844 -105553
27524a05553L26016j24398j10074k7213o6700K9757R0660P566J5915P9183o9263
$$ -105553 220463 96065 -14009 -41222 -107922 -78165 12495 20061 35976 115159 45896
27513D5896q4569M1844j61995m369J41576N3871r8483j24335J76946J23566p0390
$$ 45896 -38673 3171 -158824 -163193 -21617 32254 -66229 -190564 -13618 109948 39558
27502C9558J26133Q135j62657m8490j94981O3454K26050m6498j05163M677j3198
$$ 39558 165691 173826 11169 -37321 -232302 -168848 57202 10704 -94459 -89782 -102980
27491a02980J345N917L6189j9212J02008J2246o5643P63p0265K4293P7831j0613
$$ -102980 -101635 -95718 -59529 -78741 23267 35513 -30130 -29367 -99632 -75339 2492 -8121
27479h121O8641q7024j11951l5713J5763j6685M9826k9837k8372k4988o4812K43717
$$ -8121 60520 -26504 -138455 -174168 -158405 -175090 -125264 -155101 -183473 -208461 -273273 -29556
27467b9556J1591R8550K1337j45143o354J6682o6662P425j06169J1490P8298O6003
$$ -29556 -17965 80585 101922 -43221 -49575 -32893 -99555 -92130 -198299 -186809 -108511 -42508
27455d2508m4380P6830J61255P7798N4310l3534j68621j84330j17343L979J18142
$$ -42508 -86888 -10058 151197 228995 283305 249771 81150 -103180 -220523 -216544 -98402
27444i8402P7795l7241J37034K7063K2142L5233j03276j49230R4262J47594J32840
$$ -98402 -20607 -57848 79186 106249 128391 163624 60348 -88882 5380 152974 285814
27433B85814j08175j44219J43276J14474m1237k94582k20838m620J05683J9876
$$ 285814 177639 33420 176696 291170 249933 -44649 -265487 -270107 -164424 -144548
27423a44548k6157n6586J47389J67689o857p0638q7427R0903o3181J28734l5587
$$ -144548 -170705 -227291 -79902 87787 80930 10292 -77135 13768 -49413 79321 43734
27412D3734q022J29969o7000n6085l5094K3199M6762l0937j06471Q9154P300m5022
$$ 43734 35712 165681 98681 42596 7502 30701 77463 46526 -59945 29209 36509 -8513
27400h513P801K59526j73666j42683O2357l9483J7318J48001r1035k06247N1110
$$ -8513 -712 258814 85148 -57535 4822 -34661 -17343 130658 39623 -166624 -115514
27389a15514J6835J080J71453J28701j75224Q7736N6269N1800j64930l5114j1287
$$ -115514 -98679 -97599 73854 202555 27331 115067 171336 223136 58206 23092 11805
27378A1805j20144J04992K73679P7611n6593o7166J31286k77459R2858j16646
$$ 11805 -108339 -3347 270332 347943 291350 224184 355470 78011 170869 54223
27368E4223k13859Q1718K6431N5823J29137j5559j42964m6714J01658J34474p7471
$$ 54223 -159636 -77918 -51487 4336 133473 117914 -25050 -71764 29894 164368 86897
27357H6897p2979J03952J01940Q213q8241o0835j29190L8750J57777r147P486
$$ 86897 13918 117870 219810 228023 139782 78947 -50243 -11493 146284 137137 144623
27346A44623j63815k0524K6218j80609q6118J36289J83962J31620k4669R693j35404
$$ 144623 -19192 -39716 -13498 -194107 -280225 -143936 40026 171646 146977 156670 21266
27335B1266j8317M7010L2721J43053o678j85074M7262Q9054k7891J7301n1316
$$ 21266 2949 49959 82680 225733 219055 33981 81243 170297 142406 159707 108391
27324A08391O0336J6954J06684j23611J26958p9944j9702p5668K2482k075L2820
$$ 108391 168727 185681 292365 168754 295712 215768 196066 120398 142880 140805 173625
27313A73625J26102M3895l7942P7140M3669q6829M3130j11977J0487J31471J19078
$$ 173625 299727 343622 305680 382820 426489 339660 382790 270813 281300 412771 531849
27302E31849k06205j64560P9618q4642Q0427P6694K30276L7098p3757k9414K9254
$$ 531849 325644 161084 240702 156060 236487 313181 543457 580555 506798 477384 506638
27291E06638l8868j1677J23993n5539N09M9663J1031q6210M2589K65760P6113
$$ 506638 467770 456093 580086 524547 525056 574719 585750 499540 542129 807889 884002
27280H84002j74757r3808j42678o5095J07836Q8733J16689l6071p1538K7540j09966
$$ 884002 709245 615437 472759 407664 515500 604233 720922 684851 613313 640853 530887
27269E30887j58074J54943l4099o1143q9384J5819J30782O7890k4164J2333m7967
$$ 530887 372813 527756 493657 432514 343130 358949 489731 557621 533457 545790 497823
27258D97823J15039j75132q9833J7090k6930K5213k9450k9818n4881j2964j10288
$$ 497823 612862 437730 347897 364987 338057 363270 333820 304002 249121 236157 125869
27247A25869M2206M3008m6690m3261O0208p3761l7634J55305K31654l2145r1536
$$ 125869 168075 211083 164393 121132 181340 107579 69945 225250 456904 424759 333223
27236C33223j16463l9881K24459R1267k03646j8412j78701n500J36364r5534P4017
$$ 333223 216760 176879 401338 492605 288959 270547 91846 86346 222710 127176 201193
27225B01193P0385J4126K8551J55284j83591J476O8046n9177o8532p49k26259
$$ 201193 271578 285704 314255 469539 285948 287424 355470 296293 227761 227012 753
27214G53K3463J18849P8514M8276k5363n1457N5370r7214m6892J27220n7158N0943
$$ 753 24216 143065 221579 269855 244492 193035 248405 151191 104299 231519 174361 225304
27202B25304j29236j445J39857j7125R3560P1639n5857Q7537N5860J03714j06166
$$ 225304 96068 94623 234480 217355 310915 382554 326697 414234 470094 573808 467642
27191D67642Q7706j76289j29356k9013O7317J12567M2381j44541j02927K2966
$$ 467642 555348 379059 249703 220690 288007 400574 442955 298414 195487 218453
27181B18453L0515J60838J02539n1133J26918J8609p5323j67359Q2284K02319
$$ 218453 248968 409806 512345 461212 588130 606739 531416 364057 446341 648660
27171F48660q2204k24557J0281K85526j49899n9587J68224J81740j52020k22352
$$ 648660 566456 341899 352180 637706 487807 428220 596444 778184 626164 403812
27161D03812R9253k807L1517N0529P665N6993m0293j74088l3255K02372j6625
$$ 403812 503065 500258 531775 582304 589969 646962 606669 432581 399326 601698 585073
27150E85073o7094J53628K19832k9093N899j08023j88168M3996R3055j36946j32690
$$ 585073 517979 671607 891439 862346 868245 760222 572054 616050 709105 572159 439469
27139D39469j86346O1265J01546K2050j83007M8578J81588N9530R4767R1595p6346
$$ 439469 253123 314388 415934 437984 254977 303555 485143 544673 639440 731035 654689
27128F54689o3584L4796j85994J92693j2796k74572p5388J03144J01814J15593
$$ 654689 591105 625901 439907 632600 619804 345232 269844 372988 474802 590395
27118E90395k087m8467r820P9695P6882k45172m1955J72265j8635P0127j70404
$$ 590395 588308 539841 530021 609716 686598 441426 399471 571736 553101 623228 452824
27107D52824m2492J66275J09082K07051K08503N7470n6251O662J84215p3463N8543
$$ 452824 410332 576607 685689 892740 1101243 1158713 1102462 1109124 1293339 1219876 1278419
27096A278419L7390r7523n1219Q0834K25908J57449K58332J42685l24498j30793
$$ 1278419 1315809 1218286 1167067 1247901 1473809 1631258 1889590 2032275 1707777 1576984
27086A576984r4155J50864J21152O2140k93372m7157j18928M1969M26846K64131
$$ 1576984 1482829 1633693 1754845 1816985 1523613 1476456 1357528 1399497 1826343 2090474
27076B090474j81385k41600r8139K68238L23415J52727r9237K3113Q1593J57488
$$ 2090474 1909089 1667489 1569350 1837588 2161003 2313730 2214493 2237606 2319199 2476687
27066B476687L2378J07615j20762j84121N7290J5369j7504J57828j35053j60933
$$ 2476687 2509065 2616680 2495918 2311797 2369087 2384456 2366952 2524780 2389727 2228794
27056B228794O3316M75604M03283k53947l27938j9283k12700J64964L27097L2318
$$ 2228794 2292110 2767714 3170997 2917050 2589112 2569829 2357129 2522093 2849190 2881508
27046B881508k48893l31264k75409j29543J41888J19662k08660j46722O1596J30834
$$ 2881508 2632615 2301351 2025942 1896399 2038287 2157949 1949289 1802567 1864163 1994997
27036A994997J7518K39518j14015j32653j10600j80802r6188k14812Q7262l2590
$$ 1994997 2012515 2252033 2138018 2005365 1894765 1713963 1617775 1402963 1490225 1457635
27026A457635N4570n8340K4830K45032q5297j78661Q8222R7611J1468j16008J36953
$$ 1457635 1512205 1453865 1478695 1723727 1638430 1459769 1547991 1645602 1657070 1541062 1678015
27015A678015J25973k04071J01888l7837j03488j27053r6448K38482K09226j66256
$$ 1678015 1803988 1599917 1701805 1663968 1560480 1433427 1336979 1575461 1784687 1618431
27005A618431K41162K48527p3283j21472P3105K48134K44647J24492J26919M4898
$$ 1618431 1859593 2108120 2034837 1913365 1986470 2234604 2479251 2603743 2730662 2775560
26995B775560R2289K78733J54308M31011M06039K77830P83373J716082J137742
$$ 2775560 2867849 3146582 3300890 3731901 4137940 4415770 5199143 6915225 8052967
26986H052967r07176r02143J4406O93420J450747J064964q69086q35475j49661
$$ 8052967 7145791 6243648 6258054 6951474 8402221 9467185 8598099 7762624 7612963
26977G612963R06464J598373L100222K431572j640507k326210k34466J330760
$$ 7612963 8519427 10117800 13218022 15649594 14009087 11682877 11448411 12779171
26969A2779171L042086K633305j411661p94905J722888L1746j432336N82880J481006
$$ 12779171 15821257 18454562 17042901 16247996 17970884 18002630 16570294 17153174 18634180
26960A8634180N30524J398105M60493j096054J611663L049098L386144L151274
$$ 18634180 19164704 20562809 21023302 19927248 21538911 24588009 27974153 31125427
26952C1125427K662925j023590m299933r79460K671700L912854K890284q97994
$$ 31125427 33788352 32764762 28464829 27485369 30157069 34069923 36960207 36062213
26944C6062213m737914p97842K400247N991850L244422l05966j561887j134837
$$ 36062213 31324299 30526457 32926704 38918554 42162976 41857010 40295123 39160286
26936C9160286K650963O734800M631449R01416K03268J907463O501842J5481958
$$ 39160286 41811249 48546049 53177498 54078914 54282182 56189645 62691487 78173445
26928G8173445K7778313M3023348O497282l4303063j5746280K928567K3153918
$$ 78173445 105951758 148975106 155472388 121169325 105423045 108351612 131505530
26921A31505530L8672142K549303l7271269j4784518n18672K1487955M3772446
$$ 131505530 170177672 172726975 135455706 120671188 120152516 141640471 185412917
26914A85412917Q4275213K6155265p0587032m6964551n009883L0600402P2384289
$$ 185412917 269688130 295843395 225256363 178291812 173281929 203882331 276266620
26907B76266620J3969158q3585221n6853559k8276486n656715J0336667L5774066
$$ 276266620 290235778 206650557 149796998 121520512 115863797 126200464 161974530
26900A61974530J4451373l9057118l1731983p829442R733002L3659177J1034119
$$ 161974530 176425903 137368785 105636802 97807360 107540362 141199539 152233658
26893A52233658m4220143l6279548j9546732j1258960p531099n812920m400237
$$ 152233658 108013515 71733967 52187235 40928275 33397176 27584256 23184019
26886B3184019l191854k670672j621009j622267j987704j462734q26735r29354
$$ 23184019 19992165 17321493 15700484 14078217 12090513 10627779 9801044 8871690
26878H871690q03108k40194m16575r89971n91534l78687M795K37646k53445n29082
$$ 8871690 8068582 7828388 7411813 6421842 5830308 5451621 5456416 5694062 5440617 4911535
26868D911535l82348k79509l97756n45347m94756j35622o1732K2593k98186j22384
$$ 4911535 4529187 4249678 3851922 3306575 2811819 2676197 2614465 2637058 2338872 2216488
26858B216488Q6029k16690j71194q7915j38478j82551j28558k7566n0296j15463
$$ 2216488 2302517 2085827 1914633 1826718 1688240 1505689 1377131 1349565 1299269 1183806
26848A183806j72580M0454p4914J40044R705L574j37209j64719o1828j48460j11926
$$ 1183806 1011226 1051680 976766 1116810 1126515 1130089 992880 828161 766333 617873 505947
26837E05947Q0591J31026j32314j39903m3367M2753L7681J4201j90663q4282K00717
$$ 505947 586538 717564 585250 445347 401980 444733 482414 496615 305952 221670 422387
26826D22387k24547j39259J20326k29866J14855J28701o5388J50945k5943n5326
$$ 422387 197840 58581 178907 -50959 63896 192597 127209 278154 252211 196885
26816A96885k1915m3582m9154r7077K05471o7791l30857k9197J67462J13692q1648
$$ 196885 174970 131388 82234 -14843 190628 122837 -208020 -237217 -69755 43937 -37711
26805c7711q2785R7781R4836N1426k0915j17336L7084l2974r4875L05156J5782
$$ -37711 -120496 -22715 72121 123547 102632 -14704 22380 -10594 -105469 199687 215469
26794B15469m8977M5717N7345k0298O977j6931k2313n9144J77007N0836j97694
$$ 215469 166492 212209 269554 249256 256233 239302 216989 157845 334852 385688 187994
26783A87994j17628J26299p1318k34266J63699Q2546j70324o1992J34048J41978
$$ 187994 70366 196665 125347 -108919 54780 137326 -32998 -94990 39058 181036
26773A81036O2355J968j53247J79940o3727j807Q9607L5066j62669n4602K4373
$$ 181036 243391 245359 92112 272052 208325 206518 296125 331191 168522 113920 138293
26762A38293M8991j21359k7989R8032N6026M3678N3948J06944p2680M6080K1530
$$ 138293 187284 65925 37936 135968 191994 235672 289620 396564 323884 369964 391494
26751C91494J9947O791Q6462j87086l4111J3970L3592L52077M13159j07164k49174
$$ 391494 411441 418232 504694 317608 283497 297467 331059 683136 1096295 989131 739957
26740G39957q2268K05780M00338O4709j03728n9525q8666L266M11595N08579K35862
$$ 739957 657689 863469 1263807 1328516 1224788 1165263 1076597 1079863 1491458 2000037 2235899
26729B235899m52401m85358R4561J18671M39742j0151o05509m53789n7655L1017
$$ 2235899 1783498 1298140 1392701 1511372 1951114 1940963 1335454 881665 824010 855027
26719H55027j18211L34376J95788l16157l68531k408K3331K17382K00796l47526
$$ 855027 736816 1071192 1266980 950823 582292 579884 603215 820597 1021393 673867
26709F73867j51483j09340k1707p5571m0266L8124R1754k1675j84768J58625l5056
$$ 673867 522384 413044 391337 315766 275500 313624 405378 383703 198935 357560 322504
26698C22504p6607J26845q6769j68819J27769q2312r30J0144j27837m1822J50582
$$ 322504 245897 372742 285973 117154 244923 162611 161681 171825 43988 2166 152748
26687A52748M6113j44629O585J29692L054m6932J39572r428m9735q6473j64929
$$ 152748 198861 54232 60817 190509 193563 146631 286203 276775 227040 140567 -24362
26676b4362r1495M19153K59157l6163j11494j71796j67914o9062K72343R4316
$$ -24362 -115857 303296 562453 526290 414796 243000 75086 6024 278367 372683
26666C72683j87661n6261m7291l7612J61210M8151j20470M0565j57709j08363
$$ 372683 185022 128761 81470 43858 205068 253219 132749 173314 15605 -92758
26656i2758K539j2796J7824Q6745M7769J01659j65703O559j28655M2080j19492
$$ -92758 -90219 -103015 -85191 1554 49323 150982 -14721 -8162 -136817 -94737 -214229
26645b14229L8578K09366J00220n5260l36522j2978J20471L4209J25976J09530
$$ -214229 -175651 33715 133935 78675 -257847 -270825 -150354 -116145 9831 119361
26635A19361O5989P4090k13393k89274l0563K00554J21653J39604L7355j94167
$$ 119361 185350 259440 46047 -243227 -273790 -73236 48417 188021 225376 31209
26625C1209Q2617J2700j9634j04409l2569J71109K055k26971q8546q5739j8718
$$ 31209 113826 126526 106892 2483 -30086 141023 143078 -83893 -172439 -258178 -276896
26614b76896Q2412J60654N872j07826Q7459R2740j97140k1873P0519R577n2174
$$ -276896 -194484 -33830 -27958 -135784 -48325 44415 -152725 -174598 -104079 -94502 -146676
26603a46676K1638l4243M2697q4496m1758K39513J41227j25257j03762R1810J30108
$$ -146676 -125038 -159281 -116584 -201080 -242838 -3325 137902 12645 -91117 693 130801
26592A30801j3681j81321k1176J34536k8947k34947Q951J21988j7586J28390j68515
$$ 130801 117120 -64201 -85377 49159 20212 -214735 -205784 -83796 -101382 27008 -141507
26581a41507q5289J12919J12872O0075n8261Q3875q4131j1701M1198M928j3754
$$ -141507 -226796 -113877 -1005 59070 809 84684 553 -11148 30050 34978 21224
26570B1224j42590J59758k1223J8660J10435J37533N5838j10211l5651q0394n8992
$$ 21224 -121366 38392 17169 35829 146264 283797 339635 229424 193773 113379 54387
26559E4387n1735J60659j62578J63352J61469j79432o6627o9655J390j0618L8261
$$ 54387 2652 163311 733 164085 325554 146122 79495 9840 11230 612 38873
26548C8873Q971J7069J78374R3692k66749o9108q1961l7394K014Q7149n4514L2776
$$ 38873 47844 64913 243287 336979 70230 1122 -80839 -118233 -116219 -29070 -83584 -50808
26536e0808J40134j3332j3818m0722n2001J10959J35842P170j62938l64540n8824
$$ -50808 89326 75994 62176 21454 -30547 80412 216254 223424 60486 -304054 -362878
26525c62878J95589J22369j09535L8897J05613K6339k17747M3899J54018l0262
$$ -362878 -167289 -44920 -154455 -115558 -9945 16394 -201353 -157454 -3436 -33698
26515c3698m1706J68936J49821j7362J24063j46275o5546k437m041p7210J48638
$$ -33698 -75404 93532 243353 225991 350054 203779 138233 135796 131755 54545 203183
26504B03183J01067j26561j15606J9985K7726n6388n0068M558j4234k0555J62244
$$ 203183 304250 177689 62083 82068 109794 53406 3338 7896 -6338 -26893 135351
26493A35351j26619L7099l2813n9929J32235j97788M5114J61958k9445q5001M1321
$$ 135351 8732 45831 13018 -46911 85324 -112464 -67350 94608 65163 -19838 21483
26482B1483J58611P103q5432j01888j49055J70209N0680M5213k598j23104l1533
$$ 21483 180094 187197 101765 -123 -149178 21031 71711 116924 114326 -8778 -40311
26471d0311q485M8896Q261l0699J66925M3939L3926j67635j43667J54862k03290
$$ -40311 -48796 100 8361 -22338 144587 188526 222452 54817 -88850 66012 -137278
26460a37278o3185k2107J58260J98438K6132L4556k2815j4525j93239k45519M794
$$ -137278 -200463 -222570 -64310 134128 160260 194816 172001 157476 -35763 -281282 -276488
26449b76488K16792J77032O205o9995L2543N7222p395j49074k841J15164p7803
$$ -276488 -59696 117336 123541 53546 86089 143311 135916 -13158 -15999 99165 21362
26438B1362q5462M2253K18301j08337j920J39986j50194P6887Q504P2184k12238
$$ 21362 -64100 -21847 196454 88117 86197 226183 75989 152876 161380 233564 21326
26427B1326j14495m6486Q9458j38099L0013J58750N2699r6253J7048J15073j27244
$$ 21326 -93169 -139655 -50197 -188296 -158283 467 53166 -43087 -26039 89034 -38210
26416c8210m2998k6372j10567p2769J11491j12852K20548J40585o0270j80714
$$ -38210 -81208 -107580 -218147 -290916 -179425 -292277 -71729 68856 8586 -172128
26406a72128p200P3891J37001p7582m0167M1002J13392o0545O241P1529j75153
$$ -172128 -179328 -105437 31564 -46018 -86185 -45183 68209 7664 13905 85434 -89719
26395h9719l118n3060O5219J8132k6102J38738m0978j10866R2464P4085j17009
$$ -89719 -92837 -145897 -80678 -62546 -88648 50090 9112 -101754 -9290 64795 -52214
26384e2214N024M2376k29827O1865J73927j60007O7868O9571J21101j00762j23525
$$ -52214 -47190 -4814 -234641 -172776 1151 -158856 -90988 -21417 99684 -1078 -124603
26373a24603n3511k6842P4175M6929j15277J20708R1853r5473J64354J9923J2196
$$ -124603 -178114 -204956 -130781 -83852 -199129 -78421 13432 -82041 82313 102236 114432
26362A14432j3130j23795J8174J58910j23243k45522J62939J30676q0879r7734
$$ 114432 101302 -22493 -4319 154591 31348 -214174 -51235 79441 -1438 -99172
26352i9172K2724K818o7328k7696l7498Q0209P7129K44906K9513k6856j20361
$$ -99172 -76448 -73630 -140958 -168654 -206152 -125943 -48814 196092 225605 198749 78388
26341G8388j80723O0899M77474p6464k55036p2187p3134j73218J24801J54162
$$ 78388 -102335 -41436 436038 359574 104538 32351 -40783 -214001 -89200 64962
26331F4962l6996J28886J8308j01566L4567o086j2493j01872o8193j46017O9749
$$ 64962 27966 156852 175160 73594 108161 102075 89582 -12290 -80483 -226500 -156751
26320a56751K03719J71055J73716l04447K8880P6717q8566N8396j663k54134L4043
$$ -156751 46968 218023 391739 87292 116172 192889 104323 162719 161056 -93078 -59035
26309e9035n1419n0723k9630R1232N8357n9556Q9087l08693k7953J79421K1368
$$ -59035 -110454 -161177 -190807 -99575 -41218 -100774 -11687 -320380 -348333 -168912 -147544
26298a47544N0337Q6142J12769j32546k02564r5227J55618J3931P2029Q7660n3389
$$ -147544 -97207 -11065 101704 -30842 -233406 -328633 -173015 -159084 -87055 605 -52784
26287e2784j42597J8327J20080R3463m1069j53443j02491R6386Q2152j01737o9589
$$ -52784 -195381 -177054 -56974 36489 -4580 -158023 -260514 -164128 -81976 -183713 -253302
26276b53302N4607J14284j7544o2810L656K3863N13Q3148k9954O3971n4920l9543
$$ -253302 -198695 -84411 -101955 -164765 -161109 -137246 -136733 -53585 -83539 -19568 -74488 -114031
26264a14031L1015l05149K13705J82468J44812J06319q2456k28378k39071J33776
$$ -114031 -83016 -388165 -174460 8008 152820 259139 176683 -51695 -290766 -156990
26254a56990j09112L5803K33417J4310N97j2861j57562n0867N2765J3301J90548
$$ -156990 -266102 -230299 3118 17428 18025 5164 -152398 -203265 -150500 -137199 53349
26243E3349J21644L3989K7126q6624p6212j22367k05237J4263P488O9424j19776
$$ 53349 174993 208982 236108 149484 73272 -49095 -254332 -240069 -232581 -163157 -282933
26232b82933J49155J03787R0355J05389j50859r3089J28315L2868n8386Q007P1553
$$ -282933 -133778 -29991 60364 165753 14894 -78195 50120 82988 24602 32609 104162
26221A04162l1528N4306j04266J87215k11086j12331K65871P4855j10801j79626
$$ 104162 72634 126940 22674 209889 -1197 -113528 152343 227198 116397 -63229
26211f3229p4220O0643k5611K18423n7590j38404k52306J48046j0703n0676O7426
$$ -63229 -137449 -76806 -102417 116006 58416 -79988 -332294 -184248 -194951 -245627 -178201
26200a78201k420J98137O1133L3908j01207l6487J6232j55495P0213R6947q012
$$ -178201 -180621 17516 78649 112557 11350 -25137 -8905 -164400 -94187 2760 -5252
26189e252O2348k9335J90290P0925k30990j5037k40054L6301J20301p4321M1475
$$ -5252 57096 27761 218051 288976 57986 42949 -197105 -160804 -40503 -114824 -73349
26178g3349M0847l9378K2779j231j69889O4059p8791m5190J89148j40943j05441
$$ -73349 -32502 -71880 -49101 -50332 -220221 -156162 -234953 -280143 -90995 -231938 -337379
26167c37379J41696J51516j00626M3724R1723K074m9977O9131j90273m4760J53360
$$ -337379 -195683 -44167 -144793 -101069 -9346 -7272 -57249 11882 -178391 -223151 -69791
26156f9791K6813J06465J03206r2696j40807r6836j2306k5418N7249j09635O2207
$$ -69791 -42978 63487 166693 73997 -66810 -163646 -175952 -201370 -144121 -253756 -191549
26145a91549P6696J52403P1063J4188n8849n6539j48005j3357J25907j7574j48116
$$ -191549 -114853 37550 108613 122801 63952 7413 -140592 -153949 -28042 -45616 -193732
26134a93732n8889Q9324K4004J06710J473J8355m7473o0815Q2635N2201K37061
$$ -193732 -252621 -163297 -139293 -32583 -31110 -12755 -60228 -121043 -38408 13793 250854
26123B50854j19344k00737K135N5787j36050J38249O8349l0883n4007J1207l4001
$$ 250854 131510 -69227 -67092 -11305 -147355 -9106 59243 28360 -25647 -14440 -48441
26112d8441R6943J01102J2742j21161n4375N1373k8731p3013j13947l959K3988
$$ -48441 48502 149604 162346 41185 -13190 38183 9452 -63561 -177508 -181467 -157479
26101a57479L0m8644J59420Q1205L191R6133q5594k14616O0281Q8983j08923Q41
$$ -157479 -157449 -206093 -46673 34532 37723 133856 48262 -166354 -106073 -17090 -126013 -125172
26089a25172J89819m5108j67191L53105P8360k30023l2235k34449J08507J54856
$$ -125172 64647 19539 -147652 205453 283813 53790 21555 -212894 -104387 50469
26079E0469q7867P427J8262R8674j74375m4924N2918M681k5285L4593K63362O8255
$$ 50469 -37398 -29971 -11709 86965 -87410 -132334 -79416 -74735 -100020 -65427 197935 266190
26067B66190q2139j04787l8077k30649l5378K69309K61802j8267q584J05825j02629
$$ 266190 184051 79264 41187 -189462 -224840 44469 306271 288004 279420 385245 282616
26056B82616j97588M5019L07061J9818j88135j19511j43420J27313J67192o3042
$$ 282616 85028 130047 437108 456926 268791 149280 5860 133173 300365 237323
26046B37323p4590O030j15716K65700J76967k38961j11466k1834p7487j10524
$$ 237323 162733 168763 53047 318747 495714 256753 145287 123453 45966 -64558
26036f4558m810J8336J23190J1335m9767j17981J03123J1797J62195J26850m6811
$$ -64558 -69368 -51032 72158 83493 33726 -84255 18868 30665 192860 319710 272899
26025B72899p8371M394j26412K8355J08792J41075q793j00745j51068q0177J57733
$$ 272899 194528 198922 72510 100865 209657 350732 341939 241194 90126 9949 167682
26014A67682R0255J00422r8843j1169k44736J24548J91581J01947N5853k00583
$$ 167682 257937 358359 259516 248347 3611 128159 319740 421687 477540 276957
26004B76957O8184M560r4801l5740k3599J14023j3706j89163R1222j9507k09288
$$ 276957 345141 349701 254900 219160 195561 309584 295878 106715 197937 178430 -30858
25993c0858L1752q0788P9676O1027k156j83145j69610J07006J14766P452j03944
$$ -30858 894 -79894 -218 60809 58653 -124492 -294102 -187096 -72330 -64878 -168822
25982a68822j03592O0814R7343J05084j11860J21324J5124j04741J2745K04827
$$ -168822 -272414 -211600 -114257 -9173 -121033 291 15415 -89326 -76581 128246
25972A28246R2733J02910j4508j64076k10470J11534K21943L3017l20277r0262
$$ 128246 220979 323889 309381 145305 -65165 46369 268312 301329 -18948 -109210
25962a09210K25123j22643j74656j13067L1570L3667l5466J75482K59370P7459
$$ -109210 115913 -6730 -181386 -294453 -262883 -229216 -264682 -89200 170170 247629
25952B47629k77089J04190J77183j26189j15076j40483J07534J94032k4259n4837
$$ 247629 -29460 74730 251913 125724 10648 -129835 -22301 171731 147472 92635
25942I2635L6873J53854o2335k12226J9378p7436j46076K20934J09333N4170k65591
$$ 92635 129508 283362 221027 8801 28179 -49257 -195333 25601 134934 189104 -76487
25931g6487P0119P2103K2562l206m5405j2994J04445L3424p5941j62042k678K05918
$$ -76487 -6368 65735 88297 85091 39686 26692 131137 164561 88620 -73422 -76100 129818
25919A29818M9446n7518j30731k71943J30097J98262J94983Q8800r9231j55794
$$ 129818 179264 121746 -8985 -280928 -150831 47431 242414 331214 231983 76189
25909G6189k4298J43581J3747p0264r2228Q4064K0402L256J7847j01919j5687
$$ 76189 51891 195472 209219 138955 46727 130791 151193 154449 172296 70377 54690
25898E4690o6477q2192j93511p5726K17050J63745m4275n8615k1165J97961O2997
$$ 54690 -11787 -93979 -287490 -363216 -146166 17579 -26696 -85311 -106476 91485 154482
25887A54482O3972k17501j476n4642m320n2082p9299j7510R5809P6340R7649j54830
$$ 154482 218454 953 -523 -55165 -59485 -111567 -190866 -208376 -112567 -36227 61422 -93408
25875i3408K2892k14169J7458Q3189N9210J85597l39o6197L617j69585p7753P5217
$$ -93408 -70516 -284685 -267227 -184038 -124828 60769 60430 -5767 -2150 -171735 -249488 -174271
25863a74271J0182J38479j0598l2197j2492k8862K52583j52690M3164l8963Q4389
$$ -174271 -164089 -25610 -36208 -68405 -80897 -109759 142824 -9866 33298 -5665 78724
25852G8724J23557r3794j58038p1211o9544k07667J45235L2944k11672K82071
$$ 78724 202281 108487 -49551 -120762 -190306 -397973 -252738 -219794 -431466 -149395
25842a49395R6009J74595k0080j82842P4611R3357L2953q7411l45435k1179n7783
$$ -149395 -53386 121209 101129 -81713 -7102 86255 119208 31797 -313638 -334817 -392600
25831c92600O6609J98635J1672R2332n9301m8689N1769J69767j38105J7817J0184
$$ -392600 -325991 -127356 -115684 -23352 -82653 -131342 -79573 90194 -47911 -30094 -19910
25820a9910o8554M3687N3849j26597j2043J17299j09920J78801J17223k24653
$$ -19910 -88464 -44777 9072 -117525 -129568 -12269 -122189 56612 173835 -50818
25810e0818j06527n370K29574J07173j11284j61161j52774o9829n0583O6128J2424
$$ -50818 -157345 -162715 66859 174032 62748 -98413 -251187 -321016 -371599 -305471 -293047
25799b93047n1602K31030j5584q4874r5895j0007N8876K50573N8277J10861k04215
$$ -293047 -344649 -113619 -129203 -214077 -309972 -319979 -261103 -10530 47747 158608 -45607
25788d5607L0421M4816r8894p9378J7706K08561K29932O7705j70153k22399l9379
$$ -45607 -15186 29630 -69264 -148642 -130936 77625 307557 375262 205109 -17290 -56669
25777e6669j29090j10961l4337o922Q0018k2120k6125J47501J68929O3229K15833
$$ -56669 -185759 -296720 -331057 -337979 -257961 -280081 -306206 -158705 10224 73453 289286
25766B89286p9651j55882l0397j04746R028J08498M2729j55371O0246K3110j23723
$$ 289286 209635 53753 23356 -81390 -72362 36136 78865 -76506 -16260 6850 -116873
25755a16873m0210J14244J0870r177j7738m0075N0091M8711j23359o9037J22030
$$ -116873 -157083 -42839 -31969 -41146 -58884 -98959 -48868 -157 -123516 -192553 -70523
25744g0523L3893J49906K305j30900o1937P6640L6518J10701n8307k7901j41349
$$ -70523 -36630 113276 115581 -15319 -77256 -616 35902 146603 88296 60395 -80954
25733h0954q6819J4530P7172J19478r9151q0490r3125J95911L171j7094J21936
$$ -80954 -167773 -153243 -76071 43407 -55744 -136234 -229359 -33448 -30277 -47371 74565
25722G4565j49915J09998O8782m7352j93161l6359l908l9858p184J19668J05531
$$ 74565 -75350 34648 103430 56078 -137083 -173442 -177350 -217208 -224392 -104724 807
25711H07K5488m4113J4816o5841j55272j6178P7618j48J84176L8257n9379M2240
$$ 807 26295 -17818 -3002 -68843 -224115 -240293 -162675 -162823 21353 59610 231 42471
25699D2471r5545N6777N0215j65819J93314J73082j13815p3952o381n1328L9014
$$ 42471 -53074 3703 53918 -111901 81413 254495 140680 66728 60347 9019 48033
25688D8033o1581J13927q5020p0512R9292J3683k81580J96558n7123N4954j07689
$$ 48033 -13548 100379 15359 -55153 44139 57822 -223758 -27200 -84323 -29369 -137058
25677a37058R2140J56345K2328R6878j09016M3340Q9802J21144p1238j4554l6973
$$ -137058 -44918 111427 133755 230633 121617 164957 254759 375903 304665 290111 253138
25666B53138J13569j6085j03852k18781o4521K6927J53303j5184j16252j96747
$$ 253138 366707 350622 246770 27989 -36532 -9605 143698 128514 12262 -184485
25656a84485k8189N1885K16407m9904J62041j06134L88O5586k0309j95300J29937
$$ -184485 -212674 -160789 55618 5714 167755 61621 62009 127595 107286 -88014 41923
25645D1923J58716j8521j72085J23015N5814j19720K2431J31271R2037J3409k6852
$$ 41923 200639 182118 10033 133048 188862 69142 91573 222844 314881 328290 301438
25634C01438j73079j28701K3328P7630j80865l8245J33889l5789R9625o5251m5924
$$ 301438 128359 -342 22986 100616 -80249 -118494 15395 -20394 79231 13980 -31944
25623c1944p3966r5527K44620M5378j6254j0227o8210J11317l2412k71617j3766
$$ -31944 -105910 -201437 43183 88561 72307 62080 -6130 105187 72775 -198842 -212608
25612b12608l9712J04917P088N010J04254P7250k1905p9718m0804m5685K872m5172
$$ -212608 -252320 -147403 -140315 -135305 -31051 46199 24294 -55424 -96228 -141913 -139041 -184213
25600a84213J49129l3693k45468J42809K52677p4336R8308j21834k21235N4747
$$ -184213 -35084 -68777 -314245 -171436 81241 6905 105213 -16621 -237856 -183109
25590a83109J63847J7228o021J71330J62405m7524n7266J82234J03962j67744
$$ -183109 -19262 -2034 -8055 163275 325680 278156 220890 403124 507086 339342
25580C39342r9247n0300l1132J63542q1107j61641l4679R4646j68506p187J23633
$$ 339342 240095 189795 158663 322205 241098 79457 44778 139424 -29082 -36269 87364
25569H7364J33327q1043j51166o410j1767p9127J41443p5307J02167J2913j79402
$$ 87364 220691 139648 -11518 -17928 -29695 -108822 32621 -42686 59481 72394 -107008
25558a07008L5688J69557R628n8510p6183N3494O236j40708k5710J02242N5477
$$ -107008 -71320 98237 107865 49355 -26828 26666 32902 -107806 -133516 -31274 24203
25547B4203j36001N6179q5385j79262n8935P9510M4095J77023J42323m4388l1078
$$ 24203 -111798 -55619 -141004 -320266 -379201 -299691 -255596 -78573 63750 19362 -11716
25536a1716n446j39816O2783J75429J47277j57956J2828J65661K6177k09624m3874
$$ -11716 -17162 -156978 -94195 81234 228511 70555 83383 249044 275221 65597 21723
25525B1723J1107l9880r6019P2708K09852K6054j98724P9995J37102M2382j2217
$$ 21723 32830 -7050 -103069 -30361 179491 205545 6821 86816 223918 266300 254083
25514B54083p0708j08802j37188O512Q4480j12034J21908K74370o2964r1995j5001
$$ 254083 183375 74573 -62615 -56103 28377 -83657 38251 312621 249657 157662 142661
25503A42661j8516N1213L3911j14687J68061N6824j76869o8812O4796O1534m7771
$$ 142661 124145 175358 209269 94582 262643 319467 142598 73786 138582 200116 152345
25492A52345q4004j15456K02029q8135J33006K3417j48873M8747L4491j77468
$$ 152345 68341 -47115 154914 66779 199785 223202 74329 123076 157567 -19901
25482a9901k3069K02618k49p7311q6743j782M6054O9098J71381l4880r7377j18557
$$ -19901 -42970 159648 159399 82088 -4655 -6437 39617 108715 280096 245216 147839 29282
25470B9282J6228N1118p3307q0148j8739J13465j6884Q9490J28765n1603J15523
$$ 29282 45510 96628 23321 -56827 -75566 37899 21015 110505 239270 187667 303190
25459C03190n9585k36567N0598K68717l1909j05160K0407q5432R1973j82457j39289
$$ 303190 243605 7038 57636 326353 294444 189284 209691 124259 216232 33775 -105514
25448a05514j40178J76593R5546j60050m2373O4388K87426P5686j92948p826P0750
$$ -105514 -245692 -69099 26447 -133603 -175976 -111588 175838 251524 58576 50750 121500
25437A21500j02974r4042L8831J67778k59823K09672L6019L7944j45784J33826
$$ 121500 18526 -75516 -36685 131093 -128730 80942 116961 154905 9121 142947
25427A42947m5294P1342l9998m6366k52723j10048J34981J55413j10999j49850
$$ 142947 97653 168995 128997 82631 -170092 -280140 -145159 10254 -100745 -250595
25417b50595J02037l5150Q2707K80491o5145j18275K74602j84079j55338P7536
$$ -250595 -148558 -183708 -101001 179490 114345 -3930 270672 86593 -68745 8791
25407H791o7063J52939l8993r2719j16989N3615k7256j01508Q6420P1102k7339
$$ 8791 -58272 94667 55674 -37045 -154034 -100419 -127675 -229183 -142763 -71661 -99000
25396i9000Q5932k29571M7764K59555o112K9129o0739N0900J8474j36467q9805
$$ -99000 -13068 -242639 -194875 64680 58568 87697 26958 77858 96332 -40135 -129940
25385a29940p4567J39827k651J0298q5564j03636N9051m5508N2390J10640M9094
$$ -129940 -204507 -64680 -67331 -57033 -142597 -246233 -187182 -232690 -180300 -69660 -20566
25374b0566m9634P7409m1602J6704n7525r5711R2739O3747L161Q255O8625P2489
$$ -20566 -70200 7209 -34393 -17689 -75214 -170925 -78186 -14439 -11278 -3023 65602 138091
25362A38091q493j56985j36946Q5405J33692J33799j1148j43919R0516R3140j32927
$$ 138091 129598 -27387 -164333 -78928 54764 188563 177415 33496 124012 217152 84225
25351H4225p888m8614k7003J01564j1521j85991l8559j40673J90277J2815R5468
$$ 84225 76337 27723 720 102284 90763 -95228 -133787 -274460 -84183 -71368 24100
25340B4100o3915l2034k247P970J70796J14796p895j57733K12795Q103J3715j15691
$$ 24100 -39815 -71849 -74096 -66126 104670 219466 211571 53838 266633 274736 288451 172760
25328A72760j85329n5814l0187K7839J07488n8474P095M1037l2093J51470L6627
$$ 172760 -12569 -68383 -98570 -70731 36757 -21717 -14622 26415 -5678 145792 182419
25317A82419n1100j11978m5328j40551o835J02376K15484k23094O4413j15915
$$ 182419 131319 19341 -25987 -166538 -173373 -70997 144487 -78607 -14194 -130109
25307a30109L0285P2297J64589l6565j38652J84493M2448j15254L6036k9993r4457
$$ -130109 -99824 -27527 137062 100497 -38155 146338 188786 73532 109568 79575 -14882
25296a4882J32858K3141j57822N4085J62203k5380j43642L2800j00528k10273
$$ -14882 117976 141117 -16705 37380 199583 174203 30561 63361 -37167 -247440
25286b47440J15027K92379L6387o7111P5829J14272j88336j23049J35834n913
$$ -247440 -132413 159966 196353 129242 205071 319343 131007 7958 143792 137879
25276A37879J32205k15709k55120J9189l7202N7956K05807J36m0940K04931q5069
$$ 137879 270084 54375 -200745 -181556 -218758 -160802 45005 45141 4201 209132 124063
25265A24063k21539O0123j7380R765m1746J00445M4657R6191K9886L7995k8633
$$ 124063 -97476 -37353 -54733 -44968 -86714 13731 58388 154579 184465 222460 193827
25254A93827K11481j74907K4458k2031j94510m5577j36496o0889Q6913o0747K57
$$ 193827 405308 230401 254859 232828 38318 -7259 -143755 -204644 -117731 -178478 -178221
25243a78221J64994q8787m1493M684m1137q6660J73815J39664M8071k6908J6129
$$ -178221 -13227 -102014 -143507 -138823 -179960 -266620 -92805 46859 94930 68022 84151
25232H4151J46960R0476j86571j32885j67427j34963J58942J81296J0463J28076
$$ 84151 231111 321587 135016 2131 -165296 -300259 -141317 39979 50442 178518
25222A78518j04467k528J27736j09298j26202j78976n0296K02386M6093k7484
$$ 178518 74051 71523 199259 89961 -36241 -215217 -265513 -63127 -17034 -44518
25212d4518N7994j585k4072q4778K1716N4012j58149K41960p4478j51824Q1343
$$ -44518 13476 11891 -12181 -96959 -75243 -21231 -179380 62580 -11898 -163722 -82379
25201h2379j27818J26065K4947n3126K13765l2360R1320J9286q9795j08846m7044
$$ -82379 -210197 -84132 -59185 -112311 101454 69094 160414 179700 89905 -18941 -65985
25190f5985J00798N1308O9149m4162l3871P349N325J01906r3060o4174r156r871
$$ -65985 34813 86121 155270 111108 77237 84586 89911 191817 98757 34583 25427 15556
25178A5556q6996j3720J1313o9627J38605j17208j8973j69425Q7993M39847J215
$$ 15556 -71440 -85160 -73847 -143474 -4869 -122077 -141050 -310475 -222482 217365 218580
25167B18580p3462q6474k1854R0950P7089R5994p1103j17222r8609J935K08410
$$ 218580 145118 58644 36790 127740 204829 300823 229720 112498 13889 15824 224234
25156B24234p3944k97859m8963R27J01737J38232M4281j63719J46509j5663l33179
$$ 224234 150290 -147569 -196532 -195605 -93868 44364 88645 -75074 71435 55772 -277407
25145b77407Q1511K7002R991N0553J16499o8704J14292J14844j77615j00177m1528
$$ -277407 -195896 -168894 -158903 -108350 8149 -60555 53737 168581 -9034 -109211 -150739
25134a50739j61908O3196J28426J30331j5904r5597j581J95627L3262p1550J16509
$$ -150739 -312647 -249451 -121025 9306 -6598 -102195 -103776 91851 125113 53563 170072
25123A70072P2610j00017p5677N9324k68833L168N5466p1660J81760J7302k54973
$$ 170072 242682 142665 66988 126312 -142521 -139353 -83887 -155547 26213 43515 -211458
25112b11458J15132K19206K3650j44642o7571o3307l5805N0660r2165P0602K27310
$$ -211458 -96326 122880 146530 1888 -65683 -128990 -164795 -114135 -206300 -135698 91612
25101I1612m1908j04470J24843j58681J69784J9166n7078j67488P2667r2804j18863
$$ 91612 49704 -54766 70077 -88604 81180 100346 43268 -124220 -51553 -144357 -263220
25090b63220Q7490J88982k6582j5943k559J1241k8794J46J17669k3895M0449j1054
$$ -263220 -175730 13252 -13330 -29273 -31832 -20591 -49385 -49239 68430 44535 84984 73930
25078G3930k07085q1290J5744Q2927J6242L8647J21348J1352O7848j59031L9303
$$ 73930 -133155 -214445 -198701 -115774 -99532 -60885 60463 71815 139663 -19368 19935
25067A9935r5842J98842o4812r7207J19082l9949O1972o1052o4575j46739J0734
$$ 19935 -75907 122935 58123 -39084 79998 40049 102021 40969 -23606 -170345 -159611
25056a59611K06974J4479j0613n0574k83859N3982K00377N8211J11018R2884p5812
$$ -159611 47363 61842 51229 655 -283204 -229222 -28845 29366 140384 233268 157456
25045A57456n1553j67182r7895J88450K72222q1143O5488k3263j92726L9855m4238
$$ 157456 105903 -61279 -159174 29276 301498 220355 285843 262580 69854 109709 65471
25034F5471j36145P8752L1660k51653j3779R9764J06055J42078J2999j07694R175
$$ 65471 -70674 8078 39738 -211915 -225694 -125930 -19875 122203 135202 27508 36683
25023C6683j800J43709r9268n0738m0229J93484o1596l7819K6444K4529J7786
$$ 36683 34883 178592 79324 28586 -11643 181841 120245 82426 108870 133399 151185
25012A51185r2118o171O7564j27461q3238J77508j4776k24758P0733K10497j2330
$$ 151185 59067 52896 120460 -7001 -90239 87269 72493 -152265 -81532 128965 116635
25001A16635j1285N1745Q6336K124j25526l5291K9255J28877P9402j59399m7949
$$ 116635 105350 157095 243431 245555 120029 84738 113993 242870 322272 162873 114924
24990A14924P4767j54609R654J05115j02193J2453J7300Q3042r042J8036m7204
$$ 114924 189691 35082 44736 149851 47658 60111 77411 160453 151411 169447 122243
24979A22243j0577j25746l945P4618K1987Q8177j06760M669M3346j16567r1645
$$ 122243 111666 -14080 -18025 56593 78580 166757 59997 64666 108012 -8555 -100200
24968a00200Q9294J28038o8588R263j28722M0710J87255L6625K3416k07624k03529
$$ -100200 -10906 117132 48544 57807 -70915 -30205 157050 193675 217091 9467 -194062
24957a94062o5982K73373o4016l4188K5785J04169J80233o5549j14314j16367
$$ -194062 -260044 13329 -50687 -84875 -59090 45079 225312 159763 45449 -70918
24947g0918R5108J33242j95970j6081M8728J163Q8232o3370R4947l25147r8322
$$ -70918 24190 157432 -38538 -54619 -5891 -4728 83504 20134 115081 -210066 -308388
24936c08388J98027j14233J584J49953M3333J71691k8602P2391P5174K9526j10333
$$ -308388 -110361 -224594 -223010 -73057 -29724 141967 113365 185756 260930 290456 180123
24925A80123M0787l5308l24642r340L6364N0179j00366j4865Q0714J6848K16912
$$ 180123 220910 185602 -139040 -148380 -112016 -61837 -162203 -177068 -96354 -79506 137406
24914A37406j75658j18247k1477L78280k6254j34552J20211J37600l16882L7606
$$ 137406 -38252 -156499 -177976 200304 174050 39498 159709 297309 -19573 18033
24904A8033k0362l9056m4192n1754j4227O6326N632P8127N3552r1608j09165K63441
$$ 18033 -2329 -41385 -85577 -137331 -151558 -85232 -79600 -1473 52079 -39529 -148694 114747
24892A14747n4542o4245j58k7782j1987l4611O220J7186o3060L3873l3348J90055
$$ 114747 60205 -4040 -4198 -31980 -43967 -78578 -72358 -55172 -118232 -84359 -117707 72348
24880G2348l3113m8960N1856m2524L0487J05875o6632j4474r0263k3n7080k19268
$$ 72348 39235 -9725 42131 -393 30094 135969 69337 54863 -35400 -35423 -92503 -311771
24868c11771J88172l0413J48572R293k30255j3347J18396n9428k8593P4644P5152
$$ -311771 -123599 -154012 -5440 3853 -226402 -239749 -121353 -180781 -209374 -134730 -59578
24857e9578L0175J48037o0588O021j00516o5075J9992L3362M6346K7343K1055
$$ -59578 -29403 118634 58046 64067 -36449 -101524 -81532 -48170 -1824 25519 46574
24846D6574J21692j25694J6763l2155o851K48917j9135j5810j87967j32018J97635
$$ 46574 168266 42572 59335 27180 20329 269246 250111 234301 46334 -85684 111951
24835A11951p3998k0914O2549j09581l4933j89117K3106K97407J44456K4710q3160
$$ 111951 37953 17039 79588 -29993 -64926 -254043 -230937 66470 210926 235636 152476
24824A52476j04321M9963M9349l9453j5406J41555j56918j56375J00873k7546
$$ 152476 48155 98118 147467 108014 92608 234163 77245 -79130 21743 -5803
24814e803M415j22742M6200M4217J2886J81209J04736j06604k23477J40334r3511
$$ -5803 -1388 -124130 -77930 -33713 -20827 160382 265118 158514 -64963 75371 -18140
24803a8140n8887q0692l4085q2099K0637J59358k11177P1592o8817M5448J84008
$$ -18140 -77027 -157719 -191804 -273903 -253266 -93908 -305085 -233493 -302310 -256862 -72854
24792g2854M2000R6521n9373k38152M0292J25443O9804j16489j6693J01371k7417
$$ -72854 -30854 65667 6294 -231858 -191566 -66123 3681 -112808 -129501 -28130 -55547
24781e5547L7070j30897J24851J81276j11102J44058j39743L6186j04845r5244
$$ -55547 -18477 -149374 -24523 156753 45651 189709 49966 86152 -18693 -113937
24771a13937J4043q7469j07653K9149J06735l2600J18605j31761o1308l7747J11692
$$ -113937 -99894 -187363 -295016 -265867 -159132 -191732 -73127 -204888 -266196 -303943 -192251
24760a92251J9772J44670Q6962j08441o4322r6578N0002K05235J19563k2583K2797
$$ -192251 -172479 -27809 59153 -49288 -113610 -210188 -160186 45049 164612 142029 164826
24749A64826j32467l6093L8791K5754l6775P532R6201j2355P7542j55713j72498
$$ 164826 32359 -3734 35057 60811 24036 31568 127769 115414 192956 37243 -135255
24738a35255R6767k45112j51164J03140J89221R8107J58319n9474J7815M8061
$$ -135255 -38488 -283600 -434764 -331624 -142403 -44296 114023 54549 72364 120425
24728A20425j54858o1318J8077q7859Q0782J01010M0268J4958l8419j93724K46600
$$ 120425 -34433 -95751 -77674 -165533 -84751 16259 56527 71485 33066 -160658 85942
24717H5942M4800n8432J08056J891q0221j30391O3670k996K2399O2240j24800
$$ 85942 130742 72310 180366 182257 102036 -28355 35315 32319 54718 116958 -7842
24706g842P9987K6663J31248k10121n5596O8079N1104P6574j10308q1867O5877
$$ -7842 72145 98808 230056 19935 -35661 32418 83522 160096 49788 -32079 33798
24695C3798l0822j44407J50245K08800L6217r118j98336o8676J03379q573L9024
$$ 33798 2976 -141431 8814 217614 253831 244713 46377 -22299 81080 72507 111531
24684A11531p6355L384o300M7261M5567K6252j10125L9852j19279k36738O8141
$$ 111531 35176 38560 32260 79521 125088 151340 41215 81067 -38212 -274950 -206809
24673b06809Q5625J37677j13234k52001k3253J17150J21284N0388J37637J52373
$$ -206809 -121184 16493 -96741 -348742 -371995 -254845 -133561 -83173 54464 206837
24663B06837J50518j72790j14582n1563M6214J75347r7681p4610J23443n7699
$$ 206837 357355 184565 69983 18420 64634 239981 142300 67690 191133 133434
24653A33434l3544J11388j65785j31682r0530J76323j03215O0917k06320j44375
$$ 133434 99890 211278 45493 -86189 -176719 -396 -103611 -42694 -249014 -393389
24643c93389K17592N6642J71343J10644k16011P259J73018Q3496j45713J7075
$$ -393389 -175797 -119155 52188 162832 -53179 -45920 127098 210594 64881 81956
24633H1956j75361j4263K0416J70121K6128j68265p7652J33597j1670O4756J41199
$$ 81956 -93405 -107668 -87252 82869 108997 -59268 -136920 -3323 -14993 49763 190962
24622A90962o1074q5474J54651o9330k01848j95977J48853J04284j5591Q3489
$$ 190962 129888 44414 199065 129735 -72113 -268090 -119237 -14953 -30544 52945
24612E2945J21853j55508k79335q4874N6699J19591J62091P4112R3871P8j20289
$$ 52945 174798 19290 -260045 -344919 -288220 -168629 -6538 67574 161445 161523 41234
24601D1234J35066k24405j30844J6016n0075O036p2316P0158K05444P8020r202
$$ 41234 176300 -48105 -178949 -162933 -213008 -206972 -279288 -209130 -3686 74334 65132
24590F5132o2800J25821J43215j32174k68989j43224O7814J63304J12403j25708
$$ 65132 2332 128153 271368 139194 -129795 -273019 -205205 -41901 70502 -55206
24580e5206N425q8308j62488J04611K61206k114j67654k5682M920J67396l8155
$$ -55206 -49781 -138089 -300577 -195966 65240 63126 -104528 -130210 -125290 42106 3951
24569C951n8776N2109O2283j95277m7000J66551J84658j82445l9817L7273o158
$$ 3951 -54825 -2716 59567 -135710 -182710 -16159 168499 -13946 -53763 -16490 -22648
24558b2648O3849J5894K5591J40582J36497j05701p9513M6025j57827j29451k17371
$$ -22648 41201 57095 82686 223268 359765 254064 174551 220576 62749 -66702 -284073
24547b84073P6594j08702l5067J07517J50183r7512j5085L17680Q4344q8856q814
$$ -284073 -207479 -316181 -351248 -243731 -93548 -191060 -206145 111535 195879 107023 98209
24536I8209o7418K3186R7955j43534o7154m8804o8082J10697K52481J28549j37359
$$ 98209 30791 53977 151932 8398 -58756 -107560 -175642 -64945 187536 316085 178726
24525A78726j55112j03471p3408J77563J15349J08795J00067j56758n923L5272
$$ 178726 23614 -79857 -153265 24298 139647 248442 348509 191751 185828 221100
24515B21100k75437j7691J34580k89236m3457K18952Q9604j8085p2757k8808O6508
$$ 221100 -54337 -72028 62552 -226684 -270141 -51189 38415 20330 -52427 -81235 -14727
24504a4727m0839n2784M4282N7970n9618r836r7249K8080M5484J15007P1451M973
$$ -14727 -55566 -108350 -64068 -6098 -65716 -75552 -172801 -144721 -99237 15770 87221 92194
24492I2194Q84l3061q3903l5832J63257j36237q9001o3706l0475L6056K01005
$$ 92194 93078 60017 -23886 -59718 103539 -32698 -121699 -185405 -215880 -179824 21181
24481B1181J44110o0780J8834m2130j22228Q9094q4922j62695K00336L02967m0666
$$ 21181 165291 104511 123345 81215 -41013 48081 -36841 -199536 800 303767 263101
24470B63101m0053k2611j30357O1312o1930N084n1550l00587J8165N8755K8161
$$ 263101 223048 200437 70080 131392 69462 74546 22996 -277591 -259426 -200671 -172510
24459a72510N9511j4614J22013J6158R9734Q7322j34723j42932L9042J25980j23495
$$ -172510 -112999 -127613 -5600 10558 110292 197614 62891 -80041 -40999 84981 -38514
24448c8514j87657o5977K12763R1587j39261J1445K25553O7484K8222N810r5521
$$ -38514 -226171 -292148 -79385 12202 -127059 -115614 109939 177423 205645 211455 115934
24437A15934o8427j03654j6206K38768P2674j21706J29586j22366J6981k4762
$$ 115934 47507 -56147 -72353 166415 239089 117383 246969 124603 141584 116822
24427A16822j75815l5092J44223j41363j10596J68658r6761L0007o521k5562J63098
$$ 116822 -58993 -94085 50138 -91225 -201821 -33163 -129924 -99917 -106438 -132000 31098
24416C1098J30897j18439R9962j23906k18547m6509K5053J58264o5898p4628K16036
$$ 31098 161995 43556 143518 19612 -198935 -245444 -220391 -62127 -128025 -202653 13383
24405A3383j5983j14880P2389l2793K41583K7023l6596j38985L8752j9815n2653
$$ 13383 -2600 -117480 -45091 -77884 163699 190722 154126 15141 53893 34078 -18575
24394a8575m7875p4878J86313j4615N3980p6671p5492o0961J17590q1263j02932
$$ -18575 -66450 -141328 44985 30370 84350 7679 -67813 -128774 -11184 -92447 -195379
24383a95379J28753j01612J5087J26201j1521J28703J82469k62875j45725q9487
$$ -195379 -66626 -168238 -153151 -26950 -38471 90232 272701 9826 -135899 -225386
24373b25386J3916O5134O4756q8762q521K04466J44502P4846J12849j27875J3898
$$ -225386 -211470 -146336 -81580 -170342 -178863 25603 170105 244951 357800 229925 243823
24362B43823o4931j32154j18594j74744L08690J02972M0097R7658r5099j21564
$$ 243823 178892 46738 -71856 -246600 62090 165062 205159 302817 207718 86154
24352H6154j46910p4634J99479N1527j94866L3516l2572n3671j06051R8951J38982
$$ 86154 -60756 -135390 64089 115616 -79250 -45734 -78306 -131977 -238028 -139077 -95
24341i5j1163q7339k158J66826j0644J4826J20419j69039j35405j41031m032J34805
$$ -95 -11258 -98597 -100755 66071 55427 70253 190672 21633 -113772 -254803 -258835 -124030
24329a24030J6266o7901Q6645L15247R3746j0796j93310j95695O0486M3867n6652
$$ -124030 -107764 -175665 -89020 226227 319973 309177 115867 -79828 -19342 24525 -32127
24318c2127p637K7551j287J88841j06423n6908K2089j17624O116P0660J58448
$$ -32127 -39764 -12213 -13500 175341 68918 12010 34099 -83525 -77409 -6749 151699
24307A51699J7243J1828l1300k79305r7198K69056K4630n754J03893k0594j25310
$$ 151699 168942 180770 149470 -129835 -227033 42023 66653 60899 164792 144198 18888
24296A8888j72061O8462Q7665O5805j02135J11076j3488k8541M2893P0947O8606
$$ 18888 -153173 -84711 2954 68759 -33376 77700 64212 35671 78564 149511 218117
24285B18117p2076j88330l3060j69820K11811J55561j13305l0674J99905j90222
$$ 218117 146041 -42289 -75349 -245169 -33358 122203 8898 -21776 178129 -12093
24275a2093J14193J66575r5197k34876J9654o6047r8124J45932J04533J32263
$$ -12093 102100 268675 173478 -61398 -41744 -107791 -205915 -59983 44550 176813
24265A76813R8207L0418j22667L2288K0920p3063j74577j3078j45947O2879J50757
$$ 176813 275020 305438 182771 215059 235979 162916 -11661 -24739 -170686 -107807 42950
24254D2950P1144m2128j6975K22739J13580j36249j30456m8011J27601j44624
$$ 42950 114094 71966 54991 277730 391310 255061 124605 76594 204195 59571
24244E9571q8401J52918l6754K7146J27218o4357n7751k75356p9030Q1046J31740
$$ 59571 -28830 124088 87334 114480 241698 177341 119590 -155766 -234796 -153750 -22010
24233b2010N8515J14088J15907n5856j14647M8468J37798k15311p7396o4188j611
$$ -22010 36505 150593 266500 210644 95997 144465 282263 66952 -10444 -74632 -76243
24222g6243Q2091K5415L1043j71915L8219j21031J66675P3520n2963p3082J26566
$$ -76243 5848 31263 62306 -109609 -71390 -192421 -25746 47774 -5189 -78271 48295
24211D8295J37002o5998j96366o7419j60660N7148K29383J18868k8717j30345
$$ 48295 185297 119299 -77067 -144486 -305146 -247998 -18615 100253 71536 -58809
24201e8809r8393j4249O3533J2466k3859j60576Q3025J43718O2585k630j05594
$$ -58809 -157202 -171451 -107918 -95452 -119311 -279887 -196862 -53144 9441 6811 -98783
24190i8783J02369K0146r6400l5193N6787q6628J56045l9998q1645J33238Q2067
$$ -98783 3586 23732 -72668 -107861 -51074 -137702 18343 -21655 -103300 29938 112005
24179A12005J6942j25790j10614r6440O716K17715J72217K1835q9989j58925j45785
$$ 112005 128947 3157 -107457 -203897 -197181 20534 192751 214586 124597 -34328 -180113
24168a80113J27210J66300l2794L7059j44664L3600r9317P969K05414n9943q3695
$$ -180113 -52903 113397 80603 117662 -27002 6598 -92719 -84750 120664 60721 -22974
24157b2974Q9518m0358l8367Q6748Q9305m4336K4027Q0775O2538P7551j38535
$$ -22974 66544 26186 -12181 74567 163872 119536 143563 224338 286876 364427 225892
24146B25892j04428k6319J42653m5587K0811n2659j37847O0976l8896q5204J4553
$$ 225892 121464 95145 237798 192211 213022 160363 22516 83492 44596 -40608 -26055
24135b6055O5359m8649j08360J82611O9894j56942l0448K06736j71002m2372J79349
$$ -26055 39304 -9345 -117705 64906 134800 -22142 -52590 154146 -16856 -59228 120121
24124A20121J15363r6089J16458j43026j25014L2627J54698M7615p3500k36979
$$ 120121 235484 139395 255853 112827 -12187 20440 175138 222753 149253 -87726
24114h7726M140J52837n9753p679J03429j19527j87726J47261J2509j49597l7726
$$ -87726 -83586 69251 9498 1819 105248 -14279 -202005 -54744 -42235 -191832 -229558
24103b29558J17145K1633p9360Q8594P5749p5500K3612J82325M6308K6678J31527
$$ -229558 -112413 -90780 -170140 -81546 -5797 -81297 -57685 124640 170948 197626 329153
24092C29153k98433o1510j9522j05547q84L7743J257p5355P4651P5566k9456k049
$$ 329153 30720 -30790 -50312 -155859 -156743 -119000 -117743 -193098 -118447 -42881 -72337 -74386
24080g4386m4905n0431q8571j04250K65153J65480k28200j40171L19971J78545
$$ -74386 -119291 -169722 -258293 -362543 -97390 68090 -160110 -300281 19690 198235
24070A98235q4048k31850l30J7134N9409O8145K51014j19127j09417j35206Q1767
$$ 198235 114187 -117663 -117993 -100859 -41450 26695 277709 158582 49165 -86041 -4274
24059d274k26189n8914J58630J34687P352L9567p1856K39035p832k28224k0567
$$ -4274 -230463 -289377 -130747 3940 11292 50859 -20997 218038 210206 -18018 -38585
24048c8585J39805P0535l1845j637J91112l5059k6161r612Q297p0723j10355p2138
$$ -38585 101220 171755 139910 138273 329385 294326 268165 258553 266850 196127 85772 13634
24036A3634R611k1923J6786R0840j1642J67552j21484j50912p9222k0981J68490
$$ 13634 23245 1322 18108 108948 97306 264858 143374 -7538 -86760 -107741 60749
24025F0749P6486m9022J27787Q0004j15821n2304J61780j53786j88178q0740L00997
$$ 60749 137235 88213 216000 296004 180183 127879 289659 135873 -52305 -133045 167952
24014A67952n2960o9209N5174j81736o3535J21241R5491M3544Q24j34049J8004
$$ 167952 114992 45783 100957 -80779 -144314 -23073 72418 115962 116786 -17263 741
24003G41J44841j85216r0055N9475J22813k3644j07528J68419J99313j86992L0705
$$ 741 145582 -39634 -129689 -70214 52599 28955 -78573 89846 289159 102167 132872
23992A32872K4390k5018r644k844j9018k971N063o8679r240j9320j11896J41518
$$ 132872 157262 132244 122600 119756 100738 97767 102830 34151 24911 5591 -106305 35213
23980C5213J79069O3059l6389K1161Q0634r1907j506k60746O4629M3465r4655
$$ 35213 214282 277341 240952 262113 342747 250840 249334 -11412 53217 96682 2027
23969B027J67741o7273l2969l8971r5273L264j73856q2479J82095J25998n7264
$$ 2027 169768 102495 69526 30555 -64718 -61454 -235310 -317789 -135694 -9696 -66960
23958f6960l2800R8302o2922N2880L0914j25586K55165P9557k7792j86667K3273
$$ -66960 -99760 -1458 -64380 -11500 19414 -106172 148993 228550 200758 14091 37364
23947C7364K9069q9690j5280J06255j6683l4497L346j54168k5497J08097J21390
$$ 37364 66433 -23257 -38537 67718 51035 16538 19884 -134284 -159781 -51684 69706
23936F9706n8168m5731j04419M2748K00147J50977j99501j98986J2760r4882l9386
$$ 69706 11538 -34193 -138612 -95864 104283 255260 55759 -143227 -130467 -225349 -264735
23925b64735J56857J2070N4662J44580K19503r8793k81811Q7006J32329Q2765
$$ -264735 -107878 -95808 -41146 103434 322937 224144 -57667 29339 161668 244433
23915B44433j43616j99932N6700N6198K7301K11730Q1598o2191r6756j81840j11769
$$ 244433 100817 -99115 -42415 13783 41084 252814 334412 272221 175465 -6375 -118144
23904a18144R6325J27031J29676k3953N2744J375j06246n1613k2689N3100M0299
$$ -118144 -21819 105212 234888 210935 263679 265054 158808 107195 84506 137606 177905
23893A77905M0118n5575j80527P4743m6816j08165Q9730J9990R5728q0902M684
$$ 177905 218023 162448 -18079 56664 9848 -98317 -8587 11403 107131 26229 30913
23882C0913q7606o3767K9129L00825m7465k69421j19839p3845K17779m5392J84301
$$ 30913 -56693 -120460 -91331 209494 162029 -107392 -227231 -301076 -83297 -128689 55612
23871E5612J87574j15890L977k12729M9872J00313j64759K18062o4125j41219
$$ 55612 243186 127296 131273 -81456 -31584 68729 -96030 122032 57907 -83312
23861h3312m5085J47822Q7939M4642j96707J25219M6730n9490p452J17772M8391
$$ -83312 -128397 19425 107364 152006 -44701 80518 127248 67758 60306 178078 226469
23850B26469j60020j35074o552J37495l7067O7803K8778J41056k6827k13514m4376
$$ 226469 66449 -68625 -75177 62318 25251 93054 121832 262888 236061 22547 -21829
23839b1829j1108K6205q6466m2825J68031R6831R2995J5526l2059o5853j20376
$$ -21829 -32937 -6732 -93198 -136023 32008 128839 221834 237360 205301 139448 19072
23828A9072K9658n7025j75393M4619K02317p4953m6774J46993P4619p5435j48406
$$ 19072 48730 -8295 -183688 -139069 63248 -11705 -58479 88514 163133 87698 -60708
23817f0708k682m1143K62268J29719k0277j23608k78679J3472M56178M3382l8665
$$ -60708 -63390 -104533 157735 287454 267177 143569 -135110 -121638 334540 377922 339257
23806C39257k05876j43389M3428M7134j01626j32453n8645J85993O5245k8127
$$ 339257 133381 -10008 33420 80554 -21072 -153525 -212170 -26177 39068 10941
23796A0941J1566J17774J03722P5442r8310j31336J11453N0986J83667j49081
$$ 10941 22507 140281 244003 319445 221135 89799 201252 252238 435905 286824
23786B86824j26015N3119q8061N7675k67659J0137J52568j13270J04273Q55n6312
$$ 286824 160809 213928 125867 183542 -84117 -73980 78588 -34682 69591 70446 14134
23775A4134l842M6232P1585j53112q8625Q3964O4276L9663R0666j64843J60329
$$ 14134 10292 56524 128109 -25003 -113628 -29664 34612 74275 164941 98 160427
23764A60427j34617r2850K6916Q7012j18942J48693J13778J72821j55839j00670
$$ 160427 25810 -67040 -40124 46888 -72054 76639 190417 363238 207399 106729
23754A06729m8592m624J31707r0792r3679J95546J37040k07621l7028J0466k7908
$$ 106729 58137 53513 185220 94428 749 196295 333335 125714 88686 99152 71244
23743G1244k4149M34p5141j4596j27958R3719O6763R5097l0016M250o5961p1256
$$ 71244 47095 47529 -27612 -42208 -170166 -76447 -9684 85413 55397 59647 -6314 -77570
23731g7570k1378J01352J90527L2859J06307l8392k94470P0724P6861n1088n5216
$$ -77570 -98948 2404 192931 225790 332097 293705 -765 69959 146820 95732 40516
23720D0516J24137p252q3661j7673p7009P2579L2797n9339N9971N0570M5255K5701
$$ 40516 164653 157401 73740 56067 -20942 51637 84434 25095 85066 135636 180891 206592
$$ [...]
##END NTUPLES=NMR SPECTRUM
##END=
