##TITLE=19F_TG-2110-1
 CDCl3. 24 sc
 1.7.2019
##JCAMPDX= 6.0         $$ Bruker NMR JCAMP-DX V2.0
##DATA TYPE= NMR SPECTRUM
##DATA CLASS= NTUPLES
##ORIGIN= UXNMR, Bruker Analytische Messtechnik GmbH
##OWNER= root
$$ XWIN-NMR		Version 3.5
$$ Mon Jul  1 14:07:26 2019 Russian Standard Time (UT+4h)  she@DPX200
##.OBSERVE FREQUENCY= 188.290927
##.OBSERVE NUCLEUS= ^19F
##.ACQUISITION MODE= SIMULTANEOUS
##.ACQUISITION SCHEME= undefined
##.AVERAGES= 24
##.DIGITISER RES= 16
##SPECTROMETER/DATA SYSTEM= spect
##.PULSE SEQUENCE= zg
##.SOLVENT NAME= DMSO
##.SHIFT REFERENCE= (INTERNAL, DMSO, 0, 101.251)
##AUDIT TRAIL= $$ (NUMBER, WHEN, WHO, WHERE, WHAT)
$$ ##TITLE= Audit trail, XWIN-NMR		Version 3.5
$$ ##JCAMPDX= 5.01
$$ ##ORIGIN= Bruker BioSpin GmbH
$$ ##OWNER= she
$$ F:/spectra/data/she/nmr/f19/1/pdata/1/auditp.txt
$$ ##AUDIT TRAIL=  $$ (NUMBER, WHEN, WHO, WHERE, WHAT)
(   1,<2019-07-01 14:06:33.78 +0400>,<she>,<DPX200>,
      <created by zg, POWCHK disabled, PULCHK disabled
       configuration hash MD5:
       00 E9 B6 7A A2 85 ED C7 34 08 36 98 17 FE 4E 26
       data hash MD5: 64K
       AF 65 A6 B0 74 88 55 A6 40 65 2E 7D 70 6E C2 DB>)
(   2,<2019-07-01 14:06:36.20 +0400>,<she>,<DPX200>,
      <Start of raw data processing
       efp BC_mod = 2 LB = 1 FT_mod = 6 PKNL = 1 PHC0 = 1103.47 PHC1 = 38.35576 SI = 64K 
       data hash MD5: 64K
       1C 88 B1 E5 62 A9 5C 5E 8D 6F 0D 69 B6 F3 68 00>)
(   3,<2019-07-01 14:06:52.90 +0400>,<she>,<DPX200>,
      <pk PHC0 = -5.243214 PHC1 = 0 
       data hash MD5: 64K
       3B 1E A4 94 E6 5F A7 6B E2 AE 2E CE 8A 1F DE 62>)
(   4,<2019-07-01 14:06:56.06 +0400>,<she>,<DPX200>,
      <abs ABSG = 5 
       data hash MD5: 64K
       18 AB C0 13 2C 6F B8 66 2E 2B 5C EA 5B 33 B4 D8>)
$$ ##END=
$$ 
$$ hash MD5
$$ 66 11 BA 57 25 92 D0 D6 C9 94 69 30 D2 2A 75 3F
##$RELAX= 
##$RELAX= 
##$RELAX= 
##$RELAX= 
##$RELAX= 
##$RELAX= 
##$RELAX= 
##$RELAX= 
$$ Bruker specific parameters
$$ --------------------------
##$DU= <F:/spectra>
##$EXPNO= 1
##$NAME= <f19>
##$PROCNO= 1
##$TYPE= <nmr>
##$USER= <she>
##$AMP= (0..31)
100 100 100 100 100 100 100 100 100 100 100 100 100 100 100 100 100 100 
100 100 100 100 100 100 100 100 100 100 100 100 100 100 
##$AQSEQ= 0
##$AQ_mod= 1
##$AUNM= <au_zg>
##$AUTOPOS= <>
##$BF1= 188.310428
##$BF2= 200.13
##$BF3= 200.13
##$BF4= 200.13
##$BF5= 200.13
##$BF6= 200.13
##$BF7= 200.13
##$BF8= 200.13
##$BYTORDA= 1
##$CFDGTYP= 0
##$CFRGTYP= 5
##$CHEMSTR= <none>
##$CNST= (0..31)
1 1 145 1 1 1 1 1 1 1 1 1 1 1 1 1 1 1 1 1 1 1 1 1 1 1 1 1 1 1 1 1 
##$CPDPRG= <>
##$CPDPRG1= <>
##$CPDPRG2= <>
##$CPDPRG3= <>
##$CPDPRG4= <mlev>
##$CPDPRG5= <mlev>
##$CPDPRG6= <mlev>
##$CPDPRG7= <mlev>
##$CPDPRG8= <mlev>
##$CPDPRGB= <>
##$CPDPRGT= <>
##$D= (0..31)
0 1.3 0 0 0 0 0 0 0 0 0 0 0.25 0 0 0 0 0 0 0 0 0 0 0 0 0 0 0 0 0 0 0 
##$DATE= 1561975593
##$DBL= (0..7)
120 120 120 11 120 120 24 19 
##$DBP= (0..7)
150 150 150 150 150 150 150 150 
##$DBP07= 0
##$DBPNAM0= <>
##$DBPNAM1= <>
##$DBPNAM2= <>
##$DBPNAM3= <>
##$DBPNAM4= <>
$$ [...]
##$SUBNAM3= <"">
##$SUBNAM4= <"">
##$SUBNAM5= <"">
##$SUBNAM6= <"">
##$SUBNAM7= <"">
##$SUBNAM8= <"">
##$SUBNAM9= <"">
##$SW= 251.107818259711
##$SWIBOX= (0..15)
0 1 0 0 0 0 0 0 0 0 0 0 0 0 0 0 
##$SW_h= 47281.3238770686
##$TD= 65536
##$TD0= 1
##$TE= 0
##$TE2= 300
##$TE3= 300
##$TEG= 300
##$TL= (0..7)
0 120 53 12 22 120 120 120 
##$TP= (0..7)
150 150 150 150 150 150 150 150 
##$TP07= 0
##$TPNAME0= <>
##$TPNAME1= <>
##$TPNAME2= <>
##$TPNAME3= <>
##$TPNAME4= <>
##$TPNAME5= <>
##$TPNAME6= <>
##$TPNAME7= <>
##$TPOAL= (0..7)
0.5 0.5 0.5 0.5 0.5 0.5 0.5 0.5 
##$TPOFFS= (0..7)
0 0 0 0 0 0 0 0 
##$TUNHIN= 0
##$TUNHOUT= 0
##$TUNXOUT= 0
##$USERA1= <user>
##$USERA2= <user>
##$USERA3= <user>
##$USERA4= <user>
##$USERA5= <user>
##$V9= 5
##$VALIST= <valist>
##$VCLIST= <CCCCCCCCCCCCCCC>
##$VD= 0
##$VDLIST= <DDDDDDDDDDDDDDD>
##$VPLIST= <PPPPPPPPPPPPPPP>
##$VTLIST= <TTTTTTTTTTTTTTT>
##$WBST= 1024
##$WBSW= 4
##$XGAIN= (0..3)
0 0 0 0 
##$XL= 0
##$YL= 0
##$YMAX_a= 23586
##$YMIN_a= -42569
##$ZGOPTNS= <>
##$ZL1= 120
##$ZL2= 120
##$ZL3= 120
##$ZL4= 120
##$ABSF1= 101.2514
##$ABSF2= -149.8503
##$ABSG= 5
##$ABSL= 3
##$ALPHA= 0
##$AQORDER= 0
##$ASSFAC= 0
##$ASSFACI= 0
##$ASSFACX= 0
##$ASSWID= 0
##$AUNMP= <proc_1d>
##$AZFE= 0.1
##$AZFW= 5
##$BCFW= 0
##$BC_mod= 2
##$BYTORDP= 0
##$COROFFS= 0
##$CY= -3
##$DATMOD= 1
##$DC= 0
##$DFILT= <>
##$DTYPP= 0
##$F1P= 0
##$F2P= 0
##$FCOR= 0.5
##$FTSIZE= 65536
##$FT_mod= 6
##$GAMMA= 0
##$GB= 0
##$INTBC= 1
##$INTSCL= 8.653935e-10
##$ISEN= 128
##$LB= 1
##$LEV0= 0
##$LPBIN= 0
##$MAXI= 10000
##$MC2= 0
##$MEAN= 0
##$ME_mod= 0
##$MI= 0.4277144
##$NCOEF= 0
##$NC_proc= -4
##$NLEV= 6
##$NOISF1= -61.99997
##$NOISF2= -62.99997
##$NSP= 0
##$NTH_PI= 0
##$NZP= 0
##$OFFSET= 101.2514
##$PC= 1
##$PHC0= 1098.227
##$PHC1= 38.35576
##$PH_mod= 1
##$PKNL= yes
##$PPARMOD= 0
##$PSCAL= 0
##$PSIGN= 0
##$REVERSE= no
##$SF= 188.29550247311
##$SI= 65536
##$SIGF1= -61
##$SIGF2= -65
##$SINO= 3.502647
##$SIOLD= 65536
##$SREGLST= <1H.CDCl3>
##$SSB= 0
##$STSI= 65536
##$STSR= 0
##$SW_p= 47281.3238770685
##$SYMM= 0
##$S_DEV= 0
##$TDeff= 65536
##$TDoff= 0
##$TI= <>
##$TILT= no
##$TM1= 0
##$TM2= 0
##$TOPLEV= 0
##$USERP1= <user>
##$USERP2= <user>
##$USERP3= <user>
##$USERP4= <user>
##$USERP5= <user>
##$WDW= 1
##$XDIM= 65536
##$YMAX_p= 423259613
##$YMIN_p= -1235352
$$ End of Bruker specific parameters
$$ ---------------------------------
##NTUPLES= NMR SPECTRUM
##VAR_NAME=  FREQUENCY,     SPECTRUM/REAL,   SPECTRUM/IMAG
##SYMBOL=    X,             R,               I
##VAR_TYPE=  INDEPENDENT,   DEPENDENT,       DEPENDENT
##VAR_FORM=  AFFN,          ASDF,            ASDF
##VAR_DIM=   65536,         65536,           65536
##UNITS=     HZ,            ARBITRARY UNITS, ARBITRARY UNITS
##FACTOR=    0.721466756344984, 1,           1
##FIRST=     19065.1839562469, 0,            0
##LAST=      -28216.1399208216, 0,           0
##MIN=       -28216.1399208216, -1235352,    0
##MAX=       19065.1839562469, 423259613,    0
$$ Real data points
##PAGE= N=1
##DATA TABLE= (X++(R..R)), XYDATA
$$ [...]
29926C2703p398m06843J6876L5930k23112q8833j00165J93904L84628J74274Q3906
29915I5870j08376k21689r2591j90068J79449r651J24571l0774k39453J35684
29905c57028J72001l8292J9712J5527K9161n2905j60243J12524K37775l3745j48061
29894b03574m24880R1760J8940R3702K22026j18304L4136J25899j66448k39119
29884e65862L48853J25505j59268P2221N79150q3163k85163l18798l40881k00979
29874h28385k81715K23650L66752n9117k16890O7758J2943J99365L54110K6790
29864a34739l49835J57387J85856k82801k61548j1574J90053M7774J06881L9352
29854c13194r5278O5494J61841L5300K1185K72133k93296J35899l06839k06609
$$ plain form
29926 32703 25305 -381538 -364662 -328732 -551844 -640677 -740842 -546938 -162310 11964 95870
29915 95870 -12506 -234195 -326786 -516854 -337405 -347056 -222485 -253259 -492712 -357028
29905 -357028 -185027 -223319 -203607 -188080 -158919 -211824 -372067 -259543 -21768 -55513 -203574
29894 -203574 -628454 -536694 -517754 -424052 -202026 -320330 -286194 -160295 -326743 -565862
29884 -565862 -217009 -91504 -250772 -178551 400599 317436 32273 -286525 -627406 -828385
29874 -828385 -1110100 -886450 -519698 -578815 -795705 -727947 -715004 -515639 -161529 -134739
29864 -134739 -484574 -327187 -141331 -424132 -685680 -697254 -507201 -459427 -352546 -313194
29854 -313194 -408472 -342978 -181137 -145837 -124652 147481 -145815 -9916 -316755 -523364
29844e23364L80386K93378j24891j92927R8488k3206j09402l10283J75731J23337
29834b12753L64852m09351N0154M44306l8907l12749k31542L12738m4127k4463
29824a01842J44489J67269k42862K4496K14392n8255r2306M3308k28147j09949
29814b39407j25209k56186k55773J85328M93683J1987r3552K55953N52712j86808
29804C42728j85148k40055j54503j78196M4159j86574K93239L13401J5226j36764
29794g2487k94513l08569K06201K67750l33162j63769K40202K65105l06979j74613
29784f74834K96958k48907J8392j38716n4275L67699n6489l5487J09145K71065
29774a45449K41675l82793m85611j0073P9377N4324K28574J73712k36792m3915
$$ plain form
29844 -523364 -142978 150400 25509 -167418 -68930 -92136 -201538 -511821 -336090 -212753
29834 -212753 152099 -257252 -207098 237208 198301 -114448 -345990 -33252 -77379 -101842
29824 -101842 42647 209916 -32946 -8450 205942 147687 55381 98689 -129458 -239407
29814 -239407 -364616 -620802 -876575 -691247 -197564 -185577 -279129 -23176 529536 342728
29804 342728 157580 -82475 -236978 -415174 -371015 -557589 -264350 49051 64277 -72487
29794 -72487 -367000 -675569 -469368 -201618 -534780 -698549 -458347 -193242 -500221 -674834
29784 -674834 -377876 -626783 -608391 -747107 -801382 -433683 -490172 -525659 -416514 -145449
29774 -145449 96226 -286567 -772178 -782251 -702874 -648550 -419976 -246264 -483056 -526971
29764e26971J90666p3091R2983m3640L76168L75965k56031j13566k16089k61986
29754d55592J07196j1025K68913r6186r4052K94717l49512l40372j1626K3897
29744f63642k5162L29997K30863j16434P5695P0244R7222j27938J42963O7653
29734H1461M4657m80128j18990j28592j35119L6760K14072K63936J14343L04257
29724A96657j60897n16383J2042J2265J34078j12881o4032K11279j14944K7564
29714c75252J66083k24155r9369K37329R7701j68505j90492j11206K47132K31454
29704a89280J5331j39260l03773k24542K90825J94167L20476j681j91046J65712
29694f3071l4105K40579m21391m6973J60301L8116p382l7609K03921l5549O4612
$$ plain form
29764 -526971 -336305 -409396 -316413 -360053 16115 392080 136049 22483 -193606 -455592
29754 -455592 -348396 -359421 -90508 -186694 -280746 13971 -335541 -675913 -687539 -663642
29744 -663642 -688804 -358807 -127944 -244378 -168683 -98439 -1217 -129155 13808 81461
29734 81461 126118 -354010 -473000 -601592 -736711 -699951 -485879 -221943 -107600 196657
29724 196657 35760 -480623 -468581 -456316 -322238 -435119 -499151 -287872 -402816 -375252
29714 -375252 -209169 -433324 -532693 -295364 -197663 -366168 -556660 -667866 -420734 -189280
29704 -189280 -173949 -313209 -616982 -841524 -550699 -356532 -36056 -37737 -228783 -63071
29694 -63071 -97176 143403 -277988 -324961 -164660 -126544 -133926 -171535 32386 -3163 61449
29683F1449l6744k09262j16187L17495K38346m48639j26553J70097J39032K0439
29673I473j57330k05314j70260K70909j26435j31319R4455k96453K12754K51824
29663b47696j06790k75639M73443K10499M86201k29823n55638J02061n0686k11179
29653d05247M58220L32824p2066j61931j30110r0898r8749r1246J57328J78032
29643G6157M7913k72572j72767J31475N7134J88493J47679l1427k45424J07745
29633C4406m63479N04396J31585J49465j27101m92166K86055K91514k18323j05796
29623i444M8099J96906J06245k66311o4906j88346j60344J43286n4290k34565
29613d83670Q5876K32455l4573J22669l66166j72491L04575K92785L3495k1772
$$ plain form
29683 61449 24705 -184557 -300744 16751 255097 -193542 -320095 -149998 -10966 9473
29673 9473 -147857 -353171 -523431 -252522 -378957 -510276 -415821 -712274 -499520 -247696
29663 -247696 -354486 -630125 -156682 53817 540018 310195 -245443 -143382 -194068 -405247
29653 -405247 52973 385797 313731 151800 21690 -69208 -167957 -259203 -101875 76157
29643 76157 124070 -148502 -321269 -189794 -132660 55833 203512 172085 -73339 34406
29633 34406 -429073 75323 206908 356373 229272 -262894 23161 314675 96352 -9444
29623 -9444 38655 235561 341806 75495 10589 -177757 -338101 -194815 -249105 -483670
29613 -483670 -397794 -165339 -199912 -77243 -443409 -615900 -311325 -18540 14955 -6817
29603f817j0249j00616m33492J1271J72734j77278L59576K51624j82391o9997
29593a85635j69245J18550j00508L44151J00062k36642K92687J23977j06495n02968
29583c22066k50239l9490L18361K39470K13254n2939n1498J66468k69515j8068
29573f6262Q4052k22047k36840M67706J90766l60056r4011J57311P0845J8265
29563I729P1234j96778o8322M65407J06208P4408k35556J80475L4785j75924l63777
29552i8111r7542k3570m7872k64867J4634n7526q6566k2573J58121L64261Q0480
29541h1131J7118o5037K968R0558N1335k53729m22349K68775M12759l47044j87257
29530e13034J6136J44582J49070m4408m59788M0987r7065L33880N02499p3037
$$ plain form
29603 -6817 -17066 -117682 -551174 -539903 -367169 -544447 -184871 66753 -115638 -185635
29593 -185635 -354880 -236330 -336838 7313 107375 -129267 163420 287397 180902 -322066
29583 -322066 -572305 -611795 -293434 -53964 159290 106351 54853 221321 -48194 -66262
29573 -66262 17790 -204257 -441097 26609 217375 -142681 -236692 -79381 -8536 9729
29563 9729 80963 -115815 -184137 281270 387478 461886 226330 406805 441590 265666 -98111
29552 -98111 -195653 -219223 -267095 -531962 -517328 -574854 -661420 -683993 -525872 -161611 -81131
29541 -81131 -64013 -129050 -126082 -35524 15811 -237918 -660267 -391492 21267 -325777 -513034
29530 -513034 -496898 -352316 -203246 -247654 -707442 -666455 -763520 -429640 72859 -178
29520a78J22888n1687k95728N5007L0570L19454r9397j33185Q1562j58912j77225
29509c06831j25041r9709j02492M12761J03099k94981P0348R8054n6127k7742
29499c28661Q6515k3410J90055k10920k10429J5838K12287J10118J97645j14941
29489g5903m49675k61395k59998N86658M45025N120L882M6413L59670m30408J64001
29478A33390O2429j14530n2555J1236r8890j61546l66115k67140L49215O68192
29468A63686o8509j61939j19446j71970m5250K50883j55222j40548K16401M1445
29458a90469J04007j9351k48184M7417J21832L59826j5226M4748m48479J8030
29448b25849J57465k31916P8701j52000l14224K5262j25300M39869K50430m2359
$$ plain form
29520 -178 122710 71023 -224705 -169698 -139128 180326 80929 -52256 29306 -129606 -306831
29509 -306831 -431872 -531581 -634073 -221312 -118213 -413194 -342846 -244792 -300919 -328661
29499 -328661 -242146 -265556 -75501 -286421 -496850 -481012 -268725 -158607 39038 -75903
29489 -75903 -525578 -786973 -1046971 -460313 -15288 -10168 -6286 40127 399797 -30611 133390
29478 133390 195819 81289 28734 39970 -58920 -220466 -586581 -853721 -504506 163686
29468 163686 95177 -66762 -186208 -358178 -403428 -152545 -307767 -448315 -231914 -190469
29458 -190469 -86462 -105813 -353997 -306580 -184748 175078 159852 204600 -243879 -225849
29448 -225849 -68384 -300300 -221599 -373599 -687823 -662561 -787861 -347992 -97562 -139921
29438a39921R3741l37291r5676K54691p577J17045M5528k27796L3963J8385m400
29427b49308J59197m3627l3079J42899O0123Q6712j72121J36265j77925J78379
29417H7515J5044l98749O6113o9959J66277J04222j85229J0882j16559K66329
29407e4114j39648k69332J094R6979J41158J60805M8866M4109l42993o8996K84804
29396i7268j94027L5289J17897K34508L05298l27359n78888j42300j60260O2530
29386g44580M53350m1017J54602J41784j06661l98160j10295M80199J82018j02117
29376i0877K14615l3094k85911l48820q1735L92268q4909J63171J58377M5794
29366D8879j83404K96970j00706j90828J15432o2324k97239m3408M57864L50311
$$ plain form
29438 -139921 -46180 -383471 -479147 -224456 -232033 -114988 -69460 -297256 -263293 -244908 -249308
29427 -249308 -90111 -133738 -166817 -23918 36205 122917 -49204 87061 -90864 87515
29417 87515 102559 -296190 -230077 -300036 -133759 -29537 -214766 -203884 -320443 -54114
29407 -54114 -193762 -463094 -462000 -365021 -223863 -63058 -14192 29917 -313076 -382072 -97268
29396 -97268 -291295 -256006 -138109 96399 401697 74338 -504550 -646850 -807110 -744580
29386 -744580 -291230 -332247 -177645 -35861 -142522 -540682 -650977 -170778 11240 -90877
29376 -90877 123738 90644 -195267 -544087 -625822 -233554 -318463 -155292 3085 48879
29366 48879 -134525 162445 61739 -129089 -13657 -75981 -373220 -416628 41236 391547
29356C91547L2579n48314k67878Q8832J38141J2945r8506j84180j61560L22804
29346b73590L23806k4210N8016k24036k8449K06999J7577r5059J61675k55134
29336a32405k22626J57596n3213K23228j02358J69207r1905P3742O1851p7006
29326F111j3514L29180l0816l68746k25715K1415J58428j54343r6379K41640M04968
29315B72229p0171n7502R9091k00876l04534k73304M39556p2562k41908O7942
29305c42039K88265K76331k0938k49629j78717Q0572J05029j16332k5124M85036
29295C02454p0507k46387J3978k89884J386K28793J18456J40929J78598n7239
29285C20577J6274l0755L37441J40284k1379j73700K3920k18976l39407M6787
$$ plain form
29356 391547 424126 -124188 -392066 -303234 -165093 -152148 -250654 -434834 -596394 -273590
29346 -273590 50216 26006 84022 -140014 -168463 38536 56113 -38946 122729 -132405
29336 -132405 -355031 -197435 -250648 -27420 -129778 39429 -52476 21266 83117 6111
29326 6111 -7403 321777 290961 -77785 -303500 -282085 -123657 -278000 -374379 -132739 272229
29315 272229 202058 144556 243647 42771 -261763 -535067 -95511 -168073 -409981 -342039
29305 -342039 -53774 222557 201619 -48010 -226727 -146155 -41126 -157458 -182582 302454
29295 302454 231947 -14440 -462 -290346 -288960 -60167 58289 199218 377816 320577
29285 320577 336851 306096 643537 783821 762442 588742 612662 393686 54279 101066
29275A01066n6391j49930J35180N09822K77754q1853J09092j36581P5985J0057
29265G94201l72695Q5676m59k71041K71703k2526j83551N05208k14393J35134
29255G27257m24612k26980J85870L0372q9455j55626j93187k66896L09319M5309
29245e8629l69880N0988J01633j68898Q0376P135J70981N22995J80859m22302
29235I5258r5068j98922Q4860K22167J00392n8200J9098n6343n8539p521k05902
29224a58720K3817r2792P8051m2898M65720J11559m07134l59861K36588j79122
29214c24792j61562m149L42110K45305m41493J80862K81697r9073j50707l1403
29204a63205K02254j73202K14961L28066Q1297k31517j60823R1592k00324p64191
$$ plain form
29275 101066 44675 -105255 29925 539747 817501 735648 844740 708159 784144 794201
29265 794201 421506 507182 506723 235682 507385 484859 301308 806516 592123 727257
29255 727257 302645 75665 261535 291907 202452 46826 -146361 -413257 -103938 -58629
29245 -58629 -428509 -377521 -275888 -444786 -364410 -357275 -186294 336701 517560 95258
29235 95258 190 -198732 -113872 108295 208687 150487 169585 113242 54703 47182 -158720
29224 -158720 -134903 -227695 -149644 -192542 273178 384737 -22397 -382258 -145670 -324792
29214 -324792 -486354 -490503 -148393 96912 -344581 -163719 117978 18905 -131802 -163205
29204 -163205 39049 -134153 80808 408874 490171 258654 97831 189423 -10901 -775092
29194g75092J91398L36676K19183l08215o5131J65046p502Q4916j10012N8267
29184b10466M9261K87518O4531j11115k61827l5655J75704K45854J06586k72798
29174C7593P8635l3087k89622l4247J65969l1695m11047O0701J58158Q2893K43476
29163B7727L878K60649o18718j05483k42297J46366L59005j7638l95338K61292
29153c20557O369K21378J33878j85760k58723K13656k48593o3522j81577J37195
29143e46256M19528J01846K3104K4067r8820j46393j05493R3878k1226Q4271Q6913
29132h4581k81392j47546K70518k69590m44555q252L01725K00727n7027p8188
29122e98161L16081Q9631K05880q0131l5739J78120k09722n04982K2824J09013
$$ plain form
29194 -775092 -583694 -247018 -27835 -336050 -401181 -236135 -243637 -158721 -268733 -210466
29184 -210466 -161205 126313 190844 79729 -182098 -217753 -42049 203805 310391 37593
29174 37593 116228 83141 -206481 -240728 -74759 -106454 -517501 -456800 -298642 -215749 27727
29163 27727 31605 292254 -326464 -431947 -674244 -527878 -168873 -186511 -581849 -320557
29153 -320557 -314188 -92810 41068 -144692 -403415 -189759 -438352 -501874 -683451 -546256
29143 -546256 -126728 -24882 -1778 22289 -76531 -222924 -328417 -234539 -255765 -171494 -84581
29132 -84581 -365973 -513519 -243001 -512591 -957146 -965398 -663673 -462946 -519973 -598161
29122 -598161 -282080 -192449 13431 -66700 -102439 75681 -134041 -639023 -616199 -507186
29112e07186j12914J11923L27296N15858J07470j21470l97840J12964k1643N8397
29102G2855o1210l6480J51101l4739m2398k26339k5681J35945L85517l44512k38992
29091b64933k64098m7867n1421L55222K56710K81170K81214m02901m7348r8603
29081b855j85257J25863Q2082k25275j18146K41397p4209m702m7443j88236K23391
29070a73390j72926l1561J56901Q3036j3738o9278J70332K13080K04291M24609
29060G91356K7483n46091r3415m0325k63305k8211k0979L38695K8203j3373J22956
29049C02994o201k47404R9527J49963j88852j37043l59202O7135q816L82186J52036
29038B06323P6550K1959l92672k67700k36477l70806M02230O33210o4762k50641
$$ plain form
29112 -507186 -620100 -508177 -180881 334977 442447 320977 -76863 36101 14458 72855
29102 72855 11645 -24835 126266 91527 49129 -177210 -202891 -66946 318571 -25941 -264933
29091 -264933 -529031 -576898 -628319 -273097 -16387 264783 545997 143096 95748 -2855
29081 -2855 -188112 -62249 19833 -205442 -323588 -82191 -156400 -161102 -208545 -396781 -173390
29070 -173390 -346316 -377877 -220976 -137940 -151678 -220956 -50624 162456 366747 791356
29060 791356 818839 272748 179333 139008 -124297 -152508 -173487 165208 193411 180038 302994
29049 302994 296793 49389 148916 298879 110027 -27016 -386218 -319083 -327899 54287 206323
29038 206323 282873 304832 -87840 -355540 -592017 -962823 -560593 72617 7855 -242786
29028b42786J78491q8227J0680L49699j36352p8484J07597j41210r2188j80519
29018c13299L03674K14289j79447m50409m7868p9000m42193K77428j72501K38496
29008f50830Q5512K33304L24375m2844p4534m5624j39779n785J44910k02959K2993
28997c51261m6404J88453l105K47883J58651m4415J55140l25671L2072q0710k66045
28986c35412N590p8019K33747j00998j26027n4452q3487M06113j44551p5357J77136
28975a75717L5929j89980O7718K51633k71460k92306j59591K11517J60921k8963
28965c90299J80911K58724J81098m78776l35452r1642J73113J56046k27887K45176
28955c28988M87096l7468m14422J3038L03755l0197j21105n8393L54775j36822
$$ plain form
29028 -242786 -64295 -152522 -141842 207857 71505 -6979 100618 -40592 -132780 -313299
29018 -313299 -9625 204664 25217 -425192 -473060 -552060 -994253 -716825 -889326 -650830
29008 -650830 -565318 -332014 -7639 -50483 -125017 -170641 -310420 -316205 -171295 -374254 -351261
28997 -351261 -397665 -209212 -212317 35566 194217 149802 304942 -20729 11343 -69367 -335412
28986 -335412 -329822 -407841 -174094 -275092 -401119 -455571 -539058 -132945 -277496 -352853 -175717
28975 -175717 -139788 -329768 -262050 -10417 -281877 -574183 -733774 -522257 -361336 -390299
28965 -390299 -209388 49336 230434 -248342 -583794 -675436 -502323 -346277 -574164 -328988
28955 -328988 158108 120640 -293782 -280744 23011 -7186 -128291 -186684 168091 31269
28945C1269J83534P7941l53032K6788j33995M9145J44528L69615j243l02098j34569
28934d2117P9585o4609K8690j8419m12781j15492K47803K62249M12671J049m77488
28923i8859K2646p0005k55239k99667J60480K73147l13455Q5830L30242p2865
28913b37745l06019J82238j24399l43751M7445O22392J32200J96353k88534K08291
28903H8471l89211m26377J14896J63527L33467l24328K88057k47339m00199J85433
28893f13603L30461K6685K10285P9865j10940j6786k52276K39133j946M7092J92661
28882A30631n80948j59236L24652j60990m87228J96877M90063j27229m6812J53840
28872b66380l21000k67508J11430J89530q5747j80894L67326L38673j7490m23850
$$ plain form
28945 31269 214803 292744 -60288 -33500 -167495 -118350 26178 395793 394550 92452 -42117
28934 -42117 37468 -27141 1549 -16870 -429651 -545143 -297340 -35091 377580 378629 -98859
28923 -98859 -76213 -146218 -401457 -701124 -540644 -267497 -580952 -495122 -164880 -237745
28913 -237745 -543764 -361526 -485925 -829676 -782231 -159839 -27639 168714 -119820 88471
28903 88471 -300740 -727117 -612221 -448694 -115227 -439555 -151498 -398837 -799036 -613603
28893 -613603 -283142 -256457 -46172 33693 -77247 -94033 -346309 -107176 -109122 -62030 130631
28882 130631 -450317 -609553 -284901 -445891 -933119 -736242 -246179 -373408 -420220 -266380
28872 -266380 -587380 -854888 -743458 -553928 -639675 -820569 -453243 -114570 -132060 -555910
28862e55910m8865k55339K78706N23322r8591j36110K09353J85776l41941l3037
28852b72636j535q9368m5540J73757K29769p359j92350j80411K8443K4253K29448
28841a03529O1944J87760K64501K80152m25249m27888r5641J37810k32805J72119
28831a80826j51600j32634J66958j77817j36263n6252J98230O9767k6583j57780
28821e84800J06712J42956L66207l18333n2965J51267K8407j0454L08161j46949
28811i791j72840j98358J6724L84017J91138j54269m03362k0306J26433J83016
28801e7598j61828j41135J75180K5660l24976j14519J53617K4577L49912O8466
28791b644m04342n11387L61494K60124n6212L54310N2575k4756m89280j03879
$$ plain form
28862 -555910 -604775 -860114 -581408 -58086 -156677 -292787 -83434 102342 -239599 -272636
28852 -272636 -274171 -363539 -409079 -235322 -5553 -12912 -205262 -385673 -357230 -332977 -103529
28841 -103529 -41585 146175 410676 690828 265579 -162309 -257950 -120140 -352945 -180826
28831 -180826 -332426 -465060 -298102 -475919 -612182 -668434 -470204 -400437 -427020 -584800
28821 -584800 -478088 -335132 31075 -287258 -340223 -188956 -160549 -171003 137158 -9791
28811 -9791 -182631 -380989 -364265 19752 210890 56621 -346741 -367047 -240614 -57598
28801 -57598 -219426 -360561 -185381 -159721 -484697 -599216 -445599 -421022 -71110 -2644
28791 -2644 -406986 -918373 -556879 -296755 -352967 1343 53918 29162 -460118 -563997
28781e63997p3138K14504J76488N5740J32804K3116k43608J79002m6928l14331
28771d60348m3701k37796R723M96024J11896j28902K71887L78372Q4225p6780
28761D04600n4586j99237J12951j12795q8162j60370J67402J15493p0866l89198
28751b74768K94879N3299n8203K74339q3506j70052Q0774k97044k18922j85964
28741e85168K14104M5346j28286n3192J86545L25225K15157k91510k15838J57795
28731a29822K27858M6125l07549k17297p3947k79590L10532j0314J80845J53000
28721a00159k34117M0870M61932j46703j81948j84259O1493J93918j2232k60928
28711c62133K6045K31132O3516r5639l69738j66289N3375l22370L19659N0316
$$ plain form
28781 -563997 -637135 -422631 -246143 -190403 -57599 -34483 -278091 -99089 -146017 -460348
28771 -460348 -504049 -741845 -732122 -236098 -124202 -253104 18783 397155 481380 404600
28761 404600 350014 150777 263728 150933 62771 -97599 69803 185296 114430 -274768
28751 -274768 20111 73410 15207 289546 206040 35988 116762 -180282 -399204 -585168
28741 -585168 -371064 -325718 -454004 -507196 -320651 4574 219731 -71779 -287617 -129822
28731 -129822 98036 144161 -163388 -380685 -454632 -734222 -423690 -434004 -253159 -100159
28721 -100159 -334276 -293406 168526 21823 -160125 -344384 -282891 -88973 -101205 -362133
28711 -362133 -336088 -104956 -41440 -137079 -506817 -673106 -619731 -942101 -622442 -572126
28701e72126l15374J28110L86633N14507j59903k6951J83478k98233j26400L9217
28691b47042J24611j04341l28118M2224K42987J16026J45726N0358M4232j91220
28681a04557m13386J78485M04973k91911J14104O7873j96995P6613o3886k54061
28671d82748K80036j19017p08086J25418K75140L84073j04969k41115J75736J47757
28661b67775L1605J0501M51978m99747l88724N68172K01265Q2569P6954Q7241
28651C54039k68682L5874k4633j12419j4916k43188J40658l9581j21777O73915
28641C79290j43727l20394l7330j97967O1121m2395j23801O6394J67346L25839
28631A34376R1371k9470N7422l70711l94204K19003N0692J50506L59267n19881
$$ plain form
28701 -572126 -887500 -759390 -372757 141750 -18153 -45104 138374 -159859 -286259 -247042
28691 -247042 -122431 -226772 -554890 -512666 -269679 -153653 -7927 42431 86663 -104557
28681 -104557 -517943 -339458 65515 -226396 -112292 -44419 -241414 -164801 -228687 -482748
28671 -482748 -202712 -321729 -1029815 -904397 -629257 -245184 -350153 -591268 -415532 -267775
28661 -267775 -236170 -225669 226309 -273438 -662162 -93990 107275 189844 266798 354039
28651 354039 85357 121231 96598 -15821 -30737 -273925 -133267 -172848 -294625 379290
28641 379290 235563 -84831 -122161 -320128 -259007 -301402 -425203 -358809 -191463 134376
28631 134376 225747 196277 253699 -117012 -511216 -292213 -241521 -91015 268252 -251629
28621b51629N5988L76095k63725j87144L04369q9425k3665Q6853l73933M77447
28611A11231n3262k7414o497L8629m4697k16124J8486J02958J00957L2350j23794
28600f7177k69743j95650Q7630P5391M00785j61992k4578p3250Q4955K0211P8135
28589d5283k38627l49037K51854K5167J74315J32423O6263Q096Q0124r0964j2295
28578B036j03541j14835o3241J89511J15544k20946l74859k55462o4717J06687
28568g83823J04681M39465K46360k29242j09537P1332o9113M20057J1301k08305
28558a06824k22824l42552j2499L36912K32674j11055Q1294j83773q2686j53764
28548e65097Q0798J84813J29836J76291j29833r4919K01807k20276k00209J2271
$$ plain form
28621 -251629 -195641 180454 -83271 -270415 33954 -55471 -79136 7717 -366216 111231
28611 111231 57969 30555 24058 62687 17990 -198134 -179648 -76690 24267 56617 -67177
28600 -67177 -336920 -532570 -444940 -369549 31236 -130756 -155334 -228584 -143629 -123418 -45283
28589 -45283 -283910 -632947 -381093 -355926 -181611 -49188 17075 25171 105295 14331 2036
28578 2036 -101505 -216340 -279581 -90070 25474 -195472 -570331 -825793 -890510 -783823
28568 -783823 -679142 -239677 6683 -222559 -332096 -260764 -329877 90180 101481 -106824
28558 -106824 -329648 -672200 -684699 -347787 -115113 -226168 -144874 -328647 -411333 -565097
28548 -565097 -484299 -299486 -169650 6641 -123192 -218111 -16304 -236580 -436789 -424518
28538d24518J6837j22125K14880L73551J9647q6833q5085m0550O2259R7006R8039
28527A23108P7325j79051J44103n04443l4236J06206R582n8460J72818l04254
28517d47302m7358N61824j03697k20182J16963k08670P7627J85200l12664m9921
28507d48180J75619J39041J84750j02169l64976L57259R6234k94960r9497j62387
28497e19266K11221k41330K4380K28693l7486l87275j62747K06370J32275K36120
28487c09045Q1834M07353J39732l99736k13972M20608j77960O049k19603j57539
28477d22279j09891m30886L07810J42382J50404J5481j53468k42440K87985L00460
28467a54442r2847J39429M8473l00541O5962J35416K9790O643k9326K25510J30943
$$ plain form
28538 -424518 -407681 -529806 -314926 58625 78272 -8561 -93646 -134196 -71937 25069 123108
28527 123108 200433 21382 165485 -338958 -373194 -266988 -257406 -315866 -143048 -447302
28517 -447302 -494660 67164 -36533 -256715 -139752 -348422 -270795 -85595 -398259 -448180
28507 -448180 -272561 -133520 51230 -50939 -415915 -58656 37578 -257382 -356879 -519266
28497 -519266 -308045 -549375 -524995 -296302 -333788 -721063 -883810 -677440 -545165 -309045
28487 -309045 -227211 180142 319874 -79862 -293834 126774 -51186 -45137 -264740 -422279
28477 -422279 -532170 -963056 -655246 -512864 -362460 -346979 -500447 -742887 -454902 -154442
28467 -154442 -247289 -107860 -59387 -359928 -293966 -158550 -128760 -122117 -151443 74067 205010
28456B05010m25158j05084j28699j51093O0327P4849J24718m0369K32320J38552
28446a4627J7687R0456k34058j07334j83964k14658k79282M03743P01098q0930
28436I8131K1447J03808J04474K1731m73935j41332L5540k31338j48674Q1579
28426e28569J58190K55292j12932J92693q1508K8186M4737j77059j56331R0027
28416b87274M09674L84675o25993p4605J23944J42899n28484j342J64531k4794
28406c16769Q5312l8856k30544K86701O51732k93840n95621J15926K40745k09358
28396c04572q6520j13616O3942l32261J02596J69155m0106J16799J87436P8668
28386a58479J33597J69630K5726k21591m78342J04481Q7632j83489k02077M40027
$$ plain form
28456 205010 -220148 -325232 -453931 -605024 -544697 -469848 -345130 -385499 -153179 -14627
28446 -14627 3060 93516 -140542 -247876 -431840 -646498 -925780 -522037 179061 98131
28436 98131 119578 223386 327860 349591 -124344 -265676 -230136 -461474 -610148 -528569
28426 -528569 -370379 -115087 -228019 -35326 -116834 -88648 -43911 -220970 -377301 -287274
28416 -287274 122400 507075 -118918 -193523 -69579 73320 -455164 -456506 -291975 -316769
28406 -316769 -231457 -270313 -500857 -214156 437576 143736 -451885 -335959 -95214 -304572
28396 -304572 -391092 -504708 -440766 -773027 -670431 -501276 -541382 -424583 -237147 -158479
28386 -158479 -24882 144748 170474 -51117 -529459 -424978 -337346 -520835 -722912 -282885
28376b82885L27570k02651M12381k28951j20040J31413P0059j26520L0786k37160
28366b25998J63819j06038J11760j0312o5049r0231m0054J6568L45379J16625
28356B16469k06294q975k68965q6137j43449p9177M39227M14021k17577J24802
28346A83945m02670l80155L02837N7199l09009K31496J74738J15511n6038k80844
28336c62990O8940M45801k665O6330j2222p7428k34457k20515j6393l39269P08278
28325B3410M7450J09560j84009k47935j82719k90519J76610K81869L18921j67342
28315a14704J15449J12465J41J70156J198N4344k52425p6618l28523R4939K02775
28304b0803j28073j11859J04093J54154k21045J92631K03928j22624o1077p8849
$$ plain form
28376 -282885 44685 -157966 254415 25464 -94576 36837 106896 -19624 11162 -225998
28366 -225998 -62179 -168217 -56457 -66769 -131818 -222049 -262103 -245535 99844 216469
28356 216469 10175 1200 -267765 -353902 -497351 -576528 -137301 276720 59143 183945
28346 183945 -218725 -598880 -296043 -238844 -547853 -316357 -141619 -26108 -82146 -362990
28336 -362990 -294050 151751 149086 215416 203194 125766 -108691 -329206 -345599 -684868 23410
28325 23410 70860 180420 -3589 -251524 -434243 -724762 -548152 -266283 52638 -114704
28315 -114704 745 113210 113351 283507 284705 339049 86624 10006 -318517 -223578 -20803
28304 -20803 -148876 -260735 -156642 -2488 -223533 -30902 173026 50402 -10675 -89524
28294h9524p2940O8451l66287J02115K13070J29281k73933j19898k57900j1448
28284f79013M75694N30476l29805m3584q7609J6962j36624l44844n5189J90508
28274d63028K56013J05198J95299j52067m38080m49068J21829J40834J41435L6912
28264e04723K34374N9056j24899j01901m9978L4646j35311j4191J27874N61260
28254H6207J25993K4342k06077k00571J07690M2216K86330l43879j4254J27057
28244C5054k20387K47512J97354j61250l21527k56214L02275K17299J43611q4408
28234I9319k07526n6829J47833j32434K8784L7384L4606j71385j99488L27160
28224i2576L3365m1827n9687j459K85138m6004J78075N323l98215j24505K67512
$$ plain form
28294 -89524 -162464 -94013 -460300 -358185 -145115 -15834 -289767 -409665 -667565 -679013
28284 -679013 -203319 327157 -2648 -46232 -133841 -116879 -253503 -598347 -653536 -463028
28274 -463028 -207015 -101817 93482 -58585 -496665 -945733 -823904 -683070 -541635 -504723
28264 -504723 -270349 -211293 -336192 -438093 -488071 -453425 -588736 -602927 -475053 86207
28254 86207 212200 236542 30465 -170106 -62416 -20200 266130 -77749 -92003 35054
28244 35054 -185333 62179 259533 98283 -223244 -479458 -177183 40116 183727 99319
28234 99319 -108207 -165036 -17203 -149637 -120853 -83469 -48863 -220248 -419736 -92576
28224 -92576 -59211 -101038 -160725 -162184 122954 76950 255025 260348 -137867 -262372 5140
28213E140K7559j9106k18730l9378k125L11652m6582j35040r4536m44899l1445
28202f87490K71886J80535J70569j50513r1004j06601m5360j44469J98419J28351
28192b75677j22633n6500k51137K30260L81590l8788l85739N4933K86131K81390
28182A03830J16276K74480p6760L235m28505L25002L7681l25925L3683K34132
28172B97129j49916j66377J80210j55993m371K79579R2604K00454q1061j22137
28162C70121k63787K5516m32467k96348L41396M5349k94586J49915N13383J60060
28152C18552j54731m95099K83391q7914O7740l0283j87263L48982j03471m44894
28142d84990K58162j03103j36579q3903l9691m3653K05951k75684L37016K09325
$$ plain form
28213 5140 32699 13593 -205137 -244515 -246640 65012 18430 -116610 -211146 -656045 -687490
28202 -687490 -415604 -235069 -64500 -215013 -306017 -412618 -457978 -602447 -404028 -275677
28192 -275677 -398310 -454810 -705947 -475687 -94097 -132885 -518624 -463691 -177560 103830
28182 103830 220106 494586 417826 421061 -7444 317558 355239 29314 62997 297129
28172 297129 147213 -19164 161046 5053 682 280261 372865 573319 492258 370121
28162 370121 106334 131850 -300617 -596965 -255569 -210220 -504806 -354891 158492 318552
28152 318552 163821 -331278 -47887 -135801 -68061 -98344 -285607 63375 -40096 -484990
28142 -484990 -226828 -329931 -466510 -550413 -590104 -633757 -427806 -703490 -366474 -157149
28132a57149p5679j45934P1321o1589j14409k1751m1114L7495Q8149M73682p5195
28121b2173J78998k09297k18498j59824j06010K47590L97304K62759o5886m62549
28111a57586l89455J01804M06177J58601k45663j43384J61446j58856m66205K96995
28101d36126P9092R6994M10820O8466k02033k4255j32131R282K78323l98868o1431
28090c11867r2837L66457J39932k30216J06893q6141M5966j42197J69485J27948
28080I3423J52206k24017k30849K89723J1187o8571n190j72181p3869l7225k11738
28069d77101J68080K51498j56648k81879q2404L54072L7217J27396j86515J03727
28059a42557L33683K15235m68409r2539P0502l48974M7287q2767K26263K91877
$$ plain form
28132 -157149 -232828 -378762 -307441 -369030 -483439 -505190 -546304 -508809 -420660 53022 -22173
28121 -22173 156825 -52472 -270970 -430794 -536804 -289214 108090 370849 304963 -157586
28111 -157586 -547041 -445237 -39060 119541 -126122 -269506 -108060 -266916 -733121 -436126
28101 -436126 -357034 -260040 150780 219246 17213 -7042 -139173 -129891 148432 -250436 -311867
28090 -311867 -404704 -38247 101685 -128531 -21638 -107779 -61813 -204010 -34525 93423
28080 93423 245629 21612 -209237 80486 91673 23102 17912 -154269 -228138 -265363 -477101
28069 -477101 -309021 -57523 -214171 -496050 -578454 -224382 -187165 -59769 -246284 -142557
28059 -142557 191126 406361 -62048 -154587 -84085 -433059 -385772 -468539 -242276 49601
28049D9601k51957J81527m519N5986o6630j09319K62467q2240J2708k54877o5237
28038b72490m71962n7155L05845K33631k2239j39606K09416n04097n5874N87830
28028a86701J38387j42965m6397K15913Q6453l09531M01802K31478l53047J53459
28018A88851m2324l31584r2679j51792k28800J18339j70592R9232M91137M48711
28008C28499j97140j92404K60408j09980j17966P4717J79379k0171j93484L8147
27998E0005j83471m9133l09851J88220N7584M3946k4691j8708j19136R1149J9732
27987b54354p9616l64181K32935J4390J36455Q2162j66573k04312K70559K0019
27977c12516Q6708O6351Q5587k72715L2650n1203J67155L08573j76557j01687
$$ plain form
28049 49601 -202356 -20829 -25348 30638 -35992 -145311 117156 34916 47624 -207253 -272490
28038 -272490 -744452 -801607 -495762 -262131 -284370 -423976 -214560 -718657 -774531 -186701
28028 -186701 -48314 -191279 -237676 -21763 64690 -244841 156961 388439 35392 188851
28018 188851 146527 -185057 -277736 -429528 -658328 -539989 -710581 -611349 -120212 328499
28008 328499 131359 -61045 199363 89383 -28583 46134 225513 205342 11858 50005
27998 50005 -133466 -182599 -492450 -304230 -246646 -202700 -227391 -246099 -365235 -274086 -254354
27987 -254354 -333970 -698151 -465216 -450826 -314371 -232209 -398782 -603094 -332535 -312516
27977 -312516 -225808 -159457 -73870 -346585 -313935 -365138 -197983 110590 -65967 -167654
27967a67654l43636K24704J01781l21357m8950J58353N09639k79505n9143K9073
27957a96695K45505J58807r7827k12774k20922J16796k1754J11425K4766P27811
27947F35138R9853m95847J71332L77792j46024n19660j77230J7825J55777J10674
27937B29630j43304R1506k30271m02880K0080M82538l38125k13887J39832j1127
27927c76008p4224j24403r5060M41176J79687k21631j06120j03034J87873J52637
27917a39107K38870j05288j27269J12786l75807j25930K06531N11082Q5035q2226
27907A98677M2013l8307k56706K34222j8052m23364Q0377M9735R1602K79768r2030
27896A47935n59645M45508J39375j5074k42983m90512R4059L7434P3886o7653
$$ plain form
27967 -167654 -511290 -286586 -184805 -506162 -555112 -396759 112880 -166625 -225768 -196695
27957 -196695 48810 207617 109790 -102984 -323906 -207110 -228864 -117439 -92673 635138
27947 635138 734991 239144 410476 788268 642244 122584 -54646 -36821 118956 229630
27937 229630 86326 177832 -52439 -455319 -435239 47299 -290826 -504713 -364881 -376008
27927 -376008 -450232 -574635 -669695 -228519 -48832 -270463 -376583 -479617 -291744 -139107
27917 -139107 99763 -5525 -132794 -20008 -395815 -521745 -315214 195868 280903 198677
27907 198677 240690 202383 -54323 179899 161847 -261517 -181140 -131405 -39803 239965 147935
27896 147935 -411710 33798 173173 158099 -84884 -575396 -481337 -443903 -370017 -437670
27886d37670J92021j26015M1287J34787q2294k9320J71375l6867q7445j13906
27876c74047J49971m53333l45070K79431M13719L04405N3693r8416j01948Q7725
27866h3870L03988J82468k75264p51911M53642K5556l21135k23146J63851O17013
27856I1192n1255q6815n18477r0253J31740M63633K51166p9406L78284m13776
27846G6033k50764q4228J15971M38311k38111r3492K63348j24442k22469J66403
27836D6560J30686K7904N5126K15760k41391l05036K72382k5029o5513R8349n9780
27825A50018K11260J84503n14371l12791M45836l2714O045J87498J0155j44539
27815A90900j43937P8525N1021k43942R1134K46676k21814J1364j8588j73423
$$ plain form
27886 -437670 -245649 -371664 -330377 -195590 -277884 -307204 -135829 -172696 -260141 -374047
27876 -374047 -224076 -677409 -1022479 -743048 -329329 -24924 28769 -69647 -171595 -83870
27866 -83870 220118 402586 127322 -624589 -170947 -145391 -466526 -689672 -525821 91192
27856 91192 39937 -46878 -565355 -655608 -523868 -60235 190931 111525 489809 76033
27846 76033 -174731 -258959 -142988 295323 57212 -36280 227068 102626 -119843 46560
27836 46560 177246 205150 260276 476036 234645 -70391 201991 176962 111449 209798 150018
27825 150018 361278 545781 31410 -281381 164455 131741 137786 325284 335439 190900
27815 190900 46963 125488 176509 -67433 23701 270377 48563 59927 41339 -132084
27805a32084j09318N8518J42441J18812k04169K2820J43634q4681J87924m02748
27795b58851j78505J82316K37128m2547L00396l76947l4751M64524q7277k02708
27785B778k58435Q3851k16499L7191L54800k2335k39266j78984P0555P6432k03326
27774d93238m3889j53251O7137M60495n0987J78183j23963j93766P254l07773
27764f53798J17604K3554J85679L53736j47359J30808K17827n48227J07706K45851
27754C3381J41727M9928j17402Q0006l39300N2974K56824k56940j23282m4109
27744b66193j01149j29310J06316N68819J16566k65027j2391J87902m64762j69917
27734d29146M55735m0545m6603K68565k63593j79569K33707r51o2009J09574P8218
$$ plain form
27805 -132084 -241402 -182884 -40443 78369 -125800 -102980 40654 -44027 143897 -258851
27795 -258851 -437356 -255040 -17912 -60459 239937 -137010 -171761 292763 205486 2778
27785 2778 -255657 -171806 -388305 -351114 3686 -18649 -257915 -436899 -366344 -289912 -493238
27774 -493238 -537127 -690378 -623241 -162746 -213733 -35550 -159513 -353279 -346025 -653798
27764 -653798 -536194 -512640 -326961 26775 -120584 10224 228051 -320176 -212470 33381
27754 33381 175108 225036 107634 187640 -151660 -98686 158138 -98802 -222084 -266193
27744 -266193 -367342 -496652 -390336 178483 295049 30022 17631 205533 -259229 -429146
27734 -429146 26589 -13956 -60559 208006 -55587 -235156 -1449 -2400 -64409 45165 123383
27723A23383j62462k94516l22483K46933K64384J4551j62075K23251N7936j03668
27713a14766l39453K30095M51880r8805m60982j09612M57669j83417m13396K71310
27703c09477J73993j69280L35180N7610N5723j07372n0287J83124N1928j34110
27693H7032l20211K4879j13272k21533J26137Q9857J68694j18350r0119K09419
27683a57467j59560L37589m34000j29572K65078k63426J65574J35665K48872k61364
27673b52611R9973J68287j22274q5679R1530J9414l03494M21573J60355l36686
27663a39612K6616k28304j16572J44528J74499n4849M3849j70098M7423j28122
27653d00642J40900K84724J7831l42427l43612K15829L59543J21469j58240K74118
$$ plain form
27723 123383 -39079 -333595 -656078 -409145 -144761 -130210 -292285 -69034 -11098 -114766
27713 -114766 -454219 -224124 227756 128951 -332031 -441643 16026 -167391 -580787 -309477
27703 -309477 -135484 -304764 30416 88026 143749 36377 -13910 169214 221142 87032
27693 87032 -233179 -208300 -321572 -543105 -416968 -327111 -158417 -276767 -366886 -157467
27683 -157467 -317027 20562 -413438 -543010 -277932 -541358 -375784 -240119 8753 -252611
27673 -252611 -152638 15649 -106625 -192304 -100774 -81360 -384854 36719 197074 -139612
27663 -139612 -112996 -341300 -457872 -313344 -138845 -193694 -149845 -319943 -272520 -400642
27653 -400642 -259742 24982 42813 -299614 -643226 -427397 -67854 53615 -104625 169493
27643A69493p707k55643l77009k54503K06279L56129k28208m05158K62962J34360
27633c99005r9424j4567J54460l1770o9247M32268M6226j94936K13281j47317
27623a10031k61659K12081l31019j43413J48545L0669J52503q329K8833L37435
27613E5615J7726K3567j8073l0732l61216J39384k42132j42144L7840L12963K90621
27602H3419j70067l13483J47919q507j11911K89038j59466l27934l89828R8892
27592h61928N28614J41579q8343j51646K79835K70889l61854k89499J58132L60531
27582a3690j04845n4921L13305K0725j15938j51567J35153l4259j80573L2834
27572a53776q4165J07182M20106l05669O5671P1248m9670l24033l92222K03352
$$ plain form
27643 169493 161786 -93857 -470866 -725369 -519090 -162961 -391169 -796327 -533365 -399005
27633 -399005 -498429 -512996 -358536 -390306 -459553 -27285 18941 -175995 37286 -110031
27623 -110031 -371690 -159609 -490628 -634041 -485496 -454827 -302324 -310653 -281820 55615
27613 55615 73341 96908 78835 48103 -313113 -173729 -415861 -558005 -520165 -207202 83419
27602 83419 -86648 -400131 -252212 -260719 -372630 -83592 -243058 -570992 -960820 -861928
27592 -861928 -333314 -191735 -280078 -431724 -151889 119000 -242854 -532353 -374221 -13690
27582 -13690 -118535 -173456 139849 160574 44636 -106931 28222 -6037 -186610 -153776
27572 -153776 -237941 -130759 289347 -16322 49349 120597 70927 -253106 -645328 -441976
27562d41976L68155m23675J16857K51904O8689L21290m17160j97990P8290O3694
27552b11922J88366K353j54720J52634M4741l8844K8532l73183L77395J17648
27542A33000k03055o0059J18777p29906K77018K40126J01743J48241k1170p3681
27532f8966l34016J89810K71046O6980k61083m08917l87679N9792P6717L21584
27522d74732L60046K81311M5696l69849j87543K9088L14637J05949l12239J05185
27512a02451j82804j89417j30492L24254J93961k59463O2468O5952L33532O2080
27502A77620j12044j83291Q3731n1762j93414K37988L62049j24425k0678R0603
27492B66377k62943j0522L7189L95930n12324k7570M2532l9044l35004j7797m71161
$$ plain form
27562 -441976 -73821 -497496 -380639 -128735 -60046 261244 -155916 -353906 -275616 -211922
27552 -211922 -23556 -21203 -175923 -23289 21452 -17392 11140 -362043 15352 133000
27542 133000 -70055 -130114 -11337 -741243 -464225 -224099 -122356 25885 4715 -68966
27532 -68966 -402982 -213172 57874 124854 -136229 -545146 -932825 -873033 -796316 -474732
27522 -474732 -114686 166625 212321 -157528 -345071 -315983 -1346 104603 -207636 -102451
27512 -102451 -285255 -474672 -605164 -280910 -86949 -346412 -283944 -217992 115540 177620
27502 177620 65576 -117715 -33984 -85746 -279160 -41172 320877 196452 175774 266377
27492 266377 3434 -7088 30101 426031 -86293 -113863 -71331 -110375 -445379 -463176 -934337
27481i34337j21086L41669M51737N61547J63279n23616m77327M00850L77252P3669
27471C13637j8766J59214J89758l65641j64943j07512j81029n9259k29481P1359
27461c92663Q1872k38250P9053p3630j140K85142J52810J73369j7405k43427K4345
27450a69924j08676K15929J20676k20683K64460O4953O8305p0078j34145J07872
27440A38689J52599l29229J11962l42911P2602K66197j61850k57372L19245m8756
27430g8824r3583k07449j19646J17354J15539k6825k75986J76215r772J80788
27420b22189j60039L55040n5352j68460J84320L17662n48011k26905N06496r6590
27410a14028L20883j79698O7J24058j46872P6193j00327k98394O3682k03719Q477
$$ plain form
27481 -934337 -1055423 -713754 -262017 299530 462809 -60807 -538134 -137284 239968 313637
27471 313637 294871 454085 643843 278202 113259 5747 -175282 -234541 -464022 -392663
27461 -392663 -310791 -549041 -469988 -543618 -544758 -259616 -106806 66563 49158 -194269 -169924
27450 -169924 -278600 -62671 58005 -162678 101782 166735 235040 164962 30817 138689
27440 138689 291288 -37941 74021 -268890 -196288 69909 -91941 -349313 -30068 -78824
27430 -78824 -172407 -379856 -499502 -382148 -266609 -293434 -569420 -393205 -402977 -222189
27420 -222189 -382228 -27188 -82540 -251000 -66680 250982 -297029 -523934 -17438 -114028
27410 -114028 206855 27157 27224 151282 4410 80603 -19724 -318118 -254436 -458155 -449678
27399d49678l3838J50997j74510N6763J68642k92476K01758N81640k00695k49411
27389b40808P7345M6316k06287K55378L7212Q5014K96839J75449K70855l47173
27379D50140j04317O2887j34701J77207j48334k20147k9229j17244j12842K2285
27369a54295M62178j95180l47756M09731K43755J47891m21221j23966j33835J88705
27359G6007j10762J34669J01047l64384N273k7905J8007K0103J95992k57669j38434
27348c48056J80750l04112L05457J33098j81532J86661J24668K32867N5837j99949
27338A85689P5372K39749l96125K25357m22878n5114R8510M93269j48277j78249
27328A17303l74151l7648K24180q9837k9952J89364O3097J08761N8824j3848K44562
$$ plain form
27399 -449678 -483516 -332519 -507029 -450266 -281624 -574100 -372342 209298 8603 -240808
27389 -240808 -163463 -117147 -323434 -68056 -30844 54170 351009 526458 797313 450140
27379 450140 345823 408710 274009 451216 302882 82735 53506 -63738 -176580 -154295
27369 -154295 307883 112703 -235053 174678 418433 566324 145103 21137 -112698 76007
27359 76007 -34755 99914 200961 -163423 -158150 -186055 -168048 -147945 48047 -209622 -348056
27348 -348056 -167306 -471418 -165961 -32863 -214395 -27734 96934 329801 385638 185689
27338 185689 261061 500810 104685 330042 -92836 -147950 -49440 443829 295552 117303
27328 117303 -256848 -294496 -70316 -160153 -190105 -741 62356 171117 229941 216093 460655
27317D60655J35321j37619n64730L35945L14316p6827Q8194j78073k84300j70890
27307g8008L35351L90296J2445n43698k54809O29605K05137J80493J82436o07294
27297D51954m3453O26469j82810K71708k6308o14994K95986K16152O0426j0748
27287A044382K03996k62041q4097K48156j26561J84002K38793J19307J26633p20275
27277I72295k21779k5250J39873q5698O47859J09089n81197L8630M27954p4881
27267A346895j09472j70833K01234k56276J17471J51216q9827j28469l1729n06408
27257E23802j08281j6275n4599K93467P8147k74788K65148p2128j03745k0808
27247E09940M8953Q7294k29421r4375q7596k90305l11761K71252L29780M79737
$$ plain form
27317 460655 595976 458357 -106373 229572 543888 467061 555255 377182 92882 -78008
27307 -78008 257343 647639 660084 116386 -138423 491182 696319 876812 1059248 451954
27297 451954 408501 1034970 852160 1123868 1097560 482566 778552 994704 1055130 1044382
27287 1044382 1248378 986337 902240 1150396 1023835 1207837 1446630 1565937 1692570 972295
27277 972295 750516 725266 865139 779441 1427300 1536389 955192 993822 1421776 1346895
27267 1346895 1237423 1066590 1267824 1011548 1129019 1280235 1190408 1061939 1030210 523802
27257 523802 415521 399246 344647 638114 716261 441473 706621 634493 530748 509940
27247 509940 558893 646187 416766 322391 234795 -55510 -367271 -96019 233761 713498
27237G13498j09985j58751K69751j43955k88234L99074j06075k65681l94171j15083
27227a99612J24911O76l781O01380L47989k34423l42384N3002N3874k91517J41000
27216B51115k51132j07874K45240J69270L11633j43426j25468j59842j7574j00518
27206G1424j83638P82125Q2645k85076j04361l42437o4333O7167K82498M01045
27196G07059J12488q9955l67027k73872M1678J4934K96408p0111k05573K93474
27186D59503j56413j69620O1195P4005N64293L72244l04313k79187L07360K0858
27176I49925l38256M46671K00931o94101R0811k1455m3870J92895q6465K0350
27166G17436L436K21670J5166k9239J92982J21465j55943j3859N31256J06515
$$ plain form
27237 713498 603513 444762 714513 570558 282324 681398 575323 309642 -84529 -199612
27227 -199612 -74701 -74025 -77806 523574 871563 637140 294756 347758 401632 110115 251115
27216 251115 -17 -107891 137349 306619 618252 474826 349358 189516 171942 71424
27206 71424 -112214 669911 752556 467480 363119 20682 -43651 23516 306014 707059
27196 707059 819547 729592 362565 88693 130371 145305 441713 371602 166029 459503
27186 459503 303090 133470 194665 268670 832963 1205207 900894 621707 929067 949925
27176 949925 611669 1058340 1259271 565170 655981 634526 590656 783551 697086 717436
27166 717436 720872 942542 957708 928469 1121451 1242916 1086973 1073114 1604370 1710885
27156A710885L41908j30166o99288l57740J04837P1747K16915K2053m27381l02209
27146E51561J00061L65310p9354j450K7565N8469j65420k1376K61902n0391j11284
27135I35593k77176P324m22803J15904L77531k6629L94130L30358O1680K15854
27125A711766k21295k41067N092l80124o4271M6788R2639M6238m20494J12294
27115F87566L27708J20772j83521j33309n11338r4281L52658L288N630Q9105j70177
27104D94101k6915K23824K06231K00648l33871j40151R0939J6226K3044M60849
27094A214925J34313J90918k91220m1151l08218k47772L12317k63772P1312K62951
27084A034603n7474k8675k84918j82669L47623j22736J18217N07333k29264J2807
$$ plain form
27156 1710885 2052793 1922627 1223339 865599 970436 1042183 1259098 1281151 853770 551561
27146 551561 651622 1016932 937578 936128 963693 1022162 856742 835366 1097268 1046877 935593
27135 935593 658417 665741 242938 358842 736373 709744 1103874 1434232 1495912 1711766
27125 1711766 1490471 1249404 1254496 874372 810101 856889 949528 995766 575272 687566
27115 687566 1015274 1136046 952525 819216 307878 213597 566255 569543 575173 664278 494101
27104 494101 467186 691010 897241 1097889 764018 623867 714806 731032 754076 1214925
27094 1214925 1349238 1540156 1248936 1207785 899567 651795 964112 700340 771652 1034603
27084 1034603 977129 948454 663536 480867 828490 705754 823971 1331304 1102040 1114847
27074A114847Q7517J11019K4598O924J02547O8867l33938R7325M41454J45198
27064A866358l35742J69658l8808j4212K30769L70568J87380k4128k53008K47159
27054B405994L6592L79132Q43141k37453p87413k45704L81979N71602L81837n83444
27044C146263n88601o88229J70401L33918L23538M99315n77687o04526j05393
27035A908999Q4260L48793M09548k81243m72593r3773k2038j12609p4330K12498
27025A907512M96935r6878l31008p3137l65863N2939j63680J6948K20459L47566
27015B011793m00597J64455J62834N8244j29717J52258j29846j22916M5954L47804
27005B160266J22287K10709J36895J30605K22427K45260L63345P23086K52627
$$ plain form
27074 1114847 1202364 1313383 1337981 1344905 1447452 1516319 1182381 1279706 1721160 1866358
27064 1866358 1530616 1700274 1661466 1647254 1878023 2248591 2435971 2411843 2158835 2405994
27054 2405994 2442586 2821718 3664859 3427406 2639993 2394289 2776268 3347870 3729707 3146263
27044 3146263 2557662 1869433 2039834 2373752 2697290 3196605 2618918 2014392 1908999
27035 1908999 1993259 2342052 2751600 2470357 1997764 1903991 1881953 1769344 1695014 1907512
27025 1907512 2404447 2307569 1976561 1903424 1537561 1590500 1426820 1443768 1664227 2011793
27015 2011793 1611196 1775651 1938485 1996729 1867012 2019270 1889424 1766508 1812462 2160266
27005 2160266 2282553 2493262 2630157 2760762 2983189 3228449 3591794 4314880 4567507
26996D567507j12219N24746P85447O19049O68825R55124J287096K183899L863485
26987A5342959O542091Q558612k204157o369987j364291J489380N514552Q069549
26979C5578708k596040o149778r85001J498604O186227J3594805J7772087o380185
26971E8519427j4973524n445465J818445J1101319J4845502p695110j7736648
26964D0433946p468302k899863J443400M535744Q416605l769315p299290j819559
26956C1573366K257258N956828O688977n361070q563547l029724j031831p7569
26948B8412688k508753j902195M12511J408941K332363K799991L331410k64490
26940C4022466k750671J786601K755474L455732M155541J110182j111858K244950
$$ plain form
26996 4567507 4455288 4980034 5765481 6384530 7053355 8008479 9295575 11479474 15342959
26987 15342959 21885050 30443662 28239505 21869518 20505227 21994607 27509159 35578708
26979 35578708 32982668 26832890 25847889 27346493 33532720 47127525 64899612 58519427
26971 58519427 43545903 38100438 39918883 51020202 65865704 58170594 40433946
26964 40433946 32965644 30065781 31509181 36044925 44461530 40692215 33392925 31573366
26956 31573366 33830624 39787452 46476429 41115359 32551812 29522088 28490257 28412688
26948 28412688 25903935 24001740 24414251 25823192 28155555 30955546 34286956 34022466
26940 34022466 31271795 33058396 35813870 39269602 43425143 44535325 43423467 45668417
26932D5668417L003809L786014N266012Q594318J1355930J8506804L4097550N3905148
26924A84184002R822600l9722326k0074413J584281K6344673M5833033O256389
26917B14228239m0541202j6025919M290223L3764316O8527961J22225946L6790049
26910D23259613r8863392p0159613o988443M8194199J01873075J8263261j14618773
26903C00959927q2921511m0462348p157834J7626860N4786569K3318705n4728361
26896B11422007m8896197j2983676J6053701M9483151J5187445o4007200n4611155
26889A11648076l0124648j8240171j2291632q679246n499106l249586l692780
26882B9870907l506127l434224l925637k640638j602545j290230j065335m35892
$$ plain form
26932 45668417 48672226 52458240 57724252 66318570 77674500 96181304 130278854 184184002
26924 184184002 194006602 154284276 134209863 135794144 162138817 207971850 214228239
26917 214228239 173687037 157661118 161951341 195715657 264243618 386469564 423259613
26910 423259613 324396221 254236608 247248165 295442364 397315439 415578700 300959927
26903 300959927 218038416 177576068 170418234 188045094 242831663 266150368 211422007
26896 211422007 162525810 149542134 165595835 215078986 230266431 166259231 111648076
26889 111648076 81523428 63283257 50991625 42312379 36813273 33563687 29870907
26882 29870907 26364780 22930556 19004919 16364281 14761736 13471506 12406171 11970279
26874A1970279q57658j615545q99379n05504j20974J81077k78239j145048p15176
26865F013833p50068o76807l88735N5088m1489l35244k00843k61079l93812k57429
26855B763415k06597k9802k9181k22254j2078n33288k46466K4984M18359R7685
26845B024777k70292K59261o5884l62553M25094j07000m23215j60150P7303K41881
26835A639222l74058l11730L5067J39938k8115k46295J4354l27763K40696L94391
26825A175707l34480L8480L13720j5506P2783n32542l130q8371l16519M76605
26815G86747J49121q8517j5591l21678k54582K00821J05733m098n804K82951K56065
26804A091168n27065m41835K95969j04146K5308K88133L21305N5490l0613k17124
$$ plain form
26874 11970279 11112621 9497076 8597697 8092193 7971219 8152296 7874057 6729009 6013833
26865 6013833 5263765 4586958 4198223 4253311 4211822 3876578 3675735 3414656 3020844 2763415
26855 2763415 2556818 2527016 2497835 2275581 2263503 1730215 1483749 1508733 1927092 2024777
26845 2024777 1754485 2013746 1947862 1585309 2010403 1903403 1480188 1320038 1397341 1639222
26835 1639222 1265164 953434 988501 1128439 1100324 854029 868383 540620 781316 1175707
26825 1175707 841227 879707 1193427 1177921 1250704 718162 715032 626661 310142 786747
26815 786747 935868 847351 831760 510082 255500 456321 562054 557956 552152 835103 1091168
26804 1091168 564103 122268 418237 314091 339399 627532 948837 1004327 973714 756590
26794G56590J27118o6924M3608K15339m0225j03407l87627l40103J48175L25416
26784F77960K72533j3198l13610L7475K67843n4082j66103L65787k52254K29256
26774A051607j8418K28740k44908l00463L794Q934l38550J8690L14081k25288
26764D98219j48921K35255K83585M54241k98713l84176q1770l66592j79459m15793
26754d04124j19431P8326O66706L65925m20467K16706r9786p9999L94889L99658
26744I98403j0209K93699L40940M0329q1974k30551j38549r179M80108K06973
26734A889990n56303k88766K49305N37382P92828N72992K41766p43829n40258
26725B155107K40852K61626N19927K30598r65552k93645n6982j28312q3059K49827
$$ plain form
26794 756590 883708 816784 860392 1075731 1035506 932099 544472 204369 352544 677960
26784 677960 950493 937295 623685 661160 929003 874921 708818 1074605 822351 1051607
26774 1051607 1033189 1261929 1017021 716558 720352 729286 390736 409426 723507 498219
26764 498219 349298 584553 868138 1322379 1023666 639490 557720 191128 11669 -404124
26754 -404124 -523555 -445229 221477 587402 166935 383641 283855 203856 598745 998403
26744 998403 988194 1281893 1622833 1663162 1581188 1350637 1212088 1202909 1683017 1889990
26734 1889990 1333687 1044921 1294226 1831608 2624436 3197428 3439194 2695365 2155107
26725 2155107 2395959 2657585 3177512 3408110 2442558 2148913 2091931 1963619 1880560 2130387
26715B130387L63441o71570j81402p2020K25534L17358j04109l05153q693j08692
26705A585081o5514p3722n89126R160l0126k84869J63348J54820m98652l95429
26695b5029K93404K8847L73176j11530M4925K10344Q9668j68247j53945L3279
26685F14892J18929J07113j72390q3959J80745k70838j59799K41429L09424j11292
26675G74254J58897o978k27157J07251L64005k31761k02497L7262j0737j438K3776
26664G84877j56965R8916j82418k99004j73052k12278k35665K21537O6841K24699
26654A37488O7876J78183J72339J49961P4490k93645l61648k88330K22755O5169
26644A24638L72740j02354k40681l87065L34481Q7430l87555J73514L01316J74390
$$ plain form
26715 2130387 2493828 1822258 1640856 1568836 1794370 2111728 2007619 1702466 1693773 1585081
26705 1585081 1519567 1445845 856719 865879 835753 550884 714232 869052 370400 -25029
26695 -25029 268375 297222 670398 558868 603793 814137 903805 735558 581613 614892
26685 614892 733821 840934 668544 584585 765330 494492 334693 576122 885546 774254
26675 774254 933151 926173 699016 806267 1170272 938511 736014 773276 762539 761101 784877
26664 784877 627912 726828 544410 245406 72354 -139924 -375589 -154052 -87211 137488
26654 137488 205364 383547 555886 705847 780337 486692 125044 -163286 59469 124638
26644 124638 497378 395024 154343 -232722 101759 189189 -198366 -24852 276464 450854
26634D50854n8092n5025l32548j28301j48596J34608o8018J47992J07066K32313
26624B82253p5785j88822q0318J32975M1198O9930r4091n47592q7552L57549K74307
26613H4052m01915l33552M21330L61770j2782j45131O6624l8149J03789L1806
26603A37842k19495M666j68114O6422M17729k79732j22100K03699q3199j28412
26593a70694j92322R5755L85972K32708K77525r7308j41014j36051J867k58165
26583a727j14468Q1994J63886K98152J23866m20998k13431J23722k97392j63120
26573d19516L00615N12281Q6011k11079k83185J15578L55811j71502q4101J28357
26563C29270L4332M1335J10856k31085R092K82562k14039m78097k6268J24447
$$ plain form
26634 450854 392762 337737 5189 -123112 -271708 -137100 -205118 -57126 49940 282253
26624 282253 206468 17646 -62672 70303 111501 181431 87340 -460252 -547804 -190255 84052
26613 84052 -317863 -651415 -230085 131685 118903 -26228 40396 2247 106036 137842
26603 137842 -81653 -76987 -245101 -178679 239050 -40682 -162782 40917 -42282 -170694
26593 -170694 -363016 -267261 118711 351419 628944 531636 390622 254571 256438 -1727
26583 -1727 -116195 -34201 129685 427837 551703 130705 -82726 40996 -256396 -419516
26573 -419516 -118901 393380 479391 268312 -14873 100705 456516 285014 200913 329270
26563 329270 363602 404937 515793 284708 293800 576362 362323 -115774 -142042 -17595
26553a7595L17367k01211J47228J4034k48676k80824J20733J91408L04245k24353
26543A22356j09286j82296o7099k8076j71612L31059M4621m95358n2928J55758
26533d52861L20152K79254L0524L0537m01436k63301M1636j76609J61077M00182
26523c0845M97251k71645O1925j7498m4557j17532J31960J08879j74662j03141
26513D0135J9988j37373n69280l6076L66324K23407R0582l12901j07348P03553
26503B81011n5487j77540j46565N4419K63080m04934k5052M7r2391R7373J60538
26492d5501k34990J02902Q3887p5817J72999j64175l90237p0746P2184J13861
26482d35633j33748L67243M98969j48170K84024K39822l59147k94242j12575j29123
$$ plain form
26553 -17595 299772 98561 245789 259823 11147 -269677 -148944 42464 346709 122356
26543 122356 13070 -169226 -236325 -264401 -436013 -104954 -60333 -555691 -608619 -452861
26533 -452861 -132709 146545 177069 207606 -193830 -457131 -415495 -592104 -431027 -30845
26523 -30845 466406 194761 256686 239188 194631 77099 209059 317938 143276 40135
26513 40135 60123 -77250 -646530 -682606 -316282 -92875 -2293 -315194 -422542 281011
26503 281011 225524 47984 -98581 -44162 218918 -186016 -211068 -211021 -303412 -206039 -45501
26492 -45501 -280491 -177589 -93702 -169519 3480 -160695 -550932 -621678 -549494 -435633
26482 -435633 -569381 -202138 296831 148661 432685 672507 313360 19118 -93457 -222580
26472b22580Q0640q3236j45931J58987K72361k32362K42827m8855N9603p3070
26462H384l9134K07607L9662j77332j52169k58875p9122K56769o8160K19228k4405
26451f7547R1879K1948r2629k23618r9765k22900J97095N12520J31508k08043
26441D0448n51k5305J11953J93746n2640l11254p2041J75079m89718r4582J22548
26430d02317K16354n4837L63320J56275j85672q5842Q8330R03R0978j48228j65734
26419a26470j14312j50975L20242j01408m04257J47475M79071J91316j30486J84400
26409B94596K96443l74761l29384J05805l65948J67742M89029j43021m85247k41317
26399e86063L81229q4394j06690J78988K11309J5500J54739n35898K43857j27984
$$ plain form
26472 -222580 -141940 -225176 -371107 -212120 60241 -172121 70706 21851 81454 8384
26462 8384 -30750 176857 216519 39187 -112982 -371857 -450979 -194210 -262370 -43142 -67547
26451 -67547 24332 46280 -46349 -269967 -369732 -592632 -395537 116983 248491 40448
26441 40448 39897 14592 126545 320291 267651 -43603 -115644 59435 -430283 -524865 -402317
26430 -402317 -185963 -240800 122520 278795 93123 7281 95611 96514 187492 39264 -126470
26419 -126470 -240782 -391757 -71515 -172923 -577180 -429705 49366 240682 110196 294596
26409 294596 591039 216278 -113106 -7301 -373249 -205507 283522 140501 -344746 -586063
26399 -586063 -204834 -289228 -395918 -216930 -5621 9879 164618 -371280 -127423 -255407
26389b55407j58676Q3576P7089L88603L00802M5392j30883j66017k74411J5058
26379g4874J26569J02665n6920L5618j56718K60135j57389n11837j90985P19282
26369I5546J40530n8215K77884l36399J27046p9490M7135r9952O1095J81163q1068
26358B75275m5253K49145K77935J72736m55997p16001L74981K98392j20190j06860
26348B04163J58183l968n15736L8680K52909k71201K110L54565r9119j64587J30586
26337H6585j3507l19338r3272L22787J781n38754l29580O1474K00801P00558M97982
26326E77517o30370n08384Q7691Q6901K63267q620K71034K31993j48662l27486
26316a05119N3005k82938n1449K50725L72054l1688j41502K41838j18203j92773
$$ plain form
26389 -255407 -414083 -330507 -253418 135185 435987 481379 350496 184479 -89932 -74874
26379 -74874 51695 154360 97440 133058 -23660 236475 79086 -432751 -623736 95546
26369 95546 236076 177861 455745 119346 246392 166902 214037 114085 175180 356343 275275
26358 275275 230022 479167 757102 929838 473841 -242160 132821 431213 311023 204163
26348 204163 362346 358378 -157358 -118678 134231 -136970 -134860 219705 120586 -44001 86585
26337 86585 73078 -246260 -339532 -16745 -14964 -553718 -883298 -821824 -621023 79535 577517
26326 577517 -52853 -561237 -473546 -386645 -123378 -131998 139036 371029 222367 -105119
26316 -105119 -52114 -335052 -386501 -135776 236278 204590 63088 304926 186723 -6050
26306f050m58453k42347j96121K82192K78027L46909K26016P4524J01741K27275
26296F33713O7344J057o44183J43338L067k48461k57096K43888K45871l6551l09746
26285a57759j25153K82094k59694j53712r4599K81050l9986J57759j25623J53150
26275h2473J133j49109M34302k36868L8802K50365O5983J89969l74178m87061
26265c49135L54442l8328n3047j26310L6254J32818L5387k11458j8983J57504
26255h0856j52633k26506L19216K51149q6656J01128j90127L9041M9j2063l6487
26244g4745J87598K8878k26840k96817j80452K49615M12359J92946J95793K05256
26234F93591p3184m72865k87535K47762q1404P7892J49742j00944o5691j67511
$$ plain form
26306 -6050 -464503 -706850 -902971 -620779 -342752 4157 230173 304697 406438 633713
26296 633713 701057 702114 57931 201269 204336 -44125 -301221 -57333 188538 151987 -157759
26285 -157759 -282912 -818 -260512 -414224 -508823 -227773 -267759 -110000 -235623 -82473
26275 -82473 -81340 -230449 203853 -33015 5787 256152 322135 512104 137926 -349135
26265 -349135 5307 -33021 -86068 -212378 -176124 -43306 -7919 -219377 -238360 -80856
26255 -80856 -233489 -459995 -140779 110370 23714 124842 -65285 -26244 -26195 -38258 -74745
26244 -74745 112853 141731 -85109 -381926 -562378 -312763 99596 292542 488335 693591
26234 693591 620407 147542 -139993 107769 26365 104257 253999 153055 87364 -80147
26224h0147j4968l01109L87660P9174m9025L1438K00013r8783j25952L0652L8918
26213I7871N8366l1547K68769k27730o81541J46697L55242L45561l19108l04597
26203b92017L8464K77935l8043l7239J29537p5582j35719o3936K82537L8781l7404
26192H7314J17875J32914j90062k92883J72402K00075j97983j64552j57594J15534
26182a76960K02558j0444K52390j57983J58240N8957l13852l66243o2194K94881
26172a20650J2461K15416M9136l16341R4595j8407l97192J07016M63924L1661
26162A21619J44095m04680K45310K01315l96483K35019k0381K31517j46194k5004
26152A86133j49354k66597l4j5710Q1403n2657P1395J9853J30528K8102m05427
$$ plain form
26224 -80147 -95115 -396224 -8564 70610 21585 53023 253036 154253 28301 58953 97871
26213 97871 156237 124690 393459 165729 -515812 -369115 -13873 331688 12580 -292017
26203 -292017 -253553 24382 -13661 -50900 78637 3055 -132664 -196600 85937 124718 87314
26192 87314 205189 338103 148041 -144842 27560 227635 29652 -134900 -292494 -176960
26182 -176960 25598 15154 267544 109561 267801 326758 12906 -353337 -415531 -120650
26172 -120650 -108189 107227 156363 -159978 -65383 -83790 -480982 -373966 89958 121619
26162 121619 265714 -138966 106344 307659 -88824 146195 125814 357331 211137 186133
26152 186133 36779 -229818 -229852 -245562 -164159 -216816 -145421 -125568 4960 33062 -372365
26141c72365l1604l6488L39701K02837K60842K48847j99655n95330p6558m83940
26131g43713j24440M70732N97749K47835k02714l74343j70407L24336l6414j19047
26121a30426j63425K00785L83296j28805k76816J45465J89164n4780k56462l64011
26111d56015j05891O2723L45771J71960n3752K02754M1869l21347j94056K33747
26101g2237M7401l58717K20995J74846K72512K13815j65735m5853n43964K4370
26091b32567k6819J12569k036j78036J5343L71079J88765m6950j25594p2163q1483
26080g7892K17290l5817j48353K23215L59796Q3061m9856K76449J43620j92248
26070G99265m30292k68238J15330R8910M01730j78743j14651L43344j73499N053
$$ plain form
26141 -372365 -403969 -440457 -100756 102081 362923 611770 412115 -183215 -259773 -743713
26131 -743713 -868153 -397421 200328 448163 245449 -128894 -299301 25035 -11379 -130426
26121 -130426 -293851 -93066 290230 161425 -115391 30074 219238 164458 -92004 -456015
26111 -456015 -561906 -499183 -153412 18548 -35204 167550 209419 -111928 -305984 -72237
26101 -72237 -24836 -383553 -162558 12288 284800 498615 332880 287027 -256937 -232567
26091 -232567 -259386 -146817 -148853 -326889 -311546 59533 248298 201348 75754 3591 -77892
26080 -77892 139398 103581 -44772 178443 538239 621300 571444 847893 991513 799265
26070 799265 368973 100735 216065 314975 716705 537962 423311 766655 593156 598209
26060E98209Q9300l19246n3902J00741j6625M3887Q9651j56350K41159l44285
26050B72539k97434M7837K47168R4699j60274J76240K43054l10512k59555K29899
26040B83661k27117P3008p7623l32736L26704L03423j87829K7852J07225j75968
26030A20600J90172J91439L5952n2383K13970K70507l37118l95648N17937L78187
26020A133615l1053n04482j0478L10247J96110m6725p49908m0584L46389m56254
26010A46877k55064N6149J56518J55924K0340k17925q0629M01225k6931k14804
26000A41680J77774L1894J06194O286k1196m0104L79449n92842n7679J28941J05818
25989C66215L7688k20754O5617j84639L57177K12619k94642l33075n7937p5454
$$ plain form
26060 598209 687509 368263 314361 415102 398477 442364 532015 375665 616824 272539
26050 272539 -24895 22942 270110 364809 204535 380775 623829 313317 53762 283661
26040 283661 56544 129552 51929 -280807 45897 349320 161491 189343 296568 120600
26030 120600 310772 502211 538163 485780 699750 970257 633139 237491 755428 1133615
26020 1133615 1102562 598080 587602 897849 1093959 1047234 297326 256742 603131 146877
26010 146877 -108187 -52038 104480 260404 280744 62819 -17810 383415 356484 141680
26000 141680 319454 351348 457542 463828 442632 402528 781977 189135 131456 260397 366215
25989 366215 403903 183149 248766 64127 421304 633923 339281 6206 -51731 -127185
25979a27185j0541N81771j05343m63970k90788L28257l5088K12477L99030m8419
25969D40201j69863k84183k8754l32696o049L59974Q5450k51648M05032J76810
25959C94274j33587K28979l43491m42448J59336n0000J03826Q1303J48804j42009
25949D987m4887J4871J64006k2923Q5251L0561N44262k19188m96703J07695K08689
25938C76621M02262k23439l47895o7557k6372q8774N3902k38784J03489J16767
25928F0220j32678n9445j8084J37225K9759j38270N38K0196L01657L25832j90476
25917C36474l90237l01956M11457M6511l58316J99259R1438J49602L05038k49527
25907B39743j46618r1615k79451K46298k6349J6720k20451K04122J36624J5367
$$ plain form
25979 -127185 -137726 444045 338702 -125268 -416056 -87799 -122887 89590 488620 440201
25969 440201 270338 -13845 -42599 -375295 -381344 -21370 64080 -187568 217464 394274
25959 394274 260687 489666 146175 -296273 -136937 -186937 -83111 -1808 146996 4987
25949 4987 -39900 -25029 138977 116054 201305 231866 776128 556940 60237 167932 376621
25938 376621 778883 555444 207549 139992 113620 24846 78748 -160036 -56547 60220
25928 60220 -72458 -131903 -149987 -12762 16997 -121273 -120735 -100539 201118 526950 336474
25917 336474 -53763 -355719 55738 102249 -256067 -56808 34630 184232 489270 239743
25907 239743 93125 1510 -277941 -31643 -57992 -41272 -261723 -57601 79023 94390
25897I4390p1847n62692j87120J60125Q0488o1672J54944J97653P6570K46803
25887A27642Q6471j53293K21460l56783l7270j4061k27406j63967J13074M18681
25877A4548k43109m75003J67338J02547K17947l4354L00820M5487Q4881j49279
25867C1823j94655K72726N41480j69985k78555N8877J62666Q11k15812l77227
25857a67851L7312q7523J3026J34159J23596l0874k8086r8008J10830N4571l55803
25846b94651j60248j72197K04293J83039k55120R7071J22526O0922J30472M3929
25836c9964m88873k26810N65341L40202J98805R1936k30357l43697j75958j20988
25826d30363K27193j89148j63239J46265l103J07319L67805N4519P478J35570
$$ plain form
25897 94390 22543 -540149 -727269 -567144 -486656 -548328 -393384 -195731 -119161 127642
25887 127642 214113 60820 282280 -74503 -111773 -125834 -353240 -517207 -404133 14548
25877 14548 -228561 -703564 -536226 -433679 -215732 -250086 50734 96221 181102 31823
25867 31823 -162832 109894 651374 481389 202834 261711 424377 425188 209376 -167851
25857 -167851 -130539 -218062 -205036 -70877 52719 21845 -6241 -104249 6581 61152 -294651
25846 -294651 -454899 -627096 -422803 -239764 -494884 -397813 -275287 -214365 -83893 -39964
25836 -39964 -528837 -755647 -190306 149896 348701 440637 210280 -133417 -309375 -430363
25826 -430363 -203170 -392318 -555557 -409292 -412395 -305076 62729 117248 124726 260296
25816B60296J11146k75565j86527R8461j72913R8627R8288n61972L91205J60102
25806B1148Q749J55588n9000R5569j9619k76975k92095L35500J6781m2034l03336
25795c59724J70515L19541R7969k23047l31152n9919j0903K555n3949J73753K65923
25784h438r523l87560k19754O9015M28349M65202M294k37368M9212K08256j87593
25773A74092j6625j55150R5251o8703m04007N1772N63487K32768m26978j12063
25763f6156j10102j6127J13727K76760J78766M4996l27626J8887J46482m1950
25753B17657Q2617j36913K05825j91995j38278K39016l26632j97442K1633l7279
25743b61791l54905M6486K57857O3489j11825K42855L07229j90484K1619J43746
$$ plain form
25816 260296 371442 95877 -90650 7811 -165102 -66475 31813 -530159 -138954 21148
25806 21148 29897 185485 126485 222054 202435 -74540 -366635 -31135 -14354 -56388 -359724
25795 -359724 -189209 130332 228301 5254 -325898 -385817 -396720 -394165 -448114 -274361 -8438
25784 -8438 -17961 -405521 -625275 -556260 -127911 337291 341585 104217 153429 361685 174092
25773 174092 157467 2317 97568 28865 -375142 -323370 240117 472885 45907 -66156
25763 -66156 -176258 -192385 -78658 198102 376868 421864 94238 113125 259607 217657
25753 217657 300274 163361 369186 177191 38913 277929 -48703 -246145 -224512 -261791
25743 -261791 -616696 -570210 -312353 -248864 -360689 -117834 189395 -1089 20530 164276
25733A64276r2260J43399r4569l7434L08097J38660j09357k4606j51484P8106
25723C22828l51434j86606K66421j17899j24864N20951l58594k15979k4552N1473
25713b18255M57069J39018j48526k97469M5394Q2757J10462j78613j37185R1797
25703e3551J65057p1143M6595k57575K93659m3393k27679k8152K36301m2616j4347
25692C156J70493j49052m4271j05284l5453K4758m64391k08619j34116N46553
25682c96226K89320K5595J13665j3964J95561M0889J19918M1734Q5189l12489
25672A89192o33482J61959j9601j58431J64090j35830O5685J53963n444l12753
25662e30652R8761l3466J59306K94719k74119O8477k25031M2346l4891l39734
$$ plain form
25733 164276 72016 215415 120846 83412 391509 530169 420812 396206 244722 322828
25723 322828 -28606 -215212 51209 -66690 -191554 329397 -29197 -245176 -269728 -218255
25713 -218255 238814 377832 229306 -68163 -22769 59988 170450 -8163 -145348 -53551
25703 -53551 111506 40363 86958 -170617 123042 79649 -148030 -176182 60119 17503 3156
25692 3156 173649 24597 -19674 -124958 -160411 -135653 -600044 -808663 -942779 -396226
25682 -396226 -106906 -81311 32354 18390 213951 254840 374758 416492 501681 189192
25672 189192 -444290 -282331 -301932 -460363 -296273 -432103 -366418 -212455 -217899 -530652
25662 -530652 -431891 -465357 -306051 -11332 -285451 -216974 -442005 -399659 -434550 -774284
25652g74284R8870N36911L55955r4624J85994Q8797n27174j37630J61044K16287
25642A10146q380k78462j14307J3043N29707K46653k53145J126o4005r6454J27145
25631B13067p4148L47543Q6401l19999k70155Q7740k46040J94295r1509l4392
25621a07197J68429K649l5014K70973M4509K56449L7154k53073j30963K00934
25611D54850j69932K24293k76660m22566J86046K50158J65201l6672l04357N3532
25601A23893j71178J94672k2636J5805J75221O9900l29188m06584k22570K23657
25591c49008J23221k05279K09744j0921J68270P30354R0526m36732j73310K69810
25581D16675J95552p485p1533l88600N3742L4479k59331j83206L03349k67469
$$ plain form
25652 -774284 -675414 -138503 217452 122828 308822 397619 -129555 -267185 -106141 110146
25642 110146 101766 -176696 -291003 -277960 251747 498400 245255 246381 182376 85922 213067
25631 213067 138919 486462 572863 252864 -17291 70449 -175591 18704 -72805 -107197
25621 -107197 61232 63881 28867 299840 344349 600798 637952 384879 253916 454850
25611 454850 284918 509211 232551 -190015 -3969 246189 411390 374718 70361 123893
25601 123893 -47285 147387 124751 140556 315777 385677 56489 -350095 -572665 -349008
25591 -349008 -225787 -431066 -221322 -232243 -63973 666381 756907 320175 146865 416675
25581 416675 612227 604742 533209 144609 198351 232830 -26501 -209707 93642 -173827
25571a73827j00139N24773l29383J22788K43664k48750L60897k1408O6114O2605
25561E07334j09435l49812j78325n2075J19085m9621L7697l8876j64456N4295
25551b24189p3306L09944j37908J96869m1278K18860J19781m48611l82350Q2793
25541c79395N66049j24110l11690J39867M83o4510K37864j55672j79499p0314
25531c40927J59647J78306P8460L23588L07210P8333j50601o40130Q3527M95230
25521E72643j81942K7313J84438l25141j03627J838p8741j88919J33346r1177
25511d9969N5045l40901K4205M54710j84790J62589p6479m0866m9861K6673J52098
25500A32454N7478K84017K64225l29836m94641J22542M16196n28189J04936m817
$$ plain form
25571 -173827 -273966 250807 -78576 44212 287876 39126 400023 378615 444729 507334
25561 507334 397899 48087 -130238 -182313 -63228 -112849 -75152 -114028 -278484 -224189
25551 -224189 -297495 12449 -125459 71410 30132 248992 368773 -79838 -462188 -379395
25541 -379395 186654 62544 -249146 -109279 -108796 -173306 64558 -91114 -270613 -340927
25531 -340927 -181280 -2974 75486 399074 706284 784617 634016 -6114 77413 572643
25521 572643 390701 418014 602452 277311 173684 175522 96781 -92138 41208 -49969
25511 -49969 5076 -335825 -311620 143090 -41700 120889 44410 3544 -46317 -19644 132454
25500 132454 189932 473949 738174 408338 -86303 36239 452435 -75754 29182 24365
25490B4365j00219j35789K01214L259K8250k45015J428m1935J83701J6665J34983
25479G0907p8494K99253K98141J19216j08630k73707l18362L23243L0573l29000
25469C3140K5015j40631m7095P9303L13796J52745l41414m6460l2921n30885L49388
25458a86019N4868L83404J35737j59987j56320j6560L5277K18402m8378o58019
25448c97595J53317L25458L84182Q34k21737j61072L6013P60096K34021n87343
25438E26174k54001k16896o10766K12924L37447L70505P5095k26994l04325j69508
25428b60345J41865J13176K19714r6379l7943l40892p164M83544N31730k26514
25418E20792L89721j77615m15598j34835J85375J10828m66465O7553J22369l74602
$$ plain form
25490 24365 -75854 -211643 -10429 -7170 21080 -223935 -222507 -264442 -80741 -64076 70907
25479 70907 -7587 291666 589807 709023 600393 326686 8324 331567 362140 33140
25469 33140 58155 -82476 -129571 -50268 263528 416273 74859 28399 -4522 -535407 -186019
25458 -186019 -131151 252253 387990 228003 71683 55123 90400 308802 260424 -397595
25448 -397595 -244278 81180 465362 466196 244459 83387 119400 879496 1113517 526174
25438 526174 272173 55277 -555489 -342565 -5118 365387 440482 213488 -90837 -260345
25428 -260345 -118480 -5304 214410 118031 80088 -260804 -267968 215576 747306 520792
25418 520792 910513 732898 317300 182465 367840 478668 12203 79756 202125 -172477
25408a72477L87262K75838j37005J82254j02021n24838j6336K62587J49041N9221
25398C63526n39685r3270J18662J325K37309K0393p2049l86616n2481L10453K53698
25387A61265k11652m52176J38139J56382J06176K05202P8410J30472N8207k36459
25377A33966k62699q1693j22845l72850O9513K69591K04504J91662l79155K29814
25367a20192L66779J9650j28278M02192k83128m32816l20549L62290m5446K1852
25357a57646K33038r6203p2358L67280j54192j014J24515m4734P233n3107j0146
25346A42666J8352l12078n11982K32602K18304O8577n47235L05988J00420J52073
25336a32313K36039j99838k80359J87223J68922k36807J64642K02395q5957p2722
$$ plain form
25408 -172477 214785 490623 353618 535872 433851 -90987 -107323 155264 304305 363526
25398 363526 -176159 -269429 -150767 -149442 87867 108260 36211 -350405 -402886 -92433 161265
25387 161265 -50387 -502563 -364424 -208042 -101866 103336 181746 312218 370425 133966
25377 133966 -128733 -210426 -333271 -706121 -636608 -367017 -162513 29149 -350006 -120192
25367 -120192 246587 266237 137959 540151 257023 -175793 -496342 -134052 -179498 -157646
25357 -157646 75392 -20811 -93169 274111 119919 118905 243420 198686 205919 152812 142666
25346 142666 161018 -151060 -663042 -430440 -212136 -143559 -690794 -384806 -284386 -132313
25336 -132313 103726 -96112 -376471 -189248 -20326 -257133 -92491 109904 23947 -48775
25326d8775j96049K9051L61558l27843j77657L90847j4912K14181m1306N0879
25316B39974K48411J32395j52681o10597q1095J65749j66312J54944P968J81805
25306A20561j63499n7005q6546j81919q4601J08885m5577K84135J65628K26178
25296B86240l28675j95279J54534n948K68198M4055m6297r9817J47517m05796
25286a81268K80135M6917K0439M6942j93826L7812J50369L70995p9817l96917
25276A01781M8336J6116J5137j30234k05045L26114j53958j18551K7622P6471
25266C789J46847q2370m2582K4879j14895k90624K39475O7875l93915K35242m3923
25255b50202j971L78634k47718j13686j8185J09550J87637J87372J05263l39140
$$ plain form
25326 -48775 -244824 -215773 145785 -182058 -359715 31132 16220 230401 189095 239974
25316 239974 488385 620780 468099 -142498 -223593 -57844 -224156 -69212 -61244 120561
25306 120561 -42938 -99943 -186489 -368408 -453009 -344124 -389701 -105566 60062 286240
25296 286240 -42435 -237714 -83180 -89128 179070 223125 176828 77011 224528 -181268
25286 -181268 98867 145784 166223 213165 19339 57151 207520 578515 498698 101781
25276 101781 150117 166233 181370 51136 -153909 172205 18247 -100304 -72682 3789
25266 3789 150636 68266 25684 50563 -64332 -354956 -115481 -47606 -441521 -206279 -250202
25255 -250202 -252173 126461 -121257 -234943 -253128 -143578 44059 231431 336694 -2446
25245b446q9548O6169L3289L65787p6483q5262l20758J25987L5710n3085r3224
25234i3864J81962l39063k17081L52346l14943j43804J87580k3168K25818j68505
25224c52722K0244L88021J4003k6156j92802m55263j53443M61152N45969l39050
25214i0047k56117m42180K88363K79983J27612l86653k29015O99099L36773j49345
25204A78473m75198Q6622J76129j64064Q7315L37967J3703Q9515j17884j51219
25194F1359J53911k80984k70390J43525J68069k05050j50878k249j91589L47933
25184b26343k87659K98525K73046K68482r1995l07135j2269k9242j24398M52349
25174B13361j42109m43940j86555M7269J98559J46518Q8868L81479L48565m8126
$$ plain form
25245 -2446 -91994 -25825 7464 373251 296768 211506 -109252 16735 52445 -640 -93864
25234 -93864 88098 -250965 -468046 -115700 -430643 -574447 -386867 -410035 -184217 -352722
25224 -352722 -332478 55543 69546 43390 -149412 -604675 -758118 -296966 249003 -90047
25214 -90047 -346164 -788344 -499981 -219998 -92386 -479039 -708054 -8955 327818 178473
25204 178473 -296725 -210103 -33974 -198038 -110723 227244 240947 330462 212578 61359
25194 61359 215270 -65714 -336104 -192579 -24510 -229560 -380438 -382687 -574276 -226343
25184 -226343 -514002 -215477 57569 326051 234056 -73079 -85348 -114590 -238988 213361
25174 213361 71252 -372688 -559243 -511974 -313415 -166897 -78029 303450 652015 603889
25164F03889O616j65005k45561O7692j11185l3912l5269k12397q4452K90882j50419
25153f9121K6831K66496Q4295k87550j03585k27410l3977M27200j82105l41941
25143d40867M0173q589K94262J54664K41671m7435O9093m2925j91497N5989k38267
25132a13728k31458j25892J49026M63603L13117j07130l84498j38805M7680L98910
25122B70825j94562L09094j18425L01794M77472o22459j92225p7040M8908k50198
25112d6816n9049K07265j12973L31147j76034j69152N99j54574l54655L89887
25102a44355J51248j56962J76129L56019r0592j46296J5988j62629l1521j97801
25092b30772l8590J2353K68700O3612m40654o3367L06577M88099j92288j07162
$$ plain form
25164 603889 610505 445500 199939 267631 156446 122534 87265 -125132 -209584 81298 -69121
25153 -69121 -42290 224206 308501 20951 -82634 -310044 -344021 83179 -98926 -440867
25143 -440867 -400694 -409283 -115021 39643 281314 233879 302972 260047 68550 124539 -113728
25132 -113728 -345186 -471078 -322052 141551 454668 347538 -36960 -175765 -128085 270825
25122 270825 76263 385357 266932 568726 1046198 423739 231514 154474 203382 -46816
25112 -46816 -105865 101400 -11573 319574 143540 -25612 -25013 -179587 -534242 -144355
25102 -144355 6893 -150069 26060 382079 291487 145191 161179 -1450 -32971 -230772
25092 -230772 -269362 -257009 11691 75303 -365351 -428718 -122141 365958 173670 66508
25082F6508k334J18261Q5179L0599l09031J56513K44953p45346l03704M85128
25072a73274J78027P4481K85411P1729J4441r0169m19356n11389O9727J49528
25062c50844J19545K90434Q5687q4838K95631J04956m62128K53050p339k73458
25052b9304k03945q0076K37869J05077q1227J67661J06082J99394k68868J30224
25042B82887k03278K16069n3362l57329k18418L2720O4968p8393O3489n009r1095
25031c46751J15824J45178J58139L3434L1132k320j41180n47878r3182L05091
25021c42513L66235K84231j33705L7892q235k00620r0690n8172J60941M2166J29456
25010A86986m07293L99441p6399J29523P2017j68862K03687j8172r039q5132k08849
$$ plain form
25082 66508 64174 182435 267614 298213 -10818 145695 390648 -354698 -658402 -173274
25072 -173274 4753 79234 364645 436374 450815 360646 -58710 -570099 -500372 -350844
25062 -350844 -231299 59135 144822 59984 355615 460571 -1557 251493 244154 -29304
25052 -29304 -233249 -313325 -75456 29621 -51606 116055 222137 421531 152663 282887
25042 282887 79609 295678 242316 -115013 -333431 -300711 -235743 -314136 -250647 -255656 -346751
25031 -346751 -230927 -85749 72390 105824 136956 134636 -6544 -554422 -647604 -342513
25021 -342513 23722 307953 174248 212140 203905 3285 -87405 -145577 15364 57530 186986
25010 186986 -220307 179134 102735 232258 304275 135413 339100 320928 311889 226757 17908
24999A7908k13780J12694J6524j08273j36901J46311P350j072J30000J18761J53927
24988B43449k32156N7478L0995k05515P1645J13756k23993k88491J12024J77897
24978a42911M55249o8028j98940N2321j20437j86853N0331J32140J86490K5690
24968A85052k31447l30004J00001M40342J0452j83239O6636J11862K4046q3708
24958A09993j97561l18760o3835K04585J81154J26682j79228J80061m58247J33480
24948b81676N11206m7795Q8469j15329j94847L38893L9681L99424n37939j82710
24938A7377K55235m7501p1231l77868O7266j49760J53049K19150J14571J28383
24928C08671m89877k69894L51105L35582Q9657j21728j45254L53256j74455l95536
$$ plain form
24999 17908 -195872 -83178 -66654 -174927 -311828 -165517 -158167 -159239 -29239 89522 243449
24988 243449 11293 68771 99766 -105749 -34104 79652 -144341 -432832 -320808 -142911
24978 -142911 312338 244310 45370 97691 -22746 -209599 -159268 -27128 159362 185052
24968 185052 -46395 -376399 -276398 163944 174396 -8843 57793 169655 193701 109993
24958 109993 -87568 -406328 -470163 -265578 -84424 42258 -136970 43091 -415156 -281676
24948 -281676 229530 181735 270204 154875 -39972 298921 338602 738026 200087 17377
24938 17377 272612 225111 153880 -223988 -156722 -306482 -153433 65717 180288 308671
24928 308671 -181206 -451100 -99995 235587 325244 203516 58262 411518 237063 -158473
24918a58473Q2266N68991j74570j5911J9683l51979j60529K23416j373n857L34133
24907C59797l60833m40745J67742Q4835Q9471K61493o1735j53384k30878r5503
24897c79740J5192K99193K09173q0899J07639j45310r8155K5281Q9879M2394j36107
24886e1460J66577K35672P8051m37701k88145J33301j18661L46685k37193l23383
24876d96257p414J6073K6726J36566M88188P9508j60244j01140M8240k20945P8395
24865a12304L6139l26502K07164M00484K49295L05683l13765l93108J78276j05719
24855A25643j62557P3826j0710R9934j2854K56037j13200n2321k69307l41099
24845d06608j79202J57058k14347K33340J89367N0281J45496L58164J28591n46660
$$ plain form
24918 -158473 -76207 492784 318214 302303 321986 -29993 -190522 32894 31521 25664 359797
24907 359797 -1036 -441781 -274039 -189204 -99733 161760 100025 -53359 -284237 -379740
24897 -379740 -364548 -65355 143818 62919 170558 25248 -72907 -47626 42253 84647 -51460
24886 -51460 115117 350789 428840 -8861 -297006 -163705 -282366 64319 -172874 -496257
24876 -496257 -503671 -487598 -460872 -324306 163882 243390 83146 -17994 30246 -190699 -112304
24865 -112304 -76165 -402667 -195503 204981 454276 759959 446194 53086 231362 125643
24855 125643 -36914 36912 26202 126136 113282 369319 256119 203798 -65509 -406608
24845 -406608 -585810 -428752 -643099 -409759 -220392 -170111 -24615 333549 462140 -84520
24835h4520M6980j02281J08777K09517k42801N2342K35169n89209o9492N78343
24825A42825J74568k00348J10651l03506k84068k7027N88701L93642j89254k09777
24815A96407k47214J39545j06974m305l7827M0122K1759J7717o4552j57966k72307
24804d75595j67814L80354L18258J8847p2860j90563J64521L443j07530o8286
24794a97225J73829Q4085q4039k6983J05767O4971k51042N35703l3511k20302
24784A51253k8953m80821L7507J18480j99852J94617R1387L3473L86996j31401
24774A72686N0506J12015Q7697k61673k11146k62407J22426M9552K37950O0275
24764A57881k28869j92201r794R3252K84103j3550j58073K35722l9068K7299L829
$$ plain form
24835 -84520 -37540 -139821 -31044 178473 -64328 -11986 223183 -366026 -435518 142825
24825 142825 317393 117045 227696 -75810 -359878 -386905 201796 595438 406184 196407
24815 196407 -50807 88738 -18236 -22541 -60368 -20246 1513 19230 -45322 -203288 -475595
24804 -475595 -643409 -263055 55203 74050 1190 -189373 -24852 -21409 -128939 -197225
24794 -197225 -23396 60689 -23350 -50333 55434 120405 -130637 405066 371555 151253
24784 151253 122300 -358521 -321014 -202534 -402386 -207769 -116382 -82909 304087 172686
24774 172686 223192 335207 422904 161231 -49915 -312322 -189896 -140344 97606 157881
24764 157881 -70988 -263189 -272983 -179731 104372 90822 -67251 168471 129403 156702 160531
24753A60531j43080J70880j10276k5950L3934K32986K2432n95820k26909L39106
24743a42166n8516L3246m3923N913Q2132k11379j60256J27525K27241J20478j55466
24732a75171l7331M14844q0285j30214j167J56523j93668r4952L08297K0063j35616
24721E1323k06360K00841q7298j93759j79749R7429P6427K84033j62821m6732
24711a66666m49876j20528L32764j13774L43080M29502q5048k53430k0066m4930
24701a48972J63175J5764J03888n5699k01982m3713K41108J08853J08166K1159
24691C11747k64329J97038O1535k82121j57515J13248k25083j43156L7951o9847
24681d20532j7356K41930N9758N4101L92063j95291L29935L54225l74193l57300
$$ plain form
24753 160531 17451 188331 78055 52105 86039 319025 341457 -254363 -481272 -142166
24743 -142166 -200682 -167436 -211359 -205446 -123314 -334693 -494949 -367424 -140183 -19705 -175171
24732 -175171 -212502 202342 122057 -8157 -9324 147199 -46469 -141421 166876 186939 51323
24721 51323 -155037 45804 -41494 -235253 -415002 -317573 -241146 42887 -119934 -166666
24711 -166666 -616542 -737070 -404306 -518080 -175000 254502 169454 -83976 -104042 -148972
24701 -148972 14203 29967 133855 78156 -123826 -167539 73569 182422 290588 311747
24691 311747 47418 244456 305991 23870 -133645 -20397 -245480 -388636 -350685 -420532
24681 -420532 -437888 -195958 -136200 -82099 309964 114673 444608 798833 424640 67340
24671F7340j2655k2521j83872j9492M28816j19217r0871K79445q0784n56235N5815
24660b54231M00334k59790l753K02255O7365L13225J57116r4487j64150k47616
24650A16268J96131k62734k95186j1519J05721j94839M41606J86352j45182j35696
24640I22J14014N2026k2978j38514J90259J80151l63546l80441j06974K10440
24630b64641N78034j18212j10489R71k0814k12167n7068K68143k2506q549L04670
24619C37372l6019j52728J07639J99745J62327l68788k53811J87123k20929k54388
24609b92457k621p6129K34744o2410j92198M65760j3790K23200j11232Q9364j08194
24598A54037k74151j44925j12138L36048L27171n3926l01746J99134K14664m04902
$$ plain form
24671 67340 54685 32164 -151708 -171200 257616 138399 47528 326973 246189 -310046 -254231
24660 -254231 146103 -113687 -117440 84815 152180 465405 622521 528034 363884 116268
24650 116268 312399 49665 -245521 -257040 -151319 -346158 95448 281800 136618 922
24640 922 114936 166962 143984 5470 195729 375880 12334 -368107 -475081 -264641
24630 -264641 313393 195181 84692 85663 64849 -147318 -204386 63757 41251 32702 337372
24619 337372 301353 148625 256264 456009 618336 249548 -4263 182860 -38069 -292457
24609 -292457 -295078 -371207 -136463 -198873 -391071 74689 60899 284099 172867 262231 154037
24598 154037 -120114 -265039 -377177 -41129 286042 232116 -69630 129504 344168 -60734
24588f0734L65791L24834K7481o8354n15334k37357M4786K0248k2779j9209L14222
24577A73595j14654j27656L95908J97078j5274J21470l17038m5358R8894q0226
24567B86739n58941J62749M03411q9887L50362r4383j74735r6743J3483J41923
24557C43978P0042J87114k21491m44629K22133j81173m37582K18693J71815J43085
24547G1985L5089j41581K99577n7520k20283n1346L12985O1160R8655j55301j00100
24536A53320k88782O2773K54622l35006O6855J58611M0184L75860k28129m99580
24526b39272L14464J87876K69698j06865l08251j0614K0175J43709m9223j65958
24516E5739J6474P1863l63901J84564O3602j50379N1505P9436k83458j55219K39144
$$ plain form
24588 -60734 305057 629891 657372 589018 73684 -163673 -118887 -98639 -121418 -140627 173595
24577 173595 58941 -68715 327193 524271 508997 630467 313429 268071 366965 286739
24567 286739 -272202 -109453 293958 204071 554433 460050 285315 188572 202055 343978
24557 343978 414020 601134 379643 -64986 157147 -24026 -461608 -242915 -71100 71985
24547 71985 107074 -34507 265070 207550 -12733 -64079 248906 310066 408721 253420 153320
24536 153320 -135462 -72689 181933 -153073 -86218 72393 112577 488437 260308 -239272
24526 -239272 75192 263068 532766 425901 117650 107036 127211 270920 221697 55739
24516 55739 72213 144076 -219825 -35261 28341 -122038 -70533 8903 -274555 -429774 -190630
24505a90630k00680K67860J00389k45792j34226M7026j35163Q0391j521K51704
24495a60642K79595l27637m0805j59472J48339l17009J48193p1717K87026k8039
24485b42168J27933J03903j03415K29872m2630K7661J32999O2875R7126j8778
24475C75378l07566l79526K57744l24446j42989M77613j40124Q4586N94301R8984
24465E93955l40727N5793R2928o10l10265K30834Q8822l02703K02468r0975l14066
24454i4546k98547M37833J79106j06482K43201k37337m24551j82411J67461o1425
24444c77698M18793J75519q1223J33811K79670K25850p18835k82727K3344K6160
24434a77336Q0161R3836L43773m7305O2671m50419k15059J49456J390P3337o2343
$$ plain form
24505 -190630 -391310 -123450 -23061 -268853 -403079 -356053 -491216 -410825 -412346 -160642
24495 -160642 118953 -208684 -249489 -408961 -260622 -577631 -429438 -501155 -214129 -242168
24485 -242168 -114235 -10332 -113747 116125 73495 101156 234155 297030 394156 375378
24475 375378 67812 -311714 -53970 -378416 -521405 -43792 -183916 -99330 494971 593955
24465 593955 253228 309021 401949 401339 91074 321908 410730 108027 310495 219520 -94546
24454 -94546 -393093 44740 223846 117364 360565 123228 -301323 -483734 -316273 -377698
24444 -377698 41095 216614 135391 269202 548872 774722 55887 -226840 -203496 -177336
24434 -177336 -97175 -3339 340434 293129 355800 -94619 -309678 -160222 -158832 -85495 -147838
24423a47838J92665k06875J9763K12710L5684L8883R9248m36678J16335J56491
24413H0388O8812K33850n2083m83641R6663M49017N9580M4703j29411j72675m7350
24402A47853M3419k5275m3709o0838l36964p8751l9746K84565K18194k11394j3123
24391a15769j15540J70802l8696J20705L17971j3263j94907j06001r0741L16916
24381B51477N3083j43679k7215k03729M64272o0952l33518J07494j95313o7062
24371a55142M59710q0709m6682J25088k49957k41463J78213K68524k44887J28950
24361A41645J86310J95276j15185j79393l98216j78699q1373k22581l3981P66681
24351H0484l02593k11257L00750K42979K65889n04010P9379o14P4212L76227r8244
$$ plain form
24423 -147838 44827 -162048 -142285 70425 106109 144992 244240 -192438 -76103 80388
24413 80388 149200 383050 330967 -152674 -56011 393006 452586 497289 367878 195203 147853
24402 147853 191272 165997 122288 61450 -275514 -354265 -394011 -109446 108748 -102646 -115769
24391 -115769 -231309 -60507 -99203 21502 339473 326210 131303 25302 -65439 251477
24381 251477 304560 160881 133666 -70063 394209 333257 -261 107233 -88080 -155142
24371 -155142 304568 223859 177177 302265 52308 -189155 -10942 257582 12695 141645
24361 141645 327955 523231 408046 228653 -169563 -348262 -429635 -652216 -686197 80484
24351 80484 -222109 -433366 -132616 110363 376252 -127758 -48379 -48993 25219 401446 303202
24340C03202O6610o7853n68001N212j81212Q6391J90200K74568J00050j2039L14649
24329E11777k9829q1466j2671J95205r5205j86782L2540O0412l55364j3461K20106
24318B45262k2376l41095j14951J54442K80233o2482k68673q1921n0777J42629
24308a19709K65072j53078j53299N07189j01610n61169L6351M7100J27087K43584
24298A37518j76399m8648j82718M93738J03330p3832j91925k76983n4686J4808
24288b55797k12838L93345N3859J25584q1588R7355j94759j94216k49425j56370
24278f74850L05755Q8652P4785J5714J2218R4346m0134j90892J75064J95905l0168
24267B6395m3723J31377n357j17141n25228O4567P11391N5455j21328L5113l12221
$$ plain form
24340 303202 369812 301959 -266042 -260830 -442042 -355651 -165451 109117 209167 197128 511777
24329 511777 481948 400482 387811 583016 487811 301029 333569 393981 38617 25156 245262
24318 245262 222886 -118209 -233160 -78718 201515 139033 -129640 -211561 -262338 -119709
24308 -119709 145363 -7715 -161014 346175 244565 -316604 -280253 -233153 -106066 137518
24298 137518 -38881 -87529 -270247 223491 326821 252989 61064 -215919 -270605 -255797
24288 -255797 -468635 -75290 -21431 104153 22565 119920 -74839 -269055 -518480 -674850
24278 -674850 -369095 -280443 -205658 -189944 -177726 -83380 -123514 -314406 -139342 56563 26395
24267 26395 -17328 114049 108692 -8449 -533677 -469110 242281 297736 176408 211521 -100700
24256a00700J285J72160P0447K4278J0217k4708l1625j76476M773k62607j57147
24245d70103J45302K39000q1797j23033O1536j8825J87749k34516m9085K17255
24235a26517J25419M7908Q2922k1905L73800o1178j61037k30489l9043L14936
24225C04816L17087N2352o35097P2765L84406j06493n99474j07125k0998p1601
24215d09362K24835L28039J26513j72692n3748j00431Q2434l21046m75242J49445
24205f21255N72116J53776o9612Q9173j74009M03760k55648n08585J48409J96198
24195f5677K1002m7413J47007J9908Q5676k08149R6521J95712r4195k89384m9270
24184a88262M86211P2165k0931m40959m35928P1739K37268J69231J2782K27557
$$ plain form
24256 -100700 -99415 72745 143192 167470 177687 152979 121354 -55122 -50349 -312956 -470103
24245 -470103 -324801 -85801 -167598 -290631 -229095 -247920 -60171 -294687 -343772 -126517
24235 -126517 -1098 46810 129732 107827 481627 420449 259412 28923 -10120 304816
24225 304816 621903 674255 39158 111923 496329 389836 -209638 -316763 -337761 -409362
24215 -409362 -184527 143512 270025 97333 43585 -56846 25588 -295458 -770700 -621255
24205 -621255 -49139 104637 35025 124198 -49811 353949 98301 -410284 -261875 -65677
24195 -65677 -44675 -92088 54919 74827 160503 -47646 48875 244587 150392 -138992 -188262
24184 -188262 297949 370114 349183 -91776 -527704 -455965 -218697 -49466 -36684 190873
24174A90873J95650K17240R2378l45686K03479l4029k35665m49409k59229K4882
24164c99516P2419K59152L57634K13986k85773o3142K4200j45261l7296Q0281
24154G6684j77631J84223J09519J01380K16644J0613j24680l26268m30667J61337
24144a98846O55550j56165q1885J65060k0826J3366N4218o4309L24716j06476
24134E84403p3534l57965l00218m96184M203N99946J63578j96908J54240j97033
24124a15472j54728K73264M27561l34991k76103k55167n0358R6013K32878R6975
24114f0128r5165N8902j24452J02917n8944L00708K31662l09778K26308L59887
24104F31917m05719j10297l57669J71510K92861K32888N9784p2851j41742J49755
$$ plain form
24174 190873 386523 603763 696141 350455 553934 519905 284240 -165169 -424398 -399516
24164 -399516 -327097 -67945 289689 503675 217902 154760 178960 33699 -3597 76684
24154 76684 -100947 83276 192795 294175 510819 521432 396752 70484 -360183 -198846
24144 -198846 456704 300539 218654 383714 362888 376254 430472 366163 690879 584403
24134 584403 510869 152904 -147314 -643498 -639295 -39349 124229 -72679 81561 -115472
24124 -115472 -270200 3064 430625 95634 -180469 -435636 -485994 -389981 -157103 -60128
24114 -60128 -155293 -96391 -220843 -117926 -176870 123838 355500 45722 272030 631917
24104 631917 226198 115901 -241768 -70258 222603 455491 515275 442424 300682 450437
24094D50437m15607r2713r595l33817R8842l8578J59688J08596k87896K70356
24084i0287M38427R1206k35532j1741r2201k28142O0040j43949p6821r001Q0105
24073b17896k48512K83479J98951O4048m33620j89700J29241L55178P4222j20734
24063a05343J5108m50057J16136M01752L69043j19345p9813k39932j54089K98721
24053E2181Q1289J55593o2678L4169l18489j83386L01083P2869J57559j30234
24043A59956k77733p1436J81801M4723M7942j77789J52584M26460J64716J14294
24033G65518j02427m04584j75735L66364k6676m27636K49480J51243J02928R6746
24023E95221L3958p59002j41652j0989P7963L20210L227r4471p5392L9170m5334
$$ plain form
24094 450437 34830 -57883 -67478 -401295 -302453 -341031 -181343 -72747 -360643 -90287
24084 -90287 348140 439346 203814 192073 99872 -128270 -68230 -212179 -289000 -298001 -217896
24073 -217896 -466408 -182929 16022 80070 -353550 -543250 -414009 -58831 15391 -105343
24063 -105343 -90235 -540292 -424156 -22404 346639 227294 147481 -92451 -246540 52181
24053 52181 133470 289063 226385 260554 -57935 -241321 59762 132631 290190 159956
24043 159956 -117777 -189213 -7412 37311 85253 -92536 60048 486508 651224 765518
24033 765518 663091 258507 82772 449136 422460 -5176 244304 395547 498475 595221
24023 595221 629179 -129823 -271475 -282464 -204501 115709 118936 24465 -50927 -11757 -57091
24012e7091K48417K45977j90240j06514k06928k3287m5185K92501j15043J6594
24002E9201L58817l5249L1223o61618k8708K89118J17669j86071O2292k51511
23992b44837J36573k16756p9518J71667j70641r9008L52692p461j39945J48717
23982a48517j9415J02911N4928J32146K77321Q5881m13035l43410L6263O1148
23972a73779K20704P891l01345N08692k58908k07624j46619K76661J38978n5861
23962H790N0210k54130l0407J4712L75605J67951j52417j66239L3533l14291j03329
23951c70012K43162O9703k50018j19608Q2005K04586j57924J64466J97983K41969
23941C06312r5288J77099J24581k22860m96785L16462R3832j90986J60375K65193
$$ plain form
24012 -57091 191326 437303 247063 140549 -66379 -89666 -134851 157650 42607 59201
24002 59201 418018 382769 413992 -247626 -276334 12784 130453 -55618 6674 -244837
23992 -244837 -108264 -325020 -404538 -232871 -403512 -502520 -149828 -157289 -297234 -148517
23982 -148517 -167932 -65021 -10093 122053 399374 485255 72220 -271190 -234927 -173779
23972 -173779 46925 54816 -246529 262163 3255 -204369 -350988 -74327 64651 8790
23962 8790 59000 -195130 -225537 -210825 164780 332731 180314 14075 47608 -266683 -370012
23951 -370012 -126850 -57147 -307165 -426773 -344768 -140182 -298106 -133640 64343 306312
23941 306312 211024 388123 512704 289844 -206941 109521 203353 12367 172742 437935
23931D37935k86431l50815K60927k00086L56282J77030j45292o1517k40089k66942
23921c18998N1288M4022K31726K2619P4697R6858m38934j22459j94711k74p5864
23910f30030L33943K41471k54249L77034j49577J69945p4287k0953M174n01685
23900e04214K30448J08767M05436K20941r3003o64737J07325J36262J56431j99180
23890i5524M5034M85532L7278N6388l98984l66950j06790k7251N53846J71227
23880C53806J15211l68020j77721K25694k03282j97824M20682N71327j42209p6588
23870E21076J86958n83123j01116J41497j20083L26233R6682k01645j58152O5950
$$ plain form
23931 437935 151504 -199311 61616 -138470 217812 394842 249550 188033 -52056 -318998
23921 -318998 -267710 -223688 8038 30657 105354 202212 -236722 -359181 -553892 -554166 -630030
23910 -630030 -296087 -54616 -308865 68169 -81408 88537 14250 -6703 -2529 -504214
23900 -504214 -273766 -164999 240437 461378 368375 -296362 -189037 -52775 103656 -95524
23890 -95524 -50490 435042 472320 528708 129724 -237226 -344016 -371267 182579 353806
23880 353806 469017 100997 -76724 148970 -54312 -252136 168546 739873 597664 521076
23870 521076 708034 124911 23795 165292 45209 371442 468124 266479 108327 174277
$$ [...]
##END NTUPLES=NMR SPECTRUM
##END=
