##TITLE=19F_EC-3189(26)
 CDCl3. 24 sc
 29.4.2019
##JCAMPDX= 6.0         $$ Bruker NMR JCAMP-DX V2.0
##DATA TYPE= NMR SPECTRUM
##DATA CLASS= NTUPLES
##ORIGIN= UXNMR, Bruker Analytische Messtechnik GmbH
##OWNER= root
$$ XWIN-NMR		Version 3.5
$$ Mon Apr 29 14:04:02 2019 Russian Standard Time (UT+4h)  she@DPX200
##.OBSERVE FREQUENCY= 188.290927
##.OBSERVE NUCLEUS= ^19F
##.ACQUISITION MODE= SIMULTANEOUS
##.ACQUISITION SCHEME= undefined
##.AVERAGES= 24
##.DIGITISER RES= 16
##SPECTROMETER/DATA SYSTEM= spect
##.PULSE SEQUENCE= zg
##.SOLVENT NAME= CDCl3
##.SHIFT REFERENCE= (INTERNAL, CDCl3, 0, 101.251)
##AUDIT TRAIL= $$ (NUMBER, WHEN, WHO, WHERE, WHAT)
$$ ##TITLE= Audit trail, XWIN-NMR		Version 3.5
$$ ##JCAMPDX= 5.01
$$ ##ORIGIN= Bruker BioSpin GmbH
$$ ##OWNER= she
$$ F:/spectra/data/she/nmr/f19/1/pdata/1/auditp.txt
$$ ##AUDIT TRAIL=  $$ (NUMBER, WHEN, WHO, WHERE, WHAT)
(   1,<2019-04-29 14:03:05.92 +0400>,<she>,<DPX200>,
      <created by zg, POWCHK disabled, PULCHK disabled
       configuration hash MD5:
       00 E9 B6 7A A2 85 ED C7 34 08 36 98 17 FE 4E 26
       data hash MD5: 64K
       3E 6A FD 22 0E C7 05 38 48 71 7A E5 95 DA B7 38>)
(   2,<2019-04-29 14:03:08.70 +0400>,<she>,<DPX200>,
      <Start of raw data processing
       efp BC_mod = 2 LB = 1 FT_mod = 6 PKNL = 1 PHC0 = 929.0715 PHC1 = 622.1557 SI = 64K 
       data hash MD5: 64K
       A1 DF B6 3D 28 24 C6 F1 C3 6B 90 9B 1A 32 FC EE>)
(   3,<2019-04-29 14:03:24.10 +0400>,<she>,<DPX200>,
      <pk PHC0 = 3.075418 PHC1 = 0 
       data hash MD5: 64K
       88 23 82 3A AD 58 6A 96 AE F5 F6 76 A3 5C A6 9D>)
(   4,<2019-04-29 14:03:28.93 +0400>,<she>,<DPX200>,
      <abs ABSG = 5 
       data hash MD5: 64K
       F6 0F 72 33 61 11 1A ED 40 C1 DB CC E4 AA F2 95>)
$$ ##END=
$$ 
$$ hash MD5
$$ 6C 69 41 40 F9 B3 73 6F 0B E0 15 76 F9 7A D4 9D
##$RELAX= 
##$RELAX= 
##$RELAX= 
##$RELAX= 
##$RELAX= 
##$RELAX= 
##$RELAX= 
##$RELAX= 
$$ Bruker specific parameters
$$ --------------------------
##$DU= <F:/spectra>
##$EXPNO= 1
##$NAME= <f19>
##$PROCNO= 1
##$TYPE= <nmr>
##$USER= <she>
##$AMP= (0..31)
100 100 100 100 100 100 100 100 100 100 100 100 100 100 100 100 100 100 
100 100 100 100 100 100 100 100 100 100 100 100 100 100 
##$AQSEQ= 0
##$AQ_mod= 1
##$AUNM= <au_zg>
##$AUTOPOS= <>
##$BF1= 188.310428
##$BF2= 200.13
##$BF3= 200.13
##$BF4= 200.13
##$BF5= 200.13
##$BF6= 200.13
##$BF7= 200.13
##$BF8= 200.13
##$BYTORDA= 1
##$CFDGTYP= 0
##$CFRGTYP= 5
##$CHEMSTR= <none>
##$CNST= (0..31)
1 1 145 1 1 1 1 1 1 1 1 1 1 1 1 1 1 1 1 1 1 1 1 1 1 1 1 1 1 1 1 1 
##$CPDPRG= <>
##$CPDPRG1= <>
##$CPDPRG2= <>
##$CPDPRG3= <>
##$CPDPRG4= <mlev>
##$CPDPRG5= <mlev>
##$CPDPRG6= <mlev>
##$CPDPRG7= <mlev>
##$CPDPRG8= <mlev>
##$CPDPRGB= <>
##$CPDPRGT= <>
##$D= (0..31)
0 1.3 0 0 0 0 0 0 0 0 0 0 0.25 0 0 0 0 0 0 0 0 0 0 0 0 0 0 0 0 0 0 0 
##$DATE= 1556532185
##$DBL= (0..7)
120 120 120 11 120 120 24 19 
##$DBP= (0..7)
150 150 150 150 150 150 150 150 
##$DBP07= 0
##$DBPNAM0= <>
##$DBPNAM1= <>
##$DBPNAM2= <>
##$DBPNAM3= <>
##$DBPNAM4= <>
$$ [...]
##$SUBNAM3= <"">
##$SUBNAM4= <"">
##$SUBNAM5= <"">
##$SUBNAM6= <"">
##$SUBNAM7= <"">
##$SUBNAM8= <"">
##$SUBNAM9= <"">
##$SW= 251.107818259711
##$SWIBOX= (0..15)
0 1 0 0 0 0 0 0 0 0 0 0 0 0 0 0 
##$SW_h= 47281.3238770686
##$TD= 65536
##$TD0= 1
##$TE= 0
##$TE2= 300
##$TE3= 300
##$TEG= 300
##$TL= (0..7)
0 120 53 12 22 120 120 120 
##$TP= (0..7)
150 150 150 150 150 150 150 150 
##$TP07= 0
##$TPNAME0= <>
##$TPNAME1= <>
##$TPNAME2= <>
##$TPNAME3= <>
##$TPNAME4= <>
##$TPNAME5= <>
##$TPNAME6= <>
##$TPNAME7= <>
##$TPOAL= (0..7)
0.5 0.5 0.5 0.5 0.5 0.5 0.5 0.5 
##$TPOFFS= (0..7)
0 0 0 0 0 0 0 0 
##$TUNHIN= 0
##$TUNHOUT= 0
##$TUNXOUT= 0
##$USERA1= <user>
##$USERA2= <user>
##$USERA3= <user>
##$USERA4= <user>
##$USERA5= <user>
##$V9= 5
##$VALIST= <valist>
##$VCLIST= <CCCCCCCCCCCCCCC>
##$VD= 0
##$VDLIST= <DDDDDDDDDDDDDDD>
##$VPLIST= <PPPPPPPPPPPPPPP>
##$VTLIST= <TTTTTTTTTTTTTTT>
##$WBST= 1024
##$WBSW= 4
##$XGAIN= (0..3)
0 0 0 0 
##$XL= 0
##$YL= 0
##$YMAX_a= 31259
##$YMIN_a= -32689
##$ZGOPTNS= <>
##$ZL1= 120
##$ZL2= 120
##$ZL3= 120
##$ZL4= 120
##$ABSF1= 101.2514
##$ABSF2= -149.8503
##$ABSG= 5
##$ABSL= 3
##$ALPHA= 0
##$AQORDER= 0
##$ASSFAC= 0
##$ASSFACI= 0
##$ASSFACX= 0
##$ASSWID= 0
##$AUNMP= <proc_1d>
##$AZFE= 0.1
##$AZFW= 5
##$BCFW= 0
##$BC_mod= 2
##$BYTORDP= 0
##$COROFFS= 0
##$CY= -3
##$DATMOD= 1
##$DC= 0
##$DFILT= <>
##$DTYPP= 0
##$F1P= 0
##$F2P= 0
##$FCOR= 0.5
##$FTSIZE= 65536
##$FT_mod= 6
##$GAMMA= 0
##$GB= 0
##$INTBC= 1
##$INTSCL= 8.653935e-10
##$ISEN= 128
##$LB= 1
##$LEV0= 0
##$LPBIN= 0
##$MAXI= 10000
##$MC2= 0
##$MEAN= 0
##$ME_mod= 0
##$MI= 0.4277144
##$NCOEF= 0
##$NC_proc= -5
##$NLEV= 6
##$NOISF1= -61.99997
##$NOISF2= -62.99997
##$NSP= 0
##$NTH_PI= 0
##$NZP= 0
##$OFFSET= 101.2514
##$PC= 1
##$PHC0= 932.1469
##$PHC1= 622.1557
##$PH_mod= 1
##$PKNL= yes
##$PPARMOD= 0
##$PSCAL= 0
##$PSIGN= 0
##$REVERSE= no
##$SF= 188.29550247311
##$SI= 65536
##$SIGF1= -61
##$SIGF2= -65
##$SINO= 3.502647
##$SIOLD= 65536
##$SREGLST= <1H.CDCl3>
##$SSB= 0
##$STSI= 65536
##$STSR= 0
##$SW_p= 47281.3238770685
##$SYMM= 0
##$S_DEV= 0
##$TDeff= 65536
##$TDoff= 0
##$TI= <>
##$TILT= no
##$TM1= 0
##$TM2= 0
##$TOPLEV= 0
##$USERP1= <user>
##$USERP2= <user>
##$USERP3= <user>
##$USERP4= <user>
##$USERP5= <user>
##$WDW= 1
##$XDIM= 65536
##$YMAX_p= 303311025
##$YMIN_p= -2533612
$$ End of Bruker specific parameters
$$ ---------------------------------
##NTUPLES= NMR SPECTRUM
##VAR_NAME=  FREQUENCY,     SPECTRUM/REAL,   SPECTRUM/IMAG
##SYMBOL=    X,             R,               I
##VAR_TYPE=  INDEPENDENT,   DEPENDENT,       DEPENDENT
##VAR_FORM=  AFFN,          ASDF,            ASDF
##VAR_DIM=   65536,         65536,           65536
##UNITS=     HZ,            ARBITRARY UNITS, ARBITRARY UNITS
##FACTOR=    0.721466756344984, 1,           1
##FIRST=     19065.1839562469, 0,            0
##LAST=      -28216.1399208216, 0,           0
##MIN=       -28216.1399208216, -2533612,    0
##MAX=       19065.1839562469, 303311025,    0
$$ Real data points
##PAGE= N=1
##DATA TABLE= (X++(R..R)), XYDATA
$$ [...]
47388a028989J23100K57540j6170N90608j9401k19497J85912N7352j04708K14198
$$ -1028989 -905889 -648349 -664519 -73911 -93312 -312809 -126897 -69545 -174253 39945
47378C9945J90657L72608o05316o38854l64718K88061R55062M81241k37539l89988
$$ 39945 230602 603210 -2106 -640960 -1005678 -717617 237445 718686 481147 91159
47368I1159n65181r95121m24769K90683N14082P71913k28869K9415M134o07752
$$ 91159 -474022 -1469143 -1893912 -1603229 -1089147 -317234 -546103 -516688 -512554 -1120306
47358a120306J061017l22388n50627N9607J76934L65618P81883o19935o03915
$$ -1120306 -59289 -381677 -932304 -872697 -695763 -330145 451738 -168197 -772112
47349g72112L159K63639O16489q99456K33457J05063M94198j32199k80374j94650
$$ -772112 -768953 -505314 111175 -788281 -554824 -449761 44437 -87762 -368136 -562786
47339e62786j76817O89456J30978n89417Q371N59408K97032P16655j34744n31522
$$ -562786 -739603 -50147 80831 -508586 -500215 59193 356225 1072880 938136 406614
47329D06614k96104k07295K92591P25919K41959o5348k88986m91375k67769O23868
$$ 406614 110510 -96785 195806 921725 1163684 1098336 809350 317975 50206 674074
47319F74074O697j186500L17880n6940j00035J11326m8819j14551m9228M65056
$$ 674074 680771 -505729 -187849 -244789 -344824 -233498 -282317 -396868 -446096 18960
47309A8960l98200N4428p60158J32712J97771L69565N25393M30275k64555J61162
$$ 18960 -379240 -324812 -1084970 -952258 -754487 -384922 140471 570746 306191 467353
47299D67353m9913j2903L88150M10728j385609J31866N74511l25776K49062k20900
$$ 467353 417440 404537 792687 1203415 -182194 -50328 524183 198407 447469 226569
47289B26569j29808q28076K03248O35701n6644J56470l12466J66037K25251m82055
$$ 226569 96761 -731315 -528067 107634 50990 207460 -105006 61031 286282 -195773
47279a95773K92759L74321n52980L62870m69029K91561r3515M72709L05150p29489
$$ -195773 96986 471307 -81673 281197 -187832 103729 10214 482923 788073 58584
47269E8584o63686K00296M60542J0591J15358K02644k45430k00504N41612l3625
$$ 58584 -605102 -404806 55736 66327 181685 384329 138899 -61605 480007 446382
47259D46382k8585j54007j63262o20299l78772O74563N90139L58331M21742J91546
$$ 446382 417797 263790 100528 -519771 -898543 -223980 366159 724490 1146232 1337778
47249A337778j136365L10393p97311l702k38552l98409l07018L08069J00627J88797
$$ 1337778 201413 511806 -285505 -289207 -527759 -926168 -1233186 -925117 -824490 -635693
47239f35693N64843N06603n06924N97895m15921O1440R5938m84712m31771M01597
$$ -635693 -70850 435753 -71171 526724 110803 172243 268181 -216531 -648302 -246705
47229b46705L64092k88968l23104k82495m5575R2650K16878P703J47296P87777
$$ -246705 117387 -171581 -494685 -777180 -822755 -730105 -513227 -505524 -358228 429549
47219D29549J88619q13321l67166O30339j80236R138J67150k8772k2683k84771
$$ 429549 618168 -195153 -562319 68020 -112216 -103078 64072 35300 12617 -272154
47209b72154l86371n3844L31212N17716r7735j58080P788Q19125J031427n33438
$$ -272154 -658525 -712369 -381157 136559 38824 -119256 -111468 707657 1739084 1205646
47199A205646m91658k53715n97949J48163M77349j36365o62587m665K32284m30761
$$ 1205646 713988 460273 -137676 10487 487836 351471 -311116 -315781 -83497 -514258
47189e14258P32974L18232q38709J16912j64068l32422N36392K79413N1838o4727
$$ -514258 218716 536948 -301761 -184849 -348917 -681339 -144947 134466 186304 121577
47179A21577k34997q22740J86755P67282l99669L09n91448J28576N46472J11192
$$ 121577 -113420 -936160 -749405 17877 -381792 -381483 -972931 -844355 -297883 -186691
47169a86691L00756L74275j027474n15415O40515k59208j47193K52225j31540
$$ -186691 114065 488340 -539134 -1054549 -414034 -673242 -820435 -568210 -699750
47160f99750k88331P90584K59935J92138O07949J96683j177340q05949L77101
$$ -699750 -988081 -197497 62438 254576 862525 1059208 -118132 -924081 -546980
47151e46980J102548K88525o86972l38393Q1768J102407J08933l1162j482464
$$ -546980 555568 844093 157121 -181272 -99504 1002903 1111836 1080674 -401790
47142d01790n99023K01196P70580j88724M233O60585m018p82688n42299P56177
$$ -401790 -1000813 -799617 -29037 -217761 -213528 447057 443039 -339649 -881948 -125771
47132a25771J92898m19942J5113K27956M49498J78623k06459N3489p81542j92191
$$ -125771 67127 -352815 -337702 -109746 339752 518375 311916 365405 -416137 -608328
47122f08328N87280J97130j03481k21821j04385p64294k43305R05917K12628j16048
$$ -608328 -21048 176082 72601 -149220 -253605 -1017899 -1261204 -355287 -142659 -258707
47112b58707j26310J029196l45248Q010j53374n00870M86817k34526n29972n3148
$$ -258707 -385017 644179 298931 306941 153567 -347303 139514 -95012 -624984 -678132
47102f78132L85102l9143n13719O75326q2875K51098Q612k90825n2830p0477r5802
$$ -678132 -293030 -332173 -845892 -170566 -253441 -2343 6269 -284556 -337386 -407863 -503665
47091e03665J92760k25512P03495L91174N9112l6884J26393n85899o31050p14633
$$ -503665 -310905 -536417 167078 558252 617364 580480 706873 120974 -510076 -1224709
47081a224709K40792J084631l4187m34300j93702R34769n91639o11171N14569
$$ -1224709 -983917 100714 66527 -367773 -561475 373294 -218345 -829516 -314947
47072c14947l5958m61998J09682K91320M93821P61117l00331j55386o22022n78386
$$ -314947 -350905 -812903 -703221 -411901 81920 843037 542706 387320 -234702 -813088
47062h13088P74536O2588N86401L55934K40163o82507q05603n41268k98642P55153
$$ -813088 -38552 24036 610437 966371 1206534 524027 -281576 -822844 -1121486 -366333
47052c66333O34848l17211k82162j59459K01924K23861J39153r4659J76720R1037
$$ -366333 268515 -48696 -330858 -490317 -288393 -64532 74621 -20038 156682 247719
47042B47719L92979N81566k96446j155846N1732j96777P778L15231O37549J90931
$$ 247719 640698 1222264 925818 -230028 -178296 -375073 -367295 -52064 585485 776416
47032G76416m71904N19639n62383k46866k7808k58063l58007l93236Q7611M76842
$$ 776416 304512 824151 261768 14902 -12906 -270969 -628976 -1022212 -934601 -457759
47022d57759N73408r1804M47848J70580M9083m21954R30761k77639m40356k90647
$$ -457759 115649 23845 471693 642273 691356 269402 1200163 922524 482168 191521
47012A91521o671Q6996k32330j22364j63191L0476L81764m17142J84817R2021
$$ 191521 184850 271846 39516 -82848 -246039 -215563 166201 -250941 -66124 25897
47002B5897O61732N88320L4319m83768p88035m57637J174402k59425L4875L94001
$$ 25897 687629 1275949 1310268 826500 38465 -419172 755230 495805 530680 924681
46992I24681k7975n01573K679K1152k37859M12305M49527j30352k37342o60667
$$ 924681 896706 395133 397812 418964 181105 593410 1042937 912585 675243 14576
46982A4576j176960O9360P01815M01642k73963K48322N04644K71812r82562J21185
$$ 14576 -1162384 -1093024 -391209 10433 -263530 -15208 489436 761248 -221314 -100129
46972a00129k50330j090939L18844O40798P05960J22224p84082N51231M85608
$$ -100129 -350459 -1441398 -1122554 -481756 224204 346428 -437654 113577 599185
46963E99185k7954j60998l34323j72930L91810L95626Q1476n81456l16864k45614
$$ 599185 571231 410233 75910 -97020 294790 690416 771892 190436 -126428 -372042
46953c72042J3739k37411J139689K22162j72891n104m17334p25891J145180P35705
$$ -372042 -358303 -595714 543975 766137 593246 588142 170808 -555083 590097 1325802
46943A325802p18131N27965K26471q43173J4871m93481m69904R04584K84314K27374
$$ 1325802 607671 1135636 1362107 518934 533805 40324 -429580 475004 759318 986692
46933I86692r48289k92949P57355K02627l71844j30535k64531p23536J93509P29836
$$ 986692 38403 -254546 502809 705436 333592 203057 -61474 -785010 -591501 138335
46923A38335O9424n19209Q569L48990K82755l79605r2519l59482k00676K37373
$$ 138335 207759 -311450 -302881 46109 328864 -50741 -143260 -502742 -703418 -466045
46913d66045M56774M83471L21438L8404q63688j136821N89472J138364o82215
$$ -466045 -9271 474200 795638 834042 -29646 -1166467 -576995 561369 -120846
46904a20846p0784K64096J99990m28122L08698n08212j133011Q11014Q29431Q1138
$$ -120846 -191630 72466 272456 -155666 153032 -355180 -1488191 -677177 152254 233392
46894B33392K03692K56150q82530P8759L47251O00773n75909P6448k84932j217978
$$ 233392 437084 693234 -189296 -110537 236714 837487 261578 338026 53094 -1164884
46884a164884L89258j1249j26889j36216M5819k40367M13139M79987J44198K56366
$$ -1164884 -775626 -786875 -913764 -1049980 -1004161 -1244528 -831389 -351402 -207204 49162
46874D9162p16038L30103M33584J1456J49035L68355k80692k89575n37672k64613
$$ 49162 -666876 -336773 96811 108267 257302 625657 344965 55390 -482282 -746895
46864g46895j01960m53577N17533J033618l59823k04513p43846L03030J050910
$$ -746895 -848855 -1302432 -784899 248719 -111104 -315617 -1059463 -756433 294477
46855B94477N52349m63338K2975m69581k10982l84925O7151N0949l70785J123100
$$ 294477 846826 383488 406463 -63118 -274100 -659025 -591874 -540925 -911710 211390
46845B11390k08441o15373J70424K67497O4020o8099K80726K98296l99524j79551
$$ 211390 2949 -612424 -442000 -174503 -110483 -178582 102144 400440 916 -178635
46835a78635J91440o6015j72040j47511n4525N41629J70947j096818l17019k160
$$ -178635 12805 -53210 -225250 -372761 -427286 114343 285290 -811528 -1128547 -1130707
46825a130707J03435L16138J19009N87842L88720k44928J14668L3252J95284k36804
$$ -1130707 -1027272 -711134 -592125 -4283 384437 139509 254177 287429 482713 245909
46815B45909m07878j45763K66046N625l22280L59554j05418l65201K45456o48632
$$ 245909 -161969 -307732 -41686 -36061 -358341 1213 -104205 -469406 -223950 -872582
46805h72582O06299N93181J30066j23284l12653J38103l63507J31605N95012o34949
$$ -872582 -266283 326898 456964 333680 21027 159130 -204377 -72772 522240 -112709
46795a12709k03416N84705j97164k86448K48780L20500M58623o1699j031007n00688
$$ -112709 -316125 268580 71416 -215032 33748 354248 812871 751172 -279835 -780523
46785g80523m377M17535m39668K35281L03175P3216j15030L93992K45310K31279
$$ -780523 -784900 -367365 -807033 -571752 -268577 -195361 -310391 83601 328911 560190
46775E60190l99119M7201q03453L8048O16525q197M844J17304m86867P42358O04033
$$ 560190 161071 208272 -595181 -557133 59392 51195 56039 173343 -313524 428834 1032867
46764A032867n21784l21496J72279o80958k70110K8620k61278J025363L39l70907
$$ 1032867 511083 189587 361866 -319092 -589202 -560582 -821860 203503 203842 -167065
46754a67065m25224Q2809P06748J018945p83456j396146M20279Q05895J87256
$$ -167065 -592289 -509480 197268 1216213 432757 -963389 -543110 262785 450041
46745D50041m7634j55811J5712R4758l08447P054L63339k79718m63646L08048
$$ 450041 402407 246596 262308 357066 48619 55673 419012 139294 -324352 -16304
46735a6304n08033m35616O2554L06233J50860j1892N86230l7106k1845J91271
$$ -16304 -524337 -959953 -897399 -591166 -440306 -452198 134032 96926 75081 266352
46725B66352p5141K58152o42659m43703Q13703k00724k10203O38159L07252m52059
$$ 266352 191211 449363 -193296 -636999 176704 -24020 -234223 403936 711188 259129
46715B59129k37500k01212J4102j37114M63266m91152M36597K0101r17502j69144
$$ 259129 21629 -179583 -165481 -302595 160671 -330481 106116 126217 -791285 -960429
46705i60429M12745m26246j10617N09653M12704k1812M63545j65276j08374n41604
$$ -960429 -547684 -973930 -1084547 -574894 -162190 -184002 279543 114267 5893 -535711
46695e35711P30919K8421q48042l91548O63066N79426m90625J44219L17404K60228
$$ -535711 195208 223629 -624413 -1015961 -352895 226531 -264094 -119875 197529 457757
46685D57757q89704n37129K52066L08032J89512m26487O0925K9568J91861k16369
$$ 457757 -431947 -969076 -717010 -408978 -219466 -645953 -585028 -555460 -363599 -579968
46675e79968N01560N40797k24682k75314L87777m59927l20966p989N48287m84538
$$ -579968 -78408 462389 237707 -37607 350170 -109757 -430723 -438712 109575 -374963
46665c74963j62436Q63337m34791P6471o54186k57147J66663j78084P01721j045229
$$ -374963 -537399 325938 -108853 -32382 -686568 -943715 -777052 -955136 -253415 -1298644
46655a298644j53379J642577J140999k87276p3298j29567k54607P27744k18008
$$ -1298644 -1452023 190554 1331553 1044277 970979 841412 586805 1314549 1096541
46646A096541m70832l49272o569Q13169n02670q85500L64062k00375Q01811P9647
$$ 1096541 625709 276437 269868 1083037 580367 -305133 58929 -141446 660365 740012
46636G40012J51319R9917p64104L09746k12481n75001M21113M22256N81928o92324
$$ 740012 891331 991248 227144 536890 324409 -250592 170521 592777 1174705 482381
46626D82381p2864l58241J93087Q12411P3909j068372m85468K64024N65216k37824
$$ 482381 409517 51276 244363 1056774 1130683 62311 -423157 -159133 406083 168259
46616A68259m02580J07436O98963j90551m62642m66959N19488j75814k49244K5572
$$ 168259 -234321 -126885 572078 381527 -81115 -548074 -28586 -204400 -453644 -428072
46606d28072R8929j37935k0510k95258L10186Q81248L40331j265399o71484N55215
$$ -428072 -329143 -467078 -487588 -782846 -472660 408588 748919 -516480 -1187964 -632749
46596f32749J25530p2197R7179K33238N809k79894N4901K03477K28933n0580n67135
$$ -632749 -507219 -579416 -482237 -248999 -243190 -523084 -468183 -264706 -35773 -86353 -653488
46585f53488l3634M62757j84668j69643J254836p02031p91514Q44543J037870
$$ -653488 -687122 -224365 -409033 -578676 676160 -25871 -817385 27158 1065028
46576A065028q53546n46890j40911K48030j36129P07497J63736K92387j25528
$$ 1065028 211482 -335408 -476319 -228289 -364418 343079 506815 799202 673674
46567F73674j75754k95954m31546j53761J33841J078610L81581m44395J21693
$$ 673674 497920 201966 -229580 -383341 -249500 829110 1210691 766296 887989
46558H87989n52999J32012j67952N76402k23580o17652M08607L82916k65767m10448
$$ 887989 334990 467002 299050 875452 651872 34220 442827 825743 559976 149528
46548A49528l32365j15399M20342K62591n47157J98601J43441j37206N76971o56544
$$ 149528 -182837 -298236 122106 384697 -162460 36141 179582 42376 619347 -37197
46538c7197l10018J79617J19675M61690N40579p0479p9713r11483m78496m04492
$$ -37197 -347215 -167598 -47923 413767 954346 883867 804154 -107329 -585825 -990317
46528i90317J67066L3574L50364J08257j50312P55607k12890l53102J37251l76838
$$ -990317 -823251 -789677 -439313 -331056 -481368 274239 61349 -291753 -154502 -531340
46518e31340j281889K55042M60542J085326L54468j49604K20331m18457M4161
$$ -531340 -1813229 -1558187 -1097645 -12319 342149 192545 412876 -5581 38580
46509C8580j42185O74683M43610k33311m45670p04236l83530L50502m7623L84810
$$ 38580 -103605 571078 1014688 781377 335707 -368529 -752059 -401557 -449180 -64370
46499f4370R80383j51183K21149l94359n73752L94389J66817l04252r16430L77702
$$ -64370 916013 764830 985979 591620 17868 412257 579074 274822 -641608 -263906
46489b63906k6570O38287o3428l60180O61352L0145n73027m11827n9751K88435
$$ -263906 -290476 347811 284383 -75797 585555 615700 42673 -369154 -428905 -140470
46479a40470K59666m03665k32997q2245J75306R03386J68263q9502k52858J87559
$$ -140470 119196 -284469 -517466 -599711 -424405 478981 647244 557742 304884 492443
46469D92443k19181m28093J087978o0354j83821m05493p71509N11217N29221m24444
$$ 492443 273262 -154831 933147 872793 688972 283479 -488030 23187 552408 127964
46459A27964j69091N61651k85896o28258K93787J155529n28653q65308R03232
$$ 127964 -41127 520524 234628 -393630 -99843 1055686 527033 -338275 564957
46450E64957J59428M31744k97789k83666l57279J57266j4539l14158l68609l44605
$$ 564957 724385 1156129 858340 574674 217395 374661 360122 45964 -322645 -667250
46440f67250L39533m43922L6574N70709L72465P4738K49376N37265o65046r66461
$$ -667250 -327717 -771639 -735065 -164356 208109 282847 532223 1069488 404442 -562019
46430e62019n4005j21075r11230P58635j34030j99697M54057N2485J001277O77586
$$ -562019 -616024 -737099 -1648329 -889694 -1023724 -1223421 -769364 -716879 284398 961984
46420I61984j319453r71228L93148L11631k76827J044290M2091L1680p68861j75969
$$ 961984 -357469 -1328697 -935549 -623918 -900745 143545 185636 217316 -551545 -727514
46410g27514o933P57278K2665k02411K95945R3257n90643j49849j86262m94605
$$ -727514 -734447 22831 45496 -156915 139030 232287 -358356 -508205 -694467 -1189072
46400a189072K90721R1243R37901p7070j19923j13223K43J30435o0071K02787
$$ -1189072 -898351 -807108 130793 53723 -66200 -179423 -179180 -48745 -108816 93971
46390I3971O40260k42003k97526J63308o79337k06445O32383m0122l08189p44115
$$ 93971 734231 492228 194702 358010 -321327 -527772 104611 64489 -243700 -987815
46380i87815K98361K59753n37931K41061L35537L92574N97671o28128k69418k24424
$$ -987815 -689454 -429701 -967632 -726571 -391034 1540 599211 -28917 -298335 -522759
46370e22759K1122q3593J16628P15298l48130K54888K8564q1845n30884M05621
$$ -522759 -501637 -585230 -468602 246696 -101434 153454 182018 100173 -430711 -25090
46360b5090P47837j34042n96200l47140Q030k05688Q86399l07471j22716l19326
$$ -25090 722747 588705 -7495 -354635 -346605 -552293 334106 26635 -96081 -415407
46350d15407N69828O4115l1941J48383K37520q74852p41889M26008J22135P26153
$$ -415407 154421 218536 186595 334978 572498 -302354 -1044243 -618235 -496100 230053
46340B30053L78021q0454O29411k36184q30542m948L71938K10797o08528K17765
$$ 230053 608074 527620 1157031 920847 90305 85357 457295 668092 59564 277329
46330B77329M40937M54457j131788J69401m07659r07645J178432m65153L58208
$$ 277329 718266 1172723 40935 210336 -197323 -1104968 73464 -391689 -33481
46321c3481L30321q4789j077410l61918M05656R42147M95210K17223O6432k01939
$$ -33481 296840 212051 -865359 -1227277 -821621 120526 615736 832959 899391 697452
46311F97452k08343r44304P3908m4274Q302O25536N16098O47699J2743n95464
$$ 697452 489109 -455195 -381287 -425561 -417259 208277 724375 1372074 1384817 789353
46301G89353k27005L3562q26603p35850Q65457q5387l34911J121013Q09692O6586
$$ 789353 562348 595910 -230693 -966543 -101086 -186473 -521384 599629 1409321 1475907
46291A475907p44732j187272l5646N49597l47699J58780O47200R2810m88044k75556
$$ 1475907 731175 -456097 -491743 57854 -289845 -131065 516135 608945 120901 -154655
46281a54655L13226o92349J72468O17734P10895K91618R9811k03699j100444m19853
$$ -154655 158571 -533778 -361310 256424 967319 1258937 1358748 1155049 54605 -365248
46271c65248k44452M96945k3965m1370P57972Q21039q82512L60950l82986r40964
$$ -365248 -609700 -112755 -136720 -178090 579882 1400921 518409 879359 496373 -444591
46261d44591k8623N86128N98150l9567m95472R5274J52178l35318K23140l55466
$$ -444591 -473214 112914 711064 671497 176025 271299 423477 88159 311299 -44167
46251d4167o99056O53548q666J0769k15904j66839n34973L71214k5306l778K94949
$$ -44167 -743223 -89675 -98341 -87572 -303476 -470315 -1005288 -634074 -659380 -663158 -368209
46240c68209J065461L87273l73714J01924L01980m79403o19869j13012N28030
$$ -368209 697252 1084525 710811 812735 1114715 635312 15443 -97569 430461
46231D30461J64440p92684k84540j10312j84760J13799j12368J8849L81225K59690
$$ 430461 594901 -197783 -482323 -592635 -777395 -663596 -775964 -757115 -375890 -116200
46221a16200k50193L14445M87817J9794q90996m43660M90605M63517m91054O28409
$$ -116200 -366393 -51948 435869 455663 -435333 -878993 -388388 75129 -415925 212484
46211B12484j12551k13940k02936M32890q54626O108M29301l32R6347O0361Q4907
$$ 212484 99933 -114007 -316943 115947 -738679 -732571 -303270 -303602 -207255 -146894 -61987
46200f1987n67391j61114J47079Q42351L63545o76228j095026K74577O33803O39274
$$ -61987 -629378 -790492 -643413 198938 562483 -113745 -1208771 -934194 -300391 338883
46190C38883o23825k63020N2894J76360P18534J2460j035428L00081O5159p70851
$$ 338883 -284942 -547962 -495068 -318708 399826 412286 -623142 -323061 -257902 -1028753
46180a028753O70740M09623J65314l41780j80907k23287N92137L41261p70760
$$ -1028753 -358013 51610 216924 -124856 -305763 -529050 63087 404348 -366412
46171c66412L90297Q15668j22736l55340o46780j03362L27811o21869m29490N28709
$$ -366412 23885 839553 716817 361477 -285303 -388665 -60854 -682723 -1112213 -583504
46161e83504N77814o7492k0060M02989l02002l08275n33827O89917R6772j55722
$$ -583504 -5690 -73182 -93242 309747 7745 -300530 -834357 -144440 -47668 -203390
46151b03390N9761n7636k38122l99557M30223Q38915K21826l41641l30694j24602
$$ -203390 -143629 -201265 -439387 -838944 -408721 430194 652020 310379 -20315 -144917
46141a44917r00252L15620P22073j42714o983j49107J47339M64942L20560l46577
$$ -144917 -1045169 -729549 -7476 -150190 -157173 -306280 -158941 306001 626561 279984
46131B79984N3803L08455o9120L06525j21905p95058l54828L35012M80887l96935
$$ 279984 333787 642242 573122 879647 757742 -37316 -392144 -57132 423755 26820
46121B6820k24890l13125K16604j7849Q22658j02652L23121n1562j04369k74403
$$ 26820 -198070 -511195 -294591 -312440 510218 407566 730687 679125 574756 300353
46111C00353q66989J6116J92717Q5939k26736q2170R99J6248J16744n52476n27131
$$ 300353 -566636 -550520 -357803 -271864 -498600 -580770 -579771 -563523 -446779 -999255 -1526386
46100a526386L23920M07182J82739o75733q8072K56631m30823J111733L89164
$$ -1526386 -1202466 -795284 -612545 -1288278 -1376350 -1119719 -1550542 -438809 -49645
46091d9645K83234O4654o87111q4035O93940M51369o40830l29583k87207J13942
$$ -49645 233589 298243 -388868 -472903 221037 672406 31576 -298007 -585214 -471272
46081d71272L8055j66739J4543K94101M6632N81841l71133N89518k1485q30573
$$ -471272 -433217 -599956 -585413 -291312 -244680 337161 -33972 555546 534061 -296512
46071b96512j21510j21807L02798O76471N11274J85337l70777o36397L85852P8255
$$ -296512 -418022 -539829 -237031 439440 950714 1136051 765274 128877 514729 592984
46061E92984r02505r43657O40820P28434k8159J20561m19896j35063l98472m457
$$ 592984 -309521 -1253178 -612358 116076 87917 208478 -211418 -346481 -744953 -749410
46051g49410O95947l290J82368n72598j67597q45840P7554Q33445L76458J57278
$$ -749410 -53463 -56753 125615 -446983 -614580 -1460420 -1382866 -549421 -172963 -15685
46041a5685n59689K42756K89634K67180j24982o89959q5248L98212L22934K76501
$$ -15685 -575374 -332618 -42984 224196 99214 -590745 -675993 -277781 45153 321654
46031C21654j60115J83136o71694l90520R461N4807J64276L30693K88002j59108
$$ 321654 161539 344675 -327019 -717539 -708078 -653271 -488995 -158302 129700 -29408
46021b9408k2380j08650l29312K87927l73527l6726j17903J94228L91047r1014
$$ -29408 -51788 -160438 -489750 -201823 -575350 -612076 -729979 -535751 -144704 -235718
46011b35718L53024K48133m21501J20393J23012k88355K29369N18894o64464J86740
$$ -235718 117306 365439 -56062 64331 187343 -101012 128357 647251 -17213 169527
46001A69527N12140q73257m27604J21358J257785j32211p11182l22772O1783l09901
$$ 169527 681667 -191590 -619194 -497836 759949 627738 -83444 -406216 -344433 -654334
45991f54334j45081L72093l53435J39643L51168K94876k9143l57573o63955M60553
$$ -654334 -799415 -427322 -780757 -641114 -289946 4930 -24213 -381786 -1045741 -585188
45981e85188Q08713K19283k48432k27588M10644m46275n59019J45658N91555L02404
$$ -585188 223525 442808 194376 -33212 377432 -68843 -627862 -482204 109351 411755
45971D11755q9807N00656r11057K60869j15041K62923k6871J63974K57966p12254
$$ 411755 321948 822604 -88453 172416 57375 320298 293427 457401 715367 3113
45961C113r76848M1020L54613O55634P04261p18544O37718M0375p59431M22984
$$ 3113 -973735 -932715 -578102 77532 781793 63249 700967 741342 -18089 404895
45951D04895M3444l54813J55868J00722Q63669K62970j148654j80965Q8333l89160
$$ 404895 448339 93526 249394 350116 1213785 1476755 328101 147136 235469 -153691
45941a53691k94804o77123K84767L78472o0241K84174o7379Q1103o76614p37730
$$ -153691 -448495 -1125618 -840851 -462379 -522620 -238446 -305825 -224722 -901336 -1639066
45931a639066R83900P61320l49984l01013O73250R0607J94952L31151J1163J17404
$$ -1639066 -655166 106154 -243830 -544843 128407 219014 413966 745117 756280 873684
45921H73684o3109k86985Q249o48653n56589N59528J047864l0216j227478L26692
$$ 873684 810575 523590 531839 -116814 -673403 -113875 933989 903773 -323705 2987
45911B987Q46563p23477K1968m57930N42042p7762n22739j74734J16247L32444
$$ 2987 849550 126073 148041 -309889 232153 154391 -368348 -543082 -426835 -94391
45901i4391k39176l19161N64068M2256J15292R8173l16735p95234J78631L2490
$$ -94391 -333567 -652728 -88660 -46404 68888 167061 -149674 -944908 -766277 -733787
45891g33787Q9033Q14752N7951n00698K29257n1257L3642L7938Q44093r3951q17310
$$ -733787 -644754 169998 227949 -272749 -43492 -94749 -61107 -23169 820924 726973 -90337
45880i0337j41126k8501O39973k96756r64044l35840j35694P58175j52157Q17819
$$ -90337 -231463 -259964 380009 83253 -880791 -1216631 -1352325 -594150 -746307 71512
45870G1512j00629J46938K32800m55863j57785P37684R57262O1158j057083j43189
$$ 71512 -29117 117821 350621 -105242 -263027 474657 1431919 1493077 435994 292805
45860B92805K88917K10371k68917J97779k18300J79604o11317J40447L66294p96959
$$ 292805 581722 792093 523176 720955 502655 682259 70942 211389 577683 -219276
45850b19276k32732r3240P06096O9614q6985j346615q1011R12070K5629j092306
$$ -219276 -452008 -545248 160848 230462 143477 -1203138 -1284149 -372079 -346450 -1438756
45840a438756j29861J187206M19787j61717K92321O95941j10505m18916K07202
$$ -1438756 -1568617 -381411 38376 -123341 168980 864921 754416 335500 542702
45831E42702p11221R49373K49703m13393N8893o89039j46052L50227k6724o62222
$$ 542702 -168519 780854 1030557 617164 676057 -12982 -159034 191193 164469 -497753
45821d97753J55139J38840J41608o47183K4243m0371n7135l1519M22701N19799
$$ -497753 -342614 -203774 -62166 -709349 -685106 -725477 -782612 -814131 -391430 128369
45811A28369k10155J34838Q0458k65651m10009l99509L0385k75898Q35526M77786
$$ 128369 -81786 53052 133510 -132141 -542150 -941659 -911274 -1187172 -351646 126140
45801A26140K86564M30305j36236M18975J3K29785j077561q7348M88562l24207
$$ 126140 412704 843009 706773 1125748 1125761 1355546 277985 190637 679199 354992
45791C54992m24971M37816m4874J45054M57161o16610m62562K47037J86769L99060
$$ 354992 -69979 367837 322963 468017 925178 308568 -153994 93043 279812 678872
45781F78872m61713L94860P18196k4382j049802p75784N26350o2652L43532J55387
$$ 678872 217159 612019 1330215 1305833 256031 -519753 6597 -56055 287477 442864
45771D42864J32573K94189J0279n58555m01538j58896L79300K67165J251863j07097
$$ 442864 575437 869626 879905 321350 -80188 -239084 140216 407381 1659244 1552147
45761A552147m63793m62197n99121j25794M03092m29651j05459N01290k08052
$$ 1552147 1088354 626157 27036 -98758 304334 -125317 -230776 270514 62462
45752F2462j011869l55121J415991o8182n3915K17991J92875M62422O12895n67242
$$ 62462 -949407 -1304528 111463 43281 -10634 207357 400232 862654 1475549 908307
45742I08307J69463m81479j084733N23123O34189p28786m74296J173220M09201
$$ 908307 1077770 596291 -488442 34681 668870 -59916 -534212 639008 1048209
45733A048209q48633p0429l00700J4708K87230M48528R3818q49962K6488J50196
$$ 1048209 199576 129147 -171553 -156845 130385 578913 672731 -177231 -150743 -547
45723e47K95843R1528K22220q24320m6539M73710K10203J70969j0211o06757n64564
$$ -547 295296 386824 609044 -215276 -261815 211895 422098 593067 582856 -23901 -588465
45712e88465k54256K34171K80338N45874r5163k34644l63173k53943J81071M222
$$ -588465 -842721 -608550 -328212 217662 122499 -112145 -475318 -729261 -548190 -543968
45702e43968j88709J92122J009387k3918L35061J89012L59812P41705k02811j489974
$$ -543968 -732677 -540555 468832 444914 779975 968987 1328799 2070504 1867693 377719
45692C77719l56137j46836J14135j63984K07853K06966k03420K19584J20792j85847
$$ 377719 21582 -125254 -11119 -175103 32750 239716 36296 255880 376672 190825
45682A90825K51930j75191j26735Q275k86796L66418Q72161n84742p71330O65300
$$ 190825 442755 267564 140829 149104 -137692 228726 1100887 516145 -255185 410115
45672D10115J32703m92043K04923K37891j31601n00559j4586L91850l94507l78050
$$ 410115 542818 50775 255698 493589 361988 -138571 -153157 238693 -155814 -533864
45662e33864k13934k8406L28588P59996o52822J86942K18873p73235j69555K17088
$$ -533864 -747798 -776204 -447616 312380 -340442 -153500 65373 -707862 -877417 -660329
45652f60329l3990L87897o63923M56928N33683j14241M26737l84035Q5707l17986
$$ -660329 -694319 -306422 -970345 -513417 20266 -93975 332762 -51273 34434 -283552
45642b83552r5968m2855l40692r0537R58910K59923J98863P1932n39161L93448
$$ -283552 -379520 -422375 -763067 -853604 105306 365229 564092 636024 96863 490311
45632D90311L21128j86132l89340J20226m56357P3971K55794l70396q81017M13210
$$ 490311 811439 625307 235967 356193 -100164 -26193 229601 -140795 -1021812 -608602
45622f08602P87258l02567o43574N44569N30068k79068R2565M0132l03393P89618
$$ -608602 178656 -123911 -767485 -222916 307152 28084 120649 160781 -142612 647006
45612F47006o75007l71144R238k86248K76504j80958L16728L76278n5999l11844
$$ 647006 -28001 -399145 -389907 -676155 -399651 -580609 -263881 112397 56398 -255446
45602b55446m67438k54685J16602J60834l04488o20075J418286J320126n62316
$$ -255446 -722884 -977569 -860967 -700133 -1004621 -1624696 -206410 1113716 551400
45593E51400l6005l47410M09104M94683J95504j260342n80547o4312l47966N02824
$$ 551400 515395 167985 577089 1071772 1267276 6934 -573613 -637925 -985891 -483067
45583d83067O93350P0581L07806k41574j2002n0726m23031m0487K3440j15638
$$ -483067 210283 280864 588670 347096 335094 284368 -138663 -179150 -155710 -271348
45573b71348m16798N83572K17014j67091l38594m3330R05911L74506m20501m20504
$$ -271348 -688146 -104574 112440 -54651 -393245 -436575 469336 843842 423341 2837
45563B837O19121j02153l69981k8730J05966l42061Q8116J80497m60700j49575
$$ 2837 621958 519805 149824 121094 227060 -115001 -26885 153612 -307088 -456663
45553d56663j56905P0619R97624m80050j017489K07580Q35994J87437j89541K61177
$$ -456663 -613568 -542949 454675 -25375 -1042864 -835284 710 188147 -1394 259783
45543B59783k74269P42349L16570r20432J09693O23780l16482K95503n99514n56711
$$ 259783 -14486 727863 1044433 124001 233694 857474 540992 836495 236981 -319730
45533c19730r04333J22608P83186k34789J2153j86667J17617M48017M62877j90992
$$ -319730 -1224063 -1101455 -318269 -553058 -540905 -727572 -609955 -161938 300939 109947
45523A09947O20302j513949l25395O12880L58393o3967J40280J07416n81052P33739
$$ 109947 730249 -783700 -1109095 -496215 -137822 -201789 -61509 45907 -535145 198594
45513A98594K27027m60655m46721N04530L89258l21245p7758K61346K41474l43070
$$ 198594 425621 -35034 -481755 22775 412033 90788 13030 274376 515850 172780
45503A72780M6231j17419j44208J78762p11265o089J95022j16029M84572l7600
$$ 172780 219011 101592 -42616 136146 -575119 -581208 -386186 -502215 -17643 -55243
45493e5243j17439J0684m063k80040N05833k27241l75424r8750m3661L04700K40748
$$ -55243 -172682 -161998 -166061 -446101 59732 -167509 -542933 -641683 -685344 -380644 -139896
45482a39896l76402m67965N4577r3351J158403K5743J2555m38287N6479R60804
$$ -139896 -516298 -984263 -929686 -1023037 135366 161109 173664 -264623 -208144 752660
45472G52660K4571J22838q40297j051695M75895J069911l06318p74567N70928
$$ 752660 777231 900069 59772 -991923 -516028 553883 247565 -527002 43926
45463D3926j04762K06956l11702j94611r0529l06236N48295k2137K11157o50553
$$ 43926 -60836 146120 -165582 -360193 -450722 -756958 -208663 -230800 -19643 -670196
45453f70196j75092O54463N13925N4307n52367r5508L56125M98858J145934p3833
$$ -670196 -845288 -190825 323100 377407 -174960 -270468 85657 584515 1730449 1656616
45443A656616q05355j55886p43946J58316K39008K86166J21193J9482l87370m5431
$$ 1656616 851261 695375 -48571 109745 348753 634919 756112 775594 388224 342793
45433C42793M92644K89181n55768K13120K19976o78734m26000J019206q0446p40108
$$ 342793 835437 1124618 568850 781970 1001946 323212 -102788 916418 835972 95864
45423I5864l98035M78098l54925K25329L70983q8990j226080M80214K9862k07280
$$ 95864 -302171 175927 -178998 46331 417314 328324 -897756 -417542 -387680 -594960
45413e94960l1525J60399L89949K36798l61416k6366j67371m54534Q816O44461
$$ -594960 -626485 -466086 -76137 160661 -200755 -227121 -394492 -849026 -840210 -195749
45403a95749R01661n5553o67804J50540o56354K21925K83857k55409l11999K86672
$$ -195749 705912 650359 -17445 133095 -523259 -301334 -17477 -272886 -584885 -298213
45393b98213N73012K72159m1915m23495p32130K37871N71174N37825j92879m58709
$$ -298213 274799 546958 505043 81548 -650582 -412711 158463 696288 503409 44700
45383D4700Q29740J23901n61881k34603o47837R43063n00955J081351K13024q63978
$$ 44700 874440 998341 436460 201857 -445980 497083 -3872 1077479 1290503 426525
45373D26525o1744m65456L20808j5628j73231K12754L25161p02096l04871J92643
$$ 426525 364781 -100675 220133 204505 31274 244028 569189 -132907 -437778 -245135
45363b45135k53535j69721N49338O40972O262k72755k6776J34514l92448j5491
$$ -245135 -498670 -668391 -119053 521919 528181 255426 228650 363164 -29284 -44775
45353d4775J39446O4823j90151J08634O7347j128316N69910N73520n27333K28017
$$ -44775 94671 159494 -30657 77977 145324 -982992 -413082 160438 -366895 -138878
45343a38878L83762j87962o9911L75765J27061M6255k51883j106872k79754M30592
$$ -138878 244884 56922 -12989 362776 489837 536092 284209 -822663 -1102417 -671825
45333f71825L64975N98073N09748M90448n53437p47469M34159j33405m6876J96341
$$ -671825 -306850 291223 800971 1291419 737982 -9487 424672 291267 244391 440732
45323D40732O2429K64610m58980L1627J71655K24066n32879l67372m51845k01647
$$ 440732 503161 767771 308791 340418 512073 736139 203260 -164112 -615957 -817604
45313h17604j71465l08984P49685o9274K52617P612j59244k68707o41555M94657
$$ -817604 -989069 -1298053 -548368 -617642 -365025 -357413 -516657 -785364 -1426919 -932262
45303i32262P84748j41850K49128J43675k14619k93232j56167P0853K36987N76865
$$ -932262 -147514 -289364 -40236 103439 -111180 -404412 -560579 -489726 -252739 324126
45293C24126n02280l88558J803n87724P38386L44746O36607m047n70305n66090
$$ 324126 -178154 -566712 -564909 -1152633 -414247 -69501 567106 563059 -7246 -573336
45283e73336o7960N16856j09841n84239R4866m00639N31468J009905K79187J64268
$$ -573336 -641296 -124440 -234281 -818520 -723654 -1124293 -592825 417080 696267 860535
45273H60535L1212j87635j13522q37814k1326K38466N6998n49528j43548K80245
$$ 860535 891747 704112 590590 -247224 -268550 -30084 26914 -522614 -666162 -385917
45263c85917R54768m00475j67061k5660P0550L97748m71901J44186P66321j219451
$$ -385917 568851 168376 1315 -24345 46205 443953 -27948 116238 882559 -336892
45253c36892k58775J47525L8924M75851L46968L99397j093772K74481O9493L28406
$$ -336892 -595667 -448142 -409218 66633 413601 812998 -280774 -6293 63200 391606
45243C91606J80417j64777l26449j51497Q49075K62899q09413l91139M8928l84942
$$ 391606 572023 407246 80797 -70700 778375 1041274 231861 -159278 -110350 -495292
45233d95292N75698l08995m36256k08576P67734M75566j38286O4948l40967K64990
$$ -495292 80406 -228589 -664845 -873421 -105687 369879 231593 296541 -44426 220564
45223B20564J09959p60814j58074N66954m1134m01169M53407P23508O1810o74458
$$ 220564 330523 -430291 -588365 -21411 -62545 -463714 -10307 713201 775011 100553
45213A00553k20325P58269k35639J72238l42799j289188L52116j83093j13021
$$ 100553 -119772 638497 402858 575096 232297 -1056891 -704775 -887868 -1000889
45204a000889P6875j04943O62791m23251J42414M96705j4847N99566M80494j8258
$$ -1000889 -924014 -1028957 -366166 -789417 -647003 -150298 -165145 434421 914915 896657
45194H96657j087655o8802k15825M7535J91289l8068o74540j07529M99387N39259
$$ 896657 -190998 -259800 -475625 -428090 -236801 -274869 -949409 -1056938 -557551 -18292
45184a8292P30197n63467p94884j33617J84444J56262l53777M04712m41022N0650
$$ -18292 711905 148438 -646446 -780063 -595619 -439357 -793134 -388422 -829444 -778794
45174g78794J457303N82712j021090m01380Q49543J84502k28346k05130j48445
$$ -778794 678509 1261221 240131 -161249 688294 872796 644450 439320 290875
45165B90875j49682k11359o44472l57038J91131L94232K93434R843P9697N72769
$$ 290875 141193 -70166 -714638 -1071676 -880545 -486313 -192879 -183036 -103339 469430
45155D69430j88321N87224j6133l60599r3823k55615M9540n1487N35341l81448
$$ 469430 281109 868333 852200 491601 397778 142163 191703 140216 675557 294109
45145B94109K55024J10479q21790k64931N72664J73814L51602l89680j79725j46972
$$ 294109 549133 659612 -162178 -427109 145555 319369 670971 281291 101566 -45406
45135d5406q1717P73835k43616K90763J86614m90366k09980j42175r3450j36725
$$ -45406 -127123 646712 403096 693859 880473 390107 180127 37952 -55498 -192223
45125a92223N80902l43054p79658K08898O17238K34590R0897M88573P6523p69292
$$ -192223 388679 45625 -734033 -525135 92103 326693 417590 906163 982686 213394
45115B13394N52529j17389k46256M45300r59768m45991l4053Q3303J69443Q19197
$$ 213394 765923 648534 402278 847578 -112190 -558181 -592234 -508931 -339488 479709
45105D79709j86800j92688J63972l2127l47469N02228K74089J11724K70941l05510
$$ 479709 292909 100221 264193 232066 -115403 386825 660914 772638 1043579 738069
45095G38069l24910N57050J0715j50180j79892k88620J84703N3624L61581j151825
$$ 738069 413159 970209 980924 830744 650852 362232 546935 600559 962140 -189685
45085a89685K90950J10313N01536m48153Q4443N6388p0329J07746j65298k8233
$$ -189685 101265 211578 713114 264961 349404 405792 335463 443209 277911 249678
45075B49678R821J40792l73870k87444M51939r6364j77595J21722l19486L12363
$$ 249678 259499 400291 26421 -261023 190916 94552 -83043 38679 -280807 31556
45065C1556L65966n13116k11436R21974j1578N0780O04951M92228j26425N35901
$$ 31556 397522 -115594 -327030 594944 583366 634146 1239097 1731325 1604900 2140801
45055B140801K56806j100851m65771m46819N04201r2979L68903r43983p2694L53885
$$ 2140801 2397607 1296756 830985 384166 888367 795388 1164291 220308 147614 501499
45045E01499N8082l4401k31446j70422k11931K06079j49700N8074k75286o4814
$$ 501499 559581 525180 293734 123312 -88619 117460 -32240 25834 -249452 -314266
45035c14266L74896l41058n31537L73021q4673N8895K11738J46303J28746M9596
$$ -314266 60630 -280428 -811965 -438944 -523617 -464722 -252984 -106681 22065 71661
45025G1661K56146K73729k86297M80026L95950j95159n33767P77621K83502n72553
$$ 71661 327807 601536 315239 795265 1191215 996056 462289 1239910 1523412 950859
45015I50859n03359k97516P1875n95093J10937J287970p2562j68455O11913M00081
$$ 950859 447500 149984 221859 -373234 -262297 1025673 953111 784656 1396569 1796650
45005A796650j016658k43724K28809P1042O7931p63943J70877j49119J22022P68510
$$ 1796650 779992 536268 765077 836119 904050 140107 310984 161865 283887 1052397
44995A052397m97117n18712N3214Q86976M96683K86909j63557l51348p4330o07321
$$ 1052397 555280 36568 89782 976758 1473441 1760350 1596793 1245445 1171115 563794
44985E63794J92860L02766p02196n8670L01663M13576j68934K89387n0286j02122
$$ 563794 756654 1059420 357224 298554 600217 1013793 844859 1134246 1083960 981838
44975I81838K26033j57164j87784m74020N77514L11764j3201r88820j37460N40987
$$ 981838 1207871 1050707 862923 388903 966417 1278181 1264980 276160 138700 679687
44965F79687l12785L05431K4526j052816k77326O0324q2146j63576Q05109P26948
$$ 679687 366902 672333 696859 -355957 -633283 -572959 -655105 -818681 -13572 713376
44955G13376l44811M35882N49754n34698n0193M74372J92459j31251o62154K71778
$$ 713376 368565 804447 1354201 819503 769310 1243682 1436141 1304890 642736 914514
44945I14514K93459J5170L2416j52046j35560p45762K25521J67512N64103l7931
$$ 914514 1207973 1223143 1255559 1103513 967953 222191 447712 615224 1179327 1141396
44935A141396o49408K10500k07671o59076J7925L55308R49161J76752k81849O67937
$$ 1141396 491988 702488 494817 -164259 -146334 208974 1158135 1334887 1053038 1720975
44925A720975K65950j62309p60230l79032J3746L19275K01290N39748l99449k45275
$$ 1720975 1986925 1824616 1064386 685354 699100 1018375 1219665 1759413 1359964 1114689
44915A114689o34931J32057K42414q1017j68268l70621q86913P17266k91853r45681
$$ 1114689 479758 611815 854229 773212 604944 234323 -652590 64676 -227177 -1172858
44905a172858J159794N87911q31249k1616P15193P61454k4763n86997j95724J94475
$$ -1172858 -13064 574847 -256402 -278018 437175 1198629 1173866 586869 391145 585620
44895E85620K68182k58097j00016O99772M83737l46152k09686L12840N25338k95341
$$ 585620 853802 595705 495689 1195461 1679198 1333046 1123360 1436200 1961538 1666197
44885A666197o33819n33120M05956J98239o59048J36059Q06145J39077l81627
$$ 1666197 1032378 499258 905214 1103453 444405 580464 1386609 1525686 1144059
44876A144059j23010j22365L7599L32926r9362j59041j005565L23094N88564j74044
$$ 1144059 1021049 898684 936283 1269209 1169847 1010806 5241 328335 916899 742855
44866G42855k97548J36655k65593J73320L6671Q3515p6225K30859Q61372j61797
$$ 742855 445307 581962 316369 489689 526360 609875 533650 764509 1625881 1464084
44856A464084J87479M85139k58402P3608q86367J645J001953k01759m34084l39345
$$ 1464084 1651563 2136702 1878300 1951908 1065541 1067186 2069139 1867380 1433296 1093951
44846A093951J7976Q349J87148L013l40594R57716k25184j09382M01034L25466
$$ 1093951 1111927 1120276 1307424 1310437 969843 1927559 1702375 1592993 1994027 2319493
44836B319493o40992n20142P16390L26806M79789n00769n97145L69754K38055
$$ 2319493 1678501 1158359 1874749 2201555 2681344 2180575 1583430 1953184 2191239
44827B191239j76533L04539M5255o22789J32429r5591j72282Q22134M36641o76676
$$ 2191239 2014706 2319245 2364500 1741711 1874140 1778549 1606267 2428401 2865042 2188366
44817B188366m7884m28578M09057L94526n93022K80968J10598j89515k90364P6963
$$ 2188366 2140482 1711904 2120961 2515487 1922465 2203433 2314031 2124516 1834152 1911115
44807A911115q71430O04395M51087n32474m38116P79483M27972L65085j068819
$$ 1911115 1039685 1644080 2095167 1562693 1124577 1904060 2332032 2697117 1628298
44798A628298l04272L14521N60249n10680R0380L73665M12739J10112J18183m53552
$$ 1628298 1324026 1638547 2198796 1688116 1778496 2152161 2564900 2675012 2793195 2339643
44788B339643o50871k01006L35342J058515m7995q84945M81474K55235K14150
$$ 2339643 1688772 1487766 1823108 2881623 2833628 1948683 2430157 2685392 2899542
44779B899542K95169K86764j55272l24256l07656N26773P8440l63481o0619K98854
$$ 2899542 3194711 3481475 3326203 3001947 2694291 3221064 3299504 2936023 2875404 3174258
44769C174258l90224O07201K03664M5697K24424K53251P11468j92298l5400J97364
$$ 3174258 2784034 3391235 3594899 3640596 3865020 4118271 4829739 4637441 4602041 4799405
44759D799405r9318J914342r11247q03750M19761M38751N99416P7218K2023j70712
$$ 4799405 4700087 6614429 5703182 4899432 5319193 5757944 6357360 6434578 6456601 6285889
44749F285889M82203M33663R4684J059150j40654o3739o82592J99322k33556O34762
$$ 6285889 6768092 7201755 7296439 8355589 8214935 8151196 7468604 7667926 7434370 8069132
44739H069132R51614M19184P10396M55500J705968J649529P42569J150549P73667
$$ 8069132 9020746 9439930 10150326 10605826 12311794 13961323 14703892 15854441 16628108
44730A6628108P12727l21127p91465J312751J750309K649117J704591J835875
$$ 16628108 17340835 17019708 16228243 17540994 19291303 21940420 23645011 25480886
44722B5480886J727160K756133K572513K481092J135548J354551O94336k1546
$$ 25480886 27208046 29964179 32536692 35017784 36153332 37507883 38202219 38180673
44714C8180673r47093j412355J146765K599874K548551K491323K194244j972629
$$ 38180673 37233580 35821225 36967990 39567864 42116415 44607738 46801982 44829353
44706D4829353l611700m340567l081215p46173K23943K392723L004663M038513
$$ 44829353 41217653 36877086 33795871 33049698 33273641 35666364 38671027 42709540
44698D2709540K855401n52471p02245J421055M011661N473332M212211j2023k169012
$$ 42709540 45564941 45012470 44310225 45731280 49742941 55216273 59428484 59416461 57247449
44689E7247449j3483K429423K399840J735662m32126j563861J90741K026992J699466
$$ 57247449 57233966 59663389 62063229 63798891 63366765 61802904 61993645 64020637 65720103
44680F5720103q6834J700385K473519L610274K340540j4199m076169m274819k677354
$$ 65720103 65633269 67333654 69807173 73417447 75757987 75743788 71667619 67392800 64715446
44671F4715446j148839J002797L212722N207324M561067Q34714k855518m060509
$$ 64715446 63566607 64569404 67782126 72989450 77550517 78385231 75529713 71469204
44663G1469204k213668j90295q22188o26595R56603M51198q12672k484789l041039
$$ 71469204 69255536 69065241 68243053 67616458 68573061 69024259 68211587 65726798 62685759
44654F2685759m932254o453804n688810m132673l731937k171004J360072L227689
$$ 62685759 57753505 51299701 45610891 41478218 37746281 35575277 36935349 40163038
44646D0163038K886621k147085p160422o751050m663559l312276j831028p50065
$$ 40163038 43049659 40902574 33742152 26991102 22327543 19015267 17184239 16434174
44638A6434174k79326p91950j079094o0103j41119k46779j360177n83695P68577
$$ 16434174 16154848 15362898 14283804 14223701 14082582 13835803 12475626 11891931 12660508
44629A2660508k20262q9004k91228K321J544142N31989q8337Q69695R89136o32760
$$ 12660508 12440246 12351242 12060014 12062335 13606477 14138466 14050129 14919824 15908960 15276200
44619A5276200K47747N04005j9644N70587n15038l49596K60124o55548j28413
$$ 15276200 15523947 16027952 16008308 16578895 16063857 15714261 15974385 15318837 15190424
44610A5190424o13705p41075J05248k49235k33302K42167Q00989P35252m32814
$$ 15190424 14576719 13835644 13940892 13691657 13458355 13700522 14501511 15236763 14803949
44601A4803949n83597J15653j06851N52707N46006K74310M41242J134887L31207
$$ 14803949 14220352 14336005 14229154 14781861 15327867 15602177 16043419 17178306 17509513
44592A7509513K10455m1751M57815K42895N21982J006065L010007L241740M645661
$$ 17509513 17719968 17678217 18136032 18378927 18900909 19906974 22916981 26158721 30804382
44583C0804382O084812M306602q08790m208504m013507k466741q76183L75742
$$ 30804382 36889194 41195796 40387006 36178502 32164995 29698254 28822071 29197813
44575B9197813R64013L30242o60723J10523k02797O25797J260176K545019K861124
$$ 29197813 30161826 30492068 29831345 29941868 29739071 30364868 31625044 34170063 37031187
44566C7031187N564001P905972O884909M021727p44929k897074k616760m44482
$$ 37031187 42595188 50501160 57386069 61407796 60662867 57765793 55149033 54704551
44558E4704551j30601J967524L523233N522475P233791J0803568J4622251J6320725
$$ 54704551 54573950 56541474 60064707 65587182 72820973 83624541 98246792 114567517
44550A14567517K0067439K3193806K2412239J8291238R441325m288313j3351036
$$ 114567517 134634956 157828762 180241001 198532239 207973564 203685251 190334215
44543A90334215j8196695j9161226k0860323j8914429j6304077j3540054j1016014
$$ 190334215 172137520 152976294 132115971 113201542 96897465 83357411 72341397
44536G2341397q537119n754789m027344m120398k536561l076783k104259o27961
$$ 72341397 63804278 58049489 54022145 49901747 47365186 44288403 42184144 41556183
44528D1556183j23883R39530k77196J31328P05988J34552k55265J23667M97193
$$ 41556183 41432300 42371830 42094634 42225962 42931950 43066502 42811237 42934904 43432097
44519D3432097n06690r40389j332525k518649k562288j307336j027152o05008
$$ 43432097 42925407 41985018 40652493 38133844 35571556 34264220 33237068 32632060
44511C2632060o8588n84097m11447j028587j604023j335933j632035k791751j997933
$$ 32632060 32563472 31979375 31567928 30539341 28935318 27599385 25967350 23175599 21177666
44502B1177666j514964n96188m79491l23305j066024j027105k39356o51712l93845
$$ 21177666 19662702 19066514 18587023 18263718 17197694 16170589 15931233 15279521 14885676
44493A4885676J99998m44987J019404R37485O98296J665303K044449L172962L851363
$$ 14885676 15085674 14640687 15660091 16597576 17295872 18961175 21005624 24178586 28029949
44484B8029949M635314N851944Q125750R932463J8307501L4450348O5390432Q6587788
$$ 28029949 32665263 38517207 46642957 56575420 74882921 109333269 174723701 261311489
44476B61311489M1999536n0765820q8860890o0614724l4450561k1784253j3642646
$$ 261311489 303311025 252545205 163684315 103069591 68619030 46834777 33192131
44469C3192131q475728n365933k078157k217755j852082k266855j106739j979802
$$ 33192131 24716403 19350470 17272313 15054558 13202476 10935621 9828882 7849080
44461G849080j495041m18398K30088o08668q65540k95738L82039m88559p68729
$$ 7849080 6354039 5935641 6165729 5557061 4691521 4395783 4777822 4289263 3520534
44452C520534o22475j99322O35161l18913j89256p6821m97713n99722m7828K01705
$$ 3520534 2898059 2698737 3333898 3014985 2825729 2748908 2251195 1651473 1603645 1805350
44442A805350l83796P08272M16752l63709K37601n76820r92896K68088j19118
$$ 1805350 1421554 2129826 2546578 2182869 2420470 1843650 850754 1118842 999724
44433I99724l90944M82571L1535l36880Q33715l93820O27307J32978k23296q2451
$$ 999724 608780 1091351 1122886 786006 1619721 1225901 1853208 1986186 1762890 1680439
44423A680439l25999n22806l34685m69649M11128L38763p63619R65104J67q5192
$$ 1680439 1354440 831634 496949 27300 438428 777191 13572 978676 978843 893651
44413H93651M25971j70110l74816p32626j26378N49517L91496O17814m06734j574196
$$ 893651 1319622 1149512 774696 42070 -84308 465209 856705 1474519 1067785 -506411
44403e06411J77352O24616L56229n16662n01832M34662m45831L58313Q28762J14775
$$ -506411 -329059 295557 651786 135124 -366708 67954 -377877 -19564 809198 923973
44393I23973m00582L41561L01505m07029l53198P30353k65229k43939l16292m86480
$$ 923973 523391 864952 1166457 759428 406230 1136583 871354 627415 311123 -175357
44383a75357n4935L23260j56412j93087k43020L66936k76838J23244K01207J32353
$$ -175357 -230292 92968 -63444 -256531 -499551 -132615 -409453 -286209 -85002 47351
44373D7351m94912O61526J22298P5143o97373M40288P30540m76101j46560L53045
$$ 47351 -447561 213965 336263 411406 -285967 154321 884861 408760 262200 615245
44363F15245n91787l36429J85020L38935L86616j758o77025r8209o262O1953k28127
$$ 615245 23458 -312971 -127951 210984 597600 595842 -81183 -179392 -185654 -123701 -351828
44352c51828k72075j60154O56776Q41114p28049m96611p46795N74509N97638P0459
$$ -351828 -623903 -784057 -127281 713833 -14216 -510827 -1257622 -683113 -85475 -15016
44342a5016K10657P10561K35838j93257q79763J65996R14490n88908m15320R44323
$$ -15016 195641 906202 1142040 948783 69020 235016 1149506 560598 145278 1089601
44332A089601k34593K863n32521l38940n37971J55943J38829n0528J42224J36037
$$ 1089601 855008 857871 325350 -13590 -551561 -395618 -256789 -307317 -165093 -29056
44322b9056K43763R1483O87855P61982m18098m0706m1241N2388n99902m54320
$$ -29056 214707 306190 994045 1756027 1337929 1297223 1255982 1308370 708468 254148
44312B54148k03945M03246p08601j02905J97587j23805P62475J34900j067372
$$ 254148 50203 453449 -255152 -358057 -160470 -284275 478200 613100 -454272
44303d54272k74803j29222K98592J7028O28357M82605l62385M16995j76166o15725
$$ -454272 -729075 -858297 -559705 -542677 85680 568285 205900 622895 446729 -168996
44293a68996m95367N68939j20937j72789M56379l53221m7204M91068l73041l19038
$$ -168996 -664363 -95424 -216361 -389150 67229 -285992 -333196 157872 -215169 -534207
44283e34207K67537r2318p1611o86386l06245L41006O70103o7518k481O69354
$$ -534207 -266670 -358988 -430599 -1116985 -1423230 -1082224 -412121 -479639 -482120 187234
44273A87234j15630p93872K39209P89578R73203K39949L76385k13971q00143J96178
$$ 187234 71604 -722268 -483059 306519 1279722 1519671 1896056 1682085 881942 1078120
44263A078120n59121j010660N76929J94081J9618n98406m71491k01101O1457L14476
$$ 1078120 518999 -491661 85268 279349 298967 -299439 -770930 -972031 -910574 -596098
44253e96098O41184p5572J25744L34188j63042p4546J54943N86802l25701n62165
$$ -596098 45086 -30486 95258 429446 266404 191858 346801 933603 607902 45737
44243D5737q62119K25737Q0972j3410k5530k40559N75444j53319m62748J64056
$$ 45737 -816382 -590645 -509673 -523083 -548613 -789172 -213728 -367047 -829795 -665739
44233f65739m35060O10949Q28632m26987k60494o04883l57873K4023M06188R35621
$$ -665739 -1100799 -489850 338782 -88205 -348699 -953582 -1311455 -1287432 -881244 54377
44223E4377j03902l91733K04252M67782j173514N20288L75882j80277q9150k62026
$$ 54377 -49525 -441258 -237006 230776 -942738 -422450 -46568 -226845 -315995 -578021
44213e78021Q04259M91228m03856m86326N3510P19237q42908m90025J38840N5940
$$ -578021 226238 717466 313610 -172716 -119206 600031 -242877 -732902 -594062 -538122
44203e38122J71088Q16137r09778j086148M38677O18950k89516N43424l028L92804
$$ -538122 -367034 449103 -460675 -1546823 -1108146 -489196 -778712 -235288 -238316 154488
44193A54488L03958j45932m28983n8322o1340k52099M51515L34146m84455j11646
$$ 154488 458446 312514 -116469 -174791 -236131 -488230 -36715 297431 -187024 -298670
44183b98670J30177j68869K38955p72334L04056M05411M4141L15638K91202k94653
$$ -298670 -168493 -337362 -98407 -870741 -566685 -161274 -117133 198505 489707 195054
44173A95054O2012m25927j10599O46157J25329m97387J260705O4975p02462J95692
$$ 195054 257066 -168861 -279460 366697 492026 -5361 1255344 1320319 617857 813549
44163H13549p72236q68219J26227J42658m0846O31948n56350j43723R32118L59002
$$ 813549 41313 -826906 -700679 -558021 -598867 33081 -523269 -666992 265126 624128
44153F24128m60208l84938P60072K67337k62092p21822m30778k64367k1789J99897
$$ 624128 163920 -221018 539054 806391 544299 -177523 -608301 -872668 -894457 -694560
44143f94560k76433j51567Q14709O55300M90249m84898o04133l43502N54402O47085
$$ -694560 -970993 -1122560 -307851 347449 837698 352800 -251333 -594835 -40433 606652
44133F06652k04868j9708k7620o01608n30010m86436O82147M68833O45772j90680
$$ 606652 401784 382076 354456 -247152 -777162 -1263598 -581451 -112618 533154 342474
44123C42474p55850l03493P4843M13416K50852l45138r60624M5989L80828R61324
$$ 342474 -413376 -716869 -642026 -228610 22242 -322896 -1283520 -1237531 -856703 104621
44113A04621L75517l21987p46976J30227j059o45977O29380m85421J41171K04355
$$ 104621 480138 158151 -588825 -458598 -459657 -1105634 -476254 -961675 -820504 -616149
44103f16149M85625l26608k71354N57459R03786k96390l82187n20294q50642N95471
$$ -616149 -130524 -457132 -728486 -171027 732759 436369 54182 -466112 -1316754 -721283
44093g21283J94865j03166N83382R55283R5640j89407k07871o8442j76243o63822
$$ -721283 -526418 -629584 -46202 909081 1004721 815314 607443 539001 362758 -301064
44083c01064O1916L06148J8820n7463J11280k6986o60260j40450n71954O6981
$$ -301064 -239148 67000 85820 28357 139637 112651 -547609 -688059 -1260013 -1193032
44073a193032Q19190P92251J55323p07376o72434j5045j022656L30541J460681
$$ -1193032 -373842 418409 573732 -133644 -806078 -821123 -1843779 -1513238 -52557
44064e2557L88085m99382o24991k93908r5607J43353N41734J270702m87873r52886
$$ -52557 335528 -163854 -788845 -1082753 -1178360 -1035007 -493273 777429 289556 -663330
44054f63330J396971K11781l09429q18314K4487J91739J56282k60j29648q4025
$$ -663330 733641 945422 635993 -182321 -157834 33905 190187 189927 60279 -23746
44044b3746l21809L5075o6374J096846L40999p82853j84354l20129N29377j93480
$$ -23746 -345555 -310480 -376854 719992 1060991 278138 93784 -226345 303032 109552
44034A09552j14574p1731j27076j08553P0061K30320J07109K90903M4610l16856
$$ 109552 -5022 -76753 -203829 -312382 -242321 -12001 95108 386011 430621 113765
44024A13765j75007P11418L65542j11536m90295M82727N17129q99368m46311M62256
$$ 113765 -61242 650176 1015718 904182 413887 896614 1413743 514375 68064 530320
44014E30320j21896k47861l34054j28682k67018J62343K49609L66812p9661k03326
$$ 530320 408424 160563 -173491 -302173 -569191 -406848 -157239 209573 129912 -73414
44004g3414P8603l6633j53982P78680l60069P5009m54741l53415J86850j69808
$$ -73414 5189 -31444 -185426 593254 233185 308194 -146547 -499962 -313112 -482920
43994d82920o34614M78472Q36576k56586L19173O660l20647J42103o62063N98413
$$ -482920 -1117534 -639062 197514 -59072 260101 266761 -53886 88217 -573846 24567
43984B4567l00800l77204n14555L62204K18574n84n44867l08873l92207M52991
$$ 24567 -276233 -653437 -1167992 -805788 -587214 -587798 -1132665 -1441538 -1833745 -1380754
43974a380754R40202N67699N80935J51584j95619p76820l77418K4373K56748k60101
$$ -1380754 -440552 127147 708082 859666 664047 -112773 -490191 -465818 -209070 -469171
43964d69171J16408M99959L88556Q42794k18686l77982j08939j37342o22317r81971
$$ -469171 -352763 147196 535752 1378546 1159860 781878 672939 535597 -86720 -1068691
43954a068691o34539Q43019M19831l7997q27464L40496R99993R58812j15365o65088
$$ -1068691 -1703230 -860211 -440380 -478377 -1305841 -965345 34648 993460 878095 213007
43944B13007l63958m9538N70769p09474M50191M93683q83836K61159M81452K62963
$$ 213007 -150951 -200489 370280 -339194 110997 604680 -279156 -17997 463455 726418
43934G26418j143097m69871N12322K30295J90780J05558K61756k18587p41358
$$ 726418 -416679 -886550 -374228 -143933 46847 152405 414161 195574 -545784
43925e45784L29104N6271N62095j14728q51313R7528M92658P58925o87034j366191
$$ -545784 -216680 -160409 401686 286958 -564355 -466827 25831 784756 97722 -1268469
43915a268469M11325O95154K14396K16036l72685j37442k46287R0443o56178j81627
$$ -1268469 -857144 -161990 52406 268442 -104243 -241685 -487972 -397529 -1053707 -1235334
43905a235334m26880O16175J9561R88709j35761k30339M03918k66150j56990k12078
$$ -1235334 -1662214 -1046039 -1026478 -37769 -173530 -403869 49 -266101 -423091 -635169
43895f35169L94305O06885j43012K69714o26693k29280j05898J29883L55101j14083
$$ -635169 -240864 366021 223009 492723 -133970 -363250 -469148 -339265 15836 -98247
43885i8247j80480r6693k79576P21797L43008l65732n67977l90513o98244K59344
$$ -98247 -278727 -375420 -654996 66801 409809 44077 -523900 -914413 -1612657 -1353313
43875a353313Q37084J58220K47709j70788K22294m68087l48417j24365K11993
$$ -1353313 -516229 -358009 -110300 -281088 -58794 -526881 -875298 -999663 -787670
43866g87670N38470k65524K87956K86425m21671O9423K27911L95445K1840j55883
$$ -787670 -249200 -514724 -226768 59657 -362014 -292591 -64680 330765 352605 196722
43856A96722o84509L30528P07769k50602l73808Q6685k75148M0019j637o2844
$$ 196722 -487787 -157259 550510 299908 -73900 12785 -262363 -222344 -223981 -286825
43846b86825J16408P32618N21186o98522j053856J1280J29847J57826J53381j446
$$ -286825 -170417 562201 1083387 384865 -668991 -657711 -527864 -370038 -216657 -218103
43836b18103l60501K65461k74903k29764K18903o8158J65776L77549K7412r2114
$$ -218103 -578604 -313143 -588046 -817810 -598907 -667065 -501289 -123740 -96328 -188442
43826a88442M65409j2039q1778k82101J28947j87543j50569k8470M66852M98920
$$ -188442 276967 264928 183150 -98951 29996 -157547 -308116 -336586 130266 629186
43816F29186n37859j054893L75962L22766L85137M07917m70875n03020l74110
$$ 629186 91327 -963566 -587604 -264838 120299 528216 57341 -445679 -819789
43807h19789R02840L53967p07526M11629J8690m75000M63013J53828k22477k65073
$$ -819789 83051 437018 -270508 141121 159811 -315189 147824 301652 79175 -185898
43797a85898o16474j52641l065J25261M3458L12224P40Q63899O36477p05977p75793
$$ -185898 -802372 -955013 -958078 -832817 -789359 -477135 -476395 387504 1023981 318004 -457789
43786d57789K37566K94384K26153l9754o94644K13211n9460O89467L01144j02574
$$ -457789 -220223 74161 300314 260560 -434084 -220873 -280333 409134 710278 607704
43776F07704r90631l52672P62230j1035R118N61743m73701j145207n64620L39856
$$ 607704 -382927 -735599 26631 15596 24714 586457 112756 -1032451 -1597071 -1257215
43766a257215J097194K1137l44084q2465K02372P21330n8236N12742j90872r63280
$$ -1257215 -160021 -138884 -482968 -565433 -363061 358269 300033 812775 621903 -341377
43756c41377m42025m59424K91444P19981m65166k55252J223322K44527L6565o20374
$$ -341377 -783402 -1242826 -951382 -231401 -696567 -951819 271503 516030 552595 -67779
43746f7779r90675M02124O69356j09535L2497q9169n80213l44962J04081N17759
$$ -67779 -1058454 -656330 13026 -96509 -64012 -153181 -733394 -1078356 -974275 -456516
43736d56516O74459m58860J7676K67528l89722l47139N92619R79357l91777j63794
$$ -456516 217943 -240917 -223241 44287 -345435 -692574 -99955 879402 487625 323831
43726C23831J70373q81243M48142m03322l12740K25587K20340N53187J42143q61665
$$ 323831 494204 -387039 61103 -342219 -654959 -429372 -209032 344155 486298 -375367
43716c75367l00661m80927L20195J082504N08012l07394J37235m76159o16484
$$ -375367 -676028 -1156955 -836760 245744 753756 446362 583597 107438 -509046
43707e09046r9020M02909L47997l36407N3113Q92273m05084n76127o261Q11486
$$ -509046 -608066 -205157 142840 -193567 -140454 751819 346735 -229392 -235653 575833
43697E75833K15025q46360J20498l9006O0721n98462O01391K06246o28168k83821
$$ 575833 790858 -55502 64996 25990 86711 -511751 89640 295886 -332282 -616103
43687f16103J36072P04929k57830j83016J4160P4011q1205N73125N28769q4654
$$ -616103 -480031 224898 -32932 -215948 -201788 -127777 -208982 364143 892912 808258
43677H08258L04043k92950n78492n32994K60905l56171L39891m9531p1206P0242
$$ 808258 1112301 819351 240859 -292135 -31230 -387401 -47510 -97041 -168247 -98005
43667i8005k44047k53457J32731R18102J10471k12386N4991P836p0740k79064
$$ -98005 -342052 -595509 -462778 455324 565795 353409 408400 416236 345496 66432
43657F6432J00669L3313k36042o83176R09644N56608l61112k13497k36504J42872
$$ 66432 167101 200414 -35628 -718804 190840 747448 386336 172839 -63665 79207
43647G9207n680p38543n12755N28233L38100N59667k1867k52054J4337J57880
$$ 79207 73527 -665016 -1177771 -649538 -311438 248229 226362 -25692 -11355 146525
43637A46525m41256P7678K5109K41403j54315K7820l16697l91973l3824k28764
$$ 146525 -294731 -217053 -191944 49459 -104856 -77036 -393733 -785706 -819530 -1048294
43627a048294Q4585N15966N99188n4580J81142j63378m10897N41778J103965m48182
$$ -1048294 -963709 -447743 151445 96865 278007 114629 -296268 245510 1349475 901293
43617I01293k17451J042126r92663p62289L16526l96161k27244K05936N59532
$$ 901293 683842 1725968 733305 -28984 287542 -108619 -335863 -129927 429605
43608D29605N63579o33237r27472J62524N28115j24252l06461p26399m42010M39364
$$ 429605 993184 359947 -567525 -405001 123114 -1138 -307599 -1033998 -1476008 -1036644
43598a036644J339440p9628Q4764q42436l46552P33412J80160r60696M17760O70623
$$ -1036644 302796 223168 307932 -534504 -881056 -147644 32516 -928180 -510420 160203
43588A60203J08564q6385q628q3028r8069J84409n8589j20609L13477P1651r13871
$$ 160203 268767 182382 173754 90726 -7343 177066 118477 -2132 311345 382996 -530875
43577e30875j73793m1446J316318J06746o26544l96538K54848j5820O40944L74793
$$ -530875 -704668 -746114 570204 676950 50406 -346132 -91284 -107104 533840 908633
43567I08633j87445m78377K93493n17397L7253j70283K60658J00463m70770l70641
$$ 908633 721188 242811 536304 18907 56160 -114123 146535 246998 -223772 -594413
43557e94413n1834O7686j74593R3477J90103N37671K73774k87460j73958K19524
$$ -594413 -646247 -578561 -753154 -659677 -469574 68097 341871 54411 -119547 99977
43547I9977j55656q02403K35489j19351L25988M03855m9488n16271K41694N06559
$$ 99977 -55679 -858082 -622593 -741944 -415956 -12101 -61589 -577860 -336166 170393
43537A70393j4028J28078M94163l39420l45325n85606r16650O47764L56704L16233
$$ 170393 156365 284443 778606 439186 93861 -491745 -1408395 -760631 -403927 -87694
43527h7694n48611l34890O27504M11258N9437L72224K7176k50397k64304M11278
$$ -87694 -636305 -971195 -343691 67567 127004 499228 526404 276007 11703 422981
43517D22981L15961j97976L8585J33711P8335k23206j17059o82849o80039P7991
$$ 422981 738942 540966 579551 713262 791597 568391 451332 -231517 -911556 -833565
43507h33565J8891J02457j07699J280008L29141n67725m88905l02702J016761
$$ -833565 -814674 -712217 -819916 460092 789233 221508 -267397 -570099 446662
43498D46662k33791l68108K1477j7025m6401n09991l72667L64130M47445P3537
$$ 446662 212871 -155237 -133760 -150785 -197186 -707177 -1079844 -715714 -268269 -194732
43488a94732P49457k2048k50322o88779J19686p867M6449R60517O7493q76270
$$ -194732 554725 532677 282355 -406424 -286738 -294605 -248156 712361 779854 -96416
43478i6416p01446q1771J91040k80000j16329O99235L11051L42004l90844k23843
$$ -96416 -797862 -879633 -688593 -968593 -1084922 -385687 -74636 267368 -123476 -347319
43468c47319P08817K10729R51465j37141j063169m36305n31572M13784L09688
$$ -347319 361498 572227 1523692 1386551 323382 -112923 -644495 -230711 78977
43459G8977J11428L01266k669L00207l93067p89759Q50340L30436n39727o92178
$$ 78977 190405 491671 489002 789209 396142 -393617 456723 787159 247432 -444746
43449d44746P26100N18640k26176K14740J269J80342J50394m84970m17769J39279
$$ -444746 281354 799994 573818 788558 789827 970169 1120563 635593 217824 357103
43439C57103K40574m33023R4297P7214l31505n6498M22226l81413N5963M6521
$$ 357103 597677 164654 258951 336165 4660 -51838 370388 -11025 44938 91459
43429I1459N7444L13292n5911l43296J8899j02596j83998J81933q4337L56483
$$ 91459 148903 462195 406284 62988 81887 -20709 -204707 -22774 -107111 249372
43419B49372k43887M24814n09615j15034O59978O00186O2159o86604l45899k74297
$$ 249372 5485 430299 -79316 -194350 465628 1065814 1127973 441369 95470 -178827
43409a78827J71276O84854M03486k03804J06778k32953p51231J18004j04900n22444
$$ -178827 -7551 677303 1080789 876985 983763 750810 -421 117583 12683 -509761
43399e09761k43315P88779j143475L55219P50510M60852m86691m70636R51442
$$ -509761 -753076 35703 -1107772 -752553 -2043 458809 -27882 -498518 452924
43390D52924L86461q00308K62784J24176q38883l08303L08574n8248M03746L84250
$$ 452924 839385 39077 301861 426037 -412846 -721149 -412575 -470823 -67077 317173
43380C17173l5698J14752j84190J45720m98957j16005R30082l37791j71004n89026
$$ 317173 281475 396227 212037 357757 -141200 -257205 672877 335086 164082 -424944
43370d24944l60869K29583Q5819p8235K5218M83668n45154N58627J09333K39527
$$ -424944 -785813 -556230 -470411 -548646 -523428 -39760 -584914 -26287 83046 322573
43360C22573k84011j21347K97147J80317n82069j87497q8667P04771j81981m24503
$$ 322573 38562 -82785 214362 394679 -187390 -374887 -463554 241217 59236 -365267
43350c65267L41145J04030r79781p6572N89719k67171k51691l21264P29307M22580
$$ -365267 -24122 79908 -899873 -976445 -386726 -653897 -905588 -1226852 -497545 -74965
43340g4965n5726j26199J89198R36276Q1593n43519O3352o7937k40851k55827
$$ -74965 -130691 -256890 -67692 868584 950177 406658 470010 402073 161222 -94605
43330i4605M08501J39223K92012n24199l15890M84155O00760K03481q48487l42764
$$ -94605 313896 453119 745131 220932 -94958 389197 989957 1193438 344951 2187
43320B187Q74412k02285m89420j27195n19920K37011P41044N179K79024m32991
$$ 2187 876599 674314 184894 57699 -462221 -225210 515834 521013 800037 367046
43310C67046m81697r3641m7403r4874N45208M51649K53399m28883l19190n8625
$$ 367046 -114651 -208292 -255695 -350569 194639 646288 899687 470804 151614 92989
43300I2989K4475k55113L13704M06474O9855l93146M63793k29937k77910n91772
$$ 92989 117464 -137649 176055 582529 652384 259238 723031 493094 215184 -376588
43290c76588j67850n0952P76897J15454R0355p69533j89986O80410J08236l24720
$$ -376588 -544438 -595390 181507 296961 387316 -382217 -572203 108207 216443 -108277
43280a08277P16136l6057O00396K47622q60746n36906m81808L51734L16933n01556
$$ -108277 607859 571802 1172198 1419820 559074 22168 -459640 -107906 209027 -292529
43270b92529P7433k54239l1945P55786m64471l9767J24308j6289N21806n02116
$$ -292529 -215096 -469335 -501280 254506 -209965 -249732 -125424 -141713 380093 -122023
43260a22023l44531L69631l61001J8701J18886J38227K73982k20685m56907o43464
$$ -122023 -466554 -96923 -457924 -439223 -320337 -182110 91872 -128813 -585720 -1229184
43250a229184R49442L78968L16567K48057l08455l96082l85732q68237R36743
$$ -1229184 -279742 99226 415793 663850 355395 -40687 -426419 -1294656 -357913
43241c57913m80405n93785j85999P12777Q19597k68055L84443l40398m47531K7839
$$ -357913 -838318 -1432103 -1618102 -905325 -85728 -353783 30660 -309738 -757269 -729430
43231g29430N12111l01675q70019k14471O13667J043751J16807m93271L21055
$$ -729430 -217319 -518994 -1389013 -1603484 -989817 53934 170741 -322530 -1475
43222a475Q0433q32290j033898O00802P13705K45810P0733K7850j60304j91312
$$ -1475 78958 -753332 -1787230 -1186428 -472723 -226913 -156180 -128330 -288634 -479946
43212d79946l65091L34246L56709K78918j254232O02567K79094k14055L87306
$$ -479946 -845037 -510791 -154082 124836 -1129396 -526829 -247735 -461790 -74484
43203g4484j77550k5055K95698O93061k79203N9783m47002p6287M14123j79452
$$ -74484 -252034 -277089 18609 711670 432467 492250 45248 -31039 383084 203632
43193B03632q7264M34474L82960j73371J18618L80010M95053K28755j252242r6788
$$ 203632 116368 550842 933802 760431 879049 1259059 1754112 1982867 730625 633837
43183F33837K76095l02483Q9333n38866m30863k28185N61232p48091K28930M97506
$$ 633837 909932 607449 696782 157916 -272947 -501132 60100 -687991 -459061 38445
43173C8445K18846n8758m3981M47358N74119q01998r60324M34592J219673l21421
$$ 38445 257291 198533 154552 601910 1176029 374031 -586293 -151701 1067972 746551
43163G46551q45861L14248J91117K21921n58532J46650O11426j83066q66210o75047
$$ 746551 -99310 214938 406055 627976 69444 216094 827520 644454 -221756 -896803
43153h96803l66169Q24517L32780j66418j10453k72212J95482n98409k84420K84441
$$ -896803 -1262972 -438455 -105675 -272093 -382546 -654758 -459276 -1057685 -1342105 -1057664
43143a057664R05625M07229j69380J73495o53251m45250N40248k01772k6750Q69649
$$ -1057664 -152039 255190 85810 259305 -393946 -839196 -298948 -500720 -527470 342179
43133C42179N71232p8727M16731L72672j41643n17025m83049M70836k96397M8663
$$ 342179 913411 834684 1251415 1624087 1482444 965419 482370 953206 656809 705472
43123G05472m77803k97963k03448K67301J28297k58103m93320j95508J56761J96319
$$ 705472 227669 -70294 -273742 -6441 121856 -136247 -629567 -825075 -668314 -471995
43113d71995n68959O37839L44514p7109J01012m35789k12725J64067l13717m57313
$$ -471995 -1040954 -403115 -58601 -135710 -34698 -470487 -683212 -519145 -832862 -1290175
43103a290175q5099L2478j95185J33162P32627j71929K44537j16580m32610l82317
$$ -1290175 -1375274 -1342796 -1537981 -1404819 -672192 -844121 -599584 -716164 -1148774 -1531091
43093a531091N68887K95596N85468p912J87175j06679l67727q8546N86227j65433
$$ -1531091 -962204 -666608 -81140 -89052 98123 -8556 -376283 -464829 121398 -44035
43083d4035J76247L0252J95111j56112N75752l13435J72953O2032Q05528J32587
$$ -44035 132212 162464 357575 201463 777215 463780 636733 698765 1504293 1636880
43073A636880j371007m42712l52510k25207L59022l96973P0185J75007J182077
$$ 1636880 265873 -176839 -529349 -754556 -395534 -792507 -722322 -547315 634762
43064F34762j38344k04166L7216k6993M06942J14889j6595k11297J18741o96464
$$ 634762 496418 292252 329468 302475 709417 824306 807711 596414 715155 18691
43054A8691j6442N40558k53063j64525k13906K03138l8804m61050l68296L29654
$$ 18691 2249 542807 289744 125219 -88687 114451 75647 -385403 -753699 -424045
43044d24045L09932j04135m87970K85371K20567J88833J7710Q859n8173q75674
$$ -424045 -114113 -218248 -706218 -420847 -200280 -11447 6263 15122 -43051 -918725
43034i18725o15052J50643J009945K90374L81182o17662M8932m6004n93798M0261
$$ -918725 -1533777 -1383134 -373189 -82815 298367 -319295 -270363 -316367 -910165 -869904
43024h69904O90592n53830J00010K24255M68356o886L18576L09229j86550L9426
$$ -869904 -179312 -733142 -633132 -408877 59479 52593 371169 680398 493848 533274
43014E33274j043615K82644R35056k70939k56484M21496j285575j92208l75352
$$ 533274 -510341 -227697 707359 436420 179936 601432 -684143 -876351 -1251703
43005a251703J8J44103J23037R01448o4533l72263N19921l67785M65478J29560
$$ -1251703 -1251685 -1107582 -984545 -83097 -147630 -519893 28 -367757 97721 227281
42995B27281j07599j73192p53788O63875Q77868m00356l51131N02620m20298j98686
$$ 227281 119682 -53510 -807298 -143423 734445 334089 -17042 485578 65280 -133406
42985a33406O62703l50482l98131M21433M06483o89582M58045o23607q36728K0632
$$ -133406 529297 178815 -219316 202117 608600 -80982 377063 -246544 -1083272 -1062640
42975a062640L21500k13877M32220J06125J46969j75771P25024P65160M9575q75900
$$ -1062640 -741140 -955017 -522797 -416672 -269703 -445474 279550 1044710 1094285 218385
42965B18385L63527M07772l32407o1902K56344K46296o37162n58499P21269L65920
$$ 218385 581912 989684 657277 595375 851719 1098015 460853 -97646 623623 989543
42955I89543p20959j89078l85822O81718K4355q10220K38231J066187l74770j097410
$$ 989543 268584 79506 -306316 375402 399757 -410463 -172232 893955 519185 -578225
42945e78225m7101N76759P18362j20614p4728M92218j4110k77306p138n79698
$$ -578225 -625326 -48567 669795 549181 474453 966671 952561 675255 668117 88419
42935H8419l90477o89767j35263J049501M14092j68791m89998N70174P9678m76434
$$ 88419 -302058 -991825 -1127088 -77587 336505 167714 -322284 247890 327568 -148866
42925a48866R6782m07171L04140J41331o0876l24840J00822L93220j28543K53632
$$ -148866 -52084 -459255 -155115 -13784 -74660 -399500 -298678 94542 -34001 219631
42915B19631J8199m9928l80353n08170K85359K26254O21846o17623q42725K23585
$$ 219631 237830 187902 -192451 -700621 -415262 -189008 432838 -184785 -1027510 -803925
42905h03925Q31437L94608l17667n81539K69268P14628o77402j90225N05317m10653
$$ -803925 27512 422120 104453 -477086 -207818 506810 -170592 -360817 144500 -266153
42895b66153K13391o05016m4637m1634J01084M17945P57194n02198p80209J43247
$$ -266153 -52762 -657778 -702415 -744049 -642965 -225020 532174 29976 -750233 -606986
42885f06986K0494M86851L26812J115937r39617l97466N71490k60094l65286L76589
$$ -606986 -586492 -99641 227171 1343108 403491 6025 577515 317421 -47865 328724
42875C28724n90674m1823K12936o9263M05148Q54331K44671j077648r32364j53345
$$ 328724 -261950 -303773 -90837 -160100 245048 1099379 1344050 266402 -665962 -819307
42865h19307O60183K01247l12854K38398M55406r5242o98795l37695K19478l57030
$$ -819307 -159124 42123 -270731 -32333 423073 327831 -370964 -708659 -489181 -846211
42855h46211J137811J40630o08515m96268L91720M50559K50387L95194o29658
$$ -846211 291600 432230 -176285 -672553 -280833 169726 420113 815307 185649
42846A85649l59770L23442J55004l91354l2555J32543j27061n3282L85178o0385
$$ 185649 -174121 149321 304325 -87029 -119584 12959 -114102 -167384 217794 157409
42836A57409j7546N2615j007532n48203j39184P59766J85265J15560J145660M83546
$$ 157409 139863 192478 -815054 -1363257 -1502441 -742675 -557410 -441850 703810 1187356
42826A187356q07830p65595j6882N30895l84229p33724K80299J005960o40790
$$ 1187356 379526 -386069 -402951 127944 -256285 -990009 -709710 296250 -344540
42817c44540n40621k34785q34594N21710N22417k8533O27777J074910K9917n04114
$$ -344540 -885161 -1119946 -1954540 -1432830 -910413 -938946 -311169 763741 793658 289544
42807B89544M0610K97668J31985o08019l04460R0199K62119N20992j96437k68437
$$ 289544 330154 627822 759807 151788 -152672 -62473 199646 720638 524201 255764
42797B55764J252456M08128j170690m26238o93292R3787j00751n2668K35894J54932
$$ 255764 1508220 1916348 745658 319420 -373872 -280085 -380836 -433504 -197610 -42678
42787d2678j80360J16024J25627M8339M93462m87636k51400j22683K9332m45125
$$ -42678 -223038 -107014 18613 66952 560414 72778 -178622 -301305 -271973 -717098
42777g17098n32729j94506K79612P74878L72595L24821m92989O71865p2271o58879
$$ -717098 -1249827 -1444333 -1164721 -389843 -17248 307573 -185416 486449 414178 -244701
42767b44701Q3775N46497M55562K45146p73763k03026q34240J33890j33981R4418
$$ -244701 -160926 385571 841133 1086279 312516 109490 -724750 -590860 -724841 -630423
42757f30423O87969M3544l08806L87535R24078n16407j206261P02523m73009l17761
$$ -630423 57546 101090 -207716 179819 1103897 587490 -618771 83752 -389257 -707018
42747g07018N53938j12646k74573j19769l14553o82936l22337N63466J457562
$$ -707018 -153080 -265726 -540299 -660068 -974621 -1657557 -1979894 -1416428 41134
42738D1134M53971l08434j92186k13873J18980m76224l72642l0590q5453J055459
$$ 41134 495105 186671 -5515 -219388 -100408 -576632 -949274 -979864 -1065317 -9858
42728i858j48242M34112K36893n34606j10842p11488l07117Q8316N94064J89306
$$ -9858 -158100 276012 512905 -21701 -132543 -844031 -1151148 -1062832 -468768 -279462
42718b79462P20674M66073j466519J82567J059367K0347O3450o7723j54838j23330
$$ -279462 441212 907285 -559234 -376667 682700 703047 766497 698774 543936 420606
42708D20606N27684k34618n26494l21458k99289j42004M13102j30064K8823K49046
$$ 420606 948290 713672 187178 -134280 -433569 -575573 -162471 -292535 -263712 -14666
42698a4666L66010J20098q31345q63977l60799J68312O04617M58755N7602L74113
$$ -14666 351344 471442 -359903 -1223880 -1584679 -1416367 -811750 -352995 -295393 78720
42688G8720J09586o24775L9744N18237M60361m05766j224698j063892M79214N44356
$$ 78720 188306 -436469 -396725 121512 581873 176107 -1048591 -2112483 -1633269 -1088913
42678a088913q47093K1505K24938J190566M7145N03292J44042q51581M14392m7457
$$ -1088913 -1936006 -1914501 -1689563 -498997 -451852 51440 195482 -656099 -241707 -289164
42668b89164l66968k70190j01647L19760M05994M8882r3497m79252L19966j54752
$$ -289164 -656132 -926322 -1027969 -708209 -302215 -253333 -346830 -826082 -506116 -660868
42658f60868M60497L33069K96805j52482k19L23324k96424p6939p74378j93630
$$ -660868 -200371 132698 429503 277021 276802 600126 303702 226763 -547615 -741245
42648g41245J21233j58057j21552R3612m51864L05677L99034n18380K92076N42713
$$ -741245 -620012 -778069 -899621 -806009 -1257873 -952196 -553162 -1071542 -779466 -236753
42638b36753M32146K61786O9914j380843M8337k17075L88096P28740K11675M48967
$$ -236753 195393 457179 527093 -853750 -805413 -1022488 -634392 94348 306023 754990
42628G54990n30748l47116m06113j97235j12780O55507k00529O12466R41005j39643
$$ 754990 224242 -122874 -528987 -726222 -839002 -183495 -384024 228442 1169447 1029804
42618A029804k9474l16436l28663K41719P97393l63980m07937n33414j162176
$$ 1029804 1000330 683894 355231 596950 1394343 1030363 622426 89012 -1073164
42609a073164K11009O80177P29833L10528q33785N8948j71519o17857J6369L96715
$$ -1073164 -862155 -181978 547855 858383 24598 83546 -87973 -705830 -689461 -292746
42599b92746M58355l77497l08407j22960J065671m65815k40510j08808K37062
$$ -292746 165609 -211888 -520295 -643255 422416 -43399 -283909 -392717 -155655
42590a55655M15763m34108J79431k93617L11581o8462K58904r40611K89788K78287
$$ -155655 260108 -174000 5431 -288186 23395 -45067 213837 -726774 -436986 -158699
42580a58699J57360l13869L3988k56204N79814m75629J59254N67338K48350l84202
$$ -158699 -1339 -315208 -281220 -537424 42390 -433239 -273985 293353 541703 157501
42570A57501n41230k664k36143j76072O98440k8963K52700L55121j351569j83328
$$ 157501 -383729 -386393 -622536 -798608 -100168 -129131 123569 478690 -872879 -1056207
42560a056207J048026P27563n57148n97177J82613o4924j18405M05448K05298
$$ -1056207 -8181 719382 162234 -434943 -252330 -317254 -435659 -30211 175087
42551A75087J51067J27735j01279o9615k36324M68198O24506l44382j063692K1781
$$ 175087 326154 453889 352610 282995 46671 514869 1139375 794993 -268699 -246918
42541b46918L11619k63302m72596M12990N06196N00469J07945j11065k60205J60326
$$ -246918 64701 -198601 -671197 -258207 247989 748458 856403 745338 485133 645459
42531F45459l28702l64957k93883K02196m80745J41162L67673q51353p7823N9643
$$ 645459 316757 -48200 -342083 -139887 -620632 -479470 -111797 -963150 -1040973 -981330
42521i81330R61847J82378l12571J73017k00730n0083l20289K96192P00772k62016
$$ -981330 -19483 162895 -149676 23341 -177389 -227472 -547761 -251569 449203 187187
42511A87187l24305K85977L81108j86807j38309K67221L62274q55516k95858J82473
$$ 187187 -137118 148859 529967 343160 204851 472072 834346 -21170 -317028 -134555
42501a34555M09559j02653N52419k30017l20559K50551N9907K40021q89545o809
$$ -134555 275004 172351 724770 494753 174194 424745 484652 724673 -164872 -171681
42491a71681N97396k99585J65177L75734O13657p83417K10319k70148o46941j50552
$$ -171681 425715 126130 291307 667041 1280698 497281 707600 437452 -209489 -360041
42481c60041m282K05840q19720m93886L76917J150341J6109m2150P96980O7343
$$ -360041 -364323 -158483 -978203 -1472089 -1095172 55169 71278 29128 826108 893451
42471H93451k14204n96053j68669L59547j76602K61290K17911K54437l22743l41316
$$ 893451 679247 83194 -85475 274072 97470 358760 576671 831108 508365 167049
42461A67049j6221m75787p44289o85847Q59642J466589K1581j87439K56297j343191
$$ 167049 150828 -324959 -1069248 -1755095 -895453 571136 592717 405278 661575 -681616
42451f81616L70797P23042L2492k77559j04419L56197L90683o12107m29781R04158
$$ -681616 -310819 412223 444715 167156 62737 418934 809617 197510 -232271 671887
42441F71887P01916r24350q22924J41135k33957j50233m6986O05294K883K08043
$$ 671887 1373803 449453 -373471 -232336 -466293 -616526 -663512 -58218 -55335 152708
42431A52708K28883P4315j126997L82800N93553J42793J22963r92987p7689Q65666
$$ 152708 381591 455906 -671091 -288291 305262 448055 571018 -421969 -499658 366008
42421C66008N00862l97194K94396K46428n73211L32427k58750n92756r92785j39370
$$ 366008 866870 469676 764072 1010500 437289 769716 510966 -81790 -1074575 -1213945
42411a213945L16582j21058Q8680j40737n6827P58094M43064j236492j49512L92409
$$ -1213945 -897363 -1018421 -929741 -1070478 -1127305 -369211 73853 -1162639 -1312151 -919742
42401i19742L58005M11831q92475l4358O07014m85872Q4693K35835l79483j49031
$$ -919742 -561737 -149906 -1042381 -1076739 -469725 -955597 -870904 -635069 -1014552 -1163583
42391a163583N55048p1117K20770J47348L07520p6588k53484K49383j90945J36081
$$ -1163583 -608535 -679652 -458882 -311534 -4014 -80602 -334086 -84703 -275648 -139567
42381a39567j11572l71329J56894P89240P35686l01030j182803j03824n23189
$$ -139567 -251139 -622468 -465574 323666 1059352 758322 -424481 -528305 -1051494
42372a051494p9660j4488M55773M49019P01406o78182N15278K23397o13527l62413
$$ -1051494 -1131154 -1145642 -689869 -240850 460556 -217626 297652 521049 -92478 -454891
42362d54891m86886l51096M23809Q44562m74774J37005l82735J73794N44296Q6734
$$ -454891 -941777 -1292873 -869064 -24502 -499276 -362271 -745006 -571212 -26916 59818
42352E9818k14507k71898N17863k68141L46741Q11749j27832L3254L9100K23730
$$ 59818 -154689 -426587 91276 -176865 169876 981625 853793 887047 926147 1149877
42342A149877m78863j56625O456r4606l01953l25358P04687J14894P19465m45361
$$ 1149877 671014 514389 520845 426239 124286 -201072 503615 618509 1337974 892613
42332H92613r03333O18429m90577j76270K844m6172M6477O09005L04971l27436
$$ 892613 -10720 607709 117132 -59138 -56294 -102466 -55989 553016 857987 530551
42322E30551j75445j83186l80027o68912j87613K26121M37066O22103p892Q93203
$$ 530551 355106 171920 -208107 -877019 -1064632 -838511 -401445 220658 212766 1105969
42312A105969q07702n43089L35113M18368Q93455Q06776n65315o99507q81514
$$ 1105969 298267 -244822 90291 508659 1402114 2208890 1643575 944068 62554
42303F2554M0602M15565n33893n47360O90514O37341o73405p18040j65727N82694
$$ 62554 103156 518721 -15172 -562532 127982 765323 91918 -626122 -791849 -209155
42293b09155L31607l60086K12039K98056J68305l8255k56871M22847j98092m38821
$$ -209155 122452 -237634 -25595 272461 440766 402511 145640 568487 370395 -68426
42283f8426L6474P79643j1683r17565l85024l59960P44073P0089k55813L21830
$$ -68426 -31952 747691 736008 -181557 -566581 -926541 -182468 -112379 -368192 -46362
42273d6362M4818N9070r7510J051834k02735o11934k47265m8498n66017L8213
$$ -46362 -1544 57526 -39984 1011850 809115 197181 -50084 -98582 -664599 -626386
42263f26386J627368Q7849n47217L0747j031845L94220O43317n86517o84605k28677
$$ -626386 1000982 1088831 541614 572361 -459484 -65264 578053 -8464 -693069 -921746
42253i21746J30308j12644j85344O22559l15651K3712k55841P04546J122949M45351
$$ -921746 -791438 -904082 -1089426 -466867 -782518 -758806 -1014647 -310101 812848 1258199
42243A258199r09544j29930m65202q50158K63109L2538O53288J7057j02907K1001
$$ 1258199 348655 218725 -246477 -1096635 -833526 -800988 -147700 -130643 -233550 -212549
42233b12549K72411j04201l50349N68628L44435l51606q8118K95113k58487k07938
$$ -212549 59862 -44339 -394688 173940 518375 166769 78651 373764 115277 -92661
42223i2661L3873L57401k9319m30671M58838K17983l27466R2638J83013J37307
$$ -92661 -58788 298613 269294 -161377 297461 515444 187978 280616 463629 600936
42213F00936l57834n00826L06074L61272p56201n76105M69738L75343l53407m84267
$$ 600936 243102 -257724 48350 409622 -346579 -922684 -452946 -77603 -431010 -915277
42203i15277M83771l59689j06071N95659k29613j40896L57366J09669O1360O51889
$$ -915277 -431506 -791195 -897266 -301607 -531220 -672116 -314750 -205081 -143721 508168
42193E08168l23911q42742M58789R40622Q6192k56607q31324J67434J62012o57110
$$ 508168 184257 -658485 -199696 740926 827118 570511 -260813 -93379 68633 -588477
42183e88477m41513P28157J412316j94293r9062R60618r78105q46395K11592K10086
$$ -588477 -1029990 -301833 1110483 916190 817128 1777746 799641 -46754 164838 374924
42173C74924p82521m53072k26350K66538K59800q2348L9557K42131R71395j59981
$$ 374924 -407597 -860669 -1087019 -820481 -560681 -643029 -603472 -361341 610054 450073
42163D50073k78903m70635k66713M17969m8616j58909n6541p91584j10486O64511
$$ 450073 171170 -299465 -566178 -148209 -196825 -355734 -412275 -1203859 -1314345 -649834
42153f49834M35993j55001Q7511l4650o23234l96054o2395R33700R26726k60309
$$ -649834 -213841 -368842 -281331 -315981 -939215 -1335269 -1397664 -463964 462762 202453
42143B02453j81456K86645p32212K90866Q60206k58641l41976K92059M30878O36354
$$ 202453 20997 307642 -424570 -133704 726502 467861 125885 417944 848822 1485176
42133A485176j07111p89662m17183N2910k74241K89347r8020l80942K88627J78353
$$ 1485176 1378065 588403 171220 224130 -50111 239236 141216 -239726 48901 227254
42123B27254Q6937L05580j94756j265034O22265M93445P0795N033L71140m66340
$$ 227254 314191 619771 425015 -840019 -217754 275691 346486 351519 722659 256319
42113B56319p04225n90764R46636L83835K38083j57792n9646m07189m00408L9828
$$ 256319 -447906 -1038670 -92034 291801 529884 372092 312446 -94743 -495151 -455323
42103d55323k12629P37569O62039q3993n16318n608K25066p9482l20116m52024
$$ -455323 -667952 69617 731656 647663 131345 125737 350803 271321 -48795 -500819
42093e00819K51302J11673k13361j6325J67433j73093N66140k04615j016204J73848
$$ -500819 -249517 -137844 -351205 -367530 -200097 -373190 192950 -11665 -1027869 -854021
42083h54021K59465j02578k46304L05569J57085P7011n3225o4972O90972L12633
$$ -854021 -594556 -697134 -943438 -637869 -480784 -403773 -456998 -521970 169002 481635
42073D81635m04832k10720J49757m6471l14262O9464j29233P69719N73506q02086
$$ 481635 76803 -133917 15840 -30631 -344893 -275429 -404662 365057 938563 136477
42063A36477k81257o55233J85129J089960n0897K09633j94616L4225K46825k97208
$$ 136477 -144780 -800013 -614884 475076 424179 633812 439196 473421 720246 423038
42053D23038p36933o23258M45624k22324n83405L58283N18205l77133j27735l56901
$$ 423038 -313895 -937153 -491529 -713853 -1297258 -938975 -420770 -797903 -925638 -1282539
42043a282539L41956J02090O680m99279P71930N94483j0526J99044K86707p95045
$$ -1282539 -940583 -838493 -831813 -1331092 -559162 35321 24795 223839 510546 -284499
42033b84499o3933K72956K94039j38941N10808l2763K18558o04387L7429j12308
$$ -284499 -348432 -75476 218563 79622 590430 557667 776225 171838 209267 96959
42023I6959J5618M2613n35062m49636P09268M60763m3481Q40508o7076J46695
$$ 96959 112577 155190 -379872 -829508 -120240 340523 297042 1137550 1070474 1217169
42013A217169p94265M56972k50439k88505L47484k95978k93892M7474j123794
$$ 1217169 422904 879876 629437 340932 688416 392438 98546 146020 -977774
42004i77774O03509m72450k04092O93305K82697n55409O36586O1997n81402N67403
$$ -977774 -374265 -846715 -1050807 -357502 -74805 -630214 6372 68369 -513033 54370
41994E4370k42623K88924k42575n82305M24550m60431K20530J1917k69757k70409
$$ 54370 -188253 100671 -141904 -724209 -299659 -760090 -539560 -527643 -797400 -1067809
41984a067809j48234N74095O32952j314q81752M93923K25099j47971K87506K76155
$$ -1067809 -1216043 -641948 -8996 -10310 -892062 -398139 -173040 -321011 -33505 242650
41974B42650K00186k67683j01053j231886l8750R82085K57750L69747O23103j23607
$$ 242650 442836 175153 74100 -1157786 -1196536 -214451 43299 413046 1036149 912542
41964I12542m94326j55471Q2748p01198m38873J55596q67793P04486M63216J32177
$$ 912542 418216 262745 345493 -355705 -794578 -638982 -1506775 -802289 -339073 -206896
41954b06896m77220P60319j00179J31669k9111K44912P24417j66302j390083L48391
$$ -206896 -684116 76203 -23976 107693 78582 323494 1047911 881609 -508474 -160083
41944a60083R50125l66591l32314p09396R0082L61960M8141l76613J84604L26349
$$ -160083 790042 423451 91137 -618259 -528177 -166217 -118076 -494689 -310085 16264
41934A6264j27015K00412m69704j067731Q88320M25696n6615p45126P77098P65023
$$ 16264 -110751 89661 -380043 -1447774 -559454 -133758 -190373 -935499 -158401 606622
41924F06622J7699m0885j36282j72844M88168K88650j350336o7384R77794j121270
$$ 606622 624321 583436 447154 274310 762478 1051128 -299208 -366592 611202 -510068
41914e10068l27930K18394K72350m63779k03495j13593J44827L72637K24867L0905
$$ -510068 -837998 -619604 -347254 -811033 -1014528 -1128121 -983294 -610657 -385790 -354885
41904c54885l39577Q18036m03160l2830P81266M59986n43970J73736o22317O98784
$$ -354885 -694462 123574 -279586 -312416 468850 928836 384866 558602 -63715 635069
41894F35069k72146p5139N18548q75858m13441P16378l40643L59627j40501J12801
$$ 635069 362923 287784 806332 -69526 -482967 233411 -107232 252395 111894 224695
41884B24695J50685J13309p29116j74622J15410r8753o99010L62314Q96529m47967
$$ 224695 375380 488689 -240427 -415049 -299639 -398392 -1097402 -735088 161441 -286526
41874b86526j78644J8469q10J82001N3323M26099j18787J07374p69723N60430
$$ -286526 -465170 -446701 -447511 -265510 -212187 213912 95125 202499 -567224 -6794
41864f794j34835l13032K19977q5477M32818l87628M9222j50531m6229J353210
$$ -6794 -141629 -454661 -234684 -320161 112657 -274971 -225749 -376280 -422509 930701
41854I30701N45985p43070j06453l13455j49371n95981j29359J123982O53293
$$ 930701 1476686 733616 627163 313708 164337 -431644 -561003 562979 1216272
41845A216272j236135p6466J100567m79267j45491j18345r94609L0503P49095
$$ 1216272 -19863 -96329 1004238 524971 379480 261135 -733474 -702971 46124
41836D6124n0296k48904J01800L37677o53213n71886K33426J96231Q45092Q78928
$$ 46124 -4172 -253076 -151276 186401 -466812 -1038698 -805272 -609041 236051 1114979
41826A114979m15740J63481l40048k62886p96959l34736l63934J085942Q76038
$$ 1114979 699239 862720 522672 259786 -537173 -871909 -1235843 -149901 726137
41817G26137l10129m19132K00475J87767L1902l08466l06070J33149p53094P6409
$$ 726137 416008 -3124 197351 385118 417020 108554 -197516 -64367 -817461 -741052
41807g41052K19306K30922J140280k48933n26989l8893J36593k8995l53585K36549
$$ -741052 -521746 -290824 849456 600523 73534 34641 171234 142239 -211346 25203
41797B5203L21354M7769M64060J118p30807l73266J78095R79155l07746j181952
$$ 25203 346557 394326 858386 859504 128697 -244569 -66474 912681 604935 -577017
41787e77017K53466K96754J433092o82129r34778q6944J27255l74739k77303K00339
$$ -577017 -323551 -26797 1406295 724166 -210612 -297556 -170301 -545040 -822343 -622004
41777f22004J36612j181477k66259J191825M87095M7939M00780k1844p39159K21251
$$ -622004 -485392 -1666869 -1933128 -741303 -254208 -206269 194511 172667 -566492 -345241
41767c45241L93110p913L51264O50411o59124l71167K12251K8616M21425m87579
$$ -345241 47869 39956 391220 1041631 382507 11340 223591 252207 673632 186053
41757A86053l40878M26640M95378k01087J55199q03935o52814K70724N48377o53450
$$ 186053 -154825 271815 767193 566106 721305 -82630 -735444 -464720 83657 -569793
41747e69793K97470J57729K05901l03879p50630m06911J44136J900010j15862
$$ -569793 -272323 -114594 91307 -212572 -963202 -1370113 -1225977 674033 558171
41738E58171m76495L64952J66562K5730P505J86343m03122l86363j41583J95325
$$ 558171 81676 446628 613190 638920 646425 832768 429646 43283 -98300 97025
41728I7025N3722J88186j94253K91551J13588p33185o7806K86738r23307m4718
$$ 97025 150747 338933 144680 436231 549819 -183366 -251172 35566 -887741 -932459
41718i32459P83392O94377M9648Q6849k3672k53469K13610j47295J34873k57369
$$ -932459 -149067 545310 594958 681807 658135 404666 618276 470981 605854 348485
41708C48485m43066K88191J29138K69706k49038K38252Q2425r34324p07067J17178
$$ 348485 -94581 193610 322748 592454 343416 581668 664093 -270231 -977298 -860120
41698h60120K11825K79241L78453J48431N4968K83775k30326j77979l188J88295
$$ -860120 -648295 -369054 9399 157830 212798 496573 266247 88268 85080 273375
41688B73375N06820K25349p70080j29197m33067m14681J88147j8549N65079K74986
$$ 273375 780195 1005544 235464 106267 -326800 -741481 -553334 -571883 -6804 268182
41678B68182L78819j71671O1008n55415K1158N6110K61484j50444k1793J4040
$$ 268182 647001 475330 536338 -19077 2081 58191 319675 169231 147438 161478
41668A61478q6677J26864J4479L46577K99399q6600K85942n92440L36321L64349
$$ 161478 74801 201665 216144 562721 862120 775520 1061462 469022 805343 1169692
41658A169692l24398j80098l80828J10796p80816r76914O84963M38423M91805
$$ 1169692 845294 665196 284368 395164 -385652 -1362566 -677603 -239180 252625
41649B52625k22802n88721p32390N66881O22595m11210Q82950N8648n20292k96728
$$ 252625 29823 -558898 -1291288 -724407 -101812 -513022 369928 428576 -91716 -388444
41639c88444m10779k65536P33665k67662n1090j02040o69488N30686L38563o23437
$$ -388444 -799223 -1064759 -331094 -598756 -649846 -751886 -1421374 -890688 -552125 -1175562
41629a175562N71939O81894k53809k99812L49935M81388l74906l94113N54997
$$ -1175562 -603623 78271 -175538 -475350 -125415 355973 -18933 -413046 141951
41620A41951q9715k86281l4351o00032M89853M28444N10543N3436K17451q01436
$$ 141951 52236 -234045 -268396 -868428 -378575 49869 560412 613848 831299 29863
41610B9863j13851m60249K3934m62295K82189n72438R2663M339P36520l05811
$$ 29863 -83988 -544237 -520303 -982598 -700409 -1272847 -1180184 -1175845 -439325 -745136
41600g45136J88441J384909p3616j045686O78385L78269j76663j54779L08137
$$ -745136 -556695 828214 754598 -291088 387297 765566 588903 434124 742261
41591G42261j54172M78875o8771l41411m49528M9974j50449j4438k56722l37621
$$ 742261 588089 1066964 998193 656782 207254 257228 106779 92341 -164381 -502002
41581e02002j23092L23546J51736Q62962j45480l44850n2377J40987M89403p77603
$$ -502002 -625094 -301548 -149812 713150 567670 222820 170443 311430 800833 23230
41571B3230K55902l94952l58923K2683R14244P64117p09718p5168l58315j10632
$$ 23230 279132 -115820 -474743 -452060 462184 1226301 516583 441415 83100 -27532
41561b7532m74222J69767L96492l67130m96340M85981k44502P23637K71537J82832
$$ -27532 -501754 -331987 64505 -302625 -798965 -312984 -557486 166151 437688 620520
41551F20520j94207m21611N75787n80001o61088K33835J92984K04137o20527L27715
$$ 620520 426313 4702 580489 488 -660600 -426765 -233781 -29644 -650171 -322456
41541c22456L98677q00403o66026J70492M67929K06427k63380m4652K54614L21782
$$ -322456 76221 -724182 -1390208 -1219716 -751787 -545360 -808740 -853392 -598778 -276996
41531b76996L05220P45998k30914j60330J6063m400j007741L64788L23120j96677
$$ -276996 28224 774222 543308 382978 399041 394641 -613100 -248312 74808 -121869
$$ [...]
##END NTUPLES=NMR SPECTRUM
##END=
