##TITLE=19F_EC-3185
 DMSO. 24 sc
 4.4.2019
##JCAMPDX= 6.0         $$ Bruker NMR JCAMP-DX V2.0
##DATA TYPE= NMR SPECTRUM
##DATA CLASS= NTUPLES
##ORIGIN= UXNMR, Bruker Analytische Messtechnik GmbH
##OWNER= root
$$ XWIN-NMR		Version 3.5
$$ Tue Apr  2 15:55:23 2019 Russian Standard Time (UT+4h)  she@DPX200
##.OBSERVE FREQUENCY= 188.290927
##.OBSERVE NUCLEUS= ^19F
##.ACQUISITION MODE= SIMULTANEOUS
##.ACQUISITION SCHEME= undefined
##.AVERAGES= 24
##.DIGITISER RES= 16
##SPECTROMETER/DATA SYSTEM= spect
##.PULSE SEQUENCE= zg
##.SOLVENT NAME= DMSO
##.SHIFT REFERENCE= (INTERNAL, DMSO, 0, 98.3737)
##AUDIT TRAIL= $$ (NUMBER, WHEN, WHO, WHERE, WHAT)
$$ ##TITLE= Audit trail, XWIN-NMR		Version 3.5
$$ ##JCAMPDX= 5.01
$$ ##ORIGIN= Bruker BioSpin GmbH
$$ ##OWNER= she
$$ F:/spectra/data/she/nmr/f19/1/pdata/1/auditp.txt
$$ ##AUDIT TRAIL=  $$ (NUMBER, WHEN, WHO, WHERE, WHAT)
(   1,<2019-04-02 15:54:10.23 +0400>,<she>,<DPX200>,
      <created by zg, POWCHK disabled, PULCHK disabled
       configuration hash MD5:
       00 E9 B6 7A A2 85 ED C7 34 08 36 98 17 FE 4E 26
       data hash MD5: 64K
       95 4A 93 7A 2D A4 47 C0 C9 68 3B 09 09 27 59 D8>)
(   2,<2019-04-02 15:54:13.35 +0400>,<she>,<DPX200>,
      <Start of raw data processing
       efp BC_mod = 2 LB = 1 FT_mod = 6 PKNL = 1 PHC0 = 1384.745 PHC1 = 189.1559 SI = 64K 
       data hash MD5: 64K
       69 6E 90 8D 03 4A 7C F6 02 57 FB B0 C1 F2 31 05>)
(   3,<2019-04-02 15:54:26.32 +0400>,<she>,<DPX200>,
      <pk PHC0 = -26.84572 PHC1 = 0 
       data hash MD5: 64K
       A3 83 3B 2B C3 37 AE 99 8C 3C 5E C6 D6 A0 A0 6A>)
(   4,<2019-04-02 15:54:29.42 +0400>,<she>,<DPX200>,
      <abs ABSG = 5 
       data hash MD5: 64K
       9C 1D 30 3D EF 66 D7 81 CB 31 3C A8 4C 28 05 FE>)
(   5,<2019-04-02 15:54:56.60 +0400>,<she>,<DPX200>,
      <pk PHC0 = 1.444265 PHC1 = -4.6 
       data hash MD5: 64K
       D9 54 6F 90 F8 38 B7 A1 C5 DF 61 1F 12 F0 AA B0>)
(   6,<2019-04-02 15:55:00.20 +0400>,<she>,<DPX200>,
      <abs ABSG = 5 
       data hash MD5: 64K
       51 5F A3 27 0A E3 8D 5F EA DA 0C 31 3D C2 E5 37>)
$$ ##END=
$$ 
$$ hash MD5
$$ 0A 42 4B 56 51 D9 2C 8B 69 1F 73 9F 7F 79 D8 DF
##$RELAX= 
##$RELAX= 
##$RELAX= 
##$RELAX= 
##$RELAX= 
##$RELAX= 
##$RELAX= 
##$RELAX= 
$$ Bruker specific parameters
$$ --------------------------
##$DU= <F:/spectra>
##$EXPNO= 1
##$NAME= <f19>
##$PROCNO= 1
##$TYPE= <nmr>
##$USER= <she>
##$AMP= (0..31)
100 100 100 100 100 100 100 100 100 100 100 100 100 100 100 100 100 100 
100 100 100 100 100 100 100 100 100 100 100 100 100 100 
##$AQSEQ= 0
##$AQ_mod= 1
##$AUNM= <au_zg>
##$AUTOPOS= <>
##$BF1= 188.310428
##$BF2= 200.13
##$BF3= 200.13
##$BF4= 200.13
##$BF5= 200.13
##$BF6= 200.13
##$BF7= 200.13
##$BF8= 200.13
##$BYTORDA= 1
##$CFDGTYP= 0
##$CFRGTYP= 5
##$CHEMSTR= <none>
##$CNST= (0..31)
1 1 145 1 1 1 1 1 1 1 1 1 1 1 1 1 1 1 1 1 1 1 1 1 1 1 1 1 1 1 1 1 
##$CPDPRG= <>
##$CPDPRG1= <>
##$CPDPRG2= <>
##$CPDPRG3= <>
##$CPDPRG4= <mlev>
##$CPDPRG5= <mlev>
##$CPDPRG6= <mlev>
##$CPDPRG7= <mlev>
$$ [...]
##$SUBNAM3= <"">
##$SUBNAM4= <"">
##$SUBNAM5= <"">
##$SUBNAM6= <"">
##$SUBNAM7= <"">
##$SUBNAM8= <"">
##$SUBNAM9= <"">
##$SW= 251.107818259711
##$SWIBOX= (0..15)
0 1 0 0 0 0 0 0 0 0 0 0 0 0 0 0 
##$SW_h= 47281.3238770686
##$TD= 65536
##$TD0= 1
##$TE= 0
##$TE2= 300
##$TE3= 300
##$TEG= 300
##$TL= (0..7)
0 120 53 12 22 120 120 120 
##$TP= (0..7)
150 150 150 150 150 150 150 150 
##$TP07= 0
##$TPNAME0= <>
##$TPNAME1= <>
##$TPNAME2= <>
##$TPNAME3= <>
##$TPNAME4= <>
##$TPNAME5= <>
##$TPNAME6= <>
##$TPNAME7= <>
##$TPOAL= (0..7)
0.5 0.5 0.5 0.5 0.5 0.5 0.5 0.5 
##$TPOFFS= (0..7)
0 0 0 0 0 0 0 0 
##$TUNHIN= 0
##$TUNHOUT= 0
##$TUNXOUT= 0
##$USERA1= <user>
##$USERA2= <user>
##$USERA3= <user>
##$USERA4= <user>
##$USERA5= <user>
##$V9= 5
##$VALIST= <valist>
##$VCLIST= <CCCCCCCCCCCCCCC>
##$VD= 0
##$VDLIST= <DDDDDDDDDDDDDDD>
##$VPLIST= <PPPPPPPPPPPPPPP>
##$VTLIST= <TTTTTTTTTTTTTTT>
##$WBST= 1024
##$WBSW= 4
##$XGAIN= (0..3)
0 0 0 0 
##$XL= 0
##$YL= 0
##$YMAX_a= 7803
##$YMIN_a= -23814
##$ZGOPTNS= <>
##$ZL1= 120
##$ZL2= 120
##$ZL3= 120
##$ZL4= 120
##$ABSF1= 98.37372
##$ABSF2= -152.7273
##$ABSG= 5
##$ABSL= 3
##$ALPHA= 0
##$AQORDER= 0
##$ASSFAC= 0
##$ASSFACI= 0
##$ASSFACX= 0
##$ASSWID= 0
##$AUNMP= <proc_1d>
##$AZFE= 0.1
##$AZFW= 5
##$BCFW= 0
##$BC_mod= 2
##$BYTORDP= 0
##$COROFFS= 0
##$CY= -3
##$DATMOD= 1
##$DC= 0
##$DFILT= <>
##$DTYPP= 0
##$F1P= 0
##$F2P= 0
##$FCOR= 0.5
##$FTSIZE= 65536
##$FT_mod= 6
##$GAMMA= 0
##$GB= 0
##$INTBC= 1
##$INTSCL= 8.653935e-10
##$ISEN= 128
##$LB= 1
##$LEV0= 0
##$LPBIN= 0
##$MAXI= 10000
##$MC2= 0
##$MEAN= 0
##$ME_mod= 0
##$MI= 0.4277144
##$NCOEF= 0
##$NC_proc= -8
##$NLEV= 6
##$NOISF1= -61.99997
##$NOISF2= -62.99997
##$NSP= 0
##$NTH_PI= 0
##$NZP= 0
##$OFFSET= 98.37372
##$PC= 1
##$PHC0= 1359.343
##$PHC1= 184.5559
##$PH_mod= 1
##$PKNL= yes
##$PPARMOD= 0
##$PSCAL= 0
##$PSIGN= 0
##$REVERSE= no
##$SF= 188.296044280273
##$SI= 65536
##$SIGF1= -61
##$SIGF2= -65
##$SINO= 3.502647
##$SIOLD= 65536
##$SREGLST= <1H.CDCl3>
##$SSB= 0
##$STSI= 65536
##$STSR= 0
##$SW_p= 47281.3238770685
##$SYMM= 0
##$S_DEV= 0
##$TDeff= 65536
##$TDoff= 0
##$TI= <>
##$TILT= no
##$TM1= 0
##$TM2= 0
##$TOPLEV= 0
##$USERP1= <user>
##$USERP2= <user>
##$USERP3= <user>
##$USERP4= <user>
##$USERP5= <user>
##$WDW= 1
##$XDIM= 65536
##$YMAX_p= 333039022
##$YMIN_p= -36812080
$$ End of Bruker specific parameters
$$ ---------------------------------
##NTUPLES= NMR SPECTRUM
##VAR_NAME=  FREQUENCY,     SPECTRUM/REAL,   SPECTRUM/IMAG
##SYMBOL=    X,             R,               I
##VAR_TYPE=  INDEPENDENT,   DEPENDENT,       DEPENDENT
##VAR_FORM=  AFFN,          ASDF,            ASDF
##VAR_DIM=   65536,         65536,           65536
##UNITS=     HZ,            ARBITRARY UNITS, ARBITRARY UNITS
##FACTOR=    0.721466756344984, 1,           1
##FIRST=     18523.3820098237, 0,            0
##LAST=      -28757.9418672448, 0,           0
##MIN=       -28757.9418672448, -36812080,   0
##MAX=       18523.3820098237, 333039022,    0
$$ Real data points
##PAGE= N=1
##DATA TABLE= (X++(R..R)), XYDATA
$$ [...]
31776 -5040803 -8211475 -2503453 -683412 -3017365 -1713654 1175870 4448442 4036722
31768 4036722 5492082 5792221 5477929 2572438 -4591961 -9522784 -8466510 -9963743
31760 -9963743 -6789877 -1552967 -5756452 -8617611 -8200543 -8476145 -9003928 -12231127 -10749552
31751 -10749552 -7232131 -5179891 -8956144 -7687571 -5130674 -5141655 -1646517 -2545649
31743 -2545649 -7453125 -871410 4370800 2744308 -729500 1229904 574952 129953
31735 129953 -1956571 -1539643 -4104696 -6445265 -5960632 -2837667 -5671471 963252 3129345
31726 3129345 1094079 -2658692 -2044439 -2750842 -4207554 -4990067 1705655 5325539 228757
31717 228757 -4388442 -987785 -921022 -1212463 2759973 -2992848 1551909 6727498 6275690
31708 6275690 3779160 3035353 -711166 -2504877 5097421 5159643 2819057 -2350624 -7417463
31699 -7417463 -4133053 -6546685 -6184602 -7668703 -56975 2992915 1064316 -3836564
31691 -3836564 -4254798 -4198260 -7988142 -3096992 -2242771 -2097861 500321 4751420 2713505
31682 2713505 -2003080 -5098274 -6759526 -3439519 3763017 3376463 -2925152 -4398269
31674 -4398269 -3461727 -247554 2922371 489512 -3430282 -2899863 -3810137 1315328 -5024846
31665 -5024846 -9196468 -7552498 -2232013 -1596372 -3352241 20504 -3705509 -1115530
31657 -1115530 -4871501 -4282205 -1515518 -4789490 -772670 -2274653 -4049654 -8455968
31649 -8455968 -8000635 -3926539 -4387534 -6468008 -2778185 -2584448 -7080330 -5348554 -8201556
31640 -8201556 -7382354 -2985313 -901707 -3517251 -6264369 -3587771 -1405080 -1451185 -5144108
31631 -5144108 -3868512 2100472 7114605 2094682 -3222874 -7533884 -5381098 -2936165
31623 -2936165 -3861117 -3882868 -2056318 1001096 2230081 -2102214 1973859 2686603 1375816
31614 1375816 2725039 4837227 7728302 6788239 5765239 6409280 6328550 3486985 -2420683
31605 -2420683 -80486 -2105920 1432455 3651622 3867176 65676 472583 -1552725
31597 -1552725 -5175260 2469542 889109 3014692 5659062 7414984 2212127 -3940639
31589 -3940639 -1107129 83701 -3826511 -655456 1407767 2690711 1616181 48134
31581 48134 -4068641 -4573377 -4519610 872794 -2200910 -676856 192968 -5641320 -5228555
31572 -5228555 -6431285 -4421829 -5471619 775977 37123 -2427347 -4225353 -1811078
31564 -1811078 1114651 -1950498 -4171137 -596537 -1888050 -3639518 -3549326 1751762
31556 1751762 -1144050 -595845 -206655 -1440359 145803 3665170 3287534 -300223 -2986300
31547 -2986300 -685752 2423739 -3175504 -11829053 -10428019 -1676992 4366195 8039535
31539 8039535 -34608 -3523552 -5913378 -4135013 -8303511 -2297258 5437292 3251018
31531 3251018 4338856 5946082 5341136 -362282 -2151055 -3745047 -3119046 -668851
31523 -668851 -2234286 -205878 1171674 2288048 1150176 -1385935 673072 2964012
31515 2964012 1006738 520278 1217575 1063918 -2812016 -4909684 -1348036 2174476 -3511703
31506 -3511703 -2876715 5103729 2652040 -3223110 -934214 283104 7219 3642976
31498 3642976 2345714 539889 3591865 4340485 5958179 188899 3340219 6612067
31490 6612067 4844941 5848529 -1490447 570609 1107056 -433777 487841 6736276
31482 6736276 1373173 -5280446 -9916717 -2637706 3065096 1313132 -204538 -2245111
31474 -2245111 89890 -2113494 -762509 -6665567 -11290385 -8703669 -5512400 -504153
31466 -504153 921054 3299272 -3080504 -8885796 -5529198 -3393619 -5264378 -3725561
31458 -3725561 -2235335 884909 2636489 4663817 10158336 5113612 -1143014 2116267
31450 2116267 5532549 236204 -3407956 1102788 1955888 4972558 710057 -4646710
31442 -4646710 -4881672 -7307247 -5988067 1239191 1506398 375097 1274436 -6086779 -6339102
31433 -6339102 772314 -996969 -796815 2682937 3081312 3782414 345503 2335511 -1481650
31424 -1481650 -3282432 -4537066 -5605443 -4503196 -4185569 -6685280 -7980274 -6331934
31416 -6331934 -7096707 -11188631 -7894411 -2474395 2258311 1411938 -4851467 -6663469
31408 -6663469 -6501377 -10368032 -9546271 -3644121 -2714870 -8871989 -9393704 -5269837 -5370222
31399 -5370222 -4608692 -3523995 904369 -887974 1380424 3675278 2817940 3593424 4187944
31390 4187944 -8647465 -5205667 -2255773 2162573 -1225900 -2307225 8846704 3361549
31382 3361549 -3716018 -2450437 -765181 -4446967 -6331816 -4603623 -3299582 -327104
31374 -327104 4693415 7217607 5816058 1430821 1192783 2744775 2031246 -4733856 -10030369
31365 -10030369 -3083111 -3956843 -3706685 -1734250 -203461 2949319 -7319736 -4132956
31357 -4132956 4929479 -1586152 -2818340 1848653 -2340491 -3477604 -7064376 -5251869
31349 -5251869 -4570188 -6658527 -5964573 -5000181 -4839760 -3381626 -3840526 -3667719 -5899881
31340 -5899881 -3486237 35594 2086101 -78858 104364 810323 -224201 -1545487
31332 -1545487 -2023299 1955374 -1025328 813066 2567890 4817692 774444 1796398
31324 1796398 -555285 -2311508 -1177239 -4076511 -1857903 -1995560 1748604 -324111
31316 -324111 -4093905 -279342 -148261 -4755191 -1189413 353340 -1552654 -202671
31308 -202671 2562905 1053648 -1282347 1924869 1283111 2661376 4555106 2209181
31300 2209181 1418636 3301505 2115584 2226425 844504 -1307153 -4109019 -8258623
31292 -8258623 -7729172 -6626097 -1786902 -26282 -1071903 163560 5323425 2483071
31284 2483071 -3710048 -5804108 1732185 5750108 2265739 -335233 -4245755 -4992226
31276 -4992226 -1794525 -1377557 -477306 -1829468 368921 2535167 -6097805 -2915773
31268 -2915773 -5761241 -2827119 -5889942 -10149928 -9180817 -1796740 -1401772 -4289839
31260 -4289839 -6596803 -8263388 -7750426 -8053816 -7392094 -108650 1783263 -613959 -3975940
31251 -3975940 1393556 2610662 53681 4156459 3305893 -4001136 -13633688 -18913816
31243 -18913816 -10565359 -2446718 -267244 -4081708 378697 788913 -857466 2586175
31235 2586175 -729227 -3555875 581058 -2256923 -4379837 -3620191 -2368734 845841
31227 845841 -4433494 -2492027 794772 5492106 3314896 -1018798 -6634441 -2345096
31219 -2345096 916223 -197201 -5507298 -7642161 -10231646 -9824555 -10897077 -9262412
31211 -9262412 -8643284 -6743734 -5391769 -5474456 -2019690 -3675930 -5857987 -2863267 282212
31202 282212 -1742547 -4166777 119297 3655777 7141398 2331235 -3069267 -4455215
31194 -4455215 -2155036 3848630 -2835912 -3755390 -1908000 -3481257 229261 -1898887
31186 -1898887 -7213614 -9112136 -3343744 1896139 6123848 6951151 7180237 6755832 4944773
31177 4944773 -863362 -3732698 3473403 826044 -958999 -3475007 428572 3182093
31169 3182093 -1642547 -4866652 892047 9181458 5148976 2832222 -30847 -711623
31161 -711623 1319996 -1755171 -2126736 2050206 1757251 600585 -1637823 -3588724 -6122671
31152 -6122671 -8302810 -4740356 -780721 -3472721 -6245288 -5581319 -3236490 -8513718
31144 -8513718 -9090410 -3861129 -5608999 -5851242 -7538744 -8266297 -3224559 -2556621 -1653056
31135 -1653056 -1074736 -1327957 -4826804 -1262867 4326200 -1259991 -3161173 -3984519 -3270502
31126 -3270502 -3272410 16941 -3168179 -1227353 3865274 1931353 -3229417 -1216714 5146967
31117 5146967 3222292 1785272 48006 -2119998 484792 1225928 -1001832 -1497448
31109 -1497448 -1775326 -3506886 -7905560 -7411809 -6672152 -9379196 -5569081 -3027723 -937777
31100 -937777 -4506919 -8943698 -6749186 -6844740 -5373400 -8892413 -9916360 -6967030 -3038244
31091 -3038244 -1724295 -7601 150658 2582761 5841880 2547166 884146 4479648
31083 4479648 5449410 3851987 -205866 -3140581 -3667348 -1640035 2107045 5468401
31075 5468401 2240774 -2252574 1473601 450790 -8879519 -10648165 -6767082 -572004
31067 -572004 -2119202 -111916 2728102 872212 -3268745 632365 -3381220 -10671400
31059 -10671400 -2709521 3690981 5403727 8313309 4801621 -2776574 2120030 2177208
31051 2177208 -2977915 -2264130 -1457422 1420146 -2607353 829574 5106856 1063800
31043 1063800 -3273759 -4469949 815866 1099140 -6462431 -5276203 -4627578 -11252649
31035 -11252649 -3572194 -994481 2627598 5979880 3433465 5951349 3017607 -938361
31027 -938361 -1802911 4552083 4340365 3568414 5066443 3893492 5906031 4257476 3741792
31018 3741792 6986327 6916790 5320283 1817109 -2973007 -2012362 -4394550 -5170433 -6634579
31009 -6634579 -546523 -1965669 -918357 -2332189 -1371976 4745851 1369513 -40129
31001 -40129 -3342325 -3175225 204064 5842887 5303733 4810221 1028403 3193834 10903065
30992 10903065 8617943 5889239 4626150 6291756 6048201 4176458 2236719 2261685
30984 2261685 1376594 -2979896 -784938 -1140416 -2333255 48171 240193 -2279099 -1849491
30975 -1849491 2476840 7646417 5492455 2660355 1374484 -685013 -3314049 -1588746
30967 -1588746 -1744057 -2301616 378884 -277405 93907 -1674368 -2531870 -6255269 -1715653
30958 -1715653 -94069 -9682677 -9129066 -2700923 -327245 -807417 -1601505 -7393997 -3953630
30949 -3953630 -919015 1462149 4501707 -1676389 -2871814 -2068367 -1831492 2550961
30941 2550961 -424193 4592730 3283335 -146028 5701262 4873358 -1245529 -2919809
30933 -2919809 2229115 2481560 -212467 -3251486 -2085067 -3946516 -1913556 -4110958
30925 -4110958 784971 5812922 5828890 -1028992 -6003378 -3640834 -13840320 -12654456
30917 -12654456 -6636607 -436711 2968614 2861893 4156663 2372773 -2577681 713172
30909 713172 -891358 -3018507 -4265297 -2449001 -3990275 -4538253 -6726612 -5159474
30901 -5159474 -1331795 -2033889 -2888526 -3496686 -2710393 -4403527 3207094 4802215 -237437
30892 -237437 -2814108 -10016280 -8441252 -4523586 -7986293 -4805827 -1060914 -152983
30884 -152983 -70559 1875837 4256583 4198330 -1566454 -3150702 -3023616 -2130922 -1682609
30875 -1682609 800814 1403135 1398486 3532739 -3044507 -2113000 -3817799 -5466765 -6414291
30866 -6414291 -6079878 -6762504 -5285561 -3237750 -4428153 -3370569 -4457653 -6434330
30858 -6434330 -7978388 -3033045 136274 -5517742 -10058823 -7499375 -7838519 -9320003
30850 -9320003 -6788520 -4424697 -4861878 -6026582 -6525796 -3634287 -1432241 -2640605
30842 -2640605 1713436 3337005 1987765 506840 5422738 1171035 1311895 4139863
30834 4139863 3244186 988017 4115843 -1079666 -1524858 2394050 2593150 -4365778 -4288836
30825 -4288836 2145296 7598448 5337605 981492 -2140738 -4434392 -2581804 -3195389
30817 -3195389 779810 219722 2872768 2989665 -1401312 -6826484 -4215989 -642885
30809 -642885 -902762 322067 -988196 -2219393 -1239715 -1848077 -6452890 -23118 3491673
30800 3491673 3689725 4882989 6182775 5918124 6482127 3682707 924114 895995 -2151938
30791 -2151938 -6327945 -3870281 -2641403 178885 -1782539 -6671671 -3478086 -2863247
30783 -2863247 -2959609 -3363887 -5431433 -994712 -2602796 -6674589 -10217988 -7228570 -1551249
30774 -1551249 -6502714 -11077180 -2783266 -7531953 -78189 4311366 -4019213 -3351987
30766 -3351987 -5668896 -7445492 -3162121 -1416098 -1540564 -4303158 -8574915 -2937063
30758 -2937063 -3299384 -716024 -5743249 -10141223 -7027208 -5038195 -2866793 -823345
30750 -823345 7358244 8052337 7715045 -4662636 -6685270 77126 -2312252 -1266384
30742 -1266384 -2240743 -3069422 -1858850 -4361052 -7083538 -8288536 -5644652 -6262700 -7508056
30733 -7508056 -4253749 352008 -89101 -2888433 -1715864 2389012 -1345878 370584
30725 370584 -2202274 -859559 -421992 -2794529 -4450154 -4388275 -3199443 -4861438 -4688472
30716 -4688472 -905155 2368814 1167018 -4391381 -8633822 -5494422 338829 2564594
30708 2564594 3754436 3505993 -2570283 -5975539 -6428936 -3909161 -181468 -3042095
30700 -3042095 -3663063 -5376405 -6104734 -883824 -3700161 -5944372 -5113350 -2890465 -995994
30691 -995994 -1652872 -1454505 -2810961 -4216839 867426 -7561358 -9777029 -5265174 -818836
30682 -818836 -3032708 405463 -378362 -6613278 -4014232 -5637219 -2941853 701546
30674 701546 498131 -1204808 3278934 11184506 6910072 2498217 -314650 -181583 3074403
30665 3074403 1292435 -3298062 -4746975 -3130353 -16872 -5505596 -8747422 -5961010
30657 -5961010 -2754573 -2439722 1610298 83282 1648523 4688985 2809260 -1455263
30649 -1455263 501704 263339 -412406 -298178 279239 -3073373 -11319321 -9444917 -4033054
30640 -4033054 -7032277 -5852282 -9128277 -7575284 977336 -1382743 542184 2867253
30632 2867253 -2291976 3515728 1376743 2850892 2146735 1348987 -862905 394918
30624 394918 3445338 -1149548 -3429367 -7258064 -1005898 4052450 7365573 4285064
30616 4285064 3247973 -2019014 -5520595 -2417108 246075 -2286107 -2760793 914352
30608 914352 -313844 -2492152 1846919 2879419 -1513255 -7381490 -973996 3786538
30600 3786538 -2082711 -2973543 -1733305 -1355969 -1934667 -2821769 576350 4458659 4418457
30591 4418457 1234304 -1289735 -1754363 -2288006 1651671 -2484345 -4031443 -6590069
30583 -6590069 -6302760 -2093512 -1592581 -3103496 -2111532 -2295157 -3661123 631923 1725666
30574 1725666 -3252047 -7098381 -7423087 -6909231 -3738166 -3238542 -7752460 -4892688 -5990238
30565 -5990238 4058913 2449886 -1635396 -6081377 -828111 594347 2514487 1424887
30557 1424887 -1425519 407839 4453877 577770 -2626398 -2682125 -845608 3125750
30549 3125750 4760052 857558 -608803 2968026 -335134 -8915286 -2378242 -2280319
30541 -2280319 -1745254 -1993705 -4827509 -7231785 -11122660 -10081896 -7983089 -5749922
30533 -5749922 -7627845 -4137501 7750340 4277592 -575833 -1640080 -3245481 -1181576
30525 -1181576 -5389694 -4160887 -3988186 -4103472 -4485094 -7415277 -3935881 -1749311 -2163610
30516 -2163610 -4117615 -2609078 790845 1610447 -1945725 -1132429 4669372 -252292
30508 -252292 -1545206 -2643913 -321767 -5639421 -2996547 -5867599 -5399189 627425
30500 627425 1689217 -2557912 -1462874 -3164310 -1309686 -3924934 -6086347 2904411
30492 2904411 3352861 2159195 -322565 -1358582 5341643 5380509 4129205 4589106 5640753
30483 5640753 4687719 6896091 231865 -1783615 -2490409 1218206 -2051201 -2537213 7321610
30474 7321610 6126813 -1212187 -7103218 -13945855 -10184569 -1707651 2639946 1729909
30466 1729909 1242845 11779 -63001 2443954 6168679 4891829 2166870 -1703233 -12355657
30457 -12355657 -7229627 -4296493 -10352949 -9200723 -3460076 -2027489 -692687 -1515654
30449 -1515654 2542250 -2277332 -5507590 -7997391 -4210130 -5563040 -7422469 -6553595
30441 -6553595 -5731552 -10642824 -4798276 -1168829 -4725061 -2781510 -3431758 -4521901
30433 -4521901 -3902444 -2455975 1045626 -892726 -243065 -440738 5448193 4419248 2182123
30424 2182123 -2429778 -747397 -221537 71939 -2712594 1439808 1228013 115177 2152898
30415 2152898 -1796311 -8175568 -4556512 2316191 401544 -1681847 -7632452 -3491050
30407 -3491050 6847774 7981822 3467018 -2701784 -4230230 1180822 1676156 -333476
30399 -333476 -9669103 -10042043 -6469787 -3039591 -711975 731877 -457987 -3622098
30391 -3622098 -4461811 -4717457 -8351926 -12848219 -12551097 -6578231 -4341479 -9542286 -10990679
30382 -10990679 -8713620 -6150777 1252334 1648800 -1319764 -825943 1162935 -3493930
30374 -3493930 -2593125 -4674541 -876830 -5436291 -5947867 -36812080 -31357371 -9124861
30366 -9124861 -10453282 -3138470 -6229665 -2634887 -1191408 3815538 -807680 -2827444
30358 -2827444 -4444201 -3538867 -1455003 1473659 -2336920 1565546 4302124 -1681867
30350 -1681867 179272 4832071 3678950 5014317 4921170 2811425 -1551537 -2174003 -6120158
30341 -6120158 -2140117 3023295 1430278 2926162 2790437 5810485 3925020 2063323
30333 2063323 8630465 5416785 -404292 -3084647 -3894755 -6447000 -4338694 3103607
30325 3103607 6659014 3118244 2787488 -2557690 -6096805 -5516470 -2391293 2193892
30317 2193892 5661598 4953539 4337424 -843916 -6050588 -5711984 -5138180 -2542801 -1688110
30308 -1688110 -1885908 -4563316 -4768154 -4640185 -4916863 -11759135 -17363901 -9990629 -5325806
30299 -5325806 -1629119 -5167194 -7198768 -5148403 -3932655 -390551 -705621 -2277585
30291 -2277585 -6159770 -3207235 -970874 404610 -1348628 -1443041 -5301137 -3779149
30283 -3779149 634599 502193 3750649 829144 -4459261 -5319555 -6101822 -1844979 -1626259
30274 -1626259 -4408953 -3837942 -5852630 -1403631 3926992 10799850 7636028 1539599
30266 1539599 1093470 -5102086 -2597425 2305606 3602697 2934796 -19572 -118464 -141144
30257 -141144 1733744 1277374 407789 3128843 7636453 1595341 -3549201 167174 1719265
30248 1719265 1803353 4927938 126977 -6810743 -6103932 1417339 2090906 135987 -6578460
30239 -6578460 -7220815 -2053829 384002 -2106496 -2366844 2113323 -419805 1430517
30231 1430517 702896 -1853912 -6729246 -4105247 -4915821 -2828178 -301121 -244662 -1778946
30222 -1778946 -4401288 -3216763 -6664312 -9691617 -4918761 89225 147031 -1212662
30214 -1212662 5443031 3014677 579377 -6188127 -8430896 2664136 6747752 4304192
30206 4304192 -3140408 -1326475 8327428 2590735 12488897 15483443 4878783 7040412
30198 7040412 4071392 -586395 -2346516 2801495 -1105141 -2140832 -3782425 -127785
30190 -127785 2297819 6038697 8595667 10243181 7154712 4574849 -2829475 -5049342
30182 -5049342 3557064 9754558 5750249 -49013 3299474 4401611 -3965065 -5015185
30174 -5015185 266344 2950109 1312538 1811220 4496790 4113312 3062331 855840
30166 855840 724093 -311940 1445617 4556810 1637003 2035792 6332027 7668011 8116451
30157 8116451 9530710 7140668 4869437 3406091 -1270034 3415189 7510245 3264052
30149 3264052 166505 537897 1531780 4924082 8620451 9417996 8498816 1668268 -2884312
30140 -2884312 737810 7967251 8082561 5534144 4395885 639531 -4074286 -2185137
30132 -2185137 -1082700 -7112280 -3025812 5695836 7439121 4438757 -143191 2151792
30124 2151792 6046446 7164450 383556 -3699803 -6113382 -2924991 -4670416 -4834244
30116 -4834244 3003115 2175490 2325467 12275404 11489957 6815757 1358865 -5007872 -828456
30107 -828456 -1205292 -4523977 -4506757 -2131362 -1705383 966153 3270759 1268490 -1082302
30098 -1082302 1817576 4671150 -550129 -2057729 -1748884 386419 358719 1725517 5323830
30089 5323830 1686457 5713780 3507255 4614385 -2963963 -7934545 -6532348 -981156
30081 -981156 412100 2248865 6571032 5765158 4657168 2792255 521917 3610149
30073 3610149 -192188 -2206800 1156055 1014342 5212798 1087542 -1569330 -6290756
30065 -6290756 -3821004 -1391530 -4952372 -7394242 -5762336 -9205170 -4548999 -1732197
30057 -1732197 -1283533 61282 -4972737 3107852 5115199 3302515 941522 -1482560
30049 -1482560 -1435693 -6178286 -11819987 -10808503 -3307536 -96344 -5841209 -11382697
30041 -11382697 -8662475 -4102511 -9895737 -10109932 -7146349 -1733841 591674 436902
30033 436902 -1360465 1821586 2743232 5389374 3354125 -8132590 -11799893 -6684252
30025 -6684252 1198452 4920422 -3476200 -4376865 2409229 6352742 8744266 2290272
30017 2290272 3448724 4288499 2645330 4741950 1024445 1590526 -340054 -4261336
30009 -4261336 -5503405 -2509690 -55560 4748349 5028775 2585688 2055484 -885262
30001 -885262 -1916292 -6115655 -4623726 1304997 -1364760 -3057191 -2809606 -3917969
29993 -3917969 -3699048 -721360 -2610650 -3212499 -8121977 -12574401 -11827016 -3511303 2247084
29984 2247084 -52430 -240994 -3002033 -634969 637561 129856 6078628 6974087 2303348
29975 2303348 8036204 5003778 -2806035 -6129840 -4961327 1873145 2821955 3358995
29967 3358995 -2035172 2424229 1515897 -5841339 1010829 -1905653 -4020074 -2186148
29959 -2186148 908701 -1731766 -1698671 -243275 2215502 4790205 8373605 858389
29951 858389 -9185408 -11019751 -3898968 976638 -3483954 -891053 -444441 -3854000
29943 -3854000 -2500521 -5446719 -2638801 2669706 3084357 372478 471159 3559886 -4214326
29934 -4214326 -6912503 -1738935 1812294 3035664 3936692 406593 1972169 2833947
29926 2833947 -4798025 -6625777 -1306650 -3819815 -8215818 -4743870 4867046 9719750
29918 9719750 7551856 1369400 1207101 1193156 -1961717 -3562752 -3637241 -2562473 -8470235
29909 -8470235 -7226984 -7003474 -5094226 -5603650 -2173650 2224912 -2151184 -3767735
29901 -3767735 -845617 779860 -2495514 -3845222 -4257560 -4650098 -5508029 -1092114 5322349
29892 5322349 2030569 559366 -4991055 -1495052 4329809 5150152 2136572 -2415412
29884 -2415412 -2212324 1292862 -2717624 -2338873 772164 -30827 -4597415 -1411415 -764478
29875 -764478 2594139 1220157 4443182 401137 -6943194 -7678255 -4925143 -10174189
29867 -10174189 -11564485 -10462903 -7150051 -5907564 -2023536 -1243442 356240 9762111
29859 9762111 588584 -6115851 -2605587 3785694 2622010 2939397 632507 558855 5658460
29850 5658460 2479234 -3522853 -6437920 -3051597 -3661254 -3266790 5529686 5800913 -604744
29841 -604744 -2888954 -3401029 -2130340 -3430644 -4401097 -4129069 912089 231798 -1804791
29832 -1804791 -1473221 -1428932 4336202 5318574 6644511 10905353 10739557 10663925 3957222
29823 3957222 -1661864 5608363 4779053 4800134 1172890 -4803222 -4050955 -1593083 566365
29814 566365 5807278 2246393 -752377 -3949364 -3356551 -1033635 -1422655 -3288085 3386785
29805 3386785 623110 -1935243 -1120122 -8641094 -11357860 -2544983 -5793503 -3453154
29797 -3453154 -4803202 -4390251 -4397856 -3411501 2283471 658041 -1389551 -4330277 -480128
29788 -480128 656617 2918366 4592325 -2944988 -296702 594581 985296 887530 -2687553
29779 -2687553 579899 3392912 -4765659 -77829 4249115 -326193 -1257826 -4104287
29771 -4104287 1482828 6161378 9839229 3973720 3196945 3992085 3733686 4901603 4356646
29762 4356646 -634476 207203 648452 1058463 -1069914 -9394050 -11302662 -6298474 -4861861
29753 -4861861 -916969 -2703090 -8138845 -1860481 1994927 5488321 4053591 4864077
29745 4864077 5922150 8753605 3802759 659230 1519065 6020959 2235500 116157
29737 116157 460643 -2706771 -3996254 -1026010 -43339 4732926 -4020600 -4046092 -1430446
29728 -1430446 -5095557 -6132925 -5573733 -3003063 -8082584 -5611515 -4228335 3001632
29720 3001632 6916334 7616831 4678826 -443790 3222281 -2198362 -3212831 1334866
29712 1334866 2069431 -2594123 -4735618 -2359825 60220 4365839 2323345 -551165
29704 -551165 -2140760 -5709225 -7225605 -6265355 -4972175 -6164595 -3934189 2279305
29696 2279305 373695 -5958519 -8029120 -9078227 -3098859 -903414 3886032 4397018
29688 4397018 14992 -2140420 2757621 3355619 -1645485 -2130478 803698 -3417201
29680 -3417201 -6615767 -2389651 2235973 3074170 -1273651 -3190849 -4635273 -4649108 -2096509
29671 -2096509 1050979 7621559 5494693 3368073 2994272 2864720 1808556 -2313565
29663 -2313565 -750279 -1195765 -140252 268017 -5828365 -11724267 -9223869 -2489381
29655 -2489381 -2483120 1449977 -4878009 -9120342 -6985707 -7013132 -6628321 -4642405 -4535732
29646 -4535732 -5455941 -5543272 -3446257 -2320705 -1648895 4723058 6252890 3074370 2837038
29637 2837038 -1787466 -2797494 1576828 4975873 1679535 -1999798 -1758962 -1512849
29629 -1512849 -4374293 -8298982 -5203708 -1120385 2736668 627572 349591 841650
29621 841650 2132384 -114691 -1292268 338313 3138931 3905319 8148018 7478758 5804867
29612 5804867 -2274734 -3822563 2159614 6409766 7776469 7942313 -926981 -4003506
29604 -4003506 -1222904 -2847968 -2992730 -4039618 -2934259 -5456941 1187189 1945832
29596 1945832 6837817 9228249 8626613 6173984 1805428 -299641 -667690 1800115
29588 1800115 -848703 -1003755 4198671 -488052 -2397471 -4494996 -5421667 -2777460
29580 -2777460 806530 -2792020 -6353253 -3667376 -3725444 -11219252 -13593090 -11446543
29572 -11446543 -7313406 -8833684 -8094265 -220855 3342513 4860552 3306087 590084
29564 590084 1120147 2884682 2889686 3114263 5289553 5903457 3280647 -1578873 -978226
29555 -978226 -2847421 -4150089 1667772 512334 2655849 8999644 1912993 -400221
29547 -400221 -4969861 -5004777 -4772812 -450648 -265498 -3484852 5168210 -3378 2973699
29538 2973699 7098556 9593541 4033994 1370652 8630323 5322937 1530335 -341572
29530 -341572 -459890 652634 -1423515 -2823502 1590654 689856 -3756129 -2577014 1569196
29521 1569196 -6682657 -10410598 -5708196 -2513667 -5290990 -1525806 -1688686 355756
29513 355756 -633105 219280 5476509 3395742 5003718 3979989 -1412859 124867 4688299
29504 4688299 2933893 -697055 -486987 2342072 6079675 6128721 4463426 6240859 2486721
29495 2486721 1775198 5422087 3247328 -4237380 -3417787 -2434332 758006 -1179750 -3219493
29486 -3219493 -6410899 -7263413 -4071202 -3411776 562707 1831003 -1090895 2377324
29478 2377324 3104313 1504313 -714335 -1679839 -1099375 -1476134 -5215204 -4745428 -1647271
29469 -1647271 1235126 1165722 -1804021 -2723746 -6738944 -7136473 -5984164 -4293818 -1470406
29460 -1470406 2677640 -971663 1962103 7778591 1246853 -1328082 61473 141523
29452 141523 5851838 3742945 -2902059 -3159416 -4671919 -8527543 -5647220 -2303888
29444 -2303888 3288601 6916356 7924537 5448784 3179677 7910586 6225391 2031551
29436 2031551 3776045 5094317 5969794 4774838 3769674 5821088 9254363 7406018
29428 7406018 8018762 4976969 -745430 -1263449 4885822 1646309 -4264984 -4823645 -6954229
29419 -6954229 -5416989 -5683987 209948 4786160 4347449 7564946 10669996 12417730
29411 12417730 6224893 4916856 10268719 7553761 -1661090 -2888147 4481664 4440030
29403 4440030 -444011 3944655 4902056 4011728 6436273 5898307 7735964 3585190 -10543145
29394 -10543145 -6928716 -3800788 -5014991 -170345 -1634763 -6940343 -6670971 -2376371
29386 -2376371 -2039081 -2186159 -1627794 -2449426 -161313 1242429 -2085402 1804541 833649
29377 833649 -536776 -4698049 -7518278 -384005 397389 -370718 483058 6277500 8008509
29368 8008509 1213955 1657023 2472262 2575973 -2104917 -5541140 -4111441 1365484 -3249730
29359 -3249730 -1653563 -709728 2183360 5305319 1436640 -5201310 -7706453 -1149056
29351 -1149056 2690034 3027151 6296209 3058808 2670433 -2251288 2431429 7208215
29343 7208215 5666006 3326538 3699130 174387 -2385789 158222 2905803 3448611
29335 3448611 -334447 -3874297 -3594496 -4320558 -720574 373140 580159 2008258 209448
29326 209448 4012792 7121485 -302928 -3166703 -1967070 -3723913 -2674997 -2809676
29318 -2809676 -5370118 -4405316 -3607070 685063 -2825745 344299 -2128474 -4851705
29310 -4851705 -7245908 -7740010 -4734244 -7706198 -6055503 -4269252 -5618938 -3359714
29302 -3359714 -4242874 -10199493 -6479650 3136337 3521450 2868061 -696572 2498410 -1330135
29293 -1330135 -4616132 -2706445 -4081524 3909926 3088290 1359054 1727583 -1344113
29285 -1344113 -541179 1391604 -4774258 -2898905 3328665 11378304 7500237 491035
29277 491035 -216236 -1953642 -3168095 -10037440 -11064615 -10312795 -9655572 -2644187 2831142
29268 2831142 9568900 11070161 4868906 3717287 2644078 3655870 2530553 1789929
29260 1789929 -5129420 -4726384 -2267936 -2688387 -2908479 -258871 31842 -271456 -2622885
29251 -2622885 -1257208 477614 4032361 6236379 5818753 5554339 7255423 4648518
29243 4648518 558052 682060 -4475248 -1955487 -1257904 -6185925 -1220823 3302833
29235 3302833 3772922 6406661 8930343 5218152 5997780 5076843 -372770 -582892 4290587
29226 4290587 -578658 -5036693 -4542961 -3233182 -4128249 -4178529 -7441070 -2930777 -2604813
29217 -2604813 -754550 5693886 4949760 -1354921 -382707 -971884 2610106 3189037 5368599
29208 5368599 7888286 6136102 4265555 4763199 8102191 10900216 5155082 2950160
29200 2950160 5294868 4962835 8598654 12459550 9583108 6295922 3897970 3359438
29192 3359438 5413792 7156170 5676941 7750403 4111047 3596473 4984922 3487640
29184 3487640 2488410 693996 -4721830 -3755935 4065875 3728708 1292299 202443 465119
29175 465119 4926130 9795391 14375887 12191461 6803472 6029782 5767919 5875397 2408866
29166 2408866 4859276 8505430 7843363 8204714 4833525 317979 12370464 15368198
29158 15368198 18778359 19502742 20623232 21640727 25492119 22662599 13136624 8483746
29150 8483746 11661676 19598224 19182749 18979987 21855424 28123059 32183038 27763058
29142 27763058 22558022 26248743 22936686 26894679 28210735 31291237 22986042 17607321
29134 17607321 17321404 13240018 14190951 14550898 17494923 21684777 15090657 6899038
29126 6899038 15112649 9657077 11448558 4956718 4840352 15598894 13461849 3847755
29118 3847755 3799861 1171721 347751 10144645 12739365 5444067 6371374 3474546 6920457
29109 6920457 4227351 3665906 6691599 6574387 5947456 4770190 5893660 5617933 -2744227
29100 -2744227 -4759842 2370978 9051559 9113043 10329872 7220612 1371746 -627207
29092 -627207 1573563 8192493 13933680 9906630 6356786 3570683 2132278 -1820110
29084 -1820110 -5764622 -6819961 -6361590 313738 444790 -2659692 -2136816 -788512 -1295218
29075 -1295218 -469864 -1974226 -5687795 -3349443 1301400 1349536 -2682215 -11327 -4364574
29066 -4364574 117441 1970694 700460 1683041 3831230 1212300 -6166278 -2560695
29058 -2560695 -1028479 1881589 975978 3544316 5918725 2372688 7791374 -169213
29050 -169213 -2019456 847457 -5152469 -4961768 -4852130 -800395 3059070 1025939 -5500147
29041 -5500147 -4464953 -559466 408924 3095286 397746 -3362761 4939340 9615053
29033 9615053 6604810 5590343 3881465 842872 -2008579 -10992374 -8701421 -4621417
29025 -4621417 2762336 4534436 -1115891 2314021 445819 -932721 3084700 1356082
29017 1356082 3688240 4386449 4373715 -534972 -1768505 -1218515 -1426588 -2604465 -3350907
29008 -3350907 200148 -2213582 -5862056 -7701799 -4788788 -6192511 1375325 8360202
29000 8360202 10106104 7673501 2825871 -1629077 -713893 -2283950 -5555355 315498
28992 315498 596212 2595216 5422050 3383895 -2411150 -3179206 -3090158 2015619 1606753
28983 1606753 87495 1379170 -716299 -1500438 -5994336 242364 3721613 4911896
28975 4911896 2209662 -3318843 -5906795 2979913 10248435 8448730 5807488 6495892
28967 6495892 1148929 -594837 3178761 -652323 -2150293 -661625 -910203 -6087859
28959 -6087859 -12633055 -5292717 1478203 -3831781 -9252349 -10043042 -9078239 -8236088 -5399881
28950 -5399881 -5534275 -814807 -1148598 -1796122 3633722 341695 -271950 -1020788 -149678
28941 -149678 -2720223 1813580 3188857 2048839 -1098244 -3379298 -6084772 -3269515
28933 -3269515 -2008480 -921361 962848 3558851 -205342 -2037449 -7055670 -201425
28925 -201425 3540825 832151 5448971 421380 3517726 5827027 8040775 9593603
28917 9593603 9989849 7370774 -2737739 -3216494 -4721459 -6144131 1712117 3611390
28909 3611390 -1325617 1080692 -473548 -6058875 -8280848 -4756152 207970 -3439925
28901 -3439925 -5090994 -1919587 -960969 1433264 5837606 3115770 2765930 491773
28893 491773 214331 2816409 1402547 -163542 1241181 3868979 5041515 3275775
28885 3275775 3614245 4166203 2210262 -2026156 -2244820 3698279 5627839 2074571 -546831
28876 -546831 -7587207 -10035604 -4708227 -5149270 2153066 4712326 -2676131 1630814
28868 1630814 3193576 809241 492204 -4830634 -1963332 1992497 -2878339 -7320536
28860 -7320536 -4034430 2070014 5834521 4766121 -2729028 2854237 239392 -3285277
28852 -3285277 -3548546 -1402820 -4207866 5676362 6121009 6476839 4369990 -76029 1743034
28843 1743034 63596 -3673178 -4692990 1053319 219880 -1617898 2301778 2102842
28835 2102842 -1584752 3626198 5414288 6263133 8928040 14147830 9125223 9421407
28827 9421407 12914620 7445944 2578168 2839062 1589761 -2813948 1643622 2742655
28819 2742655 2062756 3448973 3465429 4826737 4703142 7118291 7937110 6103462 3379303
28810 3379303 4864031 14570245 15244840 9193184 3222002 4884406 9471599 14383497
28802 14383497 13203109 14303356 12342004 8629287 8110658 7605065 9231869 5791366
28794 5791366 -376361 4998398 5484224 5668394 5192708 4512120 3161833 3074444 752991
28785 752991 347844 4654795 2453803 3523509 6361557 4565145 1311202 365873 907777
28776 907777 5211471 6648098 -1463691 -2268490 -1750037 615018 1110571 2613585 4506128
28767 4506128 928608 5483 1730977 -834960 -2260316 -1884885 -437685 -863028 -2112555
28758 -2112555 6426457 5613950 5842588 10711220 5351566 2783325 2592923 -1370906 1134315
28749 1134315 5680223 8153089 8599967 5292070 3255373 1865471 -6694032 -10017742
28741 -10017742 -2616018 3991753 11174928 6552138 4792548 7156250 8037176 6114397
28733 6114397 2725176 6135133 6105286 -1789443 -4407243 -1426080 3623675 -4291478
28725 -4291478 -4163263 -286785 1222571 3992278 404511 -1089040 -6352664 -5949975
28717 -5949975 -7731229 -2053575 -5218703 -3672717 2243404 -1639810 -8330263 -5536463
28709 -5536463 -6656967 -7944859 -1274172 -5164970 -516635 1427310 -2510641 -2540105
28701 -2540105 -877673 1733266 -2795670 -5227210 -2124677 1362968 -4829096 -7120143
28693 -7120143 -81049 530470 -3892499 -8728079 -4072142 817977 3699816 -1105140
28685 -1105140 -1670477 620815 -792772 -9238738 -11572815 579931 3796526 1071067
28677 1071067 1602714 4317534 -687404 649311 1188641 676393 -520853 2381622 1741179
28668 1741179 1401533 926022 5570538 6948544 7431788 8312273 5992877 3093313 6169202
28659 6169202 1951365 1513917 4048419 6241416 652973 2213256 2626422 -4038162
28651 -4038162 -5291769 -2629650 -2553110 -1475045 -1342818 -1095724 -5413128 -7617588 -9278420
28642 -9278420 -4504325 -3539691 2528627 -525692 134846 -815290 -2845417 -3762913 -520520
28633 -520520 -10502 -3161495 -6888986 -5497097 -3270536 -953579 -45535 4967531 5486716
28624 5486716 616035 2026470 -6403080 -11950597 -7911378 -3052592 1012672 -3272026
28616 -3272026 -1265660 4506592 -5191732 -9450258 -3851433 -6176604 -6138215 1920971
28608 1920971 526987 2359763 -2553260 -5631527 -3416942 808457 3122650 -2032670
28600 -2032670 -3119563 -1001980 -2704124 -4042992 -6228684 -914546 344024 2015655
28592 2015655 7485436 5917686 -1677278 -6813486 -5713267 -3669295 -2174166 333498
28584 333498 -2731480 -331817 -753942 -67260 -3740920 1736264 894070 -1751967 2529053
28575 2529053 28091 -3705442 -1043166 2696304 3732335 323864 -342398 4899517
28567 4899517 4988274 -4051945 -7025492 -5307583 -2695372 -720243 -3512203 -640573
28559 -640573 -1442755 -1994950 -1078619 4241395 6232328 4507454 2285835 6964366 10024131
28550 10024131 -584590 -5667211 -9709491 -9748878 -7468370 -3478846 1310289 -1036104
28542 -1036104 2676347 5847502 2432409 929183 6270174 4708860 2800747 -3284710
28534 -3284710 -4655819 -2543850 -1290252 3006320 6884161 3761572 -3798770 -5363432
28526 -5363432 978672 -510867 1769913 1074661 3181941 642025 -6786401 -4985427
28518 -4985427 -6776904 -5305573 -5038567 -3235573 4019190 -3888497 -11285503 -3741611
28510 -3741611 2135468 -742254 -5097366 -3958885 -5382801 -1471007 2009923 -4283779
28502 -4283779 -3514412 -6830755 -8580645 -7628889 -5398302 -492246 3368195 -3220219
28494 -3220219 -5987597 -3034877 -33377 4217213 78595 227893 2813160 7138771
28486 7138771 2433736 1748422 -3788415 -4711325 -2492113 -3184810 -1903537 3326640 -2868215
28477 -2868215 1232068 3491981 863376 1330486 -3776305 3040272 3500127 -1005369
28469 -1005369 -2382900 -2857659 1843925 -1405886 -5035579 146520 219876 -3411592 -4759522
28460 -4759522 -6091978 -7798234 -8851384 -5146816 -8735864 -8365188 -5380498 -6465854
28452 -6465854 -7165716 -9354749 -2596515 2209752 7362989 6961039 5048844 10645119
28444 10645119 10252630 4787155 4467316 7164167 6041017 3428603 -2621878 -5869630
28436 -5869630 -3332616 5025644 6299024 -616922 -6283682 -4346387 -5744310 -3929388
28428 -3929388 4010893 8529306 13867446 17202733 8522266 1233846 -5573173 -8433690
28420 -8433690 -4986255 -1635739 -554833 -2860588 -3655797 -5537935 -6073933 3717152
28412 3717152 2294961 -5428534 -3182388 250781 3724123 6697673 10352498 4752380
28404 4752380 5607186 6059258 3681531 2882068 4713095 8221933 4578115 -541373 1765511
28395 1765511 4303535 2295333 924759 35494 3681485 4368422 4908388 1206097 -4382811
28386 -4382811 1092706 8456289 5647941 -2912628 -3757997 -2503363 202189 2232938
28378 2232938 1420274 1358227 -8346894 -8537449 -3410216 -2079970 -1067796 109122 1310053
28369 1310053 -3207688 -6598552 -4878193 -6700686 3655245 4312873 752147 -6264942
28361 -6264942 -3254075 -328374 3674233 3542758 4152627 1321530 973350 206461 -2770225
28352 -2770225 -5182591 -3142892 847996 -1111340 -6456952 -1542360 2671351 -1932720
28344 -1932720 -4664692 -5150347 -3162783 1515259 9692485 5840937 2268933 -4244380
28336 -4244380 -1665586 390056 -8110886 -7204396 -5333396 -2756110 -743657 -3009679
28328 -3009679 -4523275 -446645 -2080289 -5629363 -2383350 -6661968 -4629114 -603118
28320 -603118 3557431 2556741 3844828 221131 -1841388 -4216151 -1599429 -4705939
28312 -4705939 -6187549 -5951804 -8366314 -5931971 -1628602 -984591 -10365629 -11587106
28304 -11587106 -6037680 -4795881 -7720785 -5700492 -2567584 -1348261 -2104709 -3568505
28296 -3568505 -8306003 -9250946 -5519796 -3423872 -1037255 3548819 7644184 1080352
28288 1080352 -202439 2617718 -759084 -3763773 -2097406 11116892 10590611 7172585
28280 7172585 1534350 534872 525964 -147145 905556 -439572 2066207 4076297 1272523
28271 1272523 326357 424055 5015404 6222299 4536191 1236329 -5372376 -4432719 -125095
28262 -125095 -2355663 -5042739 -4349662 -5254235 -9228815 -2477601 -649437 4128567 6794941
28253 6794941 5222437 5088083 -699604 -56475 -7242555 1665386 4998502 4428371 3770052
28244 3770052 435412 2881219 270573 -1344265 -1466549 -761821 2512200 1366106
28236 1366106 -3063438 1816346 5169087 6755212 12257644 6696949 58331 4581856
28228 4581856 -190446 -2779713 -3995949 434987 849091 1729719 9870640 8847671
28220 8847671 -1050621 -2887852 -1293620 -3113028 3325275 5269728 6380263 6864161
28212 6864161 3309827 805571 2171126 -5249569 -3944224 -6561278 -8892569 -4500998
28204 -4500998 -1151430 -554501 -823918 -2513128 -5087057 -3191934 4082509 3468186 -2362984
28195 -2362984 2469137 5253083 402489 -2266449 -970542 1299075 196846 -454540
28187 -454540 -718153 189592 2766834 6315007 11943323 13372753 8553754 4171036 3809926
28178 3809926 1575002 -5212260 -5606800 702843 2976852 -3152234 -5540275 -3940159
28170 -3940159 -1229158 1056819 5811521 9347035 6855527 8151135 6538616 2189975
28162 2189975 4333756 8462898 1270882 -4285406 -6713011 -768708 -493068 -4150239
28154 -4150239 -1662225 1911722 2174615 489338 -240838 3165711 1504155 -148160
28146 -148160 -415979 -672863 -5092657 -1221464 -399836 -3324515 -4395964 -10441335 -18640503
28137 -18640503 -16282173 -7103777 -2296638 -1366087 2296731 -421763 6897428 6112366
28129 6112366 3732420 3603415 5173897 718482 2416526 3077613 7118971 5700128
28121 5700128 7575832 9228663 3649704 -649967 -2666087 -5593455 -4570871 -664789
28113 -664789 -1951015 1194142 -2860267 -5667288 -7386804 -680768 4446363 1333790
28105 1333790 2076586 -728754 -2422893 -6813342 -2638318 -47419 -2147784 -767699
28097 -767699 3901151 8373697 797454 -3567892 678504 3887123 2318960 35109
28089 35109 -3580284 236615 4083736 -954323 -7347463 -9177999 -4791116 -4047598 -1423603
28080 -1423603 -2481190 -5983246 -1586141 1910711 119737 65745 3746654 7817279
28072 7817279 7478497 1700367 1799706 7447071 5297938 101569 -3972066 -722526 2865091
28063 2865091 -3087743 2231810 1687772 5078541 2051524 2810224 5560139 7954557
28055 7954557 11393740 4585911 5283177 4682490 760079 -2365501 -5744521 -3040428
28047 -3040428 -793371 1895975 4470503 2888160 -5087766 -1031301 697242 -235197
28039 -235197 -1251873 1947074 4121854 -362930 -311131 8973181 8020477 5347534 1882539
28030 1882539 3478937 3519249 -179731 -2420213 -2970781 -8932563 -7112690 -5884157 -9912941
28021 -9912941 -7605788 -2238223 -3633419 -5112646 1085011 463401 -1785008 -5234664
28013 -5234664 198405 3347463 -1437207 -226360 -1829117 -7329265 151201 9166064
28005 9166064 7544312 7449829 8126286 5671187 5579712 2595931 6690606 8750286 4396284
27996 4396284 3077360 1571109 -1265681 7388602 54050 -5384296 -3625074 -3848451
27988 -3848451 -1480172 -3747780 -998212 -3223062 -3766366 -4996680 -8663427 -9240524
27980 -9240524 -5194270 -1671543 500404 6557 -3283228 -1699395 14443 -1717451
27972 -1717451 -4936676 -10345453 -6417759 -306331 1471354 932726 -1911907 903747
27964 903747 3897232 -853368 -6700082 -1524915 -1472978 -5581580 -3622086 -5125480 -90568
27955 -90568 -3292434 703811 9505647 1861254 -4380102 -2121119 1209835 1759155 1606671
27946 1606671 5860252 5887441 6636301 4973579 2797350 8401850 6710853 -192059 3039097
27937 3039097 7649653 9651659 8865928 1516956 -3979465 -3921362 -1936792 -3919358 -3355999
27928 -3355999 693271 -199175 -2411138 1924028 5007820 6095676 5603087 1236886
27920 1236886 -2187193 -1987397 1144738 -472421 944448 -1498404 -313859 -1190539
27912 -1190539 -4478157 -2868506 -1125859 -308763 -3382795 -2402393 5545290 4293457
27904 4293457 2117931 -730373 6754537 8222844 3911797 -2387317 -3248008 2931000
27896 2931000 7590088 5337128 1061243 -1573362 -1030733 -3650532 -3041817 -1858999
27888 -1858999 -2729805 -5395924 -5212981 -7755380 -1746507 -2563625 -3449366 -4242339 -6218601
27879 -6218601 -2847279 -9856919 -16122503 -12784902 -9082740 -8595754 -6069326 -5513737
27871 -5513737 -3964857 -7882509 -6047994 657269 619055 -4199290 -1001087 -649043 -584628
27862 -584628 3349012 5666006 6045258 7129432 4444957 -465017 268603 -773794 -6490658
27853 -6490658 -6038915 -1693642 -4604501 -5120221 -5206975 -5848795 -4752828 -9890118 -3271477
27844 -3271477 2432322 -363155 -903475 2689016 2884557 -1642505 -4887252 -3151580
27836 -3151580 -6064124 -3795434 -1285360 4835330 5263715 4985205 3958363 5114045
27828 5114045 6772120 5370591 236008 3484335 5942472 6817717 7937575 3756673
27820 3756673 5631901 5340585 6950862 8908924 11788298 8637821 3858063 -432443
27812 -432443 665475 2518443 962245 15323 -844046 2565500 2968596 420890 -292160
27803 -292160 2018001 1271135 5494357 6100959 4933565 74693 1698636 7728240 6133467
27794 6133467 -4052797 -6420565 -8695601 -2548697 4725764 -1681148 -4284098 -4717922
27786 -4717922 -2235288 1127903 6650041 7052952 4765635 3578733 2269872 1338269
27778 1338269 329179 -1011744 -36094 -3049442 -5243540 -4844575 -7417158 -6130285
27770 -6130285 -1217086 -252364 4498049 2892014 2424660 -1580432 -5092871 -3107567
27762 -3107567 2151954 381252 -1481628 -1379788 -1649537 2356612 4597914 2154082
27754 2154082 4240656 5085377 4575585 2219432 -465171 -584721 3010678 8130268 7465078
27745 7465078 3364010 -805455 -5147995 -6605455 -5331170 -8125666 -10229508 -5106532
27737 -5106532 -2901838 1383424 -308728 -5718579 -6759638 -2297987 4576528 -2669933
27729 -2669933 -3451642 -3549058 -1700226 3622415 8143713 8689996 11200662 11382389 1173562
27720 1173562 -2570385 -4494358 1811379 762223 -149909 3787458 8489664 4755311
27712 4755311 209725 -2458312 -1358801 -981959 -407361 2066895 -1722596 1698227
27704 1698227 2532419 1472483 2480800 -1611709 -462349 2393853 -3372552 -3173574
27696 -3173574 -2922140 -2225248 866762 2713966 2755389 3826972 832172 -3089902 -612015
27687 -612015 -248238 -6521134 -8765954 -7696018 -6982063 -3623346 1243122 2348131 6330050
27678 6330050 2909200 -2142020 -6292114 -4523723 -7234834 -5156403 4272273 5344845
27670 5344845 5124192 5387445 8032881 6522902 6098403 7810730 3864178 2666594 534133
27661 534133 -4807411 -1058775 3185068 7423658 5863186 3359395 3046610 2713465 2300233
27652 2300233 1002109 -2030170 -2100502 -1751173 1494460 4242080 5387844 9954772 2051808
27643 2051808 2658684 5714540 4061743 3328287 6509283 4559668 -1090857 -2067286 -2360951
27634 -2360951 3147409 8254934 8027276 1573458 1885532 -4560448 -87780 2179418
27626 2179418 -3260956 -1552515 4307732 4737311 1640156 -1519067 -2811860 -1776348
27618 -1776348 -660292 2245173 1244956 3185721 5134884 12073373 10930056 6516625
27610 6516625 7349192 990802 2245768 1640207 2201332 1410654 6729903 5165936 7939988
27601 7939988 9178758 4169580 7012239 5568585 1994994 3760003 4217800 4399787
27593 4399787 1917003 -3557776 5142541 6965660 2910124 4654791 2786129 3872996
27585 3872996 835632 3835430 8852314 5222005 6516130 2892577 4853358 7666028
27577 7666028 5410407 -3034371 3428471 5233822 5951572 6587663 4159375 1996287
27569 1996287 3260051 10932748 11126033 8366003 7923648 6647038 -3347950 -3699884 -7726325
27560 -7726325 -12054653 -10727074 -1475331 4442555 2666146 4221028 8583620 2956215
27552 2956215 2990842 -828464 2205142 -3369702 -1831224 2725808 6236821 8142212
27544 8142212 3653283 4468249 9379829 7312250 5972452 6474160 6524924 5487380 3779151
27535 3779151 1353811 -1073878 -2426635 1129296 3375280 3282454 2190803 2241864 5006233
27526 5006233 7486158 7716902 2194654 -3014679 431196 7302087 9957824 9316506
27518 9316506 8301881 6804783 5130014 5483319 11218960 11047897 2009996 1370070 1371075
27509 1371075 -4613171 -4034436 1597334 2427520 5228321 2429366 705840 613727 4369367
27500 4369367 5626432 1085279 -1163762 1961069 3028777 3631074 -517703 8805394
27492 8805394 577692 -1195853 3994221 1169369 -190832 -3617307 -4759356 -3635793
27484 -3635793 1164322 2542360 6272710 11194304 9961891 10613168 6393267 5012720
27476 5012720 10260241 10964842 11479012 11261570 12150334 8806258 7308025 8065711 4785155
27467 4785155 5252311 5553635 8097485 13114039 6976672 9338650 8561222 4193380 -755746
27458 -755746 -1431877 4039227 9232760 10755247 9020046 7084312 3778308 8463261
27450 8463261 8628170 4337605 4870623 988039 2657033 7734906 11865108 9270573
27442 9270573 3704924 -2191025 -5994708 -4747155 2660483 6312681 8665685 6377033
27434 6377033 96377 918174 5563147 8795148 8977361 9910313 14102697 10684449 10460422
27425 10460422 12236374 6233284 6897205 1119352 3010474 5956485 7749038 7663673
27417 7663673 11679831 14074460 13354527 9563661 6182427 4466318 2998486 9301860
27409 9301860 6659713 3184582 5872896 9500618 8509215 12817241 9935842 10337692
27401 10337692 6140240 5474049 9101131 7755789 3432806 3205949 1129045 3199503
27393 3199503 2975213 5432343 5724732 4905829 3189258 3137006 11131553 11873160 11740631
27384 11740631 7628531 5469645 7127997 4844583 5600230 8107149 5502364 8465121
27376 8465121 9297142 405496 4572575 10403325 9282659 6864153 3810628 2591011
27368 2591011 3932515 2932454 2188933 2524501 1577981 5754232 7573896 9308420 1622031
27359 1622031 -4923704 1606871 11123180 12614787 14368872 12773407 8870774 13257664
27351 13257664 16441114 13144192 7386743 12384185 16507361 20683843 23407254 27882658
27343 27882658 24945484 31307507 35549092 37192274 43018122 44794312 52376580 54381947
27335 54381947 56151178 59802226 63830091 62556856 61590939 66145367 74689805 69909030
27327 69909030 64664762 72056711 79748729 85340560 93829787 93686784 92846718 90925440
27319 90925440 91972847 91764543 92873360 88767056 86308110 87879524 82557492 73800183
27311 73800183 75648402 75444207 71895935 66759905 67618777 66945153 65149397 65986319 66891586
27302 66891586 62067515 54697467 51791186 52988756 54914197 48271256 46987326 41201408
27294 41201408 38239459 38366392 39656120 36379249 36148838 32474466 32128527 33900407
27286 33900407 29414153 30397823 29242504 21240978 27724996 30511917 27667466 26850822
27278 26850822 31967085 27253420 26685132 30440365 20711673 18242614 20308184 19133173
27270 19133173 18971906 21543869 17187095 18550930 18892457 23128470 18428190 13061853
27262 13061853 12452937 14753254 8378981 9382888 10571121 10898068 15640071 14746835
27254 14746835 9847060 12403693 13145301 13242196 15795630 13084292 15753510 16325302 10861233
27245 10861233 9624411 8481079 7840611 14700758 16631984 12281062 11406566 14492104
27237 14492104 16522320 17823847 20713137 18926972 17370102 19077527 17946494 22114734
27229 22114734 31613754 33471304 31039157 30039858 30266402 28185886 28538236 24198309
27221 24198309 25776289 24731609 20594116 24247164 25913598 22135603 22871019 26504854
27213 26504854 29776382 35844859 45774611 66215053 82547211 69448476 55956385
27206 55956385 54008407 59177626 71995465 82426541 76119251 63667361 57368339 59137856
27198 59137856 66884101 84047872 118690781 119851646 97490233 85231287 82111025
27191 82111025 90075556 111297093 116877659 101699916 84455822 65038023 61936281
27184 61936281 62278637 65049732 73142546 66568494 58040163 57314918 59287800 65852017
27176 65852017 76714887 74165052 56581737 50238101 48048671 45557156 41798143 47358252
27168 47358252 45906380 47484637 51254103 51435279 64902544 83111082 108005026 144628421
27160 144628421 188774378 189010638 159097061 138360775 146702352 178552439 214167830
27153 214167830 220477152 186035726 164280636 162350355 188942019 232167533 297774310
27146 297774310 333039022 303446385 246489229 218805387 237039409 289283551 329943260
27139 329943260 306506578 242885963 189541715 157258424 149065933 161489371 192556885
27132 192556885 193227709 164081553 132563562 123665959 129129854 151729341 163307161
27125 163307161 131243427 96686487 66381240 55318720 41303543 26182923 19285330
27118 19285330 24790237 26911877 23336630 24866247 21652179 15574570 15117262 12341881
27110 12341881 9081652 9861785 12829133 11471233 10597328 10402558 9064634 11304412
27102 11304412 8190614 8567382 2850447 1915609 4571108 3034070 -622577 -634803 4185413
27093 4185413 11068496 13210277 3084567 4080613 4351782 -5601601 -4159490 -1674255
27085 -1674255 450120 5517201 -1781771 -8081816 -4600229 831742 1121597 5416443
27077 5416443 669567 581520 2294330 2937083 -2708519 81109 -1500015 565740 5766628
27068 5766628 4420119 2259628 2143464 5364858 6250676 -686131 -1970068 4920128
27060 4920128 7726194 2392473 -1817165 2580628 -439257 1599835 11145703 8713879
27052 8713879 10535061 11693850 1075301 5366893 12966568 10724765 16333632 19655235
27044 19655235 9012060 2615111 1411165 1124473 -4026820 -3659989 5099580 12245648
27036 12245648 10537458 5744911 7865206 7447097 4211788 4341925 4948966 2196534
27028 2196534 -714268 -1109148 974633 -2048904 -3019 6489277 -1172805 535720
27020 535720 4585391 2022151 2465975 -151359 -1143484 1509913 909001 -3589641 -6307464
27011 -6307464 -4157174 -1241531 -2103466 489663 -144925 5119395 7250429 7186340 2227278
27002 2227278 695746 -393689 -4337138 -3474120 594143 1779555 -1045766 -1084666 5630321
26993 5630321 5499627 -1549445 820959 -885692 -1402620 6249259 8665757 6618234
26985 6618234 4152506 3078849 232442 639808 3489365 2352126 -762302 -3876397
26977 -3876397 -4457868 1593057 1482069 2383759 1108007 -4870052 -1549079 887344 2928788
26968 2928788 1772931 1592270 940129 1238444 5772739 595826 -1462604 -455844 -6258356
26959 -6258356 2875253 2854243 -2995294 -737541 -1942451 -3496836 -9534790 -4458505
26951 -4458505 4826333 7330948 7030258 4748516 2437918 -707290 2851118 6405599
26943 6405599 1711879 973442 -1936293 6564873 10450299 7503521 6719220 5492226
26935 5492226 5490260 7821070 13812774 12720902 12148306 10515591 10374868 9241812 6684493
26926 6684493 8718987 5830609 4684377 8822128 9826527 6069719 2008411 2199615
26918 2199615 -386719 -3767816 384199 7514182 7180012 8526906 8386372 702416
26910 702416 -3379364 6370048 4674407 901916 2541779 2259928 1811504 1734564 4037106
26901 4037106 -586010 -4626804 865389 2582656 1602155 1277248 2625430 6566008
26893 6566008 5541070 6062604 -256733 4926977 13656963 6970339 3355446 -21353
26885 -21353 1025476 3286326 955545 -4733804 -7664927 -5099734 -944543 3302072
26877 3302072 -305162 -4149653 -3954932 -3644557 -1812645 2095920 2486767 -986975 -3483396
26868 -3483396 -3055302 -1931415 -41031 1225236 -272564 774451 4854108 6262580
26860 6262580 6470625 5945084 3553922 1706843 -5139169 -1555039 3370649 1681667
26852 1681667 1083450 849715 -6628914 -5148756 1623394 5611637 -1370826 -3491688
26844 -3491688 -5272112 -3014830 3777029 4637339 3040879 2655517 -5912769 -7059378
26836 -7059378 -6901689 -5756159 -4344178 1714983 133942 -349998 7856556 9364130
26828 9364130 2979521 -99059 -1485553 2045270 1263030 -2224326 -1328145 -4688081
26820 -4688081 -5816488 -1554189 -4140594 -9318324 -8375712 -1197224 -2769715 847969
26812 847969 -724525 3137058 7010417 4696086 527221 -4230109 -5290795 -5693942
26804 -5693942 -989203 -4356291 -501547 4484153 3809164 -1690693 198132 3083848
26796 3083848 1213789 -268429 1684221 -1055295 -6295748 -2867706 63315 116472
26788 116472 1895575 154840 -1747455 -1293845 1688052 798697 -5657479 -7055183 -3880293
26779 -3880293 -3553004 -1650973 -4461119 -6447934 -8233708 -2357391 -174396 -3843001
26771 -3843001 -4691164 -4628126 -5862277 -9794684 -5853036 2896914 5492562 4496235 1354094
26762 1354094 4093965 4549243 3067792 721151 1280857 -653204 -4031472 -2502677
26754 -2502677 -9807098 -9444400 -3806298 -7616835 -6314944 -4634191 -1856765 87904
26746 87904 -4182899 -6555599 -2225335 -2751807 -939994 -1384211 -5294390 -3389396 -3245566
26737 -3245566 1510297 3413229 -12183 -3025144 -1614074 -5673192 -3229389 -2229310
26729 -2229310 -3380457 -3945205 -5385550 1369848 182045 -6321393 -4644192 -7582917
26721 -7582917 -10213774 -6471486 -1391926 434696 1003971 -595178 1206533 439170
26713 439170 3122942 -237464 1598764 -494099 -25293 518213 -793728 2280781 1754549
26704 1754549 830787 2326706 -3241617 -6704810 -1505900 4183532 3133769 7634863
26696 7634863 9470851 6372362 -753677 -1583172 1284341 3098978 -1447227 -4587514
26688 -4587514 -4606117 3366273 6788807 -170348 601284 -1494043 -9134761 -7062838 959025
26679 959025 -1911096 -9017842 -8612447 -9126355 -6946390 -3366815 -1174804 -608123 -7501223
26670 -7501223 -8306220 -3339928 654628 -3767699 -7842456 -9391134 -2568562 -2207282
26662 -2207282 295836 4405195 8500217 4440501 1058561 -1783260 -3540998 -6143530
26654 -6143530 -4177010 -2796447 1765166 -5794108 -7457555 -6222556 -7037966 -4708937
26646 -4708937 -6251982 -2944637 962828 1363426 -2548707 3144355 8489943 6460238
26638 6460238 9255990 8953955 6320579 3341355 -1535017 -322748 5187225 4213934
26630 4213934 1062921 2975935 -1532707 -3640625 1070499 311820 577687 1226518 -943908
26621 -943908 291324 -2077161 -2569115 -191171 -2554534 -1929943 -3766124 -7288498 -4740561
26612 -4740561 -902569 -521211 -1146087 -1504421 3499203 5891963 9314543 6278816 -2045296
26603 -2045296 -180146 -3143959 -9839718 -9761470 -4963884 -3108611 -5046413 -11430732
26595 -11430732 -10984465 -10714559 -10817865 -3922626 3031315 -531763 -1193667 -126606 3066727
26586 3066727 3477472 6035496 7069218 2592878 1303953 -336373 677537 2847444
26578 2847444 39569 -4320159 -3387650 -7249433 -3358684 -4461061 -3670800 685533
26570 685533 -6186942 -3911942 -5740648 -1785804 328630 -767871 2846107 5462537
26562 5462537 7812891 2745839 -1545142 5152904 5810389 5343023 3158650 3535257 6855370
26553 6855370 6305701 5672567 1431551 2808359 1861330 -1675804 72070 1283679 -1011355
26544 -1011355 -670243 -3117358 -9423142 -6353613 -1015073 -1840448 2749958 -555781
26536 -555781 935266 1430628 205070 7726851 11728941 3973688 -2360461 4724592
26528 4724592 2492478 5609998 2790677 2547788 550241 -1253433 -1882169 -5788831
26520 -5788831 -7645487 -9293091 -5406172 -1939647 -4510548 -6632545 -4055071 -3316512
26512 -3316512 -29624 4551339 6413910 5256209 -5189300 -3498525 -2005935 -9767349
26504 -9767349 -8758858 -5081647 -2443662 -1659913 -2964794 -9813868 -6469776 -5146217
26496 -5146217 -6105480 -2771393 -2924622 -2350739 -4567715 -110835 -4033566 -6732531 -7871268
26487 -7871268 -9122438 779333 1786388 -2714485 3019541 2404295 5627974 7542434
26479 7542434 4629019 2721573 3393606 4480830 -2115442 -3757099 1525282 -810146
26471 -810146 878538 1053697 -4915757 -2576089 4581689 5154473 -3424626 -5716821 -2762190
26462 -2762190 1878296 -1113636 -844370 257956 -579184 -533431 -2784336 -1575510 1925931
26453 1925931 349952 11247263 9319327 7401934 5556981 1604215 1164040 355723
26445 355723 -484353 880446 4396274 3052511 2794260 -3097316 -6316268 -3194161 235944
26436 235944 2125079 393273 -656217 2204982 2878736 -2903860 -441873 2630499
26428 2630499 2288760 899966 3052184 4357357 1667289 2720654 5986409 3542870
26420 3542870 1224217 826830 -487813 -4762945 -9030258 -8208735 -4369924 -3239061
26412 -3239061 -4489370 -1766219 -4693765 -1315164 -397312 -495049 1053742 -3106195 6877513
26403 6877513 8793311 4277504 -1500191 -3543498 -4378977 -577296 3648979 3533872
26395 3533872 -1999888 -6971368 -3143874 4102348 2522023 -4352670 -3583596 -3117030
26387 -3117030 -1773244 281900 1115652 3886037 3320602 2426698 1580777 -238184 -3802833
26378 -3802833 -4150855 -3384340 -6882085 -6465885 -1327970 1169103 -1019136 2514055 1178482
26369 1178482 -733537 -6550729 -6646397 -8534126 -7153703 1498378 -4067646 -4821976 3223899
26360 3223899 4974991 3595275 -1290587 881582 -3043254 -3399029 -891351 -2989571
26352 -2989571 -6790044 -6329340 -1726476 -3445933 -874193 2128171 -1141839 -4469430
26344 -4469430 -963921 -6968169 -6905246 -1972341 595569 -5360182 143217 7236335
26336 7236335 1614283 862428 1177866 3412060 -648388 178195 -2702739 -2808849 194884
26327 194884 -3782348 -2164900 -3603593 -348383 -934625 -4385075 -3028548 -2880912 -3673227
26318 -3673227 -6597853 -9759356 -1340704 3780450 994421 -334432 -1025518 2393210
26310 2393210 8650298 8580968 7839120 11012102 11763488 1700540 -2468061 613954 -538688
26301 -538688 8593914 10357429 9976959 4074760 53156 6148223 3660774 -115157
26293 -115157 1544015 -1275445 1314422 2922781 -2528951 -37350 10014635 11972548
26285 11972548 6344666 135486 909685 1307710 -1339063 -1515110 -4942090 -4779324 2590023
26276 2590023 3352847 1819398 -6182423 -2111028 4146056 2052840 -3784846 -2709959
26268 -2709959 1988920 2136983 6463008 3550737 -2947836 -4925599 2015634 4406263
26260 4406263 584786 749165 4322559 1750320 4212554 6677384 5235298 -2427474
26252 -2427474 -4739126 3528192 467406 2908050 4141225 282666 2554916 960034
26244 960034 238192 4037919 2210842 1990028 4910023 4552666 5575522 7786508 9915211
26235 9915211 382243 -1750577 5994825 4980704 5122617 7248006 4154016 -469740
26227 -469740 -4956386 -2241183 1325584 -1860189 -7161743 -3946052 -2966652 -4079598
26219 -4079598 -6478839 -5237514 -759607 1877481 5769494 4277364 -2300875 -1573458
26211 -1573458 -3926733 -6477446 -340412 3065196 1721950 1682744 -499399 -1619463
26203 -1619463 3750694 5346532 3838155 10161097 6922502 460046 1074835 6428139
26195 6428139 5250129 2923448 -1945965 3098311 -621864 -2294129 -105999 2252509
26187 2252509 -20839 -2905467 -7633304 -3515874 -2349103 1940007 5484296 2924034
26179 2924034 -1994240 -7033241 -4717290 -178632 -429776 -3107942 -3749478 -3202399 -228976
26170 -228976 1371223 773379 -3171602 -6889267 -9909013 -4487217 -3780184 -4465528 -1130915
26161 -1130915 -3515188 -3673266 2399020 475227 -3233454 -4364062 -7388536 -6667165
26153 -6667165 454810 3673625 -806819 -1632010 -2487585 -4031414 -2522357 -5004543
26145 -5004543 535322 3427410 5851145 2106508 -534946 1925474 2616793 456383
26137 456383 442053 164816 -3031484 -473416 2456619 335141 -4435289 -3679498 -2465574
26128 -2465574 -601508 -1461223 3357802 1082400 2632612 -1114581 -5985223 -2478915
26120 -2478915 1074233 5049609 7658691 6120641 5634996 2346203 3353663 -2736908
26112 -2736908 -7645769 -7998754 -3421821 -308103 3214849 3915681 2606069 3480367 3715465
26103 3715465 2758685 -4478864 -2615266 -1058397 -423491 -1414336 39725 -957095 -491171
26094 -491171 -1738491 -2959924 -1624033 -4677408 246358 3980665 6050054 96082
26086 96082 -2503485 -2588308 669026 -1348343 -1823738 -3734702 -2185640 -1585281 -3826260
26077 -3826260 -5893259 -2588876 -2658907 -970791 -3093238 -1621904 -2330672 -3449331 -4141732
26068 -4141732 -3863782 2674347 -2844011 -4018389 -4434860 -5838291 -2174399 -6633079
26060 -6633079 -4528163 1121669 5804086 5052367 1787065 2852833 3166339 237890
26052 237890 307438 5038274 3551296 1115833 -2147763 -1544339 -4254972 -7680962 -7916697
26043 -7916697 -7593222 -5635534 -5355940 -1935366 -982786 -6749482 -7839912 -2996103 -1291890
26034 -1291890 -5036269 -3528097 -3183206 -4586533 -5994508 -7866828 -6038161 -4762203
26026 -4762203 -4290145 -1327488 7080649 222089 -6844365 -1734652 -2043017 -8603169
26018 -8603169 -9946652 1287938 3920264 -746963 -2606964 -3351070 -5190276 -10007171
26010 -10007171 -6632921 4343396 -1853370 -7385820 -1914211 1262091 -2910237 -6266196
26002 -6266196 -1406357 921003 -677013 -1742568 -774469 -7422942 -609623 -1588522
25994 -1588522 -4320846 -5001189 -4029473 -6683272 -6756333 -1768632 1949271 1981779 -755663
25985 -755663 -4035975 -4582099 -677826 457356 5766551 -2240789 -10287211 -12194394
25977 -12194394 -11140217 -7605441 -4713718 -3069622 136815 -1089868 -1662664 440046
25969 440046 -12772 434157 620156 5289459 3925130 1602339 285235 -1862933 -4466654
25960 -4466654 -11326215 -13686471 -9630435 -9758984 -13682296 -3880459 -5954042 -6049701 -5612384
25951 -5612384 -9893732 -7253411 -5155579 -3574157 1510788 4363044 3550163 1169682
25943 1169682 -1995760 -1072242 1804148 445628 -6164218 -2710672 1446810 2376364
25935 2376364 615417 1265231 -333968 426364 192179 -1683785 2444071 8721389 6267450
25926 6267450 1610214 2381607 -3874609 -2394114 -3175873 -6356042 -7734060 -4065461
25918 -4065461 -3049216 -400416 -958855 -1692640 348189 -3375235 -4082422 -2518655 -735820
25909 -735820 -2315159 -1651937 1878051 5624624 4912808 4953694 9427877 4683365 -1664355
25900 -1664355 -8920344 -9393772 -2379135 234440 -6219934 -4868548 1699543 1314861
25892 1314861 -1183744 -4735375 -6565608 -6205705 -2355951 855672 -4688801 -7790903
25884 -7790903 -3771770 -3495808 -1701455 -6673103 -8417598 -8184975 -5850859 -3559054
25876 -3559054 -5335903 -2412473 -5965283 -7277552 -3877284 -1347060 -3951158 -7371244
25868 -7371244 -1918904 -3529924 -3089304 -5410005 -3747852 1709588 5709312 4708445
25860 4708445 937341 -836214 -805408 2916642 3382534 4737100 6684373 4205257 1539909
25851 1539909 4670152 2673330 4734128 9829638 6867755 -2202861 614445 -277264
25843 -277264 -4098116 -1740726 -1872036 -2909060 1274811 6244062 2663093 -5087327
25835 -5087327 2082332 2695614 4238065 4131360 -2355767 -1407745 -3826838 -3404180 -5988690
25826 -5988690 -3425190 -1049129 -3968290 -4529406 -7804964 -5702531 -2813591 -2421029
25818 -2421029 2126992 2382842 -3686939 -5334289 -1727423 -2461590 2414653 2531246 26899
25809 26899 -249124 -1692465 -1369324 42726 1718509 -3454889 -2024349 -1343301 -1852242
25800 -1852242 1427 1456183 -2872103 -2771135 -1521500 -2562938 -2179964 -1691202 -4860701
25791 -4860701 -922105 429073 781524 -420355 -3419196 -1680341 -2723443 -3783603
25783 -3783603 3474838 2485040 -709177 -796066 1809040 3150080 8659274 6443285 7170950
25774 7170950 7429237 2792962 4064451 4189269 -202143 -7866505 -6426657 -1941617
25766 -1941617 1913334 -1795101 -3103997 -2981454 -6896934 -4194364 -2177695 -3084761
25758 -3084761 -3545393 -4127603 -9617933 -8480328 -8647212 -7381076 -9048043 -14087864 -6859567
25749 -6859567 1729828 106246 -2585101 -1960493 7384 -92131 -1283247 -5380157 -2302763
25740 -2302763 -96266 -1373653 -651959 -4140783 -245810 5079224 2303866 932353
25732 932353 -3629438 -5479646 -1125820 -1677506 657739 1397355 1267553 -2267178 -6317885
25723 -6317885 -6003041 -2497298 2166208 4140367 1401143 1206526 2034011 -256842 1289314
25714 1289314 2276727 753953 -325435 -710686 1326813 3775108 1863306 1234864 2419664
25705 2419664 5560131 2005273 -2865517 -7734486 -6758107 -511694 4935140 2378426
25697 2378426 -1701939 1922094 2620777 4610855 -3483607 -6495795 -1971605 -5768017
25689 -5768017 -4120944 -5992500 -105432 3524236 3247362 -2972627 -1899063 -1315596
25681 -1315596 -5951625 -7625309 -7087560 -2509240 -2687793 -3668363 -4379325 -6374206 -2414159
25672 -2414159 496274 -42533 -1250537 -103658 1249812 67700 -5044059 -7798058
25664 -7798058 -6260311 -8741769 -1064961 -15104 1081598 6214180 1719581 1737263
25656 1737263 4518270 -3989130 -5840543 -7811617 -2095923 4477736 8855216 3376868
25648 3376868 1134454 1088608 1570195 -1973862 -6173869 -5252130 490900 2731737 -1134095
25639 -1134095 -2524027 -1159342 -1324774 -4618008 -5664428 -2058182 3118093 2237967
25631 2237967 3052313 -159574 -2254933 -1199407 1341999 5072547 9040906 6627574
25623 6627574 2173079 1378533 638544 -3205695 -1018311 2013562 5105888 4681589 -1668365
25614 -1668365 -6242320 577160 -581120 -3398252 693720 6653235 6890471 2391696
25606 2391696 2729340 2846851 -3853790 -3489813 -1023437 -1040222 -3265809 -2050808 976870
25597 976870 39042 3388358 767669 1057526 449175 -2383790 -9815933 -9741546 -2273141
25588 -2273141 3970022 1140525 1689279 6164609 -1668558 -6365632 -4506879 2612126
25580 2612126 2648321 -1116579 -95645 -322071 -2398431 -4253702 -3473842 -3368808 -6919677
25571 -6919677 -3444506 444836 -3081590 -3804778 -1686245 1728310 728570 2237580
25563 2237580 4371587 998231 -1687957 -905755 2311048 4932737 6814835 2568690
25555 2568690 -6212865 -2441297 4576850 7225392 5379971 3279836 6777998 -469281
25547 -469281 5540376 226636 -472633 -1432500 -5640041 -3111904 -3088589 -2877990 -3226394
25538 -3226394 -1371201 403915 187839 -8252088 -10823619 -3270822 -5451773 -6435095
25530 -6435095 -6110697 -1242545 1450170 -66733 -5005497 -2826637 -4854777 -5173940
25522 -5173940 -2497118 -4119328 -2994420 -7422345 -9315070 -3359531 553594 -2368911
25514 -2368911 -1494946 5629758 7423302 4945587 -241858 3788486 -598385 -4767551
25506 -4767551 -1014761 724338 682554 4548037 2662681 -220132 409655 1591956 2869074
25497 2869074 2007949 178058 -1622968 2576380 -810907 4167204 8538178 5173786
25489 5173786 4021775 4196752 -308487 -1417340 -2837440 -2282603 1344855 -465059
25481 -465059 -2216092 -3267482 -6609547 -5052952 -1864939 -2725679 -2457016 -290340 -3567997
25472 -3567997 -2642423 1423283 -1304471 2016140 4178036 1006290 -651258 -636516 5148737
25463 5148737 3082252 1027763 1334911 111650 3370086 -4615958 -11163051 -6784164
25455 -6784164 -957632 6786359 7775640 1978532 1363751 -1250039 -2507694 571161
25447 571161 -1304448 -2830969 -4906378 -6045800 -8612466 -6547323 -6929875 -10383355
25439 -10383355 -3655701 -3358452 -41898 -2305632 -7827268 -7866631 -4312867 -2508920
25431 -2508920 1094946 -1499371 -6068506 -1451814 -5933219 -7789751 -3864858 673090
25423 673090 1383138 3514684 587120 4191091 1392760 -1098606 882767 3650916
25415 3650916 3652294 6553773 4672674 4334339 7028836 7899863 5186406 -718644 -3365735
25406 -3365735 -4619086 -1788623 994692 -1404435 4159377 7887688 -1734046 -9612229
25398 -9612229 3733868 9372193 4787914 1615446 -3248909 3570992 6179524 4676594
25390 4676594 -3771499 -8448718 -646446 -5359416 -6580437 -3859478 -2915200 -1879753
25382 -1879753 3639395 4905260 2983929 1463089 -3846461 -7141685 -8586354 -8476015
25374 -8476015 -3868690 -8062419 -3275019 -5833025 -5004483 1891615 1294124 898535 -1258710
25365 -1258710 -5486423 -5923471 -3310867 1873792 8077135 3072612 599758 1496687
25357 1496687 2838939 2796613 -1766910 -6540417 -7360331 -2954075 -4155468 -5368071 -714208
25348 -714208 -2618093 -136712 -1746250 -1283354 2847713 1479352 -3539972 1042429
25340 1042429 -3253263 -2701764 -697343 4732392 5726754 -3715179 -5903008 -2762853
25332 -2762853 -2652876 -3872862 -4533394 -5010772 -4908387 -476929 -6308604 -10641838 -10995036
25323 -10995036 -7186279 -8484492 -12123234 -14145786 -9675596 -7328408 5009534 9723420
25315 9723420 7830685 5467665 7335235 6099603 5748038 1842207 -1962231 -4779916
25307 -4779916 -10392532 -5507684 -11247973 -12594136 -5618261 -1335617 1284548 979936
25299 979936 -2843718 344707 2379086 229997 2246062 426996 2649153 3543024
25291 3543024 1953116 -350327 -1151566 4984168 6588975 3909085 2057431 -1312194
25283 -1312194 -1615066 3144336 1343989 -4265423 -249896 243031 2287399 -234928
25275 -234928 1988941 2751542 3014385 4232478 8644805 9775547 5386482 3370697 -1975220
25266 -1975220 -1290173 -501935 1131852 427320 -847695 -5785586 -2794887 4936819 3328024
25257 3328024 -138280 1645912 -679060 786343 -461739 -3798728 -142648 5599821
25249 5599821 3899935 4699166 3534383 768946 -6152603 -7009966 -3058919 -3587498 -4665657
25240 -4665657 -4576256 -5873893 751147 -1634813 -1677741 -1902641 1100801 4495145 2829530
25231 2829530 4552575 3260307 -2040544 -490554 1486980 1467535 -378277 -1834266
25223 -1834266 -4220749 -5935544 -1625569 3306257 2513105 -1929430 298625 2558409
25215 2558409 619863 -693525 -4131033 -7531268 -3426936 1161382 2203887 3447787
25207 3447787 3867672 4894971 3309676 4012397 3765929 446551 -3594542 -6838424 -7153992
25198 -7153992 -5342010 -208444 254225 5262263 6225617 7128750 293653 -330630 4427712
25189 4427712 4319577 2524168 -172353 1041160 990010 -1939135 -7616504 -6683473 -6403104
25180 -6403104 -5701537 3499913 4789967 8729175 6078788 5028775 4999573 1954785 -3883625
25171 -3883625 -2719621 -1059688 956225 2755517 8003323 -1034240 -1835783 1741904
25163 1741904 -3038112 -667168 1880815 4108076 497417 -1282233 19634 -1043549
25155 -1043549 -6685789 -2667137 708849 4927975 4144475 -836146 -5898106 -8429569
25147 -8429569 -9068739 551188 6975810 6670995 3577968 1959168 2543857 3946333 5270187
25138 5270187 5310493 -253229 1469728 1863051 -1878052 -3124264 2301889 -217016 -2538012
25129 -2538012 448395 2895046 -273685 -1184067 -2279871 -4980798 -6595042 -4508700
25121 -4508700 -3017058 -4141585 -4506186 -6966108 -7559749 -7172195 -4348190 -2349892 1109907
25112 1109907 991892 946830 -2292705 -2247592 654926 -267808 284796 2426804 1720456
25103 1720456 7298830 11544177 6217097 -1025592 1600064 2958305 -3363164 -2943969
25095 -2943969 3750427 382730 -1986949 -1307548 1753646 3168637 4972524 3420140
25087 3420140 1677549 2522389 1376799 2367346 241747 2360245 -753008 -2556289
25079 -2556289 -394777 -509859 -1203081 -2214136 3280866 3315886 5331915 3011837 1160995
25070 1160995 2366873 4072022 5861374 5607105 1870994 -6613252 -6932411 -6760975 -4932194
25061 -4932194 -4480970 -4289824 -3435059 -1233341 2073052 1922451 -2561858 -4813790 -350524
25052 -350524 734315 -3016465 -336464 -3904507 -8561532 -9558537 -5389363 -1878504
25044 -1878504 1597396 4197580 120053 3274010 291508 432739 7185053 -247114
25036 -247114 2837373 6223408 1475406 -7614681 -8033340 -6481670 -3092210 -2309300 1208294
25027 1208294 1977471 -468748 2870394 3357779 4986968 3452041 3874419 -356836 -4083559
25018 -4083559 -10020062 -4720383 -2665145 -1201030 3003314 340408 -194779 3059997
25010 3059997 -3345655 -2092290 960051 1258776 825259 -3602879 -10039626 -4336735
25002 -4336735 -2752634 -6088593 -5075461 -3374863 -4192662 2111927 6163426 5657726
24994 5657726 -164213 -1961212 -4800300 -5232503 4958339 7308853 3860262 -1273571
24986 -1273571 -3219462 -1187110 -4823821 -7124126 2281313 2346550 -2346376 -6695476
24978 -6695476 -8958828 -4007381 -3035692 -2422486 -3553406 -3255533 2288284 3304659 2092683
24969 2092683 6324540 216120 -8299083 -8839942 -8668164 -10896718 -8635560 -2989620
24961 -2989620 -2953315 -2707067 -1595537 748844 1947437 2274003 1054661 798814 -5192252
24952 -5192252 -5281435 -7048486 -9888331 -11396171 -7690902 -2935474 -4433962 -5951200
24944 -5951200 -3910634 -6589784 -3152718 -3918262 1766534 1097431 3091149 3870553 -6237104
24935 -6237104 -8155244 -3672244 -2494907 3355052 -447758 -354763 -1842484 -2837424 -7468732
24926 -7468732 -10789776 -6643003 -8832924 -5969977 -4437158 -3253570 1321297 5226930
24918 5226930 9669966 2608220 477396 933450 3232268 3476960 4505628 6127891
24910 6127891 2066610 -2433828 -3568554 -1862194 3416133 2809872 629776 4032037
24902 4032037 590133 424320 -1870902 -997986 -2213365 -621335 433132 -784110
24894 -784110 -142109 2606819 1156191 215060 681249 2767362 -2732974 -883025 -1198600
24885 -1198600 -6338572 -2940761 -1213585 -2839911 -5066693 -1172377 4554441 489534
24877 489534 -4358318 -3020605 1106684 4151107 1994858 2309949 -406808 -2588014
24869 -2588014 3044431 1576352 -587339 1505014 -166792 658540 4808754 7047125
24861 7047125 1767445 3052904 6390340 4034813 6114574 6007150 -237543 372267
24853 372267 -1634933 1921842 3227654 -1253849 -617435 6070648 5466787 6187507 721884
24844 721884 -4639782 -2549118 492710 -24123 493343 2523617 3772824 2965602 4121601
24835 4121601 4392106 -2361860 -4716853 1470872 2937432 1288360 -408410 -16739
24827 -16739 -2321613 -5386935 -5362502 -6325479 -2853369 -3443071 -4415620 -8281619 -3108955
24818 -3108955 6413925 11206123 7115510 464750 -71241 4395840 797582 458980
24810 458980 3969911 -855400 -1951193 -2723784 -2747549 4381768 8248621 9604707 1942220
24801 1942220 -898770 1285659 247400 4114938 7907685 9130715 8294200 3658490
24793 3658490 -811131 1117929 938831 122180 -685150 2386755 3322612 1944017 54568
24784 54568 1849581 5676720 2765861 -6613527 -2628713 -3822586 -2508687 -12331053
24776 -12331053 -14965958 -5332451 970866 984117 -6149211 -6955948 -3726398 421773
24768 421773 -502123 6282499 5921574 998066 848203 3397385 4102123 683419 3482001
24759 3482001 2210062 -2252058 697926 -688064 295427 1809606 -380793 -5239160
24751 -5239160 -4671266 -3953405 -214704 3088324 -2007793 -4859340 -520193 2504656
24743 2504656 -2855374 -2511957 -296145 -3269462 -6026039 -6947062 -4210023 -3131496
24735 -3131496 -2811524 -6059383 -6702133 -6175022 -5453446 -1141288 -2731903 -4736635 -6957358
24726 -6957358 -12501972 -10421544 -6190361 -5304489 -4434520 -1056637 572662 2373985
24718 2373985 717064 1495071 -1097684 -3820375 -1466788 -5533994 -6114881 -4670566
24710 -4670566 -233245 871828 106670 -2143508 -3604583 -341899 2901666 6248158
24702 6248158 3002277 3141264 388805 -4249915 -3050866 1057087 3362516 -925884
24694 -925884 -3096356 2416767 7261527 9068817 2981959 896327 5560710 2561108
24686 2561108 82773 3703483 4121639 3080994 -157938 -3103785 -4992892 -119273
24678 -119273 4160999 3134875 5874353 5039161 -4394677 -11401244 -11834833 -3166302 -4557489
24669 -4557489 -5098273 -2487072 -227561 -4926396 -6803571 -102599 -3458341 -2995265
24661 -2995265 -5672843 1200115 -5400736 -2558649 4693286 7296021 7654266 2831667
24653 2831667 502167 707089 -4395614 -3413583 1995460 2012472 -1737545 -494257 1208183
24644 1208183 -2575749 -8863264 -9585014 -3928372 -4513701 -4069943 1943291 -4679837 -12201067
24635 -12201067 -7354383 -8456920 -9848444 -2301569 232640 -648313 -4503840 -5784061
24627 -5784061 -6488864 -2676178 -5209755 -3526628 57056 2222706 174399 -7699441
24619 -7699441 -10866523 -2978507 266452 -1269875 -1101962 436508 -1648212 -62976
24611 -62976 223868 -3193830 1839551 1371289 2239368 3218265 -671986 -2034730 -1499815
24602 -1499815 -2105257 1645197 -990739 -334757 -2067026 2682779 -1246058 -4272393
24594 -4272393 -4270872 -2066154 -2959537 572780 -563492 -5048327 -1318360 -1604544 -764703
24585 -764703 283915 -2781379 -3815570 -6091412 -7644163 -6924914 -9586433 -4547604
24577 -4547604 -2447344 -2829168 -1007128 3444657 4413745 -816575 1187541 5885449
24569 5885449 1996947 -5316307 -5174734 1775400 2828196 326155 2576205 3327994
24561 3327994 2754348 4162054 -510695 6163067 8521234 5363866 5282984 -1432951 -3619623
24552 -3619623 -350535 6750887 3922333 -3222801 -9739299 -4833979 -1383513 -3587455
24544 -3587455 -8030675 -9235294 -5614419 -7133737 -8358782 -4527736 1339337 -855417
24536 -855417 -1995606 -8831531 -4038605 808155 -586254 -1346958 -5170216 -6639768
24528 -6639768 -6066443 -4532260 -6409687 -2743567 -3433199 -6139044 -10026532 -9625062 -3105634
24519 -3105634 -2350053 -105097 -1025536 -2792650 1570923 -895655 -1597144 542372 4927929
24510 4927929 7153592 11894800 9846690 5126881 6228154 3411510 1194754 884747
24502 884747 1850903 1563154 1630569 7163788 6562062 1358274 -3153723 -7472868 -7750930
24493 -7750930 -3408733 -6931059 -8176193 -5078274 -8116655 -11815149 -5069663 -3010517
24485 -3010517 -2773982 -4469059 -2818175 -2815510 653839 1555352 2867087 -2755327 -1414582
24476 -1414582 1130401 -4530870 -2213622 152600 2810982 9512057 11558059 6508294
24468 6508294 9763870 9894939 7034478 12187565 3716418 2039836 3553516 5952305
24460 5952305 7656289 2105279 -2926665 -1562819 -3240180 -5708977 -7038736 -7442843
24452 -7442843 -4351193 -3217691 779245 -374852 -5286714 -9283345 -6383491 -3329852
24444 -3329852 4287068 4721002 -3360595 -7563989 -5730674 -10255132 -10208481 -8925152 -9449148
24435 -9449148 -6297135 2471192 -809550 1241509 3749449 1037393 -3255278 -3468273
24427 -3468273 -1608137 -8439609 -11474730 -8363147 -12699437 -8894684 -4978990 -3557881
24419 -3557881 -2396351 -2944221 -1559035 -623252 2448496 358608 -5837972 -7472689
24411 -7472689 -3669347 -2774230 1573440 1675340 3141340 461265 -5982720 -6597449 -4143005
24402 -4143005 203550 4444919 3223404 2443625 -1443350 2159959 3710782 4061156
24394 4061156 4277311 -1237716 -4487544 -5402887 -3758018 2705729 -5369995 -8188548
24386 -8188548 -5565599 -4910800 -1072653 -2012136 227695 4018809 5365687 -2739921
24378 -2739921 -7583654 -1626182 1544342 -424947 1358304 -3160462 -2454052 760154
24370 760154 4732396 6194957 5736611 -5114945 -3951129 -1981861 -3804333 -4540882
24362 -4540882 876516 5447190 3808035 -86845 25250 2545686 1250476 2525773
24354 2525773 2419024 -1448035 3705750 7573562 7025228 4073234 279673 -984524
24346 -984524 -4141648 -4150934 -1028609 1097108 2407296 7147255 5623833 8238060 8523079
24337 8523079 4450303 6352983 -2416842 -9567075 -7758599 -5448105 -5735540 -7994644
24329 -7994644 -4800254 860657 6542962 5536463 224238 -349162 1016108 -1756538
24321 -1756538 -3750265 -1100388 -3396874 -5900978 -1708279 -29497 1875752 -1479151
24313 -1479151 -6431075 -6169080 -1867321 1382633 -3712417 -3426464 -1826233 -5849609
24305 -5849609 -7331064 -4002943 -556979 1753141 1112933 4122133 2335967 -2285600
24297 -2285600 2093890 4386830 -5381917 -175884 1173014 -1372632 4560799 373866
24289 373866 -2675086 -4147947 -294491 3912487 6185116 7888456 4653 -9123091
24281 -9123091 -10978986 -10649455 -7184968 -5157167 -5893604 -1971888 -3999995 -5164387
24273 -5164387 -2935112 -6159862 -10728826 -8978270 -2800615 286822 600900 -1799352
24265 -1799352 1694577 -1195852 2064534 8134070 5164386 2095506 1841026 -902496
24257 -902496 1254534 -2040381 -4607334 1535160 2846923 -339769 1741079 4779190
24249 4779190 -1652783 -4420671 1258719 487336 2628260 1457507 -508405 -4353805
24241 -4353805 -9958101 -6082927 -452748 3281350 3440592 458339 -5967916 -3100335
24233 -3100335 513215 1943224 716561 -3077562 -393672 3606449 12619067 13121451
24225 13121451 7773554 4496108 8505137 5162897 5960344 3281828 4601994 1187628
24217 1187628 655991 1101596 -602785 3298872 5061862 183122 -1576378 -73548
24209 -73548 -2522457 -1705407 -5353037 516024 3672239 5822054 -276596 -7318678 -5297432
24200 -5297432 -2193094 526180 148640 355521 2861743 2987386 1094181 644697 -1449332
24191 -1449332 -1084575 -5246474 -3691068 510581 -1055434 -1580544 -2630125 -1498717
24183 -1498717 2254751 -51200 322423 471376 -2924929 -4776707 -712634 4523387
24175 4523387 1662518 -4529888 -3583742 -2565044 -4981872 -3411130 -5446276 -261230
24167 -261230 -902488 -1542184 -811037 1240652 3556128 5325904 -2770196 -1194375 -3624642
24158 -3624642 -6362434 -11240978 -8757471 -2653331 928935 -982579 -1129608 480439
24150 480439 -2134839 5147069 3636830 4629519 1610959 2437228 5384425 541426 -777535
24141 -777535 -6234073 -3966026 -1442028 3613424 7303746 7615787 5566668 3271025
24133 3271025 4631739 6703360 8146955 1589021 -1991881 -3059299 1120303 5541631
24125 5541631 2674953 968932 688396 594502 -3867010 -8468324 -2952846 874661 -2947952
24116 -2947952 -9077966 -2768156 1165384 -1910766 -3185396 -2400185 1994511 5277177
24108 5277177 674768 -1641500 1945748 605345 2069261 -3588134 -9902996 -6546969
24100 -6546969 -10384880 -8203236 -7710277 -5005371 -6621062 -12907558 -9760095 -6134904
24092 -6134904 -2244267 1286255 665977 -9107810 -5414231 -1489734 -180717 748310
24084 748310 -3216987 -1900112 -1719499 3229793 2783132 -1377409 2651909 -2354728 -2628996
24075 -2628996 -1684885 -9587634 -3991504 -1575243 -3454906 2198863 643714 1224801
24067 1224801 1660847 4224858 3181725 1767691 -3446141 -2712455 1951999 1877667 -1325836
24058 -1325836 -5331877 -2266640 513991 -4544051 -6217678 1175956 5068929 -1105592
24050 -1105592 -3032995 -844528 -548181 240820 7941721 6815158 392683 1266678 69303
24041 69303 -1067095 3212034 3721506 2823580 6135197 5502228 5220861 3437422 787836
24032 787836 -318308 3844363 -796045 968707 253033 1123845 974275 448892 -4039711
24023 -4039711 -808668 3346989 6986448 6817844 7391231 -1258000 449679 -4770049
24015 -4770049 1660884 3748596 -270520 -3229931 3384876 5076801 -476253 27076
24007 27076 -320306 -57527 699286 2982333 294478 16127 -26675 -2128758 -1276862
23998 -1276862 -2972754 5321995 5212604 5614238 5519488 2341788 330987 1971532 4016193
23989 4016193 3470793 3619921 1064482 -7011208 -5807117 -5287145 -6332740 -12639461 -11555408
23980 -11555408 -8429876 -2892611 -1987768 -1360766 904881 -4442675 -4046256 3312693
23972 3312693 1720617 -1105248 2784484 1902888 3338413 760805 -1358777 -2783352
23964 -2783352 193258 330401 3315348 593290 677035 -1723037 -684838 -6919928 -7214348
23955 -7214348 -2441017 1391471 4294272 3448678 -3405781 -3643113 -7460967 -6834218 -3798774
23946 -3798774 3638913 5755422 388017 2910726 2863074 1354711 5701917 5552521 760127
23937 760127 -1110014 2091067 2402286 5541500 8512699 8521051 6966621 7380774 -3463719
23928 -3463719 -5936685 -3842139 -1984014 2153134 -119835 -72897 -4150434 -4680461 -1038573
23919 -1038573 4333149 -1204691 -1330984 1127123 -4740483 -8204659 -8691455 -4835154
23911 -4835154 1766936 1228430 1471647 -1626387 -1015721 -984302 -757729 1400230 3243437
23902 3243437 7201258 337913 -2917092 -3353417 -7063660 -6840775 -2938594 -4362981
23894 -4362981 -4871716 -3798201 -939429 518169 -720770 -4639887 -2050046 -4658385
23886 -4658385 -8805217 -5041286 3257771 -2357977 -3349330 -5687509 522620 248584
23878 248584 -1829715 -5905161 -11126527 -8447040 -1316687 -939795 881675 -1579704
23870 -1579704 -3586806 -1153708 2805535 1207254 2960092 -996595 -589225 -974296
23862 -974296 5317483 9232539 12048249 7411698 4528374 -2709158 706222 5361340
23854 5361340 99352 -1049957 2376401 6922686 4124899 4882226 2050238 1730977
23846 1730977 2114245 -222043 3044709 2161004 635248 3827406 4739639 -383181 -4722238
23837 -4722238 147277 2884332 599908 1491128 387220 5503290 10744116 7827441
23829 7827441 9875718 8873433 12291250 11866685 4496416 3958940 2471493 2863646 4662565
23820 4662565 2099914 666332 5211098 3929051 -2029671 -4414747 -5513044 -4992977
23812 -4992977 1182037 1229077 -129640 9125 -2164251 2428441 6769287 4844190 8327561
23803 8327561 3773855 -5004417 -890541 955674 1839119 937809 1622511 1215267 -277925
23794 -277925 141572 3400736 3254039 -406210 -6345616 -3988333 -4422656 -1012929 1071280
23785 1071280 -1180518 -1756790 -277640 -640063 -1862870 -5083898 1671708 896973 3056181
23776 3056181 8771617 11062909 10945811 6472301 1287483 -2484821 -2179115 -3293510
23768 -3293510 -3889167 -4038123 -2159176 204493 -3079641 -3138297 -7905169 -6947973 -5565777
23759 -5565777 -7902368 -9347372 -9093801 -5631728 -2234352 -71030 -1236764 -3159512
23751 -3159512 -5562743 -4554461 1734147 2909653 -7975880 -9130331 -5038158 -4891317
23743 -4891317 -1768257 4979529 12025775 16137370 7905572 647076 -2058574 -2307648
23735 -2307648 -1502142 -3470675 -9018351 -10301458 -12912505 -8486364 -7993709 -990683
23727 -990683 4054581 2098966 737657 -2417154 -2460825 -470760 -4454284 -7122044 -5304160
23718 -5304160 2978004 3129742 96937 649276 -2858320 -1905217 -3608215 -3846707 -1423924
23709 -1423924 -1605590 -2805956 2658400 -3576112 -2445773 -858035 3276928 3773400
23701 3773400 2741315 5892728 4857336 5418014 7481728 4807030 1077851 2719144
23693 2719144 3552790 1259881 2493702 94343 3683445 1218969 2529658 2099934
23685 2099934 -2441996 4801679 2985387 472058 183716 -4954734 -2820561 -1714860
23677 -1714860 1537421 -6488283 -12849064 -4166539 -3997587 -326157 1104614 1348474
23669 1348474 -1935053 670209 301570 -3082057 1118995 920062 1589350 6991825 10264944
23660 10264944 14594650 9699917 5987873 1196213 -1336621 -5390456 -4715121 207234
23652 207234 3363062 493662 -3454337 -303494 591450 -1840312 -1630313 3148513 -370546
23643 -370546 -3552048 1590215 7354730 -66277 -4072007 -1497442 349546 -6668436
23635 -6668436 -5023286 -6333444 -6850664 2583009 5891321 4542440 821180 -902569
23627 -902569 3102359 2416605 246435 -2857881 -1862076 -1771461 136851 71822 3126439
23618 3126439 5408415 -622737 -1526429 -2383174 -1170765 528408 3298978 4166877 -1859890
23609 -1859890 -6525321 -4599945 1852692 -2984137 -3620634 -2536462 -5342892 1439904
23601 1439904 2196979 3078329 5165411 4132791 -2032913 2334033 7412957 3637500
23593 3637500 5384017 9330838 9210633 4428141 4451685 7921328 4438800 2842920 4864744
23584 4864744 5403042 5494021 7432804 8474474 4141715 -1155576 -3260705 -3369719 -463585
23575 -463585 2382015 -3489994 -6773454 -6196998 -6093297 -4620442 -1548323 1281176 157873
23566 157873 -2313554 1938845 2260557 3584762 4407681 3254001 4483069 2493177 2263908
23557 2263908 -453888 -3798481 -8185252 -6088293 336450 2089374 3017885 6683086
23549 6683086 3727395 2896875 6250000 1150669 3189829 3137089 2625738 2887703 3636307
23540 3636307 -750224 -477060 2734121 1552595 -5983866 -5961024 -6822047 -4450552 -2230538
23531 -2230538 -692093 -163325 -5362307 -6609712 -4650008 -2832219 -489036 -2156483
23523 -2156483 -1296365 -2269547 -1740713 -4452245 -3691021 3189666 3799747 7177202 3557268
23514 3557268 -608978 -2128988 -2361399 -2846178 -2709201 -441512 -1326115 -2283499 -3057699
23505 -3057699 427249 6529347 9735280 5379465 612094 1564339 1837212 -6824795
23497 -6824795 -3180977 2545582 1086280 -1367826 -2322629 2532 -4537292 -4944779
23489 -4944779 -3877367 -10752549 -6898227 850973 926295 1150175 5142995 -17311 1748223
23480 1748223 5989846 7548209 8990063 6207690 695861 -6410916 374761 3382216
23472 3382216 2844935 -131741 -3729353 -4484469 -2453062 -2420640 -3714102 -1333439 -4760469
23463 -4760469 -1976297 -956338 3142053 9945969 7034271 2249989 710777 3362672
23455 3362672 5154423 2733091 5421106 5167465 5805930 1290409 1199066 4647941 2775748
23446 2775748 3873298 3265644 -524757 3346322 2445929 -1889401 3457568 4162286 1004376
23437 1004376 -379433 2749027 6065077 828151 -6164353 -3975049 -1426790 -2869871
23429 -2869871 -2925068 -2044855 645447 -1260730 1293231 3305942 2889461 -2613790 -4710481
23420 -4710481 -8161888 -6728664 -3520203 -6121747 -7288392 -5562510 128798 7053879
23412 7053879 3945977 -2025235 -1150496 3498064 -1268194 -2487065 -124705 -569575
23404 -569575 3318349 630933 5365896 10421910 3019512 1865313 2034266 -80532
23396 -80532 191337 2746550 3427720 5675371 4654658 1874190 437208 1130024 6995309
23387 6995309 8416475 5651176 75113 -862585 2566697 1446284 2355746 4344319
23379 4344319 3397050 -67392 -1430172 1287730 4464383 2026971 -2090289 -3562913
23371 -3562913 -2090265 -1164758 4702804 4862531 -964396 4633269 393266 -7865526
23363 -7865526 -6776008 2571033 8308052 3846675 -6416244 -14652569 -11150365 -11646174
23355 -11646174 -483029 5611637 2567771 -181288 1418402 5109317 110319 -2394695
23347 -2394695 3635236 7951102 8473656 2153300 340139 976889 -3452121 -4359451 -3516894
23338 -3516894 -3583894 -2881802 -698698 -2757536 -307103 5961136 7629210 3277770 1465239
23329 1465239 -3467330 -6170917 -7087389 -7446168 -7997278 -4399898 1532707 3392182 -1331895
23320 -1331895 753175 -1066031 -1714839 618122 4354948 5105033 925799 1381797 -448120
23311 -448120 -5277100 -7137902 -954616 -1240775 -4886981 -1674001 -4418344 -5416168 -7018706
23302 -7018706 -3241332 1445797 244423 -1520124 -843829 2936006 3994202 -345463
23294 -345463 -417097 2424704 4890971 3074922 4388083 7055208 9138372 3046148 1593331
23285 1593331 1465531 2001255 3535099 -2359989 792623 -407478 -4660801 -10548168
23277 -10548168 -1369557 2141789 2978041 5751069 7527027 2280444 -7659522 -7524041
23269 -7524041 -3931457 1509492 1687214 1184754 1836367 -504649 228443 241575 35304
23260 35304 -5348068 -11839620 -12744460 -5624008 568608 -2670462 -3552093 -4343577 -3855531
23251 -3855531 1444348 96843 -6337077 -6731368 -113531 882462 -689620 -9136656
23243 -9136656 -4981378 -3124791 -603552 2681164 3076898 2929225 2197376 -3179707 -1643489
23234 -1643489 -1888692 -818694 794889 -1191095 -157142 -1557946 -1024706 1866592
23226 1866592 7660574 -333892 -7439249 -1422644 5077148 5538481 976587 -1688282
23218 -1688282 -2577334 -2810771 -1940007 -2389957 -2214221 -420763 796655 -1245268 -3452295
23209 -3452295 -4203387 -2277621 -4468055 -1811356 -1161370 6341119 5846780 2713784 255733
23200 255733 2297478 4038896 2133316 -3684930 1322866 -1228518 -3056039 2472361
23192 2472361 -1799153 -3797813 -9670 30986 3333198 2999333 649579 -217333 3696420
23183 3696420 5684087 2396460 2922236 1769227 3602343 -1598273 1607352 3357161
23175 3357161 -1085227 -3099068 -5861949 -2070070 -659114 -673865 -213116 4762118 6692444
23166 6692444 6602546 3003843 4961868 7792719 9268830 8461140 10681947 6909946 1201521
23157 1201521 -467744 518179 3352314 4329218 3027060 5606648 5031444 7676593 7935231
23148 7935231 2575896 1223068 -1861854 3856617 2106278 983107 -1090427 -190905
23140 -190905 -3082083 43173 1819653 -1654616 -6146928 -5626764 -6585253 470846 3589059
23131 3589059 263560 510057 5809253 5483788 -746242 -1616394 -930187 2581141 1964582
23122 1964582 -556106 -1138278 1501061 5816846 7953038 4489713 136787 -7086798
23114 -7086798 -4271405 591019 -3916073 -189369 8239751 7073703 2602487 -218550
23106 -218550 1566016 3558168 5554995 -1154991 -4800525 777629 2388925 5781182
23098 5781182 7275104 6904754 2431976 -942141 738071 -157913 2015179 -1038
23090 -1038 4398288 5467207 3394491 -495167 2283994 5498652 4681160 2769273 2614583
23081 2614583 4223279 4583895 1462910 7726399 8353363 3573942 1873945 -83181
23073 -83181 -2730951 1772577 1391343 -3811006 -5828565 213063 3681104 -4094712 -6517179
23064 -6517179 -4816968 63061 -639858 -5802865 178708 3346150 763481 598929
23056 598929 3621493 6197844 26056 2125046 6344598 2954870 3395760 2429292 -3554915
23047 -3554915 -1184184 -5882708 -8489840 -5690483 -5331579 -1201981 -817838 1022004
23039 1022004 -2308767 -5154185 -6593091 -9506499 -2880033 5201859 8330851 5738660
23031 5738660 3448317 866951 190456 -2716164 -3844347 -4577265 -5685818 -583459
23023 -583459 -1614051 1259867 7188363 3654140 -2244761 -61286 885244 -3408602
23015 -3408602 -222574 1765096 1836609 2282327 4292153 3215872 1041556 -1836920 -2643098
23006 -2643098 -3001224 -5337445 -2102433 1887014 3412447 5697517 5283938 1045026
22998 1045026 -1131589 1042412 -2958153 -1993805 7010087 5954911 141091 -2911908
22990 -2911908 2271079 1447543 5954820 27690 -5013477 -7129702 -5789370 -4901179
22982 -4901179 -3976331 -3488752 -6640607 -9333413 -3447731 -3360316 -898799 36140 4138270
22973 4138270 3617117 485715 847974 -42575 -3876691 71788 -5196907 -6141416 -1205928
22964 -1205928 -5613211 -5865108 5677182 5966585 -918130 -1980472 -4968251 -5594265
22956 -5594265 -2850386 -2497792 1787369 3464762 -1362173 -2990573 -247337 4685066
22948 4685066 1467304 -2411554 -740574 -2360742 1715300 10303925 4904528 -1249566
22940 -1249566 -5368505 -1480512 -2432965 -3103777 1852053 -48789 -3869703 -5448179
22932 -5448179 -1435675 -6342609 -7947051 -1803396 -1659317 489649 -1728375 208945
22924 208945 527733 -2557144 375999 6262976 9331524 1694897 -768615 2261078
22916 2261078 3635603 3166849 -492889 -3240336 -580961 1682830 928728 -3740240
22908 -3740240 -1215012 -1457899 -82115 3978413 -3361309 -3272470 -1924660 205708 4027249
22899 4027249 7286366 8458454 3185501 -697776 -3745681 -2794175 719913 594783
22891 594783 910046 637751 2700539 601360 -1161242 -2655662 -6581945 -5759870 -7150096
22882 -7150096 -7660308 -4723172 -4850642 4738352 3204174 -219945 -95163 -1328782 -719494
22873 -719494 -3021392 -1156928 1762086 3095719 -1497962 -6510942 -5811013 -1088271
22865 -1088271 -6580310 54255 4128270 -3339312 -5672425 -3578207 -1042222 -3318206
22857 -3318206 1230457 5990531 924427 -2656854 -318609 2561903 -4181430 -1615839
22849 -1615839 3461080 2298142 336015 1241887 -4679603 -8117358 -978609 980108
22841 980108 4565915 7432049 5334234 -3899416 -5043182 -3793896 3815366 7292091
22833 7292091 3597090 2328927 6170510 1343299 3145242 8190952 10722054 7866166
22825 7866166 4689836 2822090 -574799 4541171 946971 -5810666 -7094424 -2443788
22817 -2443788 -1998172 1053807 2190068 4989832 3742022 1781602 8323402 3775696
22809 3775696 4343771 4536018 -265553 1492816 -448157 -2757726 -6967096 -4078308
22801 -4078308 1423493 2932117 -3074538 1237493 -1294744 3088837 4749180 6627823
22793 6627823 4504688 -187533 -604995 5930731 9371531 3389070 -7503913 -11082662
22785 -11082662 -4120512 -4128450 -450596 -405270 4203905 2074109 2684684 5508032 5830571
22776 5830571 4712864 -43833 -2173299 -988372 5639466 3096142 -2383095 4206275
22768 4206275 9685059 5441705 -692926 -3153333 -1135589 530929 -827392 5801096
22760 5801096 3362580 -795446 660785 2997796 2707104 4654747 2474109 -4220169
22752 -4220169 -6693073 -5282907 -2998376 -7051025 -4520764 -5192134 2063340 6858071
22744 6858071 9141406 7647685 4022294 315175 -834254 1918419 5990754 2861437
22736 2861437 -501802 -4000278 -1144366 5206516 2877357 3182406 -1260937 1105586
22728 1105586 4363439 3406599 9875870 7749130 3970688 4780476 4555356 2287982 37483
22719 37483 -895690 -6224104 -3454853 3883984 3214236 2962035 -905044 4904310 10670096
22710 10670096 -711337 -11438196 -9140991 -6637397 -1244826 5729493 7490823 6012817
22702 6012817 5610405 4932635 4151732 -820977 -7270430 -4852010 2740553 2194837 -336667
22693 -336667 4726190 5082701 2721732 -544716 22932 7059779 6117430 6931160 7538425
22684 7538425 4799879 -2051991 -1718127 6110469 5893399 -1553777 1306216 4283031
22676 4283031 3191091 -2134546 -5073022 -4069618 -3821059 -2793930 -1256018 -145856
22668 -145856 1630278 521885 5133228 9282526 12136643 6967790 2399328 784829
22660 784829 -6875351 -9003369 -9353888 -4618328 2688522 1486102 -2445635 -1100691
22652 -1100691 3308727 -2328180 -885399 -2622824 -9650421 -5279761 2426372 9621057
22644 9621057 7041453 81028 -5442694 -5334934 -4202584 -4205615 -666595 2419338 1844610
22635 1844610 3443708 -2323772 -9274271 -3149804 -1820459 -2038686 3179917 4968114
22627 4968114 8038788 6986385 4357046 2562367 1923739 826610 3535702 8791089
22619 8791089 3560446 5995725 7399935 3119244 -3315051 -888486 1430548 -4973103
22611 -4973103 -4332416 -6295075 -7083913 -14203458 -8370833 -6599126 -5974270 -10656425 -10280501
22602 -10280501 -863932 -5312280 -8320637 -3163666 -2496915 675303 2197476 -1407757
22594 -1407757 95538 1401646 2932111 3044628 1653633 5475191 8740929 5661039
22586 5661039 909256 2033439 3518875 1117378 1296463 1553971 -1174410 -683867 2913231
22577 2913231 2277928 2535946 1963510 -2392495 -5074143 428659 2632011 6499463 9249379
22568 9249379 5464212 6694749 -34781 4918685 6985570 4734302 6608990 1996152
22560 1996152 2141271 749240 2314963 4263384 5103403 4674626 564298 6277649 4553905
22551 4553905 2725003 2671181 11086382 9582705 8835031 5092453 2261141 -4517076 -6341110
22542 -6341110 -1371327 451232 -2138909 -3082422 -2914113 3623804 6640801 4901744
22534 4901744 1620364 1792446 2031338 222562 -644469 -4546585 -5502701 4759277 6579487
22525 6579487 -2629783 -2996440 1670499 2037397 3584294 385795 -477685 -744270 -4903941
22516 -4903941 -3527860 -1095426 -569832 1948497 469194 2770789 5443672 5222037
22508 5222037 355729 995488 5443257 6125741 -2087609 2078971 -900211 -2067305
22500 -2067305 -4530308 -6867805 -3600449 -3248335 -6989726 -2937521 429247 -1936603
22492 -1936603 512356 3126907 3491677 6066063 3520091 3937363 3215570 5980410 5082411
22483 5082411 4651732 -616338 -1880047 2454945 4673818 2579091 190266 -2419511
$$ [...]
##END NTUPLES=NMR SPECTRUM
##END=
