##TITLE=19F_EC-3182
 CDCl3. 24 sc
 13.3.2019
##JCAMPDX= 6.0         $$ Bruker NMR JCAMP-DX V2.0
##DATA TYPE= NMR SPECTRUM
##DATA CLASS= NTUPLES
##ORIGIN= UXNMR, Bruker Analytische Messtechnik GmbH
##OWNER= root
$$ XWIN-NMR		Version 3.5
$$ Wed Mar 13 14:21:11 2019 Russian Standard Time (UT+4h)  she@DPX200
##.OBSERVE FREQUENCY= 188.290927
##.OBSERVE NUCLEUS= ^19F
##.ACQUISITION MODE= SIMULTANEOUS
##.ACQUISITION SCHEME= undefined
##.AVERAGES= 24
##.DIGITISER RES= 16
##SPECTROMETER/DATA SYSTEM= spect
##.PULSE SEQUENCE= zg
##.SOLVENT NAME= DMSO
##.SHIFT REFERENCE= (INTERNAL, DMSO, 0, 98.3737)
##AUDIT TRAIL= $$ (NUMBER, WHEN, WHO, WHERE, WHAT)
$$ ##TITLE= Audit trail, XWIN-NMR		Version 3.5
$$ ##JCAMPDX= 5.01
$$ ##ORIGIN= Bruker BioSpin GmbH
$$ ##OWNER= she
$$ F:/spectra/data/she/nmr/f19/1/pdata/1/auditp.txt
$$ ##AUDIT TRAIL=  $$ (NUMBER, WHEN, WHO, WHERE, WHAT)
(   1,<2019-03-13 14:19:47.28 +0400>,<she>,<DPX200>,
      <created by zg, POWCHK disabled, PULCHK disabled
       configuration hash MD5:
       00 E9 B6 7A A2 85 ED C7 34 08 36 98 17 FE 4E 26
       data hash MD5: 64K
       F6 E0 97 7B 45 30 3D 64 6C 1C DB 36 E7 D1 76 13>)
(   2,<2019-03-13 14:19:50.42 +0400>,<she>,<DPX200>,
      <Start of raw data processing
       efp BC_mod = 2 LB = 1 FT_mod = 6 PKNL = 1 PHC0 = 1442.835 PHC1 = 46.15593 SI = 64K 
       data hash MD5: 64K
       65 A9 40 7E E5 6A 9C C9 2B D2 FF FD 2C 22 47 AE>)
(   3,<2019-03-13 14:20:12.31 +0400>,<she>,<DPX200>,
      <pk PHC0 = 42.40022 PHC1 = -11 
       data hash MD5: 64K
       66 1C 4C 8B 5E 2F 88 5F 98 3A A9 53 B0 16 2D 33>)
(   4,<2019-03-13 14:20:16.06 +0400>,<she>,<DPX200>,
      <abs ABSG = 5 
       data hash MD5: 64K
       71 FE D9 67 A3 B3 88 E4 BD 2E 03 11 87 6A A2 CD>)
(   5,<2019-03-13 14:20:43.51 +0400>,<she>,<DPX200>,
      <abs ABSG = 5 
       data hash MD5: 64K
       54 1A 99 08 5F 62 2C FD 18 21 EA 21 5D B9 D5 47>)
$$ ##END=
$$ 
$$ hash MD5
$$ CE E6 34 A8 E4 F3 C7 47 8B 69 9E F2 59 B8 EE 86
##$RELAX= 
##$RELAX= 
##$RELAX= 
##$RELAX= 
##$RELAX= 
##$RELAX= 
##$RELAX= 
##$RELAX= 
$$ Bruker specific parameters
$$ --------------------------
##$DU= <F:/spectra>
##$EXPNO= 1
##$NAME= <f19>
##$PROCNO= 1
##$TYPE= <nmr>
##$USER= <she>
##$AMP= (0..31)
100 100 100 100 100 100 100 100 100 100 100 100 100 100 100 100 100 100 
100 100 100 100 100 100 100 100 100 100 100 100 100 100 
##$AQSEQ= 0
##$AQ_mod= 1
##$AUNM= <au_zg>
##$AUTOPOS= <>
##$BF1= 188.310428
##$BF2= 200.13
##$BF3= 200.13
##$BF4= 200.13
##$BF5= 200.13
##$BF6= 200.13
##$BF7= 200.13
##$BF8= 200.13
##$BYTORDA= 1
##$CFDGTYP= 0
##$CFRGTYP= 5
##$CHEMSTR= <none>
##$CNST= (0..31)
1 1 145 1 1 1 1 1 1 1 1 1 1 1 1 1 1 1 1 1 1 1 1 1 1 1 1 1 1 1 1 1 
##$CPDPRG= <>
##$CPDPRG1= <>
##$CPDPRG2= <>
##$CPDPRG3= <>
##$CPDPRG4= <mlev>
##$CPDPRG5= <mlev>
##$CPDPRG6= <mlev>
##$CPDPRG7= <mlev>
##$CPDPRG8= <mlev>
##$CPDPRGB= <>
##$CPDPRGT= <>
##$D= (0..31)
0 1.3 0 0 0 0 0 0 0 0 0 0 0.25 0 0 0 0 0 0 0 0 0 0 0 0 0 0 0 0 0 0 0 
##$DATE= 1552472386
##$DBL= (0..7)
$$ [...]
##$SUBNAM3= <"">
##$SUBNAM4= <"">
##$SUBNAM5= <"">
##$SUBNAM6= <"">
##$SUBNAM7= <"">
##$SUBNAM8= <"">
##$SUBNAM9= <"">
##$SW= 251.107818259711
##$SWIBOX= (0..15)
0 1 0 0 0 0 0 0 0 0 0 0 0 0 0 0 
##$SW_h= 47281.3238770686
##$TD= 65536
##$TD0= 1
##$TE= 0
##$TE2= 300
##$TE3= 300
##$TEG= 300
##$TL= (0..7)
0 120 53 12 22 120 120 120 
##$TP= (0..7)
150 150 150 150 150 150 150 150 
##$TP07= 0
##$TPNAME0= <>
##$TPNAME1= <>
##$TPNAME2= <>
##$TPNAME3= <>
##$TPNAME4= <>
##$TPNAME5= <>
##$TPNAME6= <>
##$TPNAME7= <>
##$TPOAL= (0..7)
0.5 0.5 0.5 0.5 0.5 0.5 0.5 0.5 
##$TPOFFS= (0..7)
0 0 0 0 0 0 0 0 
##$TUNHIN= 0
##$TUNHOUT= 0
##$TUNXOUT= 0
##$USERA1= <user>
##$USERA2= <user>
##$USERA3= <user>
##$USERA4= <user>
##$USERA5= <user>
##$V9= 5
##$VALIST= <valist>
##$VCLIST= <CCCCCCCCCCCCCCC>
##$VD= 0
##$VDLIST= <DDDDDDDDDDDDDDD>
##$VPLIST= <PPPPPPPPPPPPPPP>
##$VTLIST= <TTTTTTTTTTTTTTT>
##$WBST= 1024
##$WBSW= 4
##$XGAIN= (0..3)
0 0 0 0 
##$XL= 0
##$YL= 0
##$YMAX_a= 76358
##$YMIN_a= -50154
##$ZGOPTNS= <>
##$ZL1= 120
##$ZL2= 120
##$ZL3= 120
##$ZL4= 120
##$ABSF1= 98.37372
##$ABSF2= -152.7273
##$ABSG= 5
##$ABSL= 3
##$ALPHA= 0
##$AQORDER= 0
##$ASSFAC= 0
##$ASSFACI= 0
##$ASSFACX= 0
##$ASSWID= 0
##$AUNMP= <proc_1d>
##$AZFE= 0.1
##$AZFW= 5
##$BCFW= 0
##$BC_mod= 2
##$BYTORDP= 0
##$COROFFS= 0
##$CY= -3
##$DATMOD= 1
##$DC= 0
##$DFILT= <>
##$DTYPP= 0
##$F1P= 0
##$F2P= 0
##$FCOR= 0.5
##$FTSIZE= 65536
##$FT_mod= 6
##$GAMMA= 0
##$GB= 0
##$INTBC= 1
##$INTSCL= 8.653935e-10
##$ISEN= 128
##$LB= 1
##$LEV0= 0
##$LPBIN= 0
##$MAXI= 10000
##$MC2= 0
##$MEAN= 0
##$ME_mod= 0
##$MI= 0.4277144
##$NCOEF= 0
##$NC_proc= -4
##$NLEV= 6
##$NOISF1= -61.99997
##$NOISF2= -62.99997
##$NSP= 0
##$NTH_PI= 0
##$NZP= 0
##$OFFSET= 98.37372
##$PC= 1
##$PHC0= 1485.235
##$PHC1= 35.15593
##$PH_mod= 1
##$PKNL= yes
##$PPARMOD= 0
##$PSCAL= 0
##$PSIGN= 0
##$REVERSE= no
##$SF= 188.296044280273
##$SI= 65536
##$SIGF1= -61
##$SIGF2= -65
##$SINO= 3.502647
##$SIOLD= 65536
##$SREGLST= <1H.CDCl3>
##$SSB= 0
##$STSI= 65536
##$STSR= 0
##$SW_p= 47281.3238770685
##$SYMM= 0
##$S_DEV= 0
##$TDeff= 65536
##$TDoff= 0
##$TI= <>
##$TILT= no
##$TM1= 0
##$TM2= 0
##$TOPLEV= 0
##$USERP1= <user>
##$USERP2= <user>
##$USERP3= <user>
##$USERP4= <user>
##$USERP5= <user>
##$WDW= 1
##$XDIM= 65536
##$YMAX_p= 471231119
##$YMIN_p= -1536842
$$ End of Bruker specific parameters
$$ ---------------------------------
##NTUPLES= NMR SPECTRUM
##VAR_NAME=  FREQUENCY,     SPECTRUM/REAL,   SPECTRUM/IMAG
##SYMBOL=    X,             R,               I
##VAR_TYPE=  INDEPENDENT,   DEPENDENT,       DEPENDENT
##VAR_FORM=  AFFN,          ASDF,            ASDF
##VAR_DIM=   65536,         65536,           65536
##UNITS=     HZ,            ARBITRARY UNITS, ARBITRARY UNITS
##FACTOR=    0.721466756344984, 1,           1
##FIRST=     18523.3820098237, 0,            0
##LAST=      -28757.9418672448, 0,           0
##MIN=       -28757.9418672448, -1536842,    0
##MAX=       18523.3820098237, 471231119,    0
$$ Real data points
##PAGE= N=1
##DATA TABLE= (X++(R..R)), XYDATA
$$ [...]
$$ plain form
47529 358502 362453 -276561 -170721 -581561 -320969 -29171 -201306 -180127 -150073 -187869
47519 -187869 -270641 -44110 96983 360240 334698 -44500 87472 164809 197218 115400
47509 115400 207328 -84818 -124421 18928 -290803 -336856 -375313 -303322 -5124 -50291 66073
47498 66073 -79806 9149 20631 148832 -5039 -227455 -331613 -237741 44393 -108250
47488 -108250 -140092 83608 -138857 -4870 -169196 105863 59156 16074 464849 473746
47478 473746 112225 174304 237909 43836 180490 222521 214632 325768 304961 223109 66392
47467 66392 -178531 -300974 -195749 -272319 -207277 -124553 -99998 -247421 287151 461819
47457 461819 112487 -224682 -327784 -317548 -97303 -27036 -31151 264881 629191 504429
$$ packed form
47529C58502L951o39014J05840m10840K60592K91798j72135K1179L0054l7796
47519a87869q2772K26531J41093K63257k5542l79198J31972P7337L2409q1818
47509A15400R1928k92146l9603J43349l09731m6053l8457P1991K98198m5167J16364
47498F6073j45879Q8955J1482J28201j53871k22416j04158R3872K82134j52643
47488a08250l1842K23700k22465J33987j64326K75059m6707m3082M48775Q897
47478D73746l61521O2079O3605j94073J36654M2031p889J11136k0807q1852j56717
47467F6392k44923j22443J05225p6570O5042Q2724K4555j47423N34572J74668
47457D61819l49332l37169j03102J0236K20245P0267m115K96032L64310j24762
$$ plain form
47447 504429 -86094 121993 -27997 -106191 -232249 -127682 -219860 -334678 -242597 -114378
47437 -114378 -104633 -150127 -169644 -298464 -498963 -356451 316993 752037 151617 116803
47427 116803 675032 874706 548162 106863 -216575 -435731 -454473 -364445 -313386 -51546
47417 -51546 135353 562023 369881 -151776 41739 -570886 -304303 366395 201456 -281484
47407 -281484 12006 369240 235544 217741 -205163 -200737 -16020 -101436 -209341 -290081
47397 -290081 128197 298302 35744 27581 14323 137972 -70157 -102424 134459 241280
47387 241280 116505 97685 437669 160442 462460 760183 504055 123416 64020 382719
47377 382719 483339 395405 339654 148129 128145 38051 -84244 259717 -208710 -202395 -93895
$$ packed form
47447E04429n90523K08087j49990p8194j26058J04567r2178j14818R2081J28219
47437a14378R745m5494j9517j28820k00499J42512O73444M35044o00420l4814
47427A16803N58229J99674l26544m41299l23438k19156j8742R0028N1059K61840
47417e1546J86899M26670j92142n21657J93515o12625K66583O70698j64939m82940
47407b81484K93490L57234j33696j7803m22904M426J84717q5416j07905q0740
47397b90081M18278J70105k62558q163j3258J23649k08129l2267K36883J06821
47387B41280j24775j8820L39984k77227L02018K97723k56128l80639n9396L18699
47377C82719J00620q7934n5751j91525j9984r0094j22295L43961m68427O315J08500
$$ plain form
47366 -93895 13596 -291462 -95585 92963 332924 579528 153902 153662 441053 202116
47356 202116 -156339 -40026 -93573 -396012 -136225 36777 -301136 -136202 -21252 287069
47346 287069 197399 -439693 -426970 -364276 -128374 117455 144824 -239641 34754 379052
47336 379052 226827 -53777 -254188 -617218 -829802 -374322 -497908 -388191 251599 188395
47326 188395 231413 -87476 127374 404859 54625 47562 -160883 -18921 63091 -241820
47316 -241820 -289289 -93111 44580 63522 -59594 -47011 -25700 -3571 -192237 -352344
47306 -352344 29146 210403 58789 203032 174422 -81791 78129 300153 117174 -387018
47296 -387018 -50562 96534 63093 167206 36803 -348725 -143202 165867 532548 125845
$$ packed form
47366i3895J07491l05058J95877J88548K39961K46604m25626k40K87391k38937
47356B02116l58455J16313n3547l02439K59787J73002l37913J64934J14950L08321
47346B87069q9670o37092J2723O2694K35902K45829K7369l84465K74395L44298
47336C79052j52225k80604k00411l63030k12584M55480j23586J09717O39790o3204
47326A88395M3018l18889K14850K77485l50234p063k08445J41962Q2012l04911
47316b41820m7469J96178J37691J8942j23116J2583K1311K2129j88666j60107
47306c52344L81490J81257j51614J44243k8610k56213J59920K22024j82979n04192
47296c87018L36456J47096l3441J04113j30403l85528K05523L09069L66681m06703
$$ plain form
47286 125845 -60076 325111 232616 302140 163743 -122989 -324501 -145093 29643 233551
47276 233551 145167 -72721 159593 210624 25415 -56325 223207 104219 -88186 -43364
47266 -43364 14091 187009 222677 73882 326666 306478 143954 280409 230490 65557
47256 65557 -108964 -15830 -50159 -25705 506503 387697 221158 290674 188661 156885 278922
47245 278922 397953 367557 277106 106849 -294197 -354841 125139 143056 80906 -50188
47235 -50188 -395801 -720636 -436533 -174365 -46812 106166 170002 -84919 104900 175391
47225 175391 173866 39312 -181754 54451 28588 -217349 74170 167960 433189 361545
47215 361545 403223 264434 331115 455035 281187 67128 -127832 61558 -253864 -472748
$$ packed form
47286A25845j85921L85187r2495O9524j38397k86732k01512J79408J74736K03908
47276B33551q8384k17888K32314N1031j85209q1740K79532j18988j92405M4822
47266d3364N7455J72918L5668j48795K52784k0188j62524J36455m9919j64933
47256F5557j74521R3134l4329K4454N32208j18806j66539O9516j02013l1776J22037
47245B78922J19031l0396r0451j70257m01046o0644M79980J7917o2150j31094
47235e0188l45613l24835K84103K62168J27553J52978O3836k54921J89819P0491
47225A75391j525j34554k21066K36205k5863k45937K91519R3790K65229p1644
47215C61545M1678j38789O6681J23920j73848k14059j94960J89390l15422k18884
$$ plain form
47205 -472748 -610154 -634390 -434461 -205474 -167561 -336663 -27459 209706 232737 317970
47195 317970 160782 -197327 -239523 -93736 -126613 100497 -78297 -343472 -172482 55870
47185 55870 70692 20422 311731 330468 193420 -113732 -276670 28843 -8373 37163 259236
47174 259236 -43172 29845 -256873 -632816 -692567 -427665 -226895 -105532 -53596 -88354
47164 -88354 22769 103552 320971 366450 1662 -377961 -347850 -31069 85281 -219142
47154 -219142 -533423 9653 99534 144538 479864 609633 85111 -344668 -192668 654583
47144 654583 874500 142464 155921 -307113 -543726 -527093 -454699 -706027 -507947 -527615
47134 -527615 -570329 -260188 -366295 -505644 -391699 -165548 -24766 32454 46363 164180
$$ packed form
47205d72748j37406k4236J99929K28987L7913j69102L09204K37165K3031Q5233
47195C17970j57188l58109m2196J45787l2877K27110j78794k65175J70990K28352
47185E5870J4822n0270K91309J8737j37048l07152j62938L05513l7216M5536K22073
47174B59236l02408P3017k86718l75943n9751K64902K00770J21363N1936l4758
47164h8354J11123Q0783K17419M5479l64788l79623L0111L16781J16350l04423
47154b19142l14281N43076Q9881M5004L35326J29769n24522m29779J52000Q47251
47144F54583K19917p32036J3457m63034k36613J6633P2394k51328J98080j9668
47134e27615m2714L10141j06107j39349J13945K26151J40782N7220J3909J17817
$$ plain form
47124 164180 427360 513413 652509 262106 315784 423155 126351 -129832 -345682 -350698
47114 -350698 -83887 -82098 34103 95905 141045 467186 348539 -32667 -228661 124298
47104 124298 -263847 -274684 -73880 -129508 -481587 -221844 136055 -300574 5228 -11077
47094 -11077 210684 177499 -187489 -744000 -652449 -399195 -447908 -310516 -588197 -529467
47084 -529467 -294867 -9115 153923 -236768 -406917 -59392 228299 -21496 -273259 128333
47074 128333 1857 -31932 -533285 -288309 -586300 -540638 -225320 -267187 221479 74716
47064 74716 -38969 102229 63236 -14502 414352 443405 205283 -56419 -290055 -547758
47054 -547758 -269459 -382259 -132644 -127111 -110894 -413168 -364479 -280765 -302857 -621569 -570200
$$ packed form
47124A64180K63180Q6053J39096l90403N3678J07371k96804k56183k15850n016
47114c50698K66811J789J16201O1802M5140L26141j18647l81206j95994L52959
47104A24298l88145j0837K00804n5628l52079K59743L57899m36629L05802j6305
47094a1077K21761l3185l64988n56511R1551K53254m8713J37392k77681N8730
47084e29467K34600K85752J63038l90691j70149L47525K87691k49795k51763M01592
47074A28333j26476l3789n01353K44976k97991M5662L15318m1867M88666j46763
47064G4716j13685J41198l8993p7738M28854K9053k38122k61702k33636k57703
47054e47758K78299j12800K49615N533J6217l02274M8689Q3714k2092l18712N1369
$$ plain form
47043 -570200 -265118 -84120 -32221 -714563 -728042 -455230 -180961 -110632 -22353 46517
47033 46517 -126208 35616 -27690 -305560 -336480 -483452 -387485 -238665 66151 -92664
47023 -92664 -451669 -608801 -647220 -902948 -619032 -227944 -213779 -231256 35914 108681
47013 108681 214693 197351 215262 -40460 -142336 -12222 253133 397783 106270 -72268
47003 -72268 148722 108533 183203 -89884 -290841 349609 332161 95413 170559 292856
46993 292856 -129581 211779 404247 289525 246801 227548 -218493 -490376 -443906 -242238
46983 -242238 -47583 216184 9241 241987 59631 114682 340031 383895 268220 -324345
46973 -324345 -448936 -298954 -410240 -387210 -317913 -779930 -602184 -289143 -129756 83929
$$ packed form
47043e70200L05082J80998N1899o82342j3479K72812K74269P0329Q8279O8870
47033D6517j72725J61824o3306k77870l0920j46972R5967J48820L04816j58815
47023i2664l59005j57132l8419k55728K83916L91088J4165j7477K67170P2767
47013A08681J06012j7342J7911k55722j01876J30114K65355J44650k91513j78538
47003g2268K20990m0189P4670k73087k00957O40450j7448k36748P5146J22297
46993B92856m22437L41360J92468j14722m2724j9253m46041k71883M6470K01668
46983b42238J94655K63767k06943K32746j82356N5051K25349M3864j15675n92565
46973c24345j24591J49982j11286K3030O9297m62017J77746L13041J59387K13685
$$ plain form
46963 83929 279235 71671 -99781 -215253 -67840 -136524 29530 363168 231001 332430
46953 332430 -240054 -141890 107854 102136 -325511 -840992 -747368 -688299 -291430 31063
46943 31063 -289861 -255008 -290232 -353953 15586 -84104 -289473 -94754 -136632 -118033 153358
46932 153358 316975 154518 225464 196363 80269 -85421 -99606 201630 -74992 -260698
46922 -260698 -119968 -305369 -449219 -336973 -36243 96968 125673 -410 -106816 -317785
46912 -317785 -429069 -110399 17690 -94178 -109659 -390769 -385707 -175429 130075 291245
46902 291245 294703 358499 546593 797785 586262 -95027 169005 457746 213348 62994
46892 62994 -20049 -39386 1158 -315172 -96197 78926 95341 -293099 -387559 -370843 -469495
$$ packed form
46963H3929J95306k07564j71452j15472J47413o8684J66054L33638j32167J01429
46953C32430n72484R8164K49744n718m27647n15481R3624N9069L96869L22493
46943C1063l20924L4853l5224o3721L69539r9690k05369J94719m1878J8599K71391
46932A53358J63617j62457P0946k9101j16094j65690j4185L01236k76622j85706
46922b60698J40730j85401j43850J12246L00730J33211K8705j26083j06406k10969
46912c17785j11284L18670J28089j11868j5481k81110N062K10278L05504J61170
46902B91245L458O3796J88094K51192k11523o81289K64032K88741k44398j50354
46892F2994q3043j9337M0544l16330K18975J75123J6415l88440r4460J6716r8652
$$ plain form
46881 -469495 -503293 -386327 -89753 -45255 74735 3800 -156964 -220662 -163735 -64522 44704
46870 44704 274742 296187 -71238 73577 190849 518781 675108 420527 592959 223306
46860 223306 216753 170935 162994 -149513 167126 124632 -97070 174460 304544 -92126 -242379
46849 -242379 -90037 -255558 -569380 -332270 155503 467193 279378 -237001 -449845 -274677
46839 -274677 -165979 -296679 -372387 -161921 -323292 -277544 74546 43786 -73705 -208563
46829 -208563 98397 295838 265746 71546 -50115 102654 92793 162146 173679 -123288
46819 -123288 -161483 15782 -54454 -95863 -30599 -79916 -10965 249965 127402 -2141 235359
46808 235359 299751 119809 -104646 -262187 205216 505793 128447 299906 210796 125285
$$ packed form
46881d69495l3798J16966K96574M4498J19990p0935j60764o3698N6927R9213J09226
46870D4704K30038K1445l67425J44815J17272L27932J56327k54581J72432l69653
46860B23306o553m5818p941l12507L16639m2494k21702K71530J30084l96670j50253
46849b42379J52342j65521l13822K37110M87773L11690j87815n16379k12844J75168
46839b74677J08698j30700p5708K10466j61371M5748L52090l0760j17491j34858
46829b08563L06960J97441l0092j94200j21661J52769r861O9353J1533k96967
46819a23288l8195J77265p0236m1409O5264m9317O8951K60930j22563j29543K37500
46808B35359O4392j79942k24455j57541M67403L00577l77346J71459q9110q5511
$$ plain form
46798 125285 62759 19674 -172610 94054 192498 465086 488922 281973 317188 237271 29204
46787 29204 157799 -33332 52090 178537 33328 169333 45334 -153750 124879 207521
46777 207521 -54079 -113338 192601 338895 14023 -438523 -115912 5218 225389 210991
46767 210991 -11104 -311233 -48407 13708 -6660 78195 -231377 -612345 -342619 -136907
46757 -136907 -269737 -233307 -228907 -162778 338675 541517 360411 339462 146969 105387 182886
46746 182886 132901 199450 -324595 -353288 -587432 -608021 -118374 -364194 -658667 -631860
46736 -631860 -680698 -609234 -526232 -215955 68695 -127044 -59691 -32882 -359094 -171152
46726 -171152 -319574 -14601 91077 -45043 -327928 -571502 -558062 -267152 -96866 -119298
$$ packed form
46798A25285o2526m3085j92284K66664R8444K72588K3836k06949L5215p9917k08067
46787B9204J28595j91131Q5422J26447j45209J36005j23999j99084K78629Q2642
46777B07521k61600n9259L05939J46294l24872m52546L22611J21130K20171j4398
46767B10991k22095l00129K62826O2115k0368Q4855l09572l80968K69726K05712
46757a36907j32830L6430M400O6129N01453K02842j81106k0949j92493m1582P7499
46746A82886m9985O6549n24045k8693k34144k0589M89647k45820k94473K6807
46736f31860m8838P1464Q3002L10277K84650j95739O7353K6809l26212J87942
46726a71152j48422L04973J05678j36120k82885k43574J3440K90910J70286k2432
$$ plain form
46716 -119298 241522 284433 -216523 -45631 335541 297981 346 -235181 -311220 -551261
46706 -551261 -441006 -63025 -131316 84906 66275 92345 -34446 -145517 81299 99388
46696 99388 -132749 -18176 360931 16903 -87730 188048 172255 147446 -253776 -289283
46686 -289283 -105149 114982 215216 289101 -44151 -106746 -289596 -408966 -541434 -285705
46676 -285705 -87225 211171 288177 393649 230293 164333 -57904 -404096 -24514 150297
46666 150297 -192313 96986 309110 234197 68575 -500199 -629641 -785234 -247517 -158636
46656 -158636 -420974 115473 -119960 -558438 -380630 -431739 -134814 -266371 -195336 -247428
46646 -247428 34230 -26769 -326633 -169001 -156872 -17626 277509 109005 350920 467584
$$ packed form
46716a19298L60820M2911n00956J70892L81172l7560k97635k35527p6039k40041
46706e51261J10255L77981o8291K16222j8631K6070j26791j11071K26816J8089
46696I9388k32137J14573L79107l44028j04633K75778j5793k4809m01222l5507
46686b89283J84134K20131J00234P3885l33252o2595j82850j19370j32468K55729
46676b85705J98480K98396P7006J05472j63356o5960k22237l46192L79582J74811
46666A50297l42610K89299K12124p4913j65622n68774j29442j55593N37717Q8881
46656a58636k62338N36447k35433m38478J77808n1109K96925j31557P1035n2092
46646b47428K81658o0999k99864J57632J2129J39246K95135j68504K41915J16664
$$ plain form
46636 467584 147950 160036 75270 -44326 -223947 -369505 -351085 -318435 -212012 -28229
46626 -28229 -341717 -613555 -559544 -294927 -415018 -526890 -284006 130188 85004 -270140
46616 -270140 -406945 -450749 -210735 -267247 93046 222294 366536 79690 -325877 -375986
46606 -375986 -265837 -248617 -148981 82429 168653 -126680 30605 224233 173845 -70305
46596 -70305 219504 -61775 -852231 -384013 -31333 -71340 -401550 -536457 -389930 -138375
46586 -138375 92269 134313 151097 -88153 -90867 -102115 -147626 -148737 -37493 173702 18750
46575 18750 19108 255991 120598 -101700 -197041 -443615 -177644 -68511 155661 182598 64762
46564 64762 161472 346480 -76015 -155460 122233 88019 158169 233234 220810 -5222 -160502
$$ packed form
46636D67584l19634J2086q4766j19596j79621j45558J8420L2650J06423J83783
46626b8229l13488k71838N4011K64617j20091j11872K42884M14194m5184l55144
46616b70140j36805m3804K40014n6512L60293J29248J44242k86846m05567n0109
46606c75986J10149J7220R9636K31410Q6224k95333J57285J93628n0388k44150
46596g0305K89809k81279p90456M68218L52680m0007l30210j34907J46527K51555
46586a38375K30644M2044J6784k39250k714j1248m5511j111J11244K11195j54952
46575A8750L58K36883j35393k22298r5341k46574K65971J09133K24172K6937j17836
46564F4762R6710J85008m22495p9445K77693l4214P0150P5065j2424k26032j55280
$$ plain form
46553 -160502 -183780 -48484 -17310 217880 -62577 -393371 -178572 -169018 -109006 392728
46543 392728 586863 113154 -124196 25468 -91222 -593518 -749430 -284880 250258 344959
46533 344959 152909 -283841 -518165 -266871 216165 18433 928 298234 517581 422599
46523 422599 99542 76531 -88689 -297625 -130683 -232100 329471 411345 122250 -286597
46513 -286597 -151789 243644 389200 225560 156610 303099 158394 -263962 -137277 -25404
46503 -25404 -259157 -134592 -115567 60070 -24613 -171931 -287573 -200556 26225 183852
46493 183852 111673 -6316 -6168 134636 595302 496752 508110 70101 -155558 2126 37891
46482 37891 -197425 -29374 -102232 -377968 -90642 -50560 -456796 -157156 340400 213870
$$ packed form
46553a60502k3278J35296L1174K35190k80457l30794K14799R554O0012N01734
46543C92728J94135m73709k37350J49664j16690n02296j55912M64550N35138R4701
46533C44959j92050m36750k34324K51294M83036j97732j7505K97306K19347r4982
46523D22599l23057k3011j65220k08936J66942j01417N61571Q1874k89095m08847
46513b86597J34808L95433J45556j63640o8950J46489j44705m22356J26685J11873
46503b5404k33753J24565J9025J75637q4683j47318j15642Q7017K26781J57627
46493A83852p2179j17989J48J40804M60666r8550J1358m38009k25659J57684L5765
46482C7891k35316J68051p2858k75736K87326M0082m06236K99640M97556j26530
$$ plain form
46472 213870 284152 217235 -64880 -125596 5113 198455 342623 454418 522627 378678
46462 378678 395371 26448 290580 570508 56888 -64092 -156020 -173311 117004 399336
46452 399336 430102 190516 44816 -213580 -473560 15427 900053 622248 -39312 -145116
46442 -145116 -85499 -287383 -97294 26224 -207326 -88495 70455 309243 181923 -279607
46432 -279607 -249049 -75556 -253922 -186711 -16993 153965 131653 177925 233916 155621 -266817
46421 -266817 -340261 76851 -90717 -146118 -132802 -130798 -32046 -223436 -84275 84800 76341
46410 76341 78062 -361909 -44309 335414 221365 100152 -109217 -125287 -236833 -287473
46400 -287473 -176019 -141026 3793 -77675 -101492 -9192 18803 10146 318837 212453 -10811
$$ packed form
46472B13870P0282o6917k82115o0716J30709J93342J44168J11795O8209j43949
46462C78678J6693l68923K64132K79928n13620j20980r1928j7291K90315K82332
46452C99336L0766k39586j45700k58396k59980M88987Q84626k77805o61560j05804
46442a45116N9617k01884J90089J23518k33550J18831J58950K38788j27320m61530
46432b79607L0558J73493j78366O7211J69718J70958k2312M6272N5991p8295m22438
46421b66817p3444M17112j67568n5401J3316K004R8752j91390J39161J69075q459
46410G6341J721m39971L17600L79723j14049j21213k09369j6070j11546n0640
46400b87473J11454L4993J44819q1468k3817R2300K7995q657L08691j06384k23264
$$ plain form
46389 -10811 -248520 -261139 -26559 101263 -63095 -426672 -340011 187564 84930 11596
46379 11596 -486830 -559223 -474561 -70928 387341 257876 517294 532656 461509 283710
46369 283710 348570 666957 710608 530667 574469 387048 282180 74179 -106387 -108655
46359 -108655 -589387 -473153 -133649 -2633 -320705 -220055 84925 34554 -52152 216144
46349 216144 303859 442347 373647 -285590 -326160 -269167 -142978 -18479 -42389 260439
46339 260439 -148456 -361516 61182 500458 286257 55728 440635 639277 376272 361791
46329 361791 364244 79204 -145016 42039 76488 -266843 -313947 -377410 -50887 114515
46319 114515 345873 101727 -263928 -394561 -577590 -343470 -185415 -86203 172394 493072
$$ packed form
46389a0811k37709j2619K34580J27822j64358l63577Q6661N27575j02634p3334
46379A1596m98426p2393Q4662M03633M58269j29465K59418J5362p1147j77799
46369B83710O4860L18387M3651j79941M3802j87421j04868k08001j80566k268
46359a08655m80732J16234L39504J31016l18072J00650L04980n0371q6706K68296
46349B16144Q7715J38488o8700o59237m0570N6993J26189J24499k3910L02828
46339B60439m08895k13060M22698M39276k14201k30529L84907J98642k63005j4481
46329C61791K453k85040k24220J87055L4449l43331m7104o3463L26523J65402
46319A14515K31358k44146l65655j30633j83029K34120J58055R9212K58597L20678
$$ plain form
46309 493072 708015 918451 829233 370297 258105 -133066 -282693 -37652 332106 387996
46299 387996 506749 418068 92729 -104386 202198 -100616 -498513 -143660 -290165 -392066
46289 -392066 -37176 -166228 -288535 287938 410245 -75712 -607523 -528533 -373273 -114205
46279 -114205 -20128 173458 77806 -218671 -419187 -237360 108300 60843 198025 406029
46269 406029 548588 325282 221254 120627 523351 351871 267835 455323 566531 343588
46259 343588 475394 411254 -232220 -191877 126051 6591 -288349 -443115 -182605 -146316
46249 -146316 -118656 174975 492860 395912 344461 729668 831515 293338 120639 579547
46239 579547 292440 39825 -9446 116624 221516 -20194 -460234 -278913 44881 202905
$$ packed form
46309D93072K14943K10436q9218m58936j12192l91171j49627K45041L69758N5890
46299C87996J18753q8681l25339j97115L06584l02814l97897L54853j46505j01901
46289c92066L54890j29052j22307N76473J22307m85957n31811P8990J55260K59068
46279a14205R4077J93586r5652k96477k00516J81827L45660m7457J37182K08004
46269D06029J42559k23306j04028j00627M02724j71480q4036J87488J11208k22943
46259C43588J31806o4140o43474M0343L17928j19460k94940j54766K60510L6289
46249a46316K7660K93631L17885r6948n1451L85207J01847n38177j72699M58908
46239E79547k87107k52615m9271J26070J04892k41710m40040J81321L23794J58024
$$ plain form
46229 202905 -28339 -39831 -255708 -51182 -78041 -203584 -53515 381795 85318 66801
46219 66801 619224 494672 153922 151285 501210 299575 231241 169687 5395 -159730
46209 -159730 -276462 69917 38628 241155 252395 80997 -23942 298500 535264 280200
46199 280200 120137 10022 63607 441373 497743 435691 -51685 -44164 -102747 -332946 -24569
46188 -24569 149543 213261 206201 230322 240594 323033 37954 -86163 15533 253685 592466
46177 592466 8585 -359937 -35277 -133714 -98847 -174503 -141808 54864 380679 651893
46167 651893 313060 372735 419571 304171 295367 274200 208790 397119 498982 -152077 -197515
46156 -197515 49384 390745 714593 646337 529064 316379 143555 -195419 -169483 -432757
$$ packed form
46229B02905k31244j1492k15877K04526k6859j25543J50069M35310k96477j8517
46219F6801N52423j24552l40750k637L49925k01635o8334o1554j64292j65125
46209a59730j16732L46379l1289K02527J1240j71398j04939L22442K36764k55064
46199B80200j60063j10115N3585L77766N6370o2052m87376P521n8583k30199L08377
46188b4569J74112O3718p060K4121J0272Q2439k85079j24117J01696K38152L38781
46177E92466n83881l68522L24660r8437L4867p5656L2695J96672L25815K71214
46167F51893l38833N9675M6836j15400q804k1167o5410J88329J01863o51059m5438
46156a97515K46899L41361L23848o8256j17273k12685j72824l38974K5936k63274
$$ plain form
46146 -432757 -71121 287440 49061 60052 178616 -22029 663831 652207 167001 -446662
46136 -446662 -437541 -42978 197431 419610 -3271 102747 58003 -66375 -396490 -296077
46126 -296077 -96515 -39714 54846 114940 -33095 -4301 12872 259491 741384 491605
46116 491605 368936 401326 -82717 -45800 -162194 -173513 43041 -189186 52266 -249732
46106 -249732 -178966 -85221 -223801 -190736 -100972 -168912 -229900 140331 427838 446955 22250
46095 22250 298592 164831 40516 313530 49640 -76004 117031 -171463 55275 369128
46085 369128 348303 164468 -111909 -171741 -13664 -68335 -56884 266748 281039 -37247
46075 -37247 -506877 -469243 -204440 -280210 -413032 -271255 -448104 -774227 -520946 -296203
$$ packed form
46146d32757L61636L58561k38379J0991J18564k00645O85860j1624m85206o13663
46136d46662R121L94563K40409K22179m22881J06018m4744j24378l30115J00413
46126b96077J99562N6801R4560O0094j48035K8794J7173K46619M81893k49779
46116D91605j22669L2390m84043L6917j16394j1319K16554k32227K41452l01998
46106b49732P0766R3745j38580L3065Q9764o7940o0988L70231K87507J9117m24705
46095B2250K76342j33761j24315K73014k63890j25644J93035k88494K26738L13853
46085C69128k0825j83835k76377n9832J58077n4671J1451L23632J4291l18286
46075c7247m69630L7634K64803p5770j32822J41777j76849l26123K53281K24743
$$ plain form
46065 -296203 -454000 -179720 -319867 -37778 -282118 -366557 -223152 33887 -191972 -82878
46055 -82878 -111140 21726 -49612 106173 252432 276775 259482 -140814 -161394 -129154 185198
46044 185198 656305 744806 740537 221103 -113044 -52866 -36323 -14500 485162 402405 498637
46033 498637 63664 -289668 -510526 -695372 -660872 -427581 185026 113124 -8092 526203
46023 526203 620923 431405 251925 -80924 -173849 -475774 -194337 373533 613732 452143
46013 452143 230009 68186 -14125 -92769 -180456 78128 -233595 -120813 387632 398732
46003 398732 132769 345300 24192 -199781 49943 -173671 -259174 -193176 -377167 -479131
45993 -479131 -480721 -110017 -142332 -82315 -200016 -382900 -201441 299034 278798 405040
$$ packed form
46065b96203j57797K74280j40147K82089k44340q4439J43405K57039k25859J09094
46055h2878k8262J32866p1338J55785J46259K4343j7293m00296k0580L2240L14352
46044A85198M71107Q8501m269n19434l34147O0178J6543K1823M99662q2757R6232
46033D98637m34973l53332k20858j84846L4500K33291O12607p1902j21216N34295
46023E26203R4720j89518j79480l32849r2925l01925K81437N67870K40199j61589
46013D52143k22134j61823q2311p8644q7687K58584l11723J12782N08445J1100
46003C98732k65963K12531l21108k23973K49724k23614q5503O5998j83991j01964
45993d79131j590L70704l2315O0017j17701j82884J81459N00475k0236J26242
$$ plain form
45983 405040 303486 176927 300839 301979 213197 24270 192227 423212 106885 -155520
45973 -155520 284131 17701 -339205 -220570 -52780 -61499 -472959 -423914 -125848 -190288
45963 -190288 -43483 248174 -186839 -176994 -531915 -142952 234418 104325 40960 157311
45953 157311 118760 52933 -183746 -267098 -318439 -237690 104376 369019 392732 256677 692254
45942 692254 597390 673513 620923 218398 198302 -25611 -403073 -297439 -97961 -5810
45932 -5810 123916 -185989 -16933 540754 302242 18793 -95408 -190965 -376563 -10772
45922 -10772 -113657 23993 -139186 118138 352153 -29222 -20341 -44344 24594 61083 579878
45911 579878 158731 -308857 -123673 -70903 223204 98013 209405 269108 175474 -110031
$$ packed form
45983D05040j01554j26559J23912J140q8782j88927J67957K30985l16327k62405
45973a55520M39651k66430l56906J18635J67790q719m11460M9045K98066o4440
45963a90288J46805K91657m35013R845l54921L88963L77370j30093o3365J16351
45953A57311l8551o5827k36679q3352n1341Q0749L42066K64643K3713j36055M35577
45942F92254r4864P6123n2590m02525k0096k23913l77462J05634J99478R2151
45932e810J29726l09905J69056N57687k38512k83449j14201r5557j85598L65791
45922a0772j02885J37650j63179K57324K34015l81375Q881k4003O8938L6489N18795
45911E79878m21147m67588J85184N2770K94107j25191J11392N9703r3634k85505
$$ plain form
45901 -110031 -511567 -293618 -10914 -102811 -145113 -135996 -333224 -104501 18 -180020
45891 -180020 -197361 -84815 388605 509308 579544 370764 390233 -203814 -356829 -423279
45881 -423279 -385161 12414 502179 383790 120845 -31844 -42062 -96085 -320952 -192734
45871 -192734 144369 361908 173727 -157769 406094 653065 -80679 -468890 69812 247326
45861 247326 181464 58650 817 -358701 -166973 -291970 -375519 -285566 -346939 -163515
45851 -163515 -190465 -228661 191265 364612 -144752 -143512 71325 -84124 -289402 -130735
45841 -130735 236055 42965 -75596 -129669 70775 167485 240910 -35837 -183420 -71374
45831 -71374 -143455 110183 63387 81641 159148 505254 327196 430363 320944 -138967
$$ packed form
45901a10031m01536K17949K82704r1897m2302R117j97228K28723J04519j80038
45891a80020j7341J12546M73420J20703P0236k08780J9469n94047j53015o6450
45881d23279L8118L97575M89765j18389k62945j52689j0218n4023k24867J28218
45871a92734L37103K17539j88181l31496N63863K46971p33744l88211N38702J77514
45861B47326o5862j22814n7833l59518J91728j24997q3549Q9953o1373J83424
45851a63515k6950l8196M19926J73347n09364J240K14837j55449k05278J58667
45841a30735L66790j93090j18561n4073K00444R6710P3425k76747j47583J12046
45831g1374p2081K53638m6796J8254P7507L46106j78058J03167j09419m59911
$$ plain form
45821 -138967 -607290 -466001 233254 321196 86847 226212 551050 547917 419507 66330
45811 66330 228473 292201 -157280 -442745 -200689 -346125 -586785 -449904 -33729 -196196
45801 -196196 -307289 109787 -125739 -128474 32575 230609 339319 127485 199369 206681
45791 206681 502136 372283 160004 306393 59913 124129 501813 514822 900036 688712
45781 688712 537002 358123 384588 491892 433361 76425 -18577 30658 63091 3227 59327
45770 59327 231780 223771 128715 280714 294494 503769 374427 408289 553949 240033 41182
45759 41182 164650 202428 112050 81268 421501 355314 -201 -191695 -82538 255608
45749 255608 59587 -106290 -194917 -358596 -397439 -271567 -147671 -282338 -125506 -314929
$$ packed form
45821a38967m68323J41289O99255Q7942k34349J39365L24838l133j28410l53177
45811F6330J62143O3728m49481k85465K42056j45436k40660J36881M16175j62467
45801a96196j11093M17076k35526k735J61049J98034J08710k11834P1884P312
45791B06681K95455j29853k12279J46389k46480O4216L77684J3009L85214k11324
45781F88712j51710j78879K6465J07304n8531l56936r5002M9235L2433n9864N6100
45770E9327J72453q009r5056J51999J3780K09275j29342L3862J45660l13916j98851
45759D1182J23468L7778r0378l0782L40233o6187l55515j91494J09157L38146
45749B55608j96021j65877q8627j63679l8843J25872J23896j34667J56832j89423
$$ plain form
45739 -314929 -107541 -83380 118139 161650 -11001 -445551 -277728 383014 266438 -27600
45729 -27600 -159707 -73911 -38326 266004 127359 -206720 254949 422457 322990 143387
45719 143387 200789 147029 113842 67050 13008 69971 -287428 13788 127605 82701 152875
45708 152875 440887 262968 -72423 -612764 -394228 150509 180971 74511 84672 112657
45698 112657 191256 -24621 -110376 422611 643625 267088 -90637 249058 313418 206864
45688 206864 -105458 -63889 518816 444173 442158 146985 211880 174265 -329976 -468975 -367679
45677 -367679 -273255 279255 387172 239680 199517 473734 639250 245276 -178990 -212770
45667 -212770 -213678 88730 -455786 -599237 -116167 117830 -181832 -255192 -231403 -198350 15992
$$ packed form
45739c14929K07388K4161K01519M3511j72651m34550J67823O60742j16576k94038
45729b7600j32107Q5796L5585L04330j38645l34079M61669J67508r9467j79603
45719A43387N7402n3760l3187m6792n4042N6963l57399L01216J13817m4904P0174
45708A52875K88012j77919l35391n40341K18536N44737L0462j06460J0161K7985
45698A12657P8599k15877q5755N32987K21014l76537l57725L39695O4360j06554
45688B06864l12322M1569N82705p4643k015k95173O4895l7615n04241j38999J01296
45677c67679R4424N52510J07917j47492m0163K74217J65516l93974m24266l3780
45667b12770r08L02408n44516j43451M83070K33997k99662p3360K3789L3053K14342
$$ plain form
45656 15992 431555 122078 83862 309411 85060 -174701 -199980 -118227 149259 131493
45646 131493 323220 238493 99681 286629 334857 -183830 284839 571523 868337 698979
45636 698979 -181317 -209541 60562 211166 84987 -105279 -175818 -205613 -198091 82652
45626 82652 238064 77891 110586 -264796 -320350 -224999 120639 302790 194338 207324
45616 207324 263808 14099 -25014 159366 -168627 -76415 98407 101420 239999 364289
45606 364289 74537 57377 366199 -22200 -520572 -531045 -174646 -24731 155754 384304
45596 384304 241458 206175 -208532 -267371 100028 185056 67522 248776 246129 -104819
45586 -104819 -38492 163388 199867 336382 377611 337637 93054 -303127 -388095 -410086 -57730
$$ packed form
45656A5992M15563l09477l8216K25549k24351k59761k5279Q1753K67486j7766
45646A31493J91727q4727j38812J86948M8228n18687M68669K86684K96814j69358
45636F98979q80296k8224K70103J50604j26179j90266p0539k9795P522K80743
45626H2652J55412j60173L2695l75382n5554R5351L45638J82151j08452J2986
45616B07324N6484k49709l9113J84380l27993R2212J74822L013J38579J24290
45606C64289k89752j7160L08822l88399m98372j0473L56399J49915J80485K28550
45596C84304j42846l5283m14707n8839L67399Q5028j17534J81254k647l50948
45586a04819O6327K01880L6479J36515M1229l9974k44583l96181q4968k1991L52356
$$ plain form
45575 -57730 93238 -4299 306643 165053 66359 44002 -141488 -148902 375437 286751 117611
45564 117611 536326 672357 526884 481845 369140 209985 288787 411641 279092 381989
45554 381989 538623 463924 248910 272634 240778 47391 382943 608578 504376 207369
45544 207369 -471354 4626 272755 152664 -318959 -3832 272874 72065 -278253 -115667
45534 -115667 139497 413703 435403 271931 156758 -60621 42539 -25394 -113743 -16233
45524 -16233 -75213 -279409 -756156 -716921 -269551 -39558 72699 281306 -180821 -166723
45514 -166723 162438 -39126 -348880 -102353 269872 3644 -27637 88282 177964 102560
45504 102560 49990 30442 173732 117526 -387927 -318134 327560 221648 -158908 -261158
$$ packed form
45575e7730J50968r7537L10942j41590r8694k2357j85490p414N24339q8686j69140
45564A17611M18715J36031j45473m5039j12705j59155P8802J22854j32549J02897
45554C81989J56634p4699k15014K3724l1856j93387L35552K25635j04202k97007
45544B07369o78723M75980K68129j20091m71623L15127K76706k00809l50318J62586
45534a15667K55164K74206K1700j63472j15173k17379J03160o7933q8349R7510
45524a6233n8980k04196m76747L9235M47370K29993J12257K08607m62127J4098
45514a66723L29161k01564l09754K46527L72225k66228l1281J15919Q9682p5404
45504A02560n2570j9548J43290n6206n05453O9793O45694j05912l80556j02250
$$ plain form
45494 -261158 -219807 -198896 465332 684980 780698 732802 316877 270505 203053 -86038 -255867
45483 -255867 -421974 -164773 49706 -185390 113171 216763 206645 97510 261336 -121847
45473 -121847 -158477 172849 424643 320545 157314 -119032 -23591 -36011 241715 226098
45463 226098 388729 326299 625213 448199 167627 128965 73554 121349 243472 276212
45453 276212 62595 -16603 240941 -102066 22408 386484 560461 280162 416427 662910
45443 662910 691770 651437 290634 41955 -91959 -177206 80040 435699 404533 137752
45433 137752 -173932 -195264 93237 -78923 208733 566320 402986 398642 610668 791985
45423 791985 981260 624853 465969 101665 621793 527828 661852 536537 531332 168339
$$ packed form
45494b61158M1351K0911O64228K19648R5718m7896m15925m6372o7452k89091j69829
45483b55867j66107K57201K14479k35096K98561J03592j0118j09135J63826l83183
45473a21847l6630L31326K51794j04098j63231k76346R5441j2420K77726j5617
45463B26098J62631o2430K98914j77014k80572l8662n5411M7795J22123L2740
45453B76212k13617p9198K57544l43007J24474L64076J73977k80299J36265K46483
45443F62910K8860m0333l60803k48679j33914q5247K57246L55659l1166k66781
45433A37752l11684k1332K88501j72160K87656L57587j63334m344K12026J81317
45423G91985J89275l56407j58884l64304N20128r3965J34024j25315n205l62993
$$ plain form
45413 168339 47346 74353 113649 140610 133704 220163 459607 108438 -259808 -61196 110832
45402 110832 2511 142625 252973 -32003 -279286 -170423 196387 15777 146807 222775
45392 222775 436267 557810 241856 420246 429021 556741 401553 148244 -186797 -312024
45382 -312024 -263821 -121257 -315786 -291264 -631189 -488409 -53289 329805 483141 606175
45372 606175 908492 426091 449204 606613 472455 416729 217731 153496 124890 -388798
45362 -388798 -427430 77075 166009 -490040 -266522 392594 429196 432404 304646 325710 20485
45351 20485 -4449 121953 -349656 -215246 -177791 -21735 213389 323883 284678 155925
45341 155925 139159 274172 272272 230742 204474 -48241 -326545 225719 202042 120232 252846
$$ packed form
45413A68339j20993K7007L9296K6961o906Q6459K39444l51169l68246J98612J72028
45402A10832j08321J40114J10348k84976k47283J08863L66810j80610J31030P5968
45392B22775K13492J21543l15954J78390Q775J27720j55188k53309l35041j25227
45382c12024M8203J42564j94529K4522l39925J42780M35120L83094J53336J23034
45372F06175L02317m82401K3113J57409j34158n5726j98998o4235k8606n13688
45362c88798l8632N04505Q8934o56049K23518O59116L6602L208j27758K1064l05225
45351B0485k4934J26402m71609J34410L7455J56056K35124J10494l9205j28753
45341A55925j6766J35013j900m1530k6268k52715k78304N52264k3677q1810J32614
$$ plain form
45330 252846 346227 603959 442730 535862 145381 229050 163938 335079 56566 148845
45320 148845 237087 742456 906996 273131 297720 275062 596253 768900 728426 705457
45310 705457 602888 115801 -63230 -91422 -139432 149435 31012 125965 47525 236696
45300 236696 486781 243022 -69020 281637 368337 69611 -323130 -129987 218882 225593
45290 225593 573059 850631 640683 804909 762677 320403 259817 354150 709611 460245
45280 460245 -142661 -182309 -26386 352369 203475 -30744 -35422 -33323 91291 303684
45270 303684 175306 -146891 138612 94245 -210178 -39873 -45075 -260974 429094 316266
45260 316266 -166953 225669 151905 431653 831310 495113 208876 -191571 -201139 207415
$$ packed form
45330B52846R3381K57732j61229R3132l90481Q3669o5112J71141k78513R2279
45320A48845Q8242N05369J64540o33865K4589k2658L21191J72647m0474k2969
45310G05457j02569m87087j79031k8192m8010K88867j18423R4953p8440J89171
45300B36696K50085k43759l12042L50657Q6700k98726l92741J93143L48869O711
45290B25593L47466K77572k09948J64226m2232m42274o0586R4333L55461k49366
45280D60245o02906l9648J55923L78755j48894k34219m678K099J24614K12393
45270C03684j28378l22197K85503m4367l04423J70305n202k15899O90068j12828
45260C16266m83219L92622p3764K79748L99657l36197k86237m00447r568M08554
$$ plain form
45250 207415 535534 643237 331294 -429318 -177275 447323 850704 738958 529919 519510
45240 519510 506031 764323 590053 453969 415152 199346 299521 353676 448193 232818
45230 232818 600402 815614 423967 35211 2000 -199340 36200 12756 68840 237241
45220 237241 440613 456793 146507 421627 503902 461894 100480 -111910 440518 246181
45210 246181 477250 467081 237510 -37540 129561 -42253 43817 89115 -232252 -106566
45200 -106566 126977 147676 153546 -43271 245605 107921 -26528 -324 254347 267067
45190 267067 354757 474810 266994 193404 64434 -13082 134956 286723 492453 609706
45180 609706 814824 605324 410161 47267 599457 754004 300328 314643 153431 135691
$$ packed form
45250B07415L28119J07703l11943p60612K52043O24598M03381j11746k09039j0409
45240E19510j3479K58292j74270j36084l8817k15806J00175N4155R4517k15375
45230B32818L67584K15212l91647l88756l3211k01340K35540k3444N6084J68401
45220B37241K03372J6180l10286K75120Q2275m2008l61414k12390N52428j94337
45210B46181K31069j0169k29571k75050J67101j71814Q6070M5298l21367J25686
45200a06566K33543K0699N870j96817K88876j37684j34449K6204K54671J2720
45190B67067Q7690J20053k07816p3590j28970p7516J48038J51767K05730J17253
45180F09706K05118k09500j95163l62894N52190J54547m53676J4315j61212j7740
$$ plain form
45170 135691 433150 608911 279944 44060 -260834 44589 123907 -17373 294315 -133828
45160 -133828 -173456 -431525 29835 454703 180581 -114822 285666 298055 399313 252562
45150 252562 190749 260155 120091 53605 285427 420374 509766 502753 435169 458768 258277
45139 258277 315954 424462 247412 149017 56055 515359 396343 544297 438064 420877
45129 420877 118231 438002 678950 673868 606439 284888 165618 129114 239437 -14456
45119 -14456 54651 349334 315822 238971 361653 592823 592916 385671 752876 796973 286995
45108 286995 174575 265480 347265 722781 706670 592369 560697 441933 375678 461134 495311
45097 495311 282797 -31467 -121900 -121899 -111729 148959 152769 -75425 346363 736644 762331
$$ packed form
45170A35691K97459J75761l28967k35884l04894L05423P9318j41280L11688m28143
45160a33828l9628k58069M61360M24868k74122k95403M00488J2389J01258j46751
45150B52562o1813O9406j40064o6486K31822J34947Q9392p013o7584K3599k00491
45139B58277N7677J08508j77050r8395r2962M59304j19016J47954j06233j7187
45129D20877l02646L19771K40948n082o7429l21551j19270l6504J10323k53893
45119a4456O9107K94683l3512p6851J22682K31170R3k07245L67205M4097n09978
45108B86995j12420R0905Q1785L75516j6111j14301l1672j18764o6255Q5456L4177
45097D95311k12514l14264r0433JJ0170K60688L810k28194M21788L90281K5687
$$ plain form
45086 762331 590255 369093 760498 892614 234032 298940 312357 199019 -53505 323845
45076 323845 541137 746670 472324 -68683 -381256 104035 251201 -90195 458448 450248
45066 450248 253201 202556 243492 225105 46336 428427 642871 331412 302709 651751
45056 651751 211701 319854 313390 421343 956965 618672 427591 460799 312412 378625
45046 378625 474463 252994 591719 510428 185490 479199 638213 762817 736650 698747
45036 698747 575726 360109 344325 391248 65181 -137040 28771 75978 -112080 73615
45026 73615 285670 687405 598079 204337 315170 299617 301118 546450 697831 447526
45016 447526 341908 526860 820323 286593 574602 952594 1037226 786166 518657 546065
$$ packed form
45086G62331j72076k21162L91405J32116o58582O4908J3417j13338k52524L77350
45076C23845K17292K05533k74346n41007l12573M85291J47166l41396N48643q200
45066D50248j97047n0645M0936j8387j78769L82091K14444l11459k8703L49042
45056F51751m40050J08153o464J07953N35622l38293j91081L3208j48387O6213
45046C78625R5838k21469L38725q1291l24938K93709J59014J24604k6167l7903
45036F98747j23021k15617j5784M6923l26067k02221J65811M7207j88058J85695
45026G3615K12055M01735q9326l93742J10833j5553J501K45332J51381k50305
45016D47526j05618J84952K93463n33730K88009L77992Q4632k51060k67509K7408
$$ plain form
45006 546065 520513 219418 -128546 -229103 475356 668750 395530 476376 613490 250076
44996 250076 396807 255658 224423 292763 62383 302271 355738 117928 143549 211891
44986 211891 502961 593481 508299 700068 529794 548367 620277 561936 613176 434821 172069
44975 172069 535301 735902 384567 428919 298777 356875 210710 245488 505631 341808
44965 341808 810862 763077 344009 486552 601741 1080760 1025588 786164 355796 392975
44955 392975 191367 389027 725142 1039102 922283 563583 664632 543656 438149 648351
44945 648351 331466 157089 396254 813278 859818 433595 525528 714879 935251 968179
44935 968179 679821 450213 982324 999008 706458 637034 823376 797584 625874 481553
$$ packed form
45006E46065k5552l01095l47964j00557P04459J93394k73220Q0846J37114l63414
44996B50076J46731j41149l1235O8340k30380K39888N3467k37810K5621O8342
44986B11891K91070R0520q5182J91769j70274J8573P1910n8341N1240j78355k62752
44975A72069L63232K00601l51335M4352j30142N8098j46165L4778K60143j63823
44965C41808M69054m7785m19068J42543J15189M79019n5172k39424m30368L7179
44955C92975k01608J97660L36115L13960j16819l58700J01049j20976j05507K10202
44945F48351l16885j74377K39165M17024M6540m26223R1933J89351K20372L2928
44935I68179k88358k29608N32111J6684k92550o9424J86342k5792j71710j44321
$$ plain form
44925 481553 515755 219398 318452 472752 597197 903297 984947 579073 323814 322116
44915 322116 819215 897830 774391 782258 558556 760933 480106 448175 1051073 1400974
44905 1400974 1568645 1097900 701086 787569 568214 270013 323213 629205 1006749 1098841
44895 1098841 1000532 883724 421158 625558 662118 499756 405302 721310 587597 476533
44885 476533 1036770 990194 704290 649299 921614 1002094 931170 624721 738969 759367
44875 759367 673191 717482 554673 727043 718921 624486 597458 797933 844630 666038 639463
44864 639463 1171729 1363613 1630429 1478634 1213843 1016840 794354 833727 1127719 1352892
44854 1352892 1502820 1225627 749810 956938 1365873 1475514 1485436 1292453 1000557 1132819
$$ packed form
44925D81553L4202k96357R9054J54300J24445L06100Q1650m05874k55259j698
44915C22116M97099P8615j23439P867k23702K02377k80827l1931O02898L49901
44905A400974J67671m70745l96814Q6483k19355k98201N3200L05992L77544R2092
44895A098841r8309j16808m62566K04400L6560j62362r4454L16008j33713j11064
44885D76533N60237m6576k85904n4991K72315Q0480p0924l06449J14248K0398
44875G59367q6176M4291j62809J72370q122r4435k7028K00475M6697j78592k6575
44864F39463N32266J91884K66816j51795k64791j97003k22486L9373K93992K25173
44854A352892J49928k77193m75817K07128M08935J09641R922j92983k91896J32262
$$ plain form
44844 1132819 1122522 1108237 1297399 1304077 1022344 1297497 1283364 1458959 1745767 1620975
44834 1620975 1336640 692153 822831 1302465 974061 788143 768727 1009132 744859 374161
44824 374161 822636 683037 868710 1006606 1020562 1197356 1441725 1218463 792488 670860
44814 670860 717215 561494 541390 704115 760823 804734 1194759 1486755 1499461 1205088
44804 1205088 1261319 1552326 1038926 1095568 1152120 830052 492296 312762 853494 1538601
44794 1538601 1549720 1291201 1372870 1372408 1514970 1860082 1620535 1047434 880755 784831
44784 784831 995236 1257093 1115373 1542359 1471257 1220998 1255847 1325536 1642288 1318614
44774 1318614 1251398 1650041 1576631 1314521 1096227 1198585 1368387 1380840 1323042 1644502
$$ packed form
44844A132819j0297j4285J89162O678k81733K75153j4133J75595K86808j24792
44834A620975k84335o44487J30678M79634l28404j85918j9416K40405k64273l70698
44824C74161M48475j39599J85673J37896J3956J76794K44369k23262m25975j21628
44814F70860M6355j55721k0104J62725N6708M3911L90025K91996J2706k94373
44804A205088N6231K91007n13400N6642N6552l22068l37756j79534N40732O85107
44794A538601J1119k58519Q1669m62J42562L45112k39547n73101j66679r5924
44784G84831K10405K61857j41720M26986p1102k50259L4849O9689L16752l23674
44774A318614o7216L98643p3410k62110k18294J02358J69802J2453n7798L21460
$$ plain form
44764 1644502 1698482 1248616 1409319 1619449 1322523 1198375 1656705 1330195 1209118 1567709
44754 1567709 1429270 1532402 1664010 2086227 1879451 1700062 1987315 1866299 1594653
44745 1594653 2205871 2191699 1492414 1166614 1341775 1712307 2089285 1949608 1733234 1665408
44735 1665408 1864955 1849881 1732964 1957200 2257228 2466858 2284122 2412726 2466186 2289209
44725 2289209 2028492 1698005 1726078 1779197 1529757 1348417 1489052 1601242 1918474 1964677
44715 1964677 1902619 1975278 1834359 2111278 2441329 2492056 2287906 2085806 2131472 2370220
44705 2370220 2194324 2559933 2804973 2807173 2506677 2158290 2112935 2281348 2382354 2732054
44695 2732054 3082329 2881090 2539719 2782300 2921588 2639367 2781574 2893583 2927138 2842269
$$ packed form
44764A644502N3980m49866J60703K10130k96926j24148M58330l26510j21077L58591
44754A567709j38439J03132J31608M22217k06776j79389K87253j21016k71646
44745A594653O11218j4172o99285l25800J75161L70532L76978j39677k16374o7826
44735A665408J99547j5074j16917K24236L00028K09630j82736J28604N3460j76977
44725B289209k60717l30487K8073N3119k49440j81340J40635J12190L17232M6203
44715A964677o2058P2659j40919K76919L30051N0727k04150k02100M5666K38748
44705B370220j75896L65609K45040K200l00496l48387m5355J68413J01006L49700
44695B732054L50275k01239l41371K42581J39288k82221J42207J12009L3555q4869
$$ plain form
44685 2842269 2870274 2879654 2826740 2537417 2626538 2706396 2681452 2680958 3015300 2781218 2818658
44674 2818658 2562742 2882395 3232046 3287779 3428031 3687401 3720577 3300399 3171579 3502532
44664 3502532 3586263 3364879 3569819 3970325 3884152 3631810 3757543 4082431 4229369 4532435
44654 4532435 4640944 4549335 4358955 4221875 4604759 4588450 4995468 5355293 5400175 5275174
44644 5275174 5516082 5668787 5615437 6142756 6177443 6099572 6404084 6623129 6977555 7253687
44634 7253687 7129363 6993212 6893113 6895690 7052401 6812052 6818189 6426941 6361313 6670516
44624 6670516 6647727 6775088 6302214 6583252 6572917 6578259 6606661 6181585 6334563 6867621
44614 6867621 6640615 6345535 6737048 7082527 7189721 7185399 7089856 7212730 7341887 7487512
$$ packed form
44685B842269K8005R380n2914k89323Q9121P9858k4944m94L34342k34082L7440
44674B818658k55916L19653L49651N5733J40252K59370L3176m20178j28820L30953
44664C502532Q3731k21384K04940M00506q6173k52342J25733L24888J46938L03066
44654D532435J08509r1609j90380j37080L82884j6309M07018L59825M4882j25001
44644E275174K40908J52705n3350N27319L4687p7871L04512K19045L54426K76132
44634G253687j24324j36151j00099K577J56711k40349O137l91248o5628L09203
44624F670516k2789J27361m72874K81038j0335N342K8402m25076J52978N33058
44614F867621k27006k95080L91513L45479J07194m322r5543J22874J29157J45625
$$ plain form
44604 7487512 7758022 7598799 7827614 7617041 7308399 7933423 8500671 8712943 8902614
44595 8902614 9091647 9225475 8984285 8932738 9105610 9659416 10149644 10743394 10632143 10813422
44585 10813422 11230823 11460259 11991192 13069594 13370432 13627041 13883423 14186351 13977093
44576 13977093 13707857 13536974 13936141 14379672 14596811 14662140 14541726 14514053 14743602 15157439
44566 15157439 15041034 15006991 14813424 14951609 15485930 15829428 16411811 16848843 17056629
44557 17056629 17488799 17592189 18316609 18654137 18605919 18756055 19335734 19935866 20155902
44548 20155902 20585431 21049358 21498300 22218857 22650084 23369704 24351474 25482973 26283891
44539 26283891 27022825 27593974 28169962 28948927 29977894 30138642 30716204 31367776 32430408
$$ packed form
44604G487512K70510j59223K28815k10573l08642O25024N67248K12272J89671
44595H902614J89033J33828k41190n1547J72872N53806M90228N93750j11251J81279
44585A0813422M17401K29436N30933J078402L00838K56609K56382L02928k09258
44576A3977093k69236j70883L99167M43531K17139O5329j20414k7673K29549M13837
44566A5157439j16405l4043j93567J38185N34321L43498N82383M37032K07786
44557A7056629M32170J03390P24420L37528m8218J50136N79679O00132K20036
44548B0155902M29529M63927M48942P20557M31227P19620R81770J131499Q00918
44539B6283891P38934N71149N75988P78965J028967J60748N77562O51572J062632
$$ plain form
44530 32430408 33670528 34811529 36183637 37365210 39166983 40618692 42177856 43433988
44522 43433988 44668084 46102660 48283978 50874476 53334411 55634488 58413562 62378355
44514 62378355 65970741 69937848 74384909 79106586 84849093 90850590 97164609 104413665
44506 104413665 112915602 121653633 131542461 141801968 153726225 166824185 181659273
44499 181659273 198124554 216538825 237277531 260432025 285648517 312877582 341447256
44492 341447256 370696519 399097079 425367314 447294816 463023907 471231119 471063885
44485 471063885 462750589 445972470 422358420 394551679 363989215 332261282 301293254
44478 301293254 272562252 245699907 221785254 200574656 181449656 164675148 150028712
$$ packed form
44530C2430408J240120J141001J372108J181573J801773J451709J559164J256132
44522D3433988J234096J434576K181318K590498K459935K300077K779074L964793
44514F2378355L592386L967107M447061M721677N742507O001497O314019P249056
44506A04413665Q501937Q738031R888828J0259507J1924257J3097960J4835088
44499A81659273J6465281J8414271K0738706K3154494K5216492K7229065K8569674
44492C41447256K9249263K8400560K6270235K1927502J5729091Q207212j67234
44485D71063885q313296j6778119k3614050k7806741l0562464l1727933l0968028
44478C01293254k8731002k6862345k3914653k1210598j9125000j6774508j4646436
$$ plain form
44471 150028712 137309179 125993483 115924120 106706718 98670392 91965126 85668384
44464 85668384 79944902 75252828 71397898 67790713 64426347 60683588 57375737 54465896
44456 54465896 52216762 50162479 47967480 45998413 44406746 42713757 40941209 39304372
44448 39304372 37489460 35981323 34162367 32864722 31433253 29976905 28674082 27241102
44440 27241102 26510024 26001930 25006303 24198247 23285158 22538445 21782704 20914958 20300907
44431 20300907 19783815 19363302 18812930 17843470 17396701 16992609 16315473 16241588 15914665
44422 15914665 15786926 15343207 14995833 14299315 13639605 13556719 13096266 12704280 12180546
44413 12180546 11974624 11431699 11036687 10798598 10503271 10515624 10296512 10322280 9987481 9993419
$$ packed form
44471A50028712j2719533j1315696j0069363r217402q036326o705266o296742
44464H5668384n723482m692074l854930l607185l364366l742759l307851k909841
44456E4465896k249134k054283k194999j969067j591667j692989j772548j636837
44448C9304372j814912j508137j818956j297645j431469j456348j302823j432980
44440B7241102p31078n08094r95627q08056r13089p46713p55741q67746o14051
44431B0300907n17092m20513n50372r69460m46769m04092o77136p3885l26923
44422A5914665j27739m43719l47374o96518o59710q2886m60453l91986n23734
44413A2180546k05922n42925l95012k38089k95327J2353k19112K5768l34799N938
$$ plain form
44403 9993419 9914420 10141388 9727568 9354813 9121815 8898020 8446340 8453300 8841531 8408117
44393 8408117 8282666 8243621 7876059 7470127 7120817 6970809 6930141 6949397 7247923 7190986
44383 7190986 7067175 6875834 6574743 6794824 6802780 6449976 6244504 6145460 6219537 6227972
44373 6227972 6301688 6285700 5781713 5827696 5700850 5435724 5351521 5171633 5160515 5394429
44363 5394429 5199502 4980949 5061159 5043949 5133831 4926695 4679798 4732046 4731159 4868687 4722819
44352 4722819 4413956 4534856 4225222 4413034 4262577 4222350 3829186 3968314 4600625 4603126
44342 4603126 4389587 4185471 3789349 3851418 4003598 4001625 4078185 4184710 3697119 3649163
44332 3649163 3604310 3386294 3410956 3526264 3277266 3145065 3133832 3518595 3682462 3577307
$$ packed form
44403I993419p8999K26968m13820l72755k32998k23795m51680O960L88231m33414
44393H408117j25451l9045l67562m05932l49310j50008m0668J9256K98526n6937
44383G190986j23811j91341l01091K20081P956l52804k05472r9044P4077Q435
44373F227972P3716j5988n03987M5983j26846k65126q4203j79888j1118K33914
44363E394429j94927k18553Q0210j7210Q9882k07136k46897N2248q87J37528j45868
44352D722819l08863J20900l09634J87812j50457m0227l93164J39128O32311K501
44342D603126k13539k04116l96122O2069J52180j973P6560J06525m87591m7956
44332C649163m4853k18016K4662J15308k48998j32201j1233L84763J63867j05155
$$ plain form
44322 3577307 3725724 3646852 3582608 3568524 3236310 2963301 2969538 2991929 2898492 2726646 2449563
44311 2449563 2779651 2610503 2319736 2517986 2783739 3226993 2894869 2769347 2761514 2839213
44301 2839213 2727412 2582815 2479151 2751996 2644664 2622386 2639388 2835091 2927665 2948831
44291 2948831 3335608 3242010 3829507 3993927 4049045 4283580 4193305 4250730 4395504 4446443
44281 4446443 4895192 4551087 4337394 4540048 4322789 3814635 3942536 3671911 3553433
44272 3553433 3596731 3573122 3481070 3615703 3310407 2954410 2992961 2557728 2255452 2600964
44262 2600964 2268920 2363648 2811899 2683473 2426290 2378716 2366458 2305777 2078163 2067528
44252 2067528 2044707 1860974 1878287 1513399 1170560 1644464 1629106 1590150 1492172 1356503
$$ packed form
44322C577307J48417p8872o4244j4084l32214k73009O237K2391r3437j71846k77083
44311B449563L30088j69148k90767J98250K65753M43254l32124j25522p833P7699
44301B839213j11801j44597j03664K72845j07332k2278J7002J95703R2574K1166
44291B948831L86777r3598N87497J64420N5118K34535r0275N7425J44774N0939
44281D446443M48749l44105k13693K02654k17259n08154J27901k70625j18478
44272C553433M3298k3609r2052J34633l05296l55997L8551m35233l02276L45512
44262B600964l32044R4728M48251j28426k57183m7574j2258o0681k27614j0635
44252B067528k2821j83733J7313l64888l42839M73904j5358l8956r7978j35669
$$ plain form
44242 1356503 1418274 1496680 1814443 1887686 1925287 1609403 1352036 1269580 1105116 1421662
44232 1421662 1290393 1586798 1775016 1280508 1122318 1199681 1372616 1323757 1349717 1242001
44222 1242001 1458583 1104637 713746 481258 631169 816862 892897 1155430 1138006 911679
44212 911679 1003415 1150813 928883 889778 1254892 1258485 1203688 1497645 1500591 1421541 1470522
44201 1470522 1477058 1301574 1324448 1094241 1088147 1072122 634710 825581 1423911 1279259
44191 1279259 1243951 1098721 821187 683716 410962 718077 769717 789323 805246 1194006
44181 1194006 784593 946435 1138558 1428645 1122049 880967 948655 953560 1109878 1135563
44171 1135563 1246121 1077022 995310 936090 852470 1085697 1382030 1130143 888241 823899
$$ packed form
44242A356503O1771P8406L17763P3243L7601l15884k57367q2456j64464L16546
44232A421662j31269K96405J88218m94508j58190P7363J72935m8859K5960j07716
44222A242001K16582l53946l90891k32488J49911J85693P6035K62533j7424k26327
44212I11679R1736J47398k21930l9105L65114L593n4797K93957K946p9050M8981
44201A470522O536j75484K2874k30207o094j6025m37412J90871N98330j44652
44191A279259l5308j45230k77534j37471k72754L07115N1640J9606J5923L88760
44181A194006m09413J61842J92123K90087l06596k41082O7688M905J56318K5685
44171A135563J10558j69099q1712n9220q3620K33227K96333k51887k41902o4342
$$ plain form
44161 823899 916707 976610 1048630 1015358 940001 1110299 1021656 985915 886583 491411 707519
44150 707519 997767 775711 896790 875580 816679 529516 529764 269373 570897 779492
44140 779492 622057 1025733 861743 788056 701174 895257 616799 772828 703639 439654
44130 439654 372154 643436 1060220 1120165 914185 936256 1011651 804454 299736 354223
44120 354223 817322 868830 905857 693753 489672 700844 800540 459811 261116 351667
44110 351667 500224 682113 746698 1010216 1500940 1281221 1148139 1143970 1056893 889015
44100 889015 600755 504562 665593 1075556 1135768 849417 739856 1082107 774370 702908
44090 702908 784881 753003 649794 190024 591728 810211 837144 1018126 208839 213115
$$ packed form
44161H23899R2808N9903P2020l3272p5357J70298q8643l5741r9332l95172K16108
44150G07519K90248k22056J21079k1210n8901k87163K48k60391L01524K08595
44140G79492j57435M03676j63990p3687q6882J94083k78458J56029o9189k63985
44130D39654o7500K71282M16784N9945k05980K2071P5395k07197n04718N4487
44120C54223M63099N1508L7027k12104k04081K11172R9696l40729j98695R0551
44110C51667J48557J81889O4585K63518M90724k19719j33082m169q7077j67878
44100H89015k88260r6193J61031M09963O0212k86351j09561L42251l07737p1462
44090G02908Q1973l1878j03209m59770M01704K18483K6933J80982q09287M276
$$ plain form
44080 213115 347813 50084 349985 460150 460091 795434 684106 891073 727746 701785
44070 701785 554337 693591 896503 823900 253504 592022 445995 548390 878942 752892
44060 752892 744348 844436 858669 572670 362978 468413 799517 826780 603370 477842
44050 477842 453396 500399 780530 951805 1082711 992759 887909 780701 517288 609394
44040 609394 637195 892727 640676 255141 232033 157583 77829 146068 388006 350031 331939
44029 331939 566856 522985 654995 757007 663971 474146 614628 551702 488744 314476
44019 314476 -84303 -121887 174813 308073 -78972 260851 663666 468081 695378 685258
44009 685258 591178 412450 256909 128766 579938 906151 742748 600722 731094 605308
$$ packed form
44080B13115J34698k97729K99901J10165n9L35343j11328K06967j63327k5961
44070G01785j47448J39254K02912p2603n70396L38518j46027J02395L30552j26050
44060G52892q544J00088J4233k85999k09692J05435L31104K7263k23410j25528
44050D77842k4446M7003K80131J71275J30906q9952j04850j07208k63413R2106
44040F09394K7801K55532k52051l85535k3108p4450p9754O8239K41938l7975j8092
44029C31939K34917m3871J32010J02012r3036j89825J40482o2926o2958j74268
44019C14476l98779l7584K96700J33260l87045L39823M02815j95585K27297j0120
44009F85258r4080j78728j55541j28143M51172L26213j63403j42026J30372j25786
$$ plain form
43999 605308 909172 706138 450403 745422 861156 738187 629551 573906 610905 991244
43989 991244 894243 435862 153119 -56355 47432 230099 223390 135148 -66923 78726
43979 78726 438886 196790 123805 152777 368313 564238 937097 943266 855328 711317 267395
43968 267395 258787 745000 442703 434140 483976 654781 170974 -29078 64595 -168122 -170769
43957 -170769 -93826 -3483 100279 286383 318701 285263 572202 936333 633936 361480
43947 361480 681045 1008974 302590 312440 391952 387650 206459 544706 575855 361630 17451
43936 17451 352167 1026518 804947 676535 380212 246251 400810 461789 308807 445941
43926 445941 342465 749593 650462 453080 470644 655412 232157 370860 768857 581086
$$ packed form
43999F05308L03864k03034k55735K95019J15734j22969j08636n5645L6999L80339
43989I91244r7001m58381k82743k09474J03787J82667o709q8242k02071J45649
43979G8726L60160k42096p2985K8972K15536J95925L72859O169q7938j44011m43922
43968B67395q608M86213l02297q563M9836J70805m83807k00052R3673k32717k647
43957a70769P6943R0343J03762J86104L2318l3438K86939L64131l02397k72456
43947C61480L19565L27929p06384R850P9512m302j81191L38247L1149k14225l44179
43936A7451L34716O74351k21571j28412k96323j33961J54559O0979j52982J37134
43926D45941j03476M07128r9131j97382J7564J84768m23255J38703L97997j87771
$$ plain form
43916 581086 443638 46753 141182 371199 262064 350866 473510 271346 73270 353872
43906 353872 46761 214518 243801 380240 300032 -90014 151939 121579 326816 879250
43896 879250 1068032 567008 404489 128625 23146 436166 627546 246401 270145 168711
43886 168711 395423 625946 485882 11620 -111865 -2692 591064 758001 757051 660234
43876 660234 246566 -31403 -232109 -138184 267625 527480 1224529 941683 818816 810875
43866 810875 497122 300729 233998 193578 333814 635681 558148 442187 755118 819290
43856 819290 505353 407935 341698 567246 692786 508772 392753 324940 314706 375748
43846 375748 376444 119938 67284 134917 -202921 166119 594519 321761 137688 -27504
$$ packed form
43916E81086j37448l96885R4429K30017j09135Q8802J22644k02164j98076K80602
43906C53872l07111J67757K9283J36439q0208l90046K41953l0360K05237N52434
43896H79250J88782n01024j62519k75864j05479M13020J91380l81145K3744j01434
43886A68711K26712K30523j40064m74262j23485J09173N93756J66937r50r6817
43876F60234m13668k77969k00706R3925M05809K59855O97049k82846j22867p941
43866H10875l13753j96393o6731m0420J40236L01867p7533j15961L12931O4172
43856H19290l13937r7418o6237K25548J25540j84014j16019o7813j0234O1042
43846C75748O96k56506n2654O7633l37838L69040M28400k72758j84073j65192
$$ plain form
43836 -27504 240074 246648 328342 430988 426362 427093 465029 235186 114471 178326 228363 -42798
43824 -42798 169286 399236 255942 280515 152403 21371 242090 595444 535810 499822
43814 499822 309510 157879 423493 580662 488270 359065 447627 489296 393728 636657
43804 636657 678914 944018 694264 734475 685278 579733 680344 719824 636639 523505
43794 523505 450427 376249 268116 588008 558114 641683 496129 290968 242192 315585 585796
43783 585796 311568 29250 -112268 -54011 417807 63739 32055 120872 495830 565075
43773 565075 608774 658306 521896 703010 617725 744666 565585 272346 28852 325769
43763 325769 -102340 -250839 451781 317923 318771 311883 81326 -147525 -174319 144113 426470
$$ packed form
43836b7504K67578O574Q1694J02646m626P31L7936k29843j20715O3855N0037k71161
43824d2798K12084K29950j43294K4573j28112j31032K20719L53354n9634l5988
43814D99822j90312j51631K65614J57169r2392j29205Q8562M1669r5568K42929
43804F36657M2257K65104k49754M0211m9197j05545J00611L9480q3185j13134
43794E23505p3078p4178j08133L19892k9894Q3569j45554k05161m8776P3393K70211
43783E85796k74228k82318j41518N8257M71818l54068l1684Q8817L74958O9245
43773E65075M3699M9532j36410J81114q5285J26941j79081k93239k43494K96917
43763C25769m28109j48499P02620j33858Q48o888k30557k28851k6794L18432K82357
$$ plain form
43752 426470 334454 350585 477259 -120004 -91285 254103 -189815 -100854 -54256 -91557 -76220
43741 -76220 -212731 -221605 38323 427472 547908 301777 -28929 86217 -60505 -36333
43731 -36333 565244 382460 -71140 -40528 -84355 44431 330359 172275 427242 469764
43721 469764 604635 442026 -333281 -22871 417458 33335 -4133 228116 101415 114798
43711 114798 -386119 -98312 282412 426358 353696 394273 367660 417734 677492 1024050
43701 1024050 825730 876713 880118 598680 434618 126621 406368 290464 -58597 316320
43691 316320 559321 273623 47933 222036 352648 874834 1154940 635530 498096 320927
43681 320927 62820 157857 -73304 -36933 119685 -8146 341662 231461 9371 59400
$$ packed form
43752D26470r2016J6131J26674n97263K8719L45388m43918Q8961M6598l7301J5337
43741g6220j36511q874K59928L89149J20436k46131l30706J15146j46722K4172
43731c6333O01577j82784m53600L0612m3827J28786K85928j58084K54967M2522
43721D69764J34871j62609p75307L10410M40329l84123l7468K32249j26701J3383
43711A14798n00917K87807L80724J43946p2662M0577k6613N0074K59758L46558
43701A024050j98320N0983L405k81438j64062l07997K79747j15904l49061L74917
43691C16320K43001k85698k25690J74103J30612N22186K80106n19410j37434j77169
43681C20927k58107R5037k31161L6371J56618j27831L49808j10201k22090N0029
$$ plain form
43671 59400 485991 438844 260784 498125 515600 422930 170654 275191 531952 597708
43661 597708 334692 124942 47609 316892 612486 710488 477432 283318 464029 503391
43651 503391 536381 553791 362589 394938 192737 87094 232159 505219 40659 287275
43641 287275 576716 409764 -40547 -223135 -77155 53265 183546 -47519 -88865 -253453
43631 -253453 -162910 249934 462757 444243 464751 219971 225680 -7027 306005 -148101
43621 -148101 20302 325003 561156 431415 278200 237533 243416 270375 -403008 -542371
43611 -542371 -206565 62699 260445 31944 138160 451571 206723 -190105 -370246 126889
43601 126889 323905 323776 191547 75359 -64107 233649 145266 254350 315957 204127
$$ packed form
43671E9400M26591m7147j78060K37341J7475r2670k52276J04537K56761O5756
43661E97708k63016k09750p7333K69283K95594R8002k33056j94114J80711L9362
43651E03391L2990J7410j91202L2349k02201j05643J45065K73060m64560K46616
43641B87275K89441j66952m50311j82588J45980J30420J30281k31065m1346j64588
43631b53453R0543M12844K12823j8514K0508k44780N709k32707L13032m54106
43621a48101J68403L04701K36153j29741j53215m0667N883K6959o73383j39363
43611e42371L35806K69264J97746k28501J06216L13411k44848l96828j80141M97135
43601A26889J97016j29j32229j16188j39466K97756q8383J09084O1607j11830
$$ plain form
43591 204127 -85540 -336358 -313233 148701 367568 77719 -217874 -45765 -166968 89177
43581 89177 137731 -377638 -317209 -257799 -67867 -80333 87378 529238 321975 -139324
43571 -139324 -247612 -295066 390388 569825 230039 298804 -93658 122253 351802 104269
43561 104269 95552 195452 165373 -17793 16758 372212 23167 -438140 -533249 -223291 -144126
43550 -144126 -169574 31785 -274559 203930 514882 258187 230217 191438 -68811 293902
43540 293902 265864 90570 115467 361708 270157 293644 139738 451007 583291 571028
43530 571028 274687 494097 505840 531994 420588 207902 555570 122379 -7575 111121
43520 111121 216974 518435 603325 271957 32251 -258126 -733134 -695963 -395419 -36054
$$ packed form
43591B04127k89667k50818K3125M61934K18867k89849k95593J72109j21203K56145
43581H9177M8554n15369O0429N9410J89932j2466J67711M41860k07263m61299
43571a39324j08288m7454O85454J79437l39786O8765l92462K15911K29549k47533
43561A04269q717R9900l0079j83166L4551L55454l49045m61307r5109L09958P9165
43550a44126k5448K01359l06344M78489L10952k56695k7970l8779k60249L62713
43540B93902k8038j75294K4897K46241r1551K3487j53906L11269J32284j2263
43530E71028k96341K19410J1743K6154j11406k12686L47668m33191j29954J18696
43520A11121J05853L01461Q4890l31368k39706k90377m75008L7171L00544L59365
$$ plain form
43510 -36054 214689 59094 269926 6895 -1190 43260 165608 306136 313413 226975 -8598
43499 -8598 -156063 276582 259194 336819 173078 44697 354021 488731 594815 218533
43489 218533 369172 702067 551101 278343 185366 863887 522324 444102 213601 297628
43479 297628 32879 -104208 -17177 -215642 83995 268741 93851 -111912 285832 520118
43469 520118 201838 359686 468167 658205 522677 380525 147134 -14576 240531 378573
43459 378573 476828 766499 889864 467065 434140 309182 380838 271566 107399 361178
43449 361178 246977 238771 -35714 54407 257606 -408961 -530831 -436972 -26561 100250
43439 100250 -372743 -155500 115364 39269 -94509 -96991 461263 1158549 1009308 388956
$$ packed form
43510c6054K50743j55595K10832k63031q085M4450J22348J40528P277q6438k35573
43499h598j47465M32645j7388P7625j63741j28381L09324J34710J06084l76282
43489B18533J50639L32895j50966k72758r2977O78521l41563p8222k30501Q4027
43479B97628k64749j37087Q7031j98465K99637J84746j74890k05763L97744K34286
43469E20118l18280J57848J08481J90038j35528j42152k33391j61710K55107J38042
43459C78573R8255K89671J23365m22799l2925j24958P1656j09272j64167K53779
43449C61178j14201q206k74485R0121K03199o66567j21870R3859M10411J26811
43439A00250m72993K17243K70864p6095j33778k482N58254O97286j49241o20352
$$ plain form
43429 388956 208272 471552 215714 67950 307531 279893 200806 450472 474509 487060
43419 487060 360197 350952 444315 431602 130111 -71629 273877 400314 227828 593952
43409 593952 390890 -184093 -129128 4026 50095 137138 157310 471964 305497 -119601
43399 -119601 -142844 58854 155159 -183064 -180576 244016 72759 -112490 -152514 82796
43389 82796 468549 629078 335118 91447 366594 225966 -216057 -100992 165635 56498
43379 56498 19585 -26292 -167899 -182927 139921 163033 203422 65231 -49021 -71712 111247
43368 111247 458270 246782 230304 341139 227832 -266808 -39935 -45237 -114797 125224
43358 125224 341499 327778 285203 80154 -164530 -222034 17192 172382 533442 226365
$$ packed form
43429C88956j80684K63280k55838j47764K39581k7638p9087K49666K4037J2551
43419D87060j26863r245R3363j2713l01491k01740L45506J26437j72486L66124
43409E93952k03062n74983N4965J33154M6069Q7043K0172L14654j66467m25098
43399a19601k3243K01698R6305l38223K488M24592j71257j85249m0024K35310
43389H2796L85753J60529k93960k43671K75147j40628m42023J15065K66627j09137
43379E6498l6913m5877j41607j5028L22848K3112M0389j38191j14252k2691J82959
43368A11247L47023k11488j6478J10835j13307m94640K26873n302o9560K40021
43358A25224K16275j3721m2575k05049k44684n7504K39226J55190L61060l07077
$$ plain form
43348 226365 -41261 -75986 88788 210123 248693 -93112 -48004 41609 77242 427316
43338 427316 21735 -63741 105567 -402495 -527794 -215378 -578433 -414345 23167 344122
43328 344122 652665 265705 -193921 -451756 -263255 -123180 -216237 149633 362278 -63617
43318 -63617 -176089 -78542 -355511 68884 358363 833334 509769 161998 277418 211024
43308 211024 89099 250134 394698 339167 429713 229016 419352 229635 112898 411247
43298 411247 416770 356111 421356 323092 282633 58911 285954 697252 385723 -32857 314843
43287 314843 222760 107969 107940 708419 526625 255605 67951 -194454 -260067 55817 43601
43276 43601 -302732 -237145 491083 673382 353323 326876 181165 405790 445302 207089
$$ packed form
43348B26365k67626l4725J64774J21335L8570l41805M5108Q9613L5633L50074
43338D27316m05581q5476J69308n08062j25299L12416l63055J64088M37512L20955
43328C44122L08543l86960m59626k57835J88501J40075r3057L65870K12645m25895
43318f3617j12472R7547k76969M24395K89479M74971l23565l47771J15420o6394
43308B11024j21925J61035J44564n5531R0546k00697J90336j89717j16737K98349
43298D11247N523o0659O5245r8264m0459k23722K27043M11298l11529m18580L47700
43287C14843r2083j14791k9O00479j81794k71020j87654k62405o5613L15884j2216
43276D3601l46333O5587P28228J82299l20059k6447j45711K24625L9512k38213
$$ plain form
43266 207089 99921 231189 355434 261013 586197 597587 524568 667912 762534 779902
43256 779902 853409 563088 272993 51652 -152914 -148096 -26486 153930 150864 70311 -79430
43245 -79430 301731 299053 -10075 275264 580877 267067 14866 -67873 67976 217780
43235 217780 -112315 -163149 324766 337928 322093 -13832 -120649 108134 170340 203161
43225 203161 331419 447165 469905 389759 388492 679914 591382 776362 744514 306136 426134
43214 426134 408624 623387 343300 -176493 -184586 133857 341719 469141 669876 21001
43204 21001 -321748 395527 328166 192791 406236 440240 166436 -69944 -53760 51019
43194 51019 -64798 -117311 269727 -145234 -116860 450317 603467 380478 382957 515731
$$ packed form
43266B07089j07168J31268J24245r4421L25184J1390p3019J43344R4622J7368
43256G79902P3507k90321k90095k21341k04566M818J21610J80416l066q0553j49741
43245g9430L81161k678l09128K85339L05613l13810k52201q2739J35849J49804
43235B17780l30095n0834M87915J3162j5835l35925j06817K28783O2206L2821
43225B03161J28258J15746K2740q0146j267K91422q8532J84980l1848m38378J19998
43214D26134j7510K14763k80087n19793q093L18443K07862J27422K00735o48875
43204B1001l42749P17275o7361j35375K13445L4004k73804k36380J6184J04779
43194E1019j15817n2513L87038m14961K8374N67177J53150k22989K479J32774
$$ plain form
43184 515731 512540 569168 365511 336558 405479 449558 687840 696147 782618 766094 675270
43173 675270 283368 199259 87424 -112803 -250449 15011 209877 217689 101760 489803
43163 489803 364140 329151 222358 163775 169116 116521 423958 115550 2439 187566
43153 187566 104394 394418 348562 223482 356855 694379 606576 222510 -159479 -311117
43143 -311117 -44900 -225509 -94767 7795 -110926 81315 25313 142769 -209853 -245354
43133 -245354 52025 285737 398288 264474 168053 71159 -68377 -193530 68686 394469
43123 394469 155318 15077 243528 303416 319203 -54295 204098 438346 471541 431263
43113 431263 151453 40926 87029 183666 429218 243193 30670 63201 164234 188122
$$ packed form
43184E15731l191N6628k03657k8953O8921M4079K38282Q307Q6471j6524r0824
43173F75270l91902q4109j11835k00227j37646K65460J94866P812j15929L88043
43163D89803j25663l4989j06793n8583N341n2595L07437l08408j13111J85127
43153A87566q3172K90024m5856j25080J33373L37524q7803l84066l81989j51638
43143c11117K66217j80609J30742J02562j18721J92241n6002J17456l52622l5501
43133b45354K97379K33712J12551j33814r6421r6894j39536j25153K62216L25783
43123C94469k39151j40241K28451N9888J5787l73498K58393K34248L3195m0278
43113D31263k79810j10527M6103R6637K45552j86025k12523L2531J01033K3888
$$ plain form
43103 188122 608961 274600 130933 359588 398831 12496 62562 228976 -68035 -260575
43093 -260575 169396 307811 120573 272413 487690 449597 343269 287824 161091 204430
43083 204430 203185 726117 631012 239225 -39118 -215530 -155844 158660 338654 307201
43073 307201 414332 380361 571928 505233 499166 788261 681866 547477 344261 101148
43063 101148 -32031 63234 124632 188316 135704 418372 124774 -107456 -94662 -9411 47769
43052 47769 163856 384875 97989 -349464 -177416 152441 168858 291896 491252 464583
43042 464583 397835 310886 108347 78467 50762 155452 363598 92097 -193733 -91070
43032 -91070 332622 680713 779931 425874 284060 293918 479379 350565 241227 352379
$$ packed form
43103A88122M20839l34361j43667K28655L9243l86335N0066J66414k97011j92540
43093b60575M29971J38415j87238J51840K15277l8093j06328n5445j26733M3339
43083B04430j245N22932r5105l91787k78343j76412N9686L14504J79994l1453
43073C07201J07131l3971J91567o6695o067K89095j06395j34389k03216k43113
43063A01148j33179R5265O1398O3684n2612K82668k93598k32230J2794Q5251N7180
43052D7769J16087K21019k86886m47453J72048L29857J6417J23038J99356k6669
43042D64583o6748q6949k02539k9880k7705J04690K08146k71501k85830J02663
43032i1070M23692L48091R9218l54057j41814R858J85461j28814j09338J11152
$$ plain form
43022 352379 611913 642005 -26175 37770 525689 778813 402890 590809 53668 -19813
43012 -19813 225130 157369 -90517 16945 249044 275784 192306 17656 262263 504299
43002 504299 359957 -8162 -112519 -411096 -475066 -278925 -47685 405661 34814 -215740
42992 -215740 -335111 -483423 -265461 22534 145941 -246746 -20595 203207 -33327 -356355
42982 -356355 -349950 373125 678602 804556 759253 383390 62133 73766 -83670 -237077
42972 -237077 -653520 -460102 33920 -2158 -395765 -295687 -163571 -152460 256067 327383
42962 327383 369215 764087 649584 258015 -392361 -863124 -955128 -551260 -517726 -434782
42952 -434782 68057 286621 322071 530451 -119274 -100775 -89995 -438838 -137147 183248
$$ packed form
43022C52379K59534L0092o68180O3945M87919K53124l75923J87919n37141p3481
43012a9813K44943o7761k47886J07462K32099K6740q3478j74650K44607K42036
43002E04299j44342l68119j04357k98577o3970J96141K31240M53346l70847k50554
42992b15740j19371j48312K17962K87995J23407l92687K26151K23802k36534l23028
42982c56355O405P23075L05477J25954m5303l75863l21257J1633j57436j53407
42972b37077m16443J93418M94022l6078l93607J00078J32116J1111M08527P1316
42962C27383M1832L94872j14503l91569o50376m70763r2004M03868L3534Q2944
42952d34782N02839K18564L5450K08380o49725J8499J0780l48843L01691L20395
$$ plain form
42942 183248 170073 9874 -44798 2156 149257 313841 -53962 132666 494400 741862
42932 741862 331580 102265 90839 476128 462595 134367 172586 84038 491255 800967
42922 800967 653301 257921 93584 129536 190187 176815 239574 230407 232316 -149611 -192994
42911 -192994 233679 122470 86036 -2349 338614 522700 411819 272457 217925 60445
42901 60445 20361 225048 193460 -347795 -362961 -169329 -314420 -116787 58826 -29638
42891 -29638 -4156 161714 593980 547432 442675 20729 -417717 -394310 -271987 330374
42881 330374 460479 467199 652488 505896 242802 142440 73130 114414 -12818 16767
42871 16767 16427 -148084 -4409 -105830 245693 537184 304474 -92951 71056 41417
$$ packed form
42942A83248j3175j60199n4672M6954J47101J64584l67803J86628L61734K47462
42932G41862m10282k29315j1426L85289j3533l28228L8219q8548M07217L09712
42922H00967j47666l95380j64337L5952O0651j3372O2759r167J909l81927m3383
42911a92994M26673j11209l6434q8385L40963J84086j10881j39362n4532j57480
42901F0445m0084K04687l1588n41255j5166J93632j45091J97633J75613q8464
42891b9638K5482J65870M32266m6548j04757m21946m38446K3407J22323O02361
42881C30374J30105O720J85289j46592k63094j00362o9310M1284j27232K9585
42871A6767l40j64511J43675j01421L51523K91491k32710l97425J64007k9639
$$ plain form
42861 41417 -57999 441196 728776 665863 520243 458906 611319 677203 670427 409724 13431
42850 13431 -403537 -120109 189657 -132892 97476 160311 463387 511591 273127 628094
42840 628094 815894 617089 468113 366096 255912 20230 148648 320795 575497 258307
42830 258307 277167 336254 234426 -310533 -307237 6472 114263 7829 -100803 518016
42820 518016 203090 32713 244033 474761 805643 736394 328789 230031 215749 546337
42810 546337 637313 495274 623089 374193 350937 162596 156150 529307 358995 204646
42800 204646 496545 494337 107999 184641 411424 432618 64160 52353 355539 284362 87481
42789 87481 614839 302255 -77474 89866 -467428 -409183 137058 514877 607181 429306
$$ packed form
42861D1417r9416M99195K87580o2913j45620o1337J52413O5884o776k60703l96293
42850A3431m16968K83428L09766l22549K30368O2835L03076M8204k38464L54967
42840F28094J87800j98805j48976j02017j10184k35682J28418J72147K54702l17190
42830B58307J8860N9087j01828n44959L296L13709J07791j06434j08632O18819
42820E18016l14926j70377K11320K30728L30882o9249m07605r8758j4282L30588
42810E46337R0976j42039J27815k48896k3256j88341o446L73157j70312j54349
42800B04646K91899k208l86338P6642K26783K1194l68458j1807L03186p1177j96881
42789H7481N27358l12584l79729J67340n57294N8245N46241L77819R2304j77875
$$ plain form
42779 429306 135666 264180 132223 266203 144015 204448 -60846 -121335 290823 -21017
42769 -21017 -7854 228214 493854 357003 49181 -259717 -117969 48443 40967 165930
42759 165930 205776 399461 164509 179406 342864 316072 485947 693041 562943 498627
42749 498627 261962 188037 372480 234520 461147 462494 378267 830711 945740 390483
42739 390483 353953 609666 248757 32272 127833 485541 462337 597144 661027 471866
42729 471866 273607 174779 149988 298060 -11522 155858 390054 413357 330341 210203
42719 210203 39316 159462 -76348 -178632 33965 131965 56205 -359734 -302533 141199
42709 141199 317052 479728 135320 -67568 -126344 -40806 569703 631339 24059 -191862
$$ packed form
42779D29306k93640J28514j31957J33980j22188O0433k65294o0489M12158l11840
42769b1017J3163K36068K65640j36851l07822l08898J41748J66412p476J24963
42759A65930L9846J93685k34952J4897J63458k6792J69875K07094j30098o4316
42749D98627k36665p3925J84443j37960K26627J347q4227M52444J15029n55257
42739C90483l6530K55713l60909k16485R5561L57708k3204J34807O3883j89161
42729D71866j98259r8828k4791J48072l09582J67380K34196K3303q3016j20138
42719B10203j70887J20146k35810j02284K12597R8000p5760m15939N7201M43732
42709A41199J75853J62676l44408k02888n8776Q5538O10509O1636o07280k15921
$$ plain form
42699 -191862 127109 592138 530426 71198 19510 590938 660669 1110130 896242 657959
42689 657959 706065 685390 524888 444515 174937 246058 463582 -3243 236985 405342
42679 405342 92503 -9104 -80609 -133149 522776 537160 283818 329591 210082 78275
42669 78275 -76455 -169846 -19026 -35822 93114 104400 70006 -148738 -237567 -544662 -477986
42658 -477986 -206954 257323 138662 -195158 -363774 -254318 -161487 -249641 81060 -39821
42648 -39821 22791 236255 394810 448213 277880 57489 -164674 -316593 -230333 -266408
42638 -266408 62270 292722 323830 50553 387558 417948 830721 699645 717510 525403
42628 525403 144070 -25705 263276 122556 287826 46816 -64255 -257832 -69129 250893
$$ packed form
42699a91862L18971M65029o1712m59228n1688N71428O9731M49461k13888k38283
42689F57959M8106k0675j60502q0373k69578P1121K17524m66825K40228J68357
42679D05342l12839j01607p1505n2540O55925J4384k53342M5773j19509j31807
42669G8275j54730r3391J50820j6796J28936J1286l4394k18744q8829l07095O6676
42658d77986K71032M64277j18661l33820j68616J09456R2831q8154L30701j20881
42648c9821O2612K13464J58555N3403j70333k20391k22163j51919Q6260l6075
42638b66408L28678K30452L1108k73277L37005L0390M12773j31076J7865j92107
42628E25403l81333j69775K88981j40720J65270k41010j11071j93577J88703L20022
$$ plain form
42618 250893 299974 506469 398328 -7653 235355 423001 271271 120261 -107305 602872
42608 602872 563313 397934 362308 672728 1208092 868621 832423 464574 247141 420987
42598 420987 318266 -264838 -430818 -132248 -16023 -5773 199576 345144 281866 307784
42588 307784 185653 118577 -84873 -240350 -222951 54949 105989 115489 -190858 89448
42578 89448 140943 38605 -234439 -379335 -2866 78307 119890 84357 -336289 -600501
42568 -600501 -611255 -509525 -335327 195052 -33012 16354 -26479 -212910 -465296 -24021
42558 -24021 322655 19192 65557 -48911 -181154 -46881 -325693 105284 183007 85029
42548 85029 109078 41571 152024 190517 359886 314870 291409 130343 14018 516262 252953
$$ packed form
42618B50893M9081K06495j08141m05981K43008J87646j51730j51010k27566P10177
42608F02872l9559j65379l5626L10420N35364l39471l6198l67849k17433J73846
42598D20987j02721n83104j65980K98570J16225J0250K05349J45568o3278K5918
42588C07784j22131o7076k03450j55477J7399K77900N1040R500l06347K80306
42578H9448N1495j02338k73044j44896L76469Q1173M1583l5533m20646k64212
42568f00501j0754J01730J74198N30379k28064M9366m2833j86431k52386M41275
42558b4021L46676l03463M6365j14468j32243J34273k78812M30977P7723r7978
42548H5029K4049o7507J10453L8493J69369m5016k3461j61066j16325N02244k63309
$$ plain form
42537 252953 222193 218913 235030 44712 241181 284738 191173 246411 318371 86834 288463
42526 288463 283882 -186167 -287512 -419691 -188372 -30901 314149 144709 -341430 381141
42516 381141 688166 287532 195445 265857 614895 314354 204953 832309 545885 441581
42506 441581 162231 128991 210839 -56539 -48138 -242701 -98303 70251 -113066 -271286
42496 -271286 5191 76757 -341231 -459284 -51764 -9062 94513 437422 673112 810257
42486 810257 661448 485131 851347 675594 512445 539053 129935 185956 -49447 -213662
42476 -213662 -339900 237648 310060 163861 -68439 69340 158207 187855 334051 -74725
42466 -74725 120450 299189 166011 -59805 -41679 -36247 245318 432601 171186 179998 562173
$$ packed form
42537B52953l0760l280J6117j90318J96469M3557r3565N5238P1960k31537K01629
42526B88463m581m70049j01345j32179K31319J57471L45050j69440m86139P22571
42516C81141L07025m00634r2087P0412L49038l00541j09401O27356k86424j04304
42506D41581k79350l3240Q1848k67378Q401j94563J44398J68554j83317j58220
42496b71286K76477P1566m17988j18053M07520M2702J03575L42909K35690J37145
42486H10257j48809j76317L66216j75753j63149K6608m09118N6021k35403j64215
42476b13662j26238N77548P2412j46199k32300J37779Q8867K9648J46196m08776
42466g4725J95175J78739j33178k25816J8126N432K81565J87283k61415Q812L82175
$$ plain form
42455 562173 265452 -36370 88660 146066 255146 301070 272494 -108108 -188001 96630
42445 96630 324302 305782 286675 -197380 -309740 -123630 8240 89059 355954 7340
42435 7340 -251419 88650 419461 246711 18630 -12043 37288 168938 -83577 -25847
42425 -25847 345835 558895 538997 122194 -125502 153919 307400 455139 193829 186233
42415 186233 86061 -178471 -158150 135944 357769 334574 162357 315527 617828 257790
42405 257790 166262 348898 272471 117159 552525 280410 105105 361937 618072 334249
42395 334249 434023 719294 694183 216323 17970 -57306 -396289 -234396 30851 -79314
42385 -79314 -256124 -94900 -129782 -107586 176234 -133881 -94401 98300 -146053 149485
$$ packed form
42455E62173k96721l01822J25030N7406J09080M5924k8576l80602p9893K84631
42445I6630K27672j8520j9107m84055j12360J86110J31870Q0819K66895l48614
42435G340k58759L40069L30811j72750k28081l0673M9331J31650k52515N7730
42425b5847L71682K13060j9898m16803k47696K79421J53481J47739k61310p596
42415A86233j00172k64532K0321K94094K21825k3195j72217J53170L02301l60038
42405B57790r1528J82636p6427j55312M35366k72115j75305K56832K56135k83823
42395C34249R9774K85271k5111m77860j98353p5276l38983J61893K65247j10165
42385g9314j76810J61224l4882K2196K83820l10115L9480J92701k44353K95538
$$ plain form
42375 149485 270155 316583 125158 -3748 228236 -86589 -86561 -24844 213194 223160 80971
42364 80971 -61532 64365 415898 349750 69411 -313957 -117807 55183 -32347 -137243
42354 -137243 -135626 -24140 -116349 265097 165299 -2823 -300723 -343492 -102838 201653
42344 201653 189675 -107207 -446464 -127631 342300 608746 454073 431195 89861 -176672
42334 -176672 2121 79088 147619 -87910 229346 553283 525832 572459 471566 82458
42324 82458 -35411 -253582 -152471 73790 -165660 -106056 194005 -44162 -280653 -7251
42314 -7251 196787 362855 624990 335348 41371 -35869 120839 -17495 129969 133442
42304 133442 -231179 -263634 -58371 -133769 89673 190519 -208141 -445443 -369439 -241300
$$ packed form
42375A49485J20670M6428j91425j28906K31984l14825K8O1717K38038R966j42189
42364H0971j42503J25897L51533o6148k80339l83368J96150J72990q7530j04896
42354a37243J617J11486r2209L81446r9798j68122k97900m2769K40654L04491
42344B01653j1978k96882l39257L18833M69931K66446j54673k2878l41334k66533
42334a76672J78793P6967O8531k35529L17256L23937k7451M6627j00893l89108
42324H2458j17869k18171J01111K26261k39450N9604L00061k38167k36491K73402
42314g251K04038J66068K62135k89642k93977p7240J56708j38334J47464L473
42304A33442l64621l2455K05263p5398K23442J00846l98660k37302P6004J28139
$$ plain form
42294 -241300 -254488 8550 -2901 -25169 -79653 43883 275385 515419 495152 230590
42284 230590 307913 357850 838135 862451 461474 408418 378635 514478 328907 521963
42274 521963 807151 667517 572305 349570 236826 6086 -22551 -111396 -121563 15072
42264 15072 69071 156271 322519 429788 377101 201547 -76020 -22657 101628 269602
42254 269602 312492 359435 322437 61344 -306015 -100754 -136966 -531815 -222367 192219
42244 192219 111335 -6712 208886 130164 -30259 -411549 -156065 -66235 -102312 75544
42234 75544 53815 108579 -191470 -282168 -187250 -98648 26628 13325 214229 280143 112086
42223 112086 161421 -237081 -425207 -233883 -67910 -116556 -319323 -121339 -133773 -233249
$$ packed form
42294b41300j3188K63038j1451k2268n4484J23536K31502K40034k0267k64562
42284B30590P7323M9937M80285K4316m00977n3056k9783J35843j85571J93056
42274E21963K85188j39634r5212k22735j12744k30740k8637q8845j0167J36635
42264A5072N3999Q7200J66248J07269n2687j75554k77567N3363J24285J67974
42254B69602M2890M6943l6998k61093l67359K05261l6212l94849L09448M14586
42244A92219q0884j18047K15598p8722j60423l81290K55484Q9830l6077J77856
42234G5544k1729N4764l00049r0698R4918Q8602J25276j3303K00904O5914j68057
42223A12086M9335l98502j88126J91324J65973m8646k02767J97984j2434r9476
$$ plain form
42213 -233249 35047 32721 39884 264111 310594 -42 -20495 -261497 -575377 -358985 -14318
42202 -14318 336965 343424 425644 231949 576942 72230 63376 236578 345789 517067 432384
42191 432384 912374 745795 789106 384688 17929 49797 337945 323967 139548 -86786
42181 -86786 -186353 283628 390138 253774 273536 275560 577340 226422 51594 206811
42171 206811 102156 -209011 219845 104528 175866 365973 434003 518298 290436 275402
42161 275402 475656 380222 274640 488801 541187 44194 -49003 338600 -24147 -241124
42151 -241124 72157 -71520 -18082 142198 -148783 -91503 275827 237048 342457 159430
42141 159430 14416 -298462 -601632 -553193 -92731 216770 433938 197164 235524 280992
$$ packed form
42213b33249K68296k326P163K24227M6483l10636k0453k41002l13880K16392L44667
42202a4318L51283O459Q2220j93695L44993n04712q854J73202J09211J71278q4683
42191D32384M79990j66579M3311m04418l66759L1868K88148j3978j84419k26334
42181h6786r9567M69981J06510j36364J9762K024L01780l50918j74828J55217
42171B06811j04655l11167M28856j15317P1338J90107O8030Q4295k27862j5034
42161B75402K00254r5434j05582K14161N2386m96993r3197L87603l62747k16977
42151b41124L13281j43677N3438J60280k90981N7280L67330l8779J05409j83027
42141A59430j45014l12878l03170M8439M60462L09501K17168k36774L8360M5468
$$ plain form
42131 280992 186839 193816 149778 203255 172351 -6340 385784 403385 137213 64889 182386
42120 182386 223787 3352 -117176 -115317 118193 298266 75152 247398 401900 14925
42110 14925 201622 211932 35397 16016 89653 55355 447742 748802 882077 827092 494534
42099 494534 388083 -3220 18552 -182534 279962 280884 575104 463848 -5235 209918
42089 209918 47943 -140431 -173450 177579 513798 238459 431843 293593 257726 -54328
42079 -54328 -156282 34474 22282 142031 221427 304254 463222 241300 189753 64422
42069 64422 175047 77925 448743 583686 427104 88183 39239 164150 45787 107329
42059 107329 80232 216587 257946 -393344 -546457 -286262 -85709 157117 -259205 -309724
$$ packed form
42131B80992r4153O977m4038N3477l0904j78691L92124J7601k66172p2324J17497
42120A82386M1401k20435j20528J859K33510J80073k23114J72246J54502l86975
42110A4925J86697J0310j76535j9381P3637l4298L92387L01060J33275n4985l32558
42099D94534j06451l91303K1772k01086M62496R22K94220j11256m69083K15153
42089B09918j61975j88374l3019L51029L36219k75339J93384j38250l5867l12054
42079e4328j01954J90756j2192J19749P9396Q2827J58968k21922n1547j25331
42069F4422J10625r7122L70818J34943j56582l38921m8944J24911j18363O1542
42059A07329k7097J36355M1359o51290j53113K60195K00553K42826m16322n0519
$$ plain form
42049 -309724 -384784 -146831 -242980 -262999 14180 -47053 -366929 -154640 25775 11435
42039 11435 9557 -258135 365549 723582 644500 332723 -24037 -193037 -69702 -36892
42029 -36892 -566177 -972378 -393184 -92763 -99668 5162 11465 283227 633985 371735
42019 371735 312504 395474 498148 46249 -21698 84551 -92359 -185773 -142222 -97132 53385
42008 53385 110895 -57461 22608 477591 595161 132174 33092 62059 279843 19688
41998 19688 80441 453241 767600 513164 -2480 -383439 -234628 -72253 288774 417307
41988 417307 638639 643196 154753 111529 224503 29266 392603 596773 468123 495253
41978 495253 348918 536543 330056 -71421 137652 150331 -399514 -544453 -646957 -454256
$$ packed form
42049c09724p5060K37953r6149k0019K77179o1233l19876K12289J80415j4340
42039A1435j878k67692O23684L58033p9082l11777l56760j69000J23335L2810
42029c6892n29285m06201N79194L00421o905J04830O303K71762L50758k62250
42019C71735n9231Q2970J02674m51899o7947J06249j76910r3414M3551M5090J50517
42008E3385N7510j68356Q0069M54983J17570m62987r9082K8967K17784k60155
41998A9688O0753L72800L14359k54436n15644l80959J48811J62375L61027J28533
41988D17307K21332M557m88443m3224J12974j95237L63337K04170j28650K7130
41978D95253j46335J87625k06487m01477K09073J2679n49845j44939j02504J92701
$$ plain form
41968 -454256 -174397 -158520 -84632 -173623 -154299 -189167 -335315 -333290 -232376 -192106 -507398
41957 -507398 -462715 -200581 -124881 -42437 128365 300534 389662 196998 -226396 77563
41947 77563 -89179 -41551 69641 243901 342339 380962 185888 457144 933427 843269
41937 843269 309032 236589 -187394 258347 382722 296370 32321 -401113 -217470 -92873
41927 -92873 118906 244414 522840 579307 229438 -204374 -339464 21247 88286 174922
41917 174922 73930 -130570 -105125 -377344 -246449 209873 426254 210099 336752 556981
41907 556981 -207222 -336283 -79742 84068 14504 617688 772492 708854 609206 857803
41897 857803 769074 781758 637992 246893 286995 73312 -227047 304111 658650 358932
$$ packed form
41968d54256K79859J5877P3888q8991J9324l4868j46148K025J00914M0270l15292
41957e07398M4683K62134P5700Q2444J70802J72169Q9128j92664m23394L03959
41947G7563j66742M7628J11192J74260R8438L8623j95074K71256M76283r0158
41937H43269n34237p2443m23983M45741J24375q6352k64049m33434J83643J24597
41927i2873K11779J25508K78426N6467l49869m33812j35090L60711O7039Q6636
41917A74922j00992k04500K5445k72219J30895M56322K16381k16155J26653K20229
41907E56981p64203j29061K56541J63810o9564O03184J54804o3638r9648K48597
41897H57803q8729J2684j43766l91099M0102k13683l00359N31158L54539k99718
$$ plain form
41887 358932 37040 504257 304156 176027 287035 137452 -149933 -17533 130662 221668
41877 221668 121269 11471 138162 442310 345134 81433 -355200 -389580 -435143 15994
41867 15994 605726 498260 150440 554955 237281 117587 95119 110558 -286859 -215940
41857 -215940 20724 -284860 -535338 -703968 -105091 382707 83027 -7996 455337 613900
41847 613900 375652 196478 -8198 -26172 476957 500757 109050 85692 -4681 68318
41837 68318 -341138 -389604 187559 808730 933930 549035 582120 769109 605977 551091
41827 551091 189034 220521 379976 131776 -105585 -240074 -430132 -384157 230514 363333
41817 363333 308172 358848 416034 387168 287203 473415 -201058 -2421 223165 -2443
$$ packed form
41887C58932l21892M67217k00101j28129J11008j49583k87385J32400J48195R1006
41877B21668j00399j09798J26691L04148r7176k63701m36633l4380m5563M51137
41867A5994N89732j07466l47820M04515l17674j19694k2468J5439l97417P0919
41857b15940K36664l05584k50478j68630N98877M87798k99680r1023M63333J58563
41847F13900k38248j79174k04676j7974N03129K3800l91707k3358r0373P2999
41837F8318m09456m8466N77163O21171J25200l84895L3085J86989j63132n4886
41827E51091l62057L1487J59455k48200k37361j34489j90058M5975O14671J32819
41817C63333n5161N0676N7186k8866r9965J86212o74473J98637K25586k25608
$$ plain form
41807 -2443 -38775 115816 180731 556388 326851 -24798 -147666 42943 -26982 -281660
41797 -281660 -51592 21212 100717 47065 243890 424779 288319 136368 -86723 -94928
41787 -94928 -193263 93164 268849 -90118 -399693 -96840 76412 359362 564479 237349
41777 237349 -100780 421367 384855 65772 219488 18459 216430 287167 338171 -4945
41767 -4945 -328673 -499967 -474846 -341226 -411853 -255619 220256 -21784 -303317 -248265
41757 -248265 14959 -28076 180931 413123 -78917 212562 302696 347686 212646 19596
41747 19596 207572 355186 423226 460093 462572 322715 -62809 -28091 68246 -127285 -118659
41736 -118659 -42666 -296823 -405120 -312855 -423763 -115530 103124 430041 491796 220248
$$ packed form
41807b443l6332J54591O4915L75657k29537l51649j22868J90609o9925k54678
41797b81660K30068P2804P9505n3652J96825J80889j36460j51951k23091q205
41787i4928r8335K86427J75685l58967l09575L02853J73252K82950K05117l27130
41777B37349l38129N22147l6512l19083J53716k01029J97971P0737N1004l43116
41767d945l23728j71294K5121J33620p0627J56234M75875k42040k81533N5052
41757b48265K63224m3035K09007K32192m92040K91479R0134M4990j35040j93050
41747A9596J87976J47614O8040L6867K479j39857l85524L4718R6337j95531Q626
41736a18659P5993k54157j08297R2265j10908L08233K18654L26917O1755k71548
$$ plain form
41726 220248 292822 189469 -143027 -149287 -86667 11118 121948 -151716 -456028 -233123
41716 -233123 -121937 14611 166407 -112724 -251772 -342697 -72023 -1287 107750 390537
41706 390537 535959 638527 -18402 -138086 175825 197349 184636 445411 518244 473044
41696 473044 459119 326445 436217 365038 159988 189297 367906 44090 -124986 58782
41686 58782 601034 400746 345518 132712 356819 406401 262220 481089 238171 153887
41676 153887 -43356 -256777 -143571 271634 139824 304187 237000 304654 468501 100536
41666 100536 -112784 -121341 -157353 -40086 262180 30273 -4835 271752 465441 677915
41656 677915 566016 -5863 -86527 303247 601142 498467 26091 -213973 -91809 -205065
$$ packed form
41726B20248P2574j03353l32496o260O2620R7785J10830k73664l04312K22905
41716b33123J11186J36548J51796k79131j39048r0925K70674P0736J09037K82787
41706C90537J45422J02568o56929j19684L13911K1524j2713K60775P2833m5200
41696D73044j3925j32674J09772p1179k05050K9309J78609l23816j69076J83768
41686E8782N42252k00288n5228k12806K24107M9582j44181K18869k42918q4284
41676A53887j97243k13421J13206M15205j31810J64363o7187O7654J63847l67965
41666A00536k13320q557l6012J17267L02266k31907l5108K76587J93689K12474
41656F77915j11899n71879q0664L89774K97895j02675m72376k40064J22164j13256
$$ plain form
41646 -205065 -478896 -224415 50633 -11282 185771 206308 280322 323735 -87461 -69610
41636 -69610 6784 -99073 387185 89175 -211600 -200424 141500 392430 68876 218377
41626 218377 303793 268185 411275 -97855 348386 762096 604647 203260 267312 363364
41616 363364 428473 362942 237578 147842 924 419475 517644 223341 492367 388067
41606 388067 207927 480718 111121 -49765 -171372 -44893 144496 215367 229948 -100173
41596 -100173 48285 246965 83255 108864 -22437 -177214 -174523 -54426 -59760 304922
41586 304922 183577 186133 280438 28994 -14565 21772 132678 22839 56248 471794 476757
41575 476757 445210 175866 185547 663302 888782 875984 774947 614074 333131 -361606
$$ packed form
41646b05065k73831K54481K75048o1915J97053K0537P4014M3413m11196J7851
41636f9610P6394j05857M86258k98010l00775J1176L41924K50930l23554J49501
41626B18377Q5416l5608J43090n09130M46241M13710j57449m01387O4052R6052
41616C63364O5109o5531j25364q9736j46918M18551R8169k94303K69026j04300
41606C88067j80140K72791l69597j60886j21607J26479J89389P0871J4581l30121
41596a00173J48458J98680j63710K5609j31301j54777K691J20097n334L64682
41586C04922j21345K556R4305k51444m3559L6337J10906j09839L3409M15546M963
41575D76757l1547k69344R681M77755K25480j2798j01037j60873k80943o94737
$$ plain form
41565 -361606 -561459 -433752 -216779 -6617 58482 284283 604286 198892 -134379 -46014
41555 -46014 1418 -31105 -60664 -208800 78520 262507 678413 648749 231688 64418
41545 64418 313752 107807 361166 673141 561295 915162 781935 367060 23176 182089
41535 182089 67386 -91405 -28380 46558 41791 153422 476882 389363 380685 221129 -121884
41524 -121884 -57770 362596 320499 508417 207196 -305244 -398603 76126 436094 72445
41514 72445 44301 -48743 -72624 226161 267297 446767 116703 -204356 -104123 170900
41504 170900 307820 378994 494663 200975 118819 351363 677536 634901 570099 443787
41494 443787 155142 87482 -109388 22276 152986 245166 129700 256161 358746 305183
$$ packed form
41565c61606j99853J27707K16973K10162O5099K25801L20003m05394l33271Q8365
41555d6014M7432l2523k9559j48136K87320J83987M15906k9664m17061j67270
41545F4418K49334k05945K53359L11975j11846L53867j33227m14875l43884J58913
41535A82089j14703j58791O3025P4938m767J11631L23460q7519q678j59556l43013
41524a21884O4114M20366m2097J87918l01221n12440r3359M74729L59968l63649
41514G2445k8144r3044k3881K98785M1136J79470l30064l21059J00233K75023
41504A70900J36920P1174J15669k93688q2156K32544L26173m2635o4802j26312
41494D43787k88645o7660j96870J31664J30710R2180j15466J26461J02585n3563
$$ plain form
41484 305183 244410 -39782 -313970 -204107 -231575 -358473 -11862 165938 -5952 -24267
41474 -24267 193827 -196822 -215490 344424 350150 330079 300402 752093 836883 637709 509873
41463 509873 576581 400293 76906 330698 496098 439292 269946 70843 -28440 -272405
41453 -272405 -456516 -46018 257266 276861 451239 188331 145319 422180 150299 183819
41443 183819 522565 714606 350991 -18922 73824 155868 2062 181801 -192358 -126409
41433 -126409 256050 244683 233171 500211 561834 682242 433883 -10276 -287267 49190
$$ packed form
41484C05183o0773k84192k74188J09863k7468j26898L46611J77800j71890j8315
41474b4267K18094l90649j8668N59914N726k0071k9677M51691Q4790j99174j27836
41463E09873O6708j76288l23387K53792J65400n6806j69346j99103r9283k43965
41453b72405j84111M10498L03284J9595J74378k62908m3012K76861k71881L3520
41443A83819L38746J92041l63615l69913R2746Q2044j53806J79739l74159O5949
41433a26409L82459j1367j1512K67040O1623J20408k48359m44159k76991L36457
$$ [...]
##END NTUPLES=NMR SPECTRUM
##END=
