##TITLE=19F_EC-3174
 CDCl3. 24 sc
 15.1.2019
##JCAMPDX= 6.0         $$ Bruker NMR JCAMP-DX V2.0
##DATA TYPE= NMR SPECTRUM
##DATA CLASS= NTUPLES
##ORIGIN= UXNMR, Bruker Analytische Messtechnik GmbH
##OWNER= root
$$ XWIN-NMR		Version 3.5
$$ Thu Jan 17 13:55:31 2019 Russian Standard Time (UT+4h)  she@DPX200
##.OBSERVE FREQUENCY= 188.290927
##.OBSERVE NUCLEUS= ^19F
##.ACQUISITION MODE= SIMULTANEOUS
##.ACQUISITION SCHEME= undefined
##.AVERAGES= 24
##.DIGITISER RES= 16
##SPECTROMETER/DATA SYSTEM= spect
##.PULSE SEQUENCE= zg
##.SOLVENT NAME= DMSO
##.SHIFT REFERENCE= (INTERNAL, DMSO, 0, 98.3737)
##AUDIT TRAIL= $$ (NUMBER, WHEN, WHO, WHERE, WHAT)
$$ ##TITLE= Audit trail, XWIN-NMR		Version 3.5
$$ ##JCAMPDX= 5.01
$$ ##ORIGIN= Bruker BioSpin GmbH
$$ ##OWNER= she
$$ F:/spectra/data/she/nmr/f19/1/pdata/1/auditp.txt
$$ ##AUDIT TRAIL=  $$ (NUMBER, WHEN, WHO, WHERE, WHAT)
(   1,<2019-01-17 13:54:20.90 +0400>,<she>,<DPX200>,
      <created by zg, POWCHK disabled, PULCHK disabled
       configuration hash MD5:
       00 E9 B6 7A A2 85 ED C7 34 08 36 98 17 FE 4E 26
       data hash MD5: 64K
       43 B2 B7 B0 D8 60 E4 35 FD 0D 1D 98 85 99 FF FF>)
(   2,<2019-01-17 13:54:45.46 +0400>,<she>,<DPX200>,
      <Start of raw data processing
       efp BC_mod = 2 LB = 1 FT_mod = 6 PKNL = 1 PHC0 = 1690.717 PHC1 = 41.75593 SI = 64K 
       data hash MD5: 64K
       E1 BA 44 95 DF F8 C9 26 D4 C5 D2 65 3D 7D 7B 0B>)
(   3,<2019-01-17 13:55:01.87 +0400>,<she>,<DPX200>,
      <pk PHC0 = -1.135042 PHC1 = 0 
       data hash MD5: 64K
       29 57 F0 8B E3 33 2A 0B E8 19 DF 74 9F F5 AE 70>)
(   4,<2019-01-17 13:55:04.95 +0400>,<she>,<DPX200>,
      <abs ABSG = 5 
       data hash MD5: 64K
       42 AD DB 87 0D 84 A1 CA BD 18 7C EF 49 8E 43 20>)
$$ ##END=
$$ 
$$ hash MD5
$$ 30 2A E4 42 B3 EF 05 40 4C EB 85 FC 80 F1 98 DC
##$RELAX= 
##$RELAX= 
##$RELAX= 
##$RELAX= 
##$RELAX= 
##$RELAX= 
##$RELAX= 
##$RELAX= 
$$ Bruker specific parameters
$$ --------------------------
##$DU= <F:/spectra>
##$EXPNO= 1
##$NAME= <f19>
##$PROCNO= 1
##$TYPE= <nmr>
##$USER= <she>
##$AMP= (0..31)
100 100 100 100 100 100 100 100 100 100 100 100 100 100 100 100 100 100 
100 100 100 100 100 100 100 100 100 100 100 100 100 100 
##$AQSEQ= 0
##$AQ_mod= 1
##$AUNM= <au_zg>
##$AUTOPOS= <>
##$BF1= 188.310428
##$BF2= 200.13
##$BF3= 200.13
##$BF4= 200.13
##$BF5= 200.13
##$BF6= 200.13
##$BF7= 200.13
##$BF8= 200.13
##$BYTORDA= 1
##$CFDGTYP= 0
##$CFRGTYP= 5
##$CHEMSTR= <none>
##$CNST= (0..31)
1 1 145 1 1 1 1 1 1 1 1 1 1 1 1 1 1 1 1 1 1 1 1 1 1 1 1 1 1 1 1 1 
##$CPDPRG= <>
##$CPDPRG1= <>
##$CPDPRG2= <>
##$CPDPRG3= <>
##$CPDPRG4= <mlev>
##$CPDPRG5= <mlev>
##$CPDPRG6= <mlev>
##$CPDPRG7= <mlev>
##$CPDPRG8= <mlev>
##$CPDPRGB= <>
##$CPDPRGT= <>
##$D= (0..31)
0 1.3 0 0 0 0 0 0 0 0 0 0 0.25 0 0 0 0 0 0 0 0 0 0 0 0 0 0 0 0 0 0 0 
##$DATE= 1547718860
##$DBL= (0..7)
120 120 120 11 120 120 24 19 
##$DBP= (0..7)
150 150 150 150 150 150 150 150 
##$DBP07= 0
##$DBPNAM0= <>
##$DBPNAM1= <>
##$DBPNAM2= <>
##$DBPNAM3= <>
##$DBPNAM4= <>
$$ [...]
##$SUBNAM3= <"">
##$SUBNAM4= <"">
##$SUBNAM5= <"">
##$SUBNAM6= <"">
##$SUBNAM7= <"">
##$SUBNAM8= <"">
##$SUBNAM9= <"">
##$SW= 251.107818259711
##$SWIBOX= (0..15)
0 1 0 0 0 0 0 0 0 0 0 0 0 0 0 0 
##$SW_h= 47281.3238770686
##$TD= 65536
##$TD0= 1
##$TE= 0
##$TE2= 300
##$TE3= 300
##$TEG= 300
##$TL= (0..7)
0 120 53 12 22 120 120 120 
##$TP= (0..7)
150 150 150 150 150 150 150 150 
##$TP07= 0
##$TPNAME0= <>
##$TPNAME1= <>
##$TPNAME2= <>
##$TPNAME3= <>
##$TPNAME4= <>
##$TPNAME5= <>
##$TPNAME6= <>
##$TPNAME7= <>
##$TPOAL= (0..7)
0.5 0.5 0.5 0.5 0.5 0.5 0.5 0.5 
##$TPOFFS= (0..7)
0 0 0 0 0 0 0 0 
##$TUNHIN= 0
##$TUNHOUT= 0
##$TUNXOUT= 0
##$USERA1= <user>
##$USERA2= <user>
##$USERA3= <user>
##$USERA4= <user>
##$USERA5= <user>
##$V9= 5
##$VALIST= <valist>
##$VCLIST= <CCCCCCCCCCCCCCC>
##$VD= 0
##$VDLIST= <DDDDDDDDDDDDDDD>
##$VPLIST= <PPPPPPPPPPPPPPP>
##$VTLIST= <TTTTTTTTTTTTTTT>
##$WBST= 1024
##$WBSW= 4
##$XGAIN= (0..3)
0 0 0 0 
##$XL= 0
##$YL= 0
##$YMAX_a= 57766
##$YMIN_a= -13150
##$ZGOPTNS= <>
##$ZL1= 120
##$ZL2= 120
##$ZL3= 120
##$ZL4= 120
##$ABSF1= 98.37372
##$ABSF2= -152.7273
##$ABSG= 5
##$ABSL= 3
##$ALPHA= 0
##$AQORDER= 0
##$ASSFAC= 0
##$ASSFACI= 0
##$ASSFACX= 0
##$ASSWID= 0
##$AUNMP= <proc_1d>
##$AZFE= 0.1
##$AZFW= 5
##$BCFW= 0
##$BC_mod= 2
##$BYTORDP= 0
##$COROFFS= 0
##$CY= -3
##$DATMOD= 1
##$DC= 0
##$DFILT= <>
##$DTYPP= 0
##$F1P= 0
##$F2P= 0
##$FCOR= 0.5
##$FTSIZE= 65536
##$FT_mod= 6
##$GAMMA= 0
##$GB= 0
##$INTBC= 1
##$INTSCL= 8.653935e-10
##$ISEN= 128
##$LB= 1
##$LEV0= 0
##$LPBIN= 0
##$MAXI= 10000
##$MC2= 0
##$MEAN= 0
##$ME_mod= 0
##$MI= 0.4277144
##$NCOEF= 0
##$NC_proc= -5
##$NLEV= 6
##$NOISF1= -61.99997
##$NOISF2= -62.99997
##$NSP= 0
##$NTH_PI= 0
##$NZP= 0
##$OFFSET= 98.37372
##$PC= 1
##$PHC0= 1689.582
##$PHC1= 41.75593
##$PH_mod= 1
##$PKNL= yes
##$PPARMOD= 0
##$PSCAL= 0
##$PSIGN= 0
##$REVERSE= no
##$SF= 188.296044280273
##$SI= 65536
##$SIGF1= -61
##$SIGF2= -65
##$SINO= 3.502647
##$SIOLD= 65536
##$SREGLST= <1H.CDCl3>
##$SSB= 0
##$STSI= 65536
##$STSR= 0
##$SW_p= 47281.3238770685
##$SYMM= 0
##$S_DEV= 0
##$TDeff= 65536
##$TDoff= 0
##$TI= <>
##$TILT= no
##$TM1= 0
##$TM2= 0
##$TOPLEV= 0
##$USERP1= <user>
##$USERP2= <user>
##$USERP3= <user>
##$USERP4= <user>
##$USERP5= <user>
##$WDW= 1
##$XDIM= 65536
##$YMAX_p= 444379944
##$YMIN_p= -3947085
$$ End of Bruker specific parameters
$$ ---------------------------------
##NTUPLES= NMR SPECTRUM
##VAR_NAME=  FREQUENCY,     SPECTRUM/REAL,   SPECTRUM/IMAG
##SYMBOL=    X,             R,               I
##VAR_TYPE=  INDEPENDENT,   DEPENDENT,       DEPENDENT
##VAR_FORM=  AFFN,          ASDF,            ASDF
##VAR_DIM=   65536,         65536,           65536
##UNITS=     HZ,            ARBITRARY UNITS, ARBITRARY UNITS
##FACTOR=    0.721466756344984, 1,           1
##FIRST=     18523.3820098237, 0,            0
##LAST=      -28757.9418672448, 0,           0
##MIN=       -28757.9418672448, -3947085,    0
##MAX=       18523.3820098237, 444379944,    0
$$ Real data points
##PAGE= N=1
##DATA TABLE= (X++(R..R)), XYDATA
$$ [...]
$$ plain form
29878 -451202 -848822 -307898 -141591 -671113 -994317 -454562 -556538 -1135457 -410768 114714
29868 114714 -487452 -892731 -862066 -902668 -786105 -654773 -173660 -680705 -1004532 -555262
29858 -555262 -1343143 -982342 -1104677 -887299 -1335264 -1168179 -732961 -338600 -229971 -583204
29848 -583204 -1043910 -452632 -913828 -1092785 -923963 -954764 235540 135452 -764644 -727349
29838 -727349 -931616 -1638515 -1116974 -286319 -698745 -979311 -315684 -866882 -1649359 -1000981
29828 -1000981 -304564 -683957 -757208 -1127880 -1160528 -1381956 -1522028 -1688306 -1304027 -1537282
29818 -1537282 -840812 -829297 -101999 -267956 -962485 -308304 59715 555909 401409 -350977
29808 -350977 -965000 -1204057 -953842 -689999 -692434 -1094002 -809763 -988406 -1801856 -1600269
$$ packed form
29878d51202l97620N40924J66307n29522l23204N39755j01976n78919P24689N25482
29868A14714o02166m05279L0665m0602J16563J31332M81113n07045l23827M49270
29858e55262p87881L60801j22335K17378m47965J67085M35218L94361J08629l53233
29848e83204m60706N91278m61196j78957J68822l0801J190304j00088r00096L7295
29838g27349k04267p06899N21541Q30655m12426k80566O63627n51198p82477O48378
29828a000981O96417l79393p3251l70672l2648k21428j40072j66278L84279k33255
29818a537282O96470J1515P27298j65957o94529O54181L68019M96194j54500p52386
29808c50977o14023k39057K50215K63843k435m01568K84239j78643q13450K01587
$$ plain form
29798 -1600269 -1174574 -646582 28071 306461 -138842 158830 157423 -302426 -677538 -1006031
29788 -1006031 -1566165 -1160757 -1136453 -1376476 -398896 -939893 -1178981 -767090 -877384 -528185
29778 -528185 61970 -144374 -424991 -652616 -598941 -691057 -654302 -544049 -887095 -1019806
29768 -1019806 -1142555 -1506784 -1291173 -1172218 -482717 -422554 -576667 -1006686 -895625 -870857
29758 -870857 -292414 916579 271329 -196060 -827612 -103179 14938 146257 -453873
29749 -453873 -605410 -925793 -1141947 -692274 -428064 -265124 377577 511733 633714 243340
29739 243340 -723780 -1072628 -478717 -733245 -378882 54118 262248 -715042 -279332 -311258
29729 -311258 -9789 -749390 30541 341649 -166953 127027 -92256 -288967 -914852 -808516
$$ packed form
29798a600269M25695N27992O74653K78390m45303K97672j407m59849l75112l28493
29788a006031n60134M05408K4304k40023R77580n40997k39088M11891j10294L49199
29778e28185N90155k06344k80617k27625N3675r2116L6755J10253l43046j32711
29768a019806j22749l64229K15611J18955O89501O0163j54113m30019J11061K4768
29758h70857N78443J208993o45250m67389o31552P24433J18117J31319o00130
29749d53873j51537l20383k16154M49673K64210J62940O42701J34156J21981l90374
29739B43340r67120l48848N93911k54528L54363M33000K08130r77290M35710l1926
29729c11258L01469p39601P79931L11108n08602K93980k19283j96711o25885J06336
$$ plain form
29719 -808516 -118892 -640987 -672944 -511361 -835136 -431197 -62922 -297122 -1394766 -865420
29709 -865420 -493124 -603683 -1129234 -1016104 -823502 -868841 -367396 609847 652562 -436248
29699 -436248 -216079 -197997 -224802 -219955 387183 -318953 -1101503 -1138326 -65287 -609305
29689 -609305 -691288 -194537 -484243 -667928 -586510 -362437 -239544 -246360 -1246865 -1093353
29679 -1093353 -443082 -933376 -840688 -628223 -284616 -323762 -983932 -1180318 -744926 -314995
29669 -314995 -868491 -281236 -845731 -694673 -429218 -321933 -287505 16488 -148054 -511510
29659 -511510 -548593 -873355 -1071365 -972628 -675738 -329180 -285168 100438 313595 -337393
29649 -337393 -340535 -169856 -751793 -1027229 -329771 876172 969448 -28834 322020 -221868
$$ packed form
29719h08516O89624n22095l1957J61583l23775M03939L68275k34200j097644N29346
29709h65420L72296j10559n25551J13130J92602m5339N01445R77243M2715j088810
29699d36248K20169J8082k6805M847O07138p06136p82550l6823J073039n44018
29689f09305q1983M96751k89706j83685Q1418K24073J22893o816j000505J53512
29679a093353O50271m90294R2688K12465L43607l9146o60170j96386M35392M29931
29669c14995n53496N87255n64495J51058K65455J07285L4428L03993j64542l63456
29659e11510l7083l24762j98010R8737K96890L46558M4012L85606K13157o50988
29649c37393l142J70679n81937k75436O97458J205943R3276r98282L50854n43888
$$ plain form
29639 -221868 -104791 169729 -198367 -39490 -547266 -1591055 -867080 -1138935 -591743
29630 -591743 -874636 -1038501 -1509273 -1361444 -326120 134504 -658188 -1247305 -597980
29621 -597980 691256 712204 212996 -285055 -1158621 -1273082 -1153634 -1344169 -1387070 -1418550
29611 -1418550 -1098633 107409 133936 -396576 -1320768 -299700 475526 -457635 -475436
29602 -475436 -737415 -975843 -886047 -1163744 -1439096 -1262912 -330748 -420204 -434061 -356961
29592 -356961 -578687 -449961 -35512 76739 220251 388544 -334249 -525369 -410554 -529378
29582 -529378 -711706 -894964 -475455 -461162 -686270 -802174 -927886 -717083 -834390 -1201842
29572 -1201842 -1766241 -1576445 -971945 66230 5228 -984843 -1240860 -475089 -368641
$$ packed form
29639b21868J17077K74520l68096J58877n07776j043789P23975k71855N47192
29630e91743k82893j63865m70772J47829J035324M60624p92692n89117O49325
29621e97980J289236K0948m99208m98051q73566j14461J19448j90535m2901l1480
29611a418550L19917J206042K6527n30512r24192J021068P75226r33161j7801
29602d75436k61979k38428Q9796k77697k75352J76184R32164q9456j3857P7100
29592c56961k21726J28726M14449J12251J43512J68293p22793j91120J14815j18824
29582e29378j82328j83258M19509J4293k25108j15904j25712K10803j17307l67452
29572a201842n64399J89796O04500J038175o1002r90071k56017P65771J06448
$$ plain form
29563 -368641 -360385 -1048618 -813022 -1172255 -1642223 -1467044 -1704840 -1249320 -889570 -449699
29553 -449699 130769 -657455 -1154888 -853585 -328946 -993665 -1207599 -523993 -321777 -1232726
29543 -1232726 -821580 -1011267 -1290695 -1505170 -1498277 -1660649 -1683141 -1494246 -1755286 -239151
29533 -239151 130189 284429 285003 -272835 -586584 -490457 -151882 221482 143325 113202 510540
29522 510540 2136 -512606 -288368 -836926 -839051 -808931 -902636 -944768 -1442463 -1146594
29512 -1146594 -368220 655328 -233961 -1124072 -398126 -1174270 -1669879 -1469548 -1011502
29503 -1011502 -692411 -881805 -277631 123054 -485345 -489220 -1264267 -1516973 -1528527 -1060616
29493 -1060616 -573006 -986888 -1584954 -1594447 -1232103 -1232304 -1233411 -1556441 -1170000 -800119 -446641
$$ packed form
29563c68641Q256o88233K35596l59233m69968J75179k37796M55520L59750M39871
29553d49699N80468p88224m97433L01303N24639o64719k13934O83606K02216r10949
29543a232726M11146j89687k79428k14475O893j62372k2492J88895k61040J516135
29533b39151L69340J54240N74n57838l13749R6127L38575L73364p8157l0123L97338
29522E10540n08404n14742K24238n48558k125L0120r3705m2132m97695K95869
29512a146594P78374J023548q89289q90111P25946p76144m95609K00331M58046
29503a011502L19091j89394O04174M00685o08399l875p75047k52706j1554M67911
29493a060616M87610m13882n98066r493L62344k01j107l23030L86441L69881L53478
$$ plain form
29482 -446641 -688694 -629962 -695120 -623452 -257489 -919985 -881225 -608413 -370297 -31123
29472 -31123 502755 554171 601955 -11290 -719733 -842876 -600410 -1197009 -634948 -794052
29462 -794052 -438245 -501020 -799308 -556955 -813320 -232958 -183504 -544220 -447588 -237871
29452 -237871 -533311 -1045438 -527450 -475604 -307675 -563707 -1064928 -709241 45283 33223
29442 33223 -394760 -816281 -1304250 -265302 -377909 -509057 -263663 -613688 -701178 -414887
29432 -414887 -839353 -889803 -1377880 -1356328 -528113 376139 9204 -867872 -957950 -1144682
29422 -1144682 -690954 112371 -335790 -244612 39513 -68768 320390 249744 797052 619838
29412 619838 557645 272063 67486 545770 265373 418239 521503 615780 1014752 241105
$$ packed form
29482d46641k42053N8732o5158P1668L65963o62496L8760K72812K38116L39174
29472c1123N33878N1416M7784o13245p08443j23143K42466n96599N62061j59104
29462g94052L55807o2775k98288K42353k56365N80362M9454l60716R6632K09717
29452b37871k95440n12127N17988N1846J67929k56032n01221L55687P54524j2060
29442C3223m27983m21521m87969J038948j12607j31148K45394l50025q7490K86291
29432d14887m24466n0450m88077K1552Q28215R04252l66935q77076r0078j86732
29422a144682M53728Q03325m48161R1178K84125j08281L89158p0646N47308j77214
29412F19838o2193k85582k04577M78284k80397J52866J03264R4277L98972p73647
$$ plain form
29402 241105 -808949 -93887 -553495 -844582 -926654 -230442 -476072 -720282 -554608 -592700
29392 -592700 -463049 -493909 -210382 -822167 -1474573 -967933 -753964 -194326 -98065 -1221853
29382 -1221853 -663873 -253420 -364744 -12421 -323032 464 -583120 -137632 636893
29373 636893 208770 -83223 -384914 -638128 -1111191 -1055185 -1318049 -415115 -979991 -1053737
29363 -1053737 -1457235 -2325721 -819327 -712632 -5153 -29171 228679 968362 411291
29354 411291 651819 280286 64347 92207 92586 -898789 -2003491 -1675621 -727031 -592090
29344 -592090 -332238 -395081 -351879 -394099 -592500 -917332 -1275344 -1800610 -885464 -556347
29334 -556347 -1476249 -1222540 -1231516 -189556 -355096 -622557 -374268 -469264 -447035 -365161
$$ packed form
29402B41105j050054P15062m59608k91087q2072O96212k45630k44210J65674l8092
29392e92700J29651l0860K83527o11785o52406N06640K13969N59638R6261j123788
29382a221853N57980M10453j11324L52323l10611L23496n83584M45488P74525
29373F36893m28123k91993l01691k53214m73063N6006k62864R02934n64876p3746
29363a053737m03498q68486J506394J06695P07479k4018K57850P39683n57071
29354D11291K40528l71533k15939K7860L79r91375j104702L27870R48590J34941
29344e92090K59852o2843M3202m2220j98401l24832l58012n25266R15146L29117
29334e56347r19902K53709q976J041960j65540k67461K48289r4996K2229Q1874
$$ plain form
29324 -365161 626042 995518 698305 -170989 -473495 -181828 292567 684813 649526 -69086
29314 -69086 55841 196415 -817486 -924877 -436705 -590637 147903 -136884 -226964 -1110206
29304 -1110206 -1090888 -1876968 -1938253 -1177035 -1090501 -1169389 -980825 245329 79083 -269697
29294 -269697 -253901 -719601 206903 162554 -384167 -343220 -642246 -634347 -671909 -647327 -480450
29283 -480450 82593 -381087 -930501 -941304 -164700 -410427 -1125972 -793929 -976806 -737269
29273 -737269 -229759 -884863 -1673257 -1462772 -460575 -466124 -1026164 -180383 232515 -220182
29263 -220182 -407744 -110073 -136672 -540170 -224454 -331320 -129787 208300 862930 713798
29253 713798 527240 71411 -115638 118553 1549151 1872943 898333 -189454 -5674
$$ packed form
29324c65161R91203L69476k97213q69294l02506K91667M74395L92246l5287p18612
29314f9086J24927J40574j013901j07391M88172j53932P38540k84787r0080q83242
29304a110206J9318p86080o1285P61218Q6534p8888J88564J226154j66246l48780
29294b69697J5796m65700R26504m4349n46721M0947k99026P899l7562K4582J66877
29283d80450N63043m63680n49414j0803P76604k45727p15545L32043j82877K39537
29273g37269N07510o55104p88394K10485J002197n549n60040Q45781M12898m52697
29263b20182j87562K97671k6599m03498L15716j06866K01533L38087O54630j49132
29253G13798j86558m55829j87049K34191J430598L23792r74610j087787J83780
$$ plain form
29244 -5674 -186440 -1062506 -927234 -748456 -1520313 -1241695 -921463 -303875 -202118 -546478
29234 -546478 -795448 -624771 -1261147 -669242 -360364 -908449 -664437 -290351 -719557 -1014843
29224 -1014843 -682725 -520829 -1125876 -1887674 -2131431 -1036460 -966260 -1227974 -175747
29215 -175747 -459365 -712069 -836032 -513627 -236087 -209909 241347 -229173 -177051 -332846
29205 -332846 40903 311046 -638121 -744176 -1323209 -2136123 -1176617 -426904 -140934 -525187
29195 -525187 -1456234 -1288346 -580998 -1204937 -1055813 243493 126639 -13843 -500151
29186 -500151 -549623 -1169504 -794369 -477707 -952510 -756357 -628547 -421202 -250434 -519031
29176 -519031 -956336 -1218859 -1086951 -567484 -399543 -136159 -727027 16963 410993 -184040
$$ packed form
29244e674j80766q76066J35272J78778p71857K78618L20232O17588J01757l44360
29234e46478k48970J70677o36376N91905L08878n48085K44012L74086m29206k95286
29224a014843L32118J61896o05047p61798k43757J094971P0200k61714J052227
29215a75747k83618k52704j23963L22405K77540K6178M51256m70520N2122j55795
29205c32846L73749K70143r49167j06055n79033q12914R59506P49713K85970l84253
29195e25187r31047J67888P07348o23939J49124J299306j16854j40482m86308
29186e00151m9472o19881L75135L16662m74803J96153J27810K07345J70768k68597
29176e19031m37305k62523J31908N19467J67941K63384n90868P43990L94030n95033
$$ plain form
29166 -184040 -1540259 -1581787 -1283047 -205553 -74090 -18452 694346 484010 598900 764338
29156 764338 -23763 -812889 -821838 171207 649049 550985 415088 -153584 -541639 -1076766
29146 -1076766 -1422840 -1015286 -1168309 -897697 -950364 -111993 443718 -537240 -1030558 -994389
29136 -994389 -567428 -403826 156075 234524 -398595 -420694 262602 379565 -109630 -204758
29126 -204758 -395916 -327750 -211957 -543365 -770455 -656001 -473895 -104930 272052 -523318
29116 -523318 -1071854 -1351785 -1698335 -1531106 -804347 -1059798 -1335326 -791208 -1299807 -884040
29106 -884040 -710985 -436220 -452648 -1113198 -1606431 -1225512 -687662 -732647 -1124369 -474766
29096 -474766 -301267 -462905 -471109 -345674 -384051 -528718 -236116 -618985 -1117258 -690464
$$ packed form
29166a84040j356219m1528K98740J077494J31463N5638P12798k10336J14890J65438
29156G64338p88101p89126q949R93045M77842r8064j35897n68672l88055n35127
29146a076766l46074M07554j53023K70612n2667Q38371N55711r80958m93318L6169
29136i94389M26961J63602N59901P8449o33119k2099O83296J16963m89195r5128
29126b04758j91158O8166J15793l31408k27090J14454J82106L68965L76982p95370
29116e23318n48536k79931l46550J67229P26759k55451k75528N44118n08599M15767
29106h84040J73055K74765j6428o60550m93233L80919N37850m4985l91722O49603
29096d74766J73499j61638q204J25435l8377j44667K92602l82869m98273M26794
$$ plain form
29086 -690464 -109844 -211721 -102875 102693 -1148117 -1672350 -1383943 -1317989 -1217299 -646960
29076 -646960 -724049 -373299 -198881 27553 244723 420408 -340174 -236393 67732 -654759
29066 -654759 193677 282671 -460633 -537640 -485270 -48252 -279985 -444689 -908569 -1014886
29056 -1014886 -716498 112320 -204333 -937903 -1188403 -217954 190268 6645 6354 183878
29046 183878 -179113 -612895 -1263986 -1840914 -2118894 -960063 -394856 -975068 -1293099
29037 -1293099 -888835 -485719 -28251 -605967 -1003219 -1333645 -248570 104302 -288786
29028 -288786 -649815 -197894 -137630 -440605 172878 553505 120867 -80515 92670 146198
29018 146198 -346938 -610068 19183 551621 301183 -166462 -714978 -372838 -309236 -247418
$$ packed form
29086f90464N80620j01877J08846K05568j250810n24233K88407O5954J00690N70339
29076f46960p7089L50750J74418K26434K17170J75685p60582J03781L04125p22491
29066f54759Q48436Q8994p43304p7007N2370M37018k31733j64704m63880j06317
29056a014886K98388Q28818l16653p33570k50500R70449M08222j83623k91J77524
29046A83878l62991m33782o51091n76928k77980J158831N65207n80212l18031
29037a293099M04264M03116M57468n77716l97252l30426J085075L52872l93088
29028b88786l61029M51921O0264l02975O13483L80627m32638k01382J73185N3528
29018A46198m93136k63130O29251N32438k50438m67645n48516L42140O3602O1818
$$ plain form
29008 -247418 -484863 -803971 -750259 -289401 678618 181692 -469353 -423872 -15765 549077
28998 549077 -63004 -468082 -511482 -962518 -1458441 -1109261 -1294980 -1706224 -1399122 -459790
28988 -459790 461326 22090 -476553 -287047 -705614 -475019 -615072 -613686 -842537 -788046
28978 -788046 -372796 -470543 366735 243090 -18210 -823333 -969229 -671297 -1403125 -1233555
28968 -1233555 -114904 115772 297613 -305967 -294508 -518013 -738971 -980059 -1031
28959 -1031 72219 194434 -250291 314872 -353172 -586745 -471841 -357966 59202 172636
28949 172636 -120762 34752 106678 384227 -360032 129259 -364275 -662565 -105534 -294027
28939 -294027 -134158 51819 392842 48027 -100770 -285953 -1172390 -498438 136468 -563267
$$ packed form
29008b47418k37445l19108N3712M60858R68019m96926o51045M5481M08107N64842
28998E49077o12081m05078m3400m51036m95923L49180j85719m11244L07102R39332
28988d59790R21116m39236m98643J89506m18567K30595j40053J386k28851N4491
28978g88046M15250r7747Q37278j23645k61300q05123j45896K97932p31828J69570
28968a233555J118651K30676J81841o03580J1459k23505k20958k41088R79028
28959a031P3250J22215m44725N65163o68044k33573J14904J13875M17168J13434
28949A72636k93398J55514P1926K77549p44259M89291m93534k98290N57031j88493
28939b94027J59869J85977L41023l44815j48797j85183q86437O73952O34906o99735
$$ plain form
28929 -563267 -399663 245133 73892 498569 507084 808779 601993 340277 284678 177293
28919 177293 247801 154526 255069 -441142 -1323907 -518137 411766 -23577 -392345 -96695
28909 -96695 -576257 -163239 -71190 -410677 -495131 -102058 -360619 -1374194 -1710964 -1142864
28899 -1142864 -1760396 -1456787 -1025252 -419102 -268177 -456871 -441098 477988 509210 76991
28889 76991 273555 -566615 -1092753 -1244570 -823831 -1590375 -1452482 -452182 -208142 566492
28879 566492 684694 -530143 -923675 -264274 -258983 206550 35039 -607975 -282964 -245715
28869 -245715 -320671 46548 -453700 -510821 470530 -216400 -1139542 -1724329 -1663720 -1551632
28859 -1551632 -1364663 -1217694 -787478 -185869 -269931 -850656 -404399 -217777 -1038564 -1100543
$$ packed form
28929e63267J63604O44796j71241M24677Q515L01695k06786k61716n5599j07385
28919A77293P0508r3275J00543o96211q82765Q05770R29903m35343l68768K95650
28909i6695m79562M13018R2049l39487q4454L93073k58561j013575l36770N68100
28899a142864o17532L03609M31535O06150J50925j88694J5773R19086L1222m32219
28889G6991J96564q40170n26138j51817M20739p66544J37893J000300K44040P74634
28879E66492J18202j214837l93532O59401N291M65533j71511o43014L25011L7249
28869b45715p4956L67219n00248n7121R81351o86930r23142n84787O0609J12088
28859a551632J86969J46969M30216O01609q4062n80725M46257J86622q20787o1979
$$ plain form
28849 -1100543 -1407414 -1176496 -1629960 -900775 98251 822888 629781 590115 780857 342363
28839 342363 -15379 -494997 -401671 -497529 -631959 -279679 -332171 -698613 -1004472 -808604
28829 -808604 -577650 -681421 -40086 172702 -5490 -126748 -678447 -467826 -397737 -989812
28819 -989812 -674193 -522427 -749149 -411054 -756385 -298690 -1319784 -1145332 -154222
28810 -154222 -440651 -925981 -899583 -924288 -1163676 -1253413 -999738 273776 182574 -627565
28800 -627565 -932060 -1535306 -1395597 -589314 -751156 -754760 -661075 -635456 333732 -271981
28790 -271981 -37313 -760639 -1266070 -909392 -388382 150498 469200 -214665 432233 187132
28780 187132 -535312 -475220 -409135 65354 -593399 -1054179 -1071197 -450469 -104611 -326429
$$ packed form
28849a100543l06871K30918m53464P29185R99026P24637j93107l9666J90742m38494
28839C42363l57742m79618R3326r5858j34430L52280n2492l66442l05859J95868
28829h08604K30954j03771O41335K12788j78192j21258n51699K10621P0089n92075
28819i89812L15619J51766k26722L38095l45331M57695j021094J74452R91110
28810a54222k86429m85330K6398k4705k39388q9737K53675J273514r1202q10139
28800f27565l04495o03246J39709Q06283j61842l604R3685K5619R69188o05713
28790b71981K34668p23326n05431L56678N21010N38880L18702o83865O46898k45101
28780A87132p22444O0092O6085M74489o58753m60780j7018O20728L45858k21818
$$ plain form
28770 -326429 -408874 -421079 -1033433 -1097922 234453 92720 -958415 -1097664 -561700 -766672
28760 -766672 -846557 -1314980 -1506837 -977555 -1388949 -974802 -991134 -932186 -1113434 -1450891
28750 -1450891 -1744120 -1528404 -1358392 -1492016 -703836 -910910 -1304390 -583554 -1037623
28741 -1037623 -1359756 -1136745 -1281244 -1416540 -922625 55849 -37482 -534240 -782381 -1644059
28731 -1644059 -1124067 -923963 -749185 -270507 -229666 -1132237 -1258365 -1155250 -1426138 -980003
28721 -980003 175968 -51425 -583252 -251085 -562378 -379426 -682194 -419565 -658114
28712 -658114 -543903 -179572 351710 -325044 -468520 -748583 -671669 -326992 226039 138782
28702 138782 331570 -279264 -131764 -628457 -970632 -532301 -439216 -489065 86924 734019
$$ packed form
28770c26429q2445j2205o12354o4489J332375j41733j051135j39249N35964k04972
28760g66672p9885m68423j91857N29282m11394M14147j6332N8948j81248l37457
28750a450891k93229K15716J70012j33624P88180k07074l93480P20836m54069
28741a037623l22133K23011j44499j35296M93915R78474r3331m96758k48141q61678
28731a644059N19992K00104J74778M78678M0841r02571j26128J03115k70888M46135
28721i80003J155971k27393n31827L32167l11293J82952l02768K62629k38549
28712f58114J14211L64331N31282o76754j43476k80063P6914L44677N53031q7257
28702A38782J92788o10834J47500m96693l42175M38331R3085m9849N75989O47095
$$ plain form
28692 734019 424644 -421929 -339187 -403756 -1064399 -1056618 -784549 -936452 -551101 -356441
28682 -356441 -369224 -97649 -846049 -1000531 -639801 -512377 -255290 -199129 -513467 -51596
28672 -51596 97599 -185592 -610334 -929560 -1297476 -843131 -710684 -1082514 -515460 -123024
28662 -123024 -262824 -651107 -865642 16179 39272 -500487 -169094 -964407 -1105538 -281758
28652 -281758 -90381 -482537 -940267 -1056763 -446727 -617310 -901636 -984619 -793934 -425834
28642 -425834 -654530 -458808 -822457 -1293964 -1416668 -1545832 -959034 -397772 61251 -85401
28632 -85401 -1174340 -1341261 -1138327 -1045903 -1411634 -741621 -309656 -967209 -901768 -467662
28622 -467662 -840782 -713386 -1016535 -896527 -541786 -52417 -403145 -287372 -80639 -1006671
$$ packed form
28692G34019l09375q46573Q2742o4569o60643P781K72069j51903L85351J94660
28682c56441j2783K71575p48400j54482L60730J27424K57087N6161l14338M61871
28672e1596J49195k83191m24742l19226l67916M54345J32447l71830N67054L92436
28662a23024j39800l88283k14535Q81821K3093n39759L31393p95313j41131Q23780
28652b81758J91377l92156m57730j16496O10036j70583k84326q2983J90685L68100
28642d25834k28696J95722l63649m71507j22704j29164N86798N61262M59023j46652
28632h5401j088939j66921K02934R2424l65731O70013M31965o57553O5441M34106
28622d67662l73120J27396l03149J20008L54741M89369l50728J15773K06733r26032
$$ plain form
28612 -1006671 -253209 526197 211482 -239078 5210 197166 -662691 -1275921 -1196388 -536338
28602 -536338 -80000 571633 -278117 -767489 -202883 -182229 21018 -1008621 -532158 -33813
28592 -33813 -836222 -456236 270799 -72068 -86296 615233 725181 910998 912069 -637466
28582 -637466 -1178635 -531278 -225896 61996 -766603 -795465 -409695 -339768 376850 1263567
28572 1263567 174824 -934321 -791443 -680357 -725610 -460252 464388 468949 -206019 -458980
28562 -458980 21434 -321846 -74850 -128598 -748927 -1326943 -669671 -391918 -405771 -949629
28552 -949629 -356588 -281357 -1052742 -1452031 -2014238 -1136391 -384737 -670499 -470327 -657655
28542 -657655 -1191399 -926288 -321365 698133 1058570 -124644 -395552 461966 292655
$$ packed form
28612a006671P53462P79406l14715m50560K44288J91956q59857o13230P9533O60050
28602e36338M56338O51633q49750m89372N64606K0654K03247j029639M76463M98345
28592c3813q02409L79986P27035l42867j4228P01529J09948J85817J071j549535
28582f37466n41169O47357L05382K87892q28599k8862L85770O9927P16618Q86717
28572A263567j088743j109145J42878J11086m5253K65358R24640M561o74968k52961
28562d58980M80414l43280K46996n3748o20329n78016O57272K77753j3853n43858
28552i49629N93041P5231p71385l99289n62207Q77847P51654k85762K00172j87328
28542f57655n33744K65111O04923J019498L60437j183214k70908Q57518j69311
$$ plain form
28533 292655 -69462 -86771 -134176 -126752 1187188 474647 -195797 -391468 -462467 -889292
28523 -889292 -620831 -690834 -108671 -101575 724775 109684 -456210 309920 -296053 -575898
28513 -575898 -872003 -736609 -742012 -438530 -498713 -794470 -950550 -714592 -72070 80010
28503 80010 -774625 -1021698 -1288601 -1006549 98130 -226150 -603508 -912368 -271698 -283360
28493 -283360 -768237 -215644 -676932 -886035 -971017 -381584 -491790 -82552 267617 -167003
28483 -167003 -551435 -898203 -1356488 -726812 -747785 -1046619 -308883 -289032 -638893 -904080
28473 -904080 -698772 -791395 -89026 -192169 -750121 -1588219 -735764 -163874 26701 -513479
28463 -513479 -607715 -273301 -634024 -1272920 -1529645 -415838 294727 -503768 -572596 -793196
$$ packed form
28533B92655l62117j7309m7405P424J313940p12541o70444j95671p0999m26825
28523h89292K68461p0003N82163P096Q26350o15091n65894P66130o05973k79845
28513e75898k96105J35394n403L03482o0183k95757j56080K35958O42522J52080
28503H0010q54635k47073k66903K82052J104679l24280l77358l08860O40670j1662
28493b83360m84877N52593m61288k09103q4982N89433j10206M09238L50169m34620
28483a67003l84432l46768m58285O29676k0973k98834P37736J9851l49861k65187
28473i04080K05308r2623P02369j03143n57952q38098Q52455N71890J90575n40180
28463e13479r4236L34414l60723o38896k56725J113807P10565p98495o8828k20600
$$ plain form
28453 -793196 -481111 40299 -456915 -625798 -376210 -11524 -140945 -278873 -242285 29124
28443 29124 -221082 -174413 -797570 -514673 -1042594 -975670 -1129204 -1051643 -1048866 -992830 -525684
28432 -525684 -799914 -612335 -14620 -30180 37124 -607866 -186463 -216002 236647 714282
28422 714282 186221 -833824 -690663 -349843 -676237 -1042970 -836254 109023 561979
28413 561979 251896 139257 -255117 227499 226898 396651 84132 -566179 -508949 49976
28403 49976 -57577 -467067 -211492 -1068061 -1111384 -680203 -323033 -708928 -1096032 -660955
28393 -660955 -433227 -866078 -1045200 -797018 -573690 92814 858930 210876 -574714 -685638
28383 -685638 -803366 -1168998 -2006316 -1669762 -460109 -682632 -375926 144336 389017
$$ packed form
28453g93196L12085N21410m97214j68883K49588L64686j29421j37928L6588K71409
28443B9124k50206M6669o23157K82897n27921O6924j53534P7561K777N6036M67146
28432e25684k74230J87579N97715j5560O7304o44990M21403k9539M52649M77635
28422G14282n28061j020045J43161L40820l26394l66733K06716R45277M52956
28413E61979l10083j12639l94374M82616o01J69753l12519o50311N7230N58925
28403D9976j07553m09490K55575q56569m3323M31181L57170l85895l87104M35077
28393f60955K27728m32851j79122K48182K23328O66504P66116o48054p85590j10924
28383f85638j17728l65632q37318L36554J209653k22523L06706N20262K44681
$$ plain form
28374 389017 354828 69334 -835175 -966854 -363754 -181492 148220 277189 442393 -300739
28364 -300739 -32120 138007 196573 -174670 -328607 -76311 52460 -288934 -465618 -647888
28354 -647888 -966145 -359194 -502093 -1312834 -324009 304354 -133043 -489171 321147 -272619
28344 -272619 -705962 -841432 -856346 -2443 -345754 281126 707074 209279 -299277 -208245
28334 -208245 189640 -355865 -721338 -384545 -703170 -178383 526743 106532 -608317 -432615
28324 -432615 -116892 -370403 -518259 -704013 -1083809 -669049 -214144 -768452 -910894 -595301
28314 -595301 -605817 -1298215 -698420 -149486 -38984 -309021 -862215 -483999 -587836 -45588
28304 -45588 -171277 174743 417430 -240941 -1100732 -514526 -170425 -146589 -688115 -799177
$$ packed form
28374C89017l4189k85494r04509j31679O03100J82262L29712J28969J65204p43132
28364c00739K68619J70127N8566l71243j53937K52296J28771l41394j76684j82270
28354f47888l18257O06951j42899q10741R88825O28363m37397l56128Q10318n93766
28344b72619m33343j35470j4914Q53903l43311O26880M25948m97795n08556R1032
28334b08245L97885n45505l65473L36793l18625N24787P05126m20211p14849J75702
28324d32615L15723k53511j47856j85754l79796M14760M54905n54308j42442L15593
28314e95301j0516o92398N99795N48934J10502k70037n53194L78216j03837N42248
28304d5588j25689L46020K42687o58371q59791N86206L44101K3836n41526j11062
$$ plain form
28294 -799177 68110 496974 368961 -214791 -547537 -544626 -148407 -1009977 -546432 -244318
28284 -244318 -973584 -1062390 -551201 -588160 -770439 -871525 -1315029 -1884481 -2390042 -1567188
28274 -1567188 -920316 -809155 -813240 -128035 -380308 -671990 170419 -234919 -1529247 -918848
28264 -918848 -637796 -205118 -1090 -70401 -1039979 -697722 -961588 -1081389 -259988 -53558
28254 -53558 79735 259398 -302090 -232662 135600 148285 293475 -365855 -752710 -622357
28244 -622357 -1229491 -787981 -690698 -721541 -718672 -699731 -369391 31850 407001 143757
28234 143757 493538 124459 -22333 112562 -101221 -49604 162884 2799 116801 384532
28224 384532 -222632 -682720 -760205 -491289 -1570229 -1573108 -1048872 -604758 -309516 -1047720
$$ packed form
28294g99177Q67287M28864j28013n83752l32746K911L96219q61570M63545L02114
28284b44318p29266q8806N11189l6959j82279j01086m43504n69452n05561Q22854
28274a567188O46872J11161m085O85205k52273k91682Q42409m05338j294328O10399
28264i18848K81052M32678K04028o9311r69578L42257k63866j19801Q21401K06430
28254e3558J33293J79663n61488O9428L68262J2685J45190o59330l86855J30353
28244f22357o07134M41510R7283l0843K869J8941L30340M01241L75151k63244
28234A43757L49781l69079j46792J34895k13783N1617K12488j60085J14002K67731
28224C84532o07164m60088p7485K68916j078940k879N24236M44114K95242p38204
$$ plain form
28214 -1047720 -922661 -127258 -318553 -364545 -283667 -626605 -191231 78498 -483548 -1787474
28204 -1787474 -794592 -157959 -282165 109566 -104034 -275655 209357 423698 373575 319886
28194 319886 20715 94082 -1044139 -773325 -60577 -478204 -303062 -316453 -348273 -742920
28184 -742920 -495800 -447300 -723420 -981567 -229057 271327 136778 -495381 -526491 -984480
28174 -984480 -759549 -503725 -690954 -465253 -299657 440871 957533 32434 -4222 -337999
28164 -337999 -78527 -74519 -41959 -152200 -319324 17246 -129216 73320 214761 570488
28154 570488 169236 350725 132852 -254289 -481830 -1017714 -767124 -815822 -874489 -668162
28144 -668162 204963 852866 729054 68063 108533 -28471 -325489 -401828 -792188 -1525223
$$ packed form
28214a047720J25059P95403j91295m5992Q0878l42938M35374K69729n62046j303926
28204a787474R92882O36633j24206L91731k13600j71621M85012K14341n0123n3689
28194C19886k99171P3367j138221K70814P12748m17627J75142j3391l1820l94647
28184g42920K47120M8500k76120k58147P52510N00384j34549o32159l1110m57989
28174i84480K24931K55824j87229K25701J65596P40528N16662r25099l6656l33777
28164c37999K59472M008L2560j10241j67124L36570j46462K02536J41441L55727
28154E70488m01252J81489k17873l87141k27541n35884K50590m8698n8667K06327
28144f68162Q73125O47903j23812o60991M0470j37004k97018p6339l90360p33035
$$ plain form
28134 -1525223 -1046906 114777 959096 395142 -328630 -1362711 -753447 -263248 118587
28125 118587 -821963 -508646 133736 31144 133789 -178394 -103674 -300350 -1200126 -1105659
28115 -1105659 -1231960 -198440 -557734 -1527373 -969421 -1245869 -1533274 -1385459 -463521
28106 -463521 197039 -247292 -428444 -757375 -470624 251838 425330 136671 -79191 53490
28096 53490 -143731 -259411 -336894 -247362 -252037 -821036 -403966 -210861 -141535 -145076 -434880
28085 -434880 -837952 -1634458 -1548990 -715232 -86796 -383884 -334116 -1039221 -878038 -688138
28075 -688138 -1209967 -610840 319581 -143125 -679354 -605570 -187611 721932 252404 -118529
28065 -118529 -31859 -700373 -1601990 -1259429 -1219455 -312440 -247036 -152034 -295004 -1434115
$$ packed form
28134a525223M78317J161683Q44319n63954p23772j034081O09264M90199L81835
28125A18587r40550L13317O42382j02592J02645l12183P4720j96676q99776R4467
28115a105659j26301J033520l59294r69639N57952k76448k87405J47815R21938
28106d63521O60560m44331j81152l28931K86751P22462J73492k88659k15862J32681
28096E3490j97221j15680p7483Q9532m675n68999M17070J93105O9326l541k89804
28085d34880m03072p96506Q5468Q33758O28436k97088M9768p05105J61183J89900
28075f88138n21829N99127R30421m62706n36229P3784M17959R09543m69528l70933
28065a18529Q6670o68514r01617L42561L9974R07015O5404R5002j42970j139111
$$ plain form
28055 -1434115 -583743 -87292 -843897 -469327 -634843 -400020 -109306 -262495 -129837
28046 -129837 -214918 167356 61638 -477605 -921144 -1141437 -779352 -768741 -567115 -618963
28036 -618963 -516426 -192974 -95116 78018 284713 34035 -461578 28198 392769 632385
28026 632385 950772 1276889 907912 357864 211443 514986 682365 148627 220143 120228
28016 120228 -606516 243074 595846 36333 -432866 -9673 113749 45832 441466 -420125
28006 -420125 -600903 53381 241715 -686472 -125507 -526727 -1356083 -464236 -922813 -838222
27996 -838222 -835430 -613395 162689 201875 -360113 -789026 -345512 -157784 -374961 -925369
27986 -925369 -917410 -853582 -1069235 -853466 -699152 5248 -102445 -48059 -768327 -1411261
$$ packed form
28055a434115Q50372M96451p56605L74570j65516K34823K90714j53189J32658
28046a29837q5081L82274j05718n39243m43539k20293L62085J0611K01626n1848
28036f18963J02537L23452R7858J73134K06695k50678m95613M89776L64571K39616
28026F32385L18387L26117l68977n50048j46421L03543J67379n33738P1516r9915
28016A20228p26744Q49590L52772n59513m69199M23193J23422o7917L95634q61591
28006d20125j80778O54284J88334r28187N60965m01220q29356Q91847m58577Q4591
27996h38222K792K22035P76084L9186n61988m28913M43514J87728k17177n50408
27986i25369P959O3828k15653K15769J54314P04400j07693N4386p20268o42934
$$ plain form
27976 -1411261 -757877 162152 614276 388815 -237522 -207787 -421877 -645091 -369228 394667
27966 394667 59869 283833 -356798 -1445080 -1877548 -2143403 -2372921 -1269354 -535110
27957 -535110 -861055 -1047706 -819623 -941306 -378172 -317551 -500220 -375594 249036 -346358
27947 -346358 -463208 -603833 -686581 -103579 26769 -332351 -694924 -573012 -1374614 -1306470
27937 -1306470 -963079 -828982 -530076 -238784 -975941 -1047146 -750651 -504898 -445123 -1249623
27927 -1249623 -1047612 -446753 382276 467814 -74755 -662734 -642477 -122050 -431269 140430
27917 140430 -412056 -875051 -253798 -877666 -675868 -658264 -285187 -529533 -454548 -565060
27907 -565060 84053 636311 517650 422547 49568 944168 -172174 -466708 -935223 -906509
$$ packed form
27976a411261O53384R20029M52124k25461o26337K9735k14090k23214K75863P63895
27966C94667l34798K23964o40631j088282m32468k65855k29518J103567P34244
27957e35110l25945j86651K28083j21683N63134O0621j82669J24626O24630n95394
27947c46358j16850j40625q2748N83002J30348l59120l62573J21912q01602O8144
27937a306470L43391J34097K98906K91292p37157p1205K96495K45753N9775q04500
27927a249623K02011O00859Q29029Q5538n42569n87979K0257N20427l09219N71699
27917A40430n52486m62995O21253o23868K01798J7604L73077k44346P4985j10512
27907e65060O49113N52258j18661r5103l72979Q94600j116342k94534m68515K8714
$$ plain form
27897 -906509 -671301 -198105 205389 -124227 159539 27448 74890 -608757 -626431 41007
27887 41007 72250 37160 289167 186995 -166328 -771099 -445621 -190885 -691589 -348014
27877 -348014 -610741 -1024121 -919218 122931 23707 -823490 -445543 -8999 -347868 -235823
27867 -235823 -170131 127658 424415 172665 -75516 -556603 -264078 -97317 380560 700828
27857 700828 413645 88537 -339273 -435178 -23237 132869 -366554 -530985 -611407 -325431
27847 -325431 -682322 -1090017 -903551 -255957 548961 320580 44407 -502669 -598034 24978
27837 24978 456278 348000 339890 228402 545865 1079305 433360 -870318 -712548 -596848
27827 -596848 -407932 -570090 -268022 215435 77321 -173181 -554846 -286893 -355982 -645282
$$ packed form
27897i06509K35208M73196M03494l29616K83766j32091M7442o83647j7674O67438
27887D1007L1243l5090K52007j02172l53323o04771L25478K54736n00704L43575
27877c48014k62727m13380J04903J042149r9224q47197L77947M36544l38869J12045
27867b35823O5692K97789K96757k51750k48181m81087K92525J66761M77877L20268
27857G00828k87183l25108m27810r5905M11941J56106m99423j64431q0422K85976
27847c25431l56891m07695J86466O47594Q04918k28381k76173n47076r5365O23012
27837B4978M31300j08278q110j11488L17463N33440o45945j303678J57770J15700
27827e96848J88916j62158L02068M83457j38114k50502l81665K67953o9089k89300
$$ plain form
27817 -645282 -113078 -555097 -184948 -401319 -551300 -1359176 -1397121 -1287912 -1238687 -516352
27807 -516352 -426911 -537181 -660896 -733626 -138297 -425630 -1151616 -883949 -750913 -388738
27797 -388738 -209544 -265676 -376485 65075 -58171 -859869 -1526043 -850771 -287501 -1054713
27787 -1054713 -1322093 -869800 -904598 -1127877 -1013791 -783490 -1288552 -1193592 -1248666 -812147
27777 -812147 -498869 62449 490632 -292960 -1234297 -616527 -218096 -185631 36639 -72198
27767 -72198 176355 -810925 -937917 -904529 -1151754 -1527994 -938539 -58467 313798 -232430
27757 -232430 -704862 -635041 -850075 -652324 -109711 686633 588330 -43697 -1024493 -559713
27747 -559713 -566772 -483149 -163604 -433405 -947520 -894296 -197916 -740848 -1769805 -1332886
$$ packed form
27817f45282N32204m42019L70149k16371j49981q07876l7945J09209M9225P22335
27807e16352Q9441j10270j23715p2730N95329k87333p25986K67667J33036L62175
27797c88738J79194n6132j10809M41560j23246q01698o66174O75272N63270p67212
27787a054713k67380M52293l4798k23279J14086K30301n05062R4960n5074M36519
27777h12147L13278N61318M28183p83592r41337O17770L98431L2465K22270j08837
27767g2198K48553r87280j26992L3388k47225l76240N89455Q80072L72265n46228
27757b32430m72432O9821k15034J97751N42613P96344r8303o32027r80796M64780
27747e59713p059Q3623L19545k69801n14115N3224O96380n42932j028957M36919
$$ plain form
27737 -1332886 -443107 -145771 -253797 -362375 -147257 210315 -257874 -402766 -735043
27728 -735043 -1620848 -1398547 -912744 -888264 -1006361 -1557692 -912185 -87724 139479 -521178
27718 -521178 -798260 -946721 -387950 -2001 -787776 -537322 25137 537219 -533578
27709 -533578 -817430 -629441 -507651 -408359 95727 -343552 -656698 -151645 -67984 -357979
27699 -357979 550691 675581 426977 -93109 -409872 -298997 166311 -894792 -2221319
27690 -2221319 -1584522 -314177 -524639 -388586 -130624 36892 -501904 -1172179 -1101102
27681 -1101102 -961558 -894023 -770755 212410 -29946 -1441395 -1736515 -1022157 -632072
27672 -632072 -384912 34422 -36492 -29778 -903414 -949829 -796898 -532358 -401557 247427
$$ packed form
27737a332886Q89779K97336j08026j08578K15118L57572m68189j44892l32277
27728g35043q85805K22301M85803K4480j18097n51331O45507Q24461K27203o60657
27718e21178k77082j48461N58771L85949p85775K50454N62459N12082j070797
27709e33578k83852J87989J21790R9292N04086m39279l13146N05053Q3661k89995
27699c57979R08670J24890k48604n20086l16763J10875M65308j061103j326527
27690b221319O36797J270345k10462J36053K57962J67516n38796o70275P1077
27681a101102J39544O7535J23268R83165k42356j411449k95120P14358L90085
27672f32072K47160M19334p0914O714q73636m6415J52931K64540J30801O48984
$$ plain form
27662 247427 -298035 -453155 -329841 -279398 -150634 -219100 -160151 -323012 -305347 436870
27652 436870 609627 -71687 -262765 -401078 -1378185 -1062293 -301158 -821925 -829518 89725
27642 89725 -721072 -1118668 -1648633 -895843 -6052 -178674 80815 898033 850675 213784
27632 213784 52897 -67877 -602694 -531808 -157664 -666139 -751776 -385427 -755239 4965
27622 4965 -341296 -169556 -645052 -1405083 -1388223 -784408 -118525 127803 151888 -25435
27612 -25435 -435073 520023 -293485 -854502 -116169 806457 -614494 -1415895 -1701400 -1365353
27602 -1365353 -1397833 -1216833 -13349 -333371 775933 959495 -265880 -503951 -272344
27593 -272344 -325814 -130346 -853546 -958884 -185966 -331231 -1018361 -693577 -965289 -437363
$$ packed form
27662B47427n45462j55120J23314N0443J28764o8466N8949j62861J7665P42217
27652D36870J72757o81314j91078j38313r77107L15892P61135n20767p593R19243
27642H9725q10797l97596n29965P52790Q89791j72622K59489Q17218m7358o36891
27632B13784j60887j20774n34817P0886L74144n08475q5637L66349l69812P60204
27622D965l46261J71740m75496p60031J6860O03815O65883K46328K4085j77323
27612b5435m09638R55096q13508n61017P38333R22626j420951q01401k85505L36047
27602a365353l2480J81000J203484l20022J109304J83562j225375k38071K31607
27593b72344n3470J95468p23200j05338P72918j45265o87130L24784k71712N27926
$$ plain form
27583 -437363 -642903 -964601 -995766 -997252 -699088 -784376 -378595 418212 -346708 -778355
27573 -778355 -850080 -1288071 -1124495 -928192 -1149142 -328008 -488790 -702459 -514874 -873899
27563 -873899 -1123206 -693044 -674392 -943142 -687538 -460521 -747995 -393175 -136189 -2735
27553 -2735 349148 21672 48164 444540 93522 38308 -34453 -10394 -311046 -81689 -103914
27542 -103914 -213952 74709 -566449 -670832 -1210001 -393787 -191049 -192314 -184347 -760724
27532 -760724 -539919 -622291 -371972 -108880 -556764 373463 909060 554112 -382894 -1039510
27522 -1039510 -929657 -1749532 -2058097 -1115824 -297063 -80278 262774 173956 5041 -221088
27512 -221088 -9643 -28732 41800 -565998 -909961 -194649 -685602 -886302 -583269 -659304
$$ packed form
27583d37363k05540l21698l1165j486K98164q5288M05781P96807p64920m31647
27573g78355p1725m37991J63576J96303k20950Q21134j60782k13669J87585l59025
27563h73899k49307M30162J8652k68750K55604K27017k87474L54820K56986J33454
27553b735L51883l27476K6492L96376l51018n5214p2761K4059l00652K29357k2225
27542a03914j10038K88661o41158j04383n39169Q16214K02738j265P967n76377
27532g60724K20805q2372K50319K63092m47884R30227N35597l54948r37006o56616
27522a039510J09853q19875l08565R42273Q18761K16785L43052q8818j68915k26129
27512b21088K11445j9089P0532o07798l43963P15312m90953k00700L03033p6035
$$ plain form
27502 -659304 -11412 -694688 -893880 -460756 -215391 174045 258651 178370 451659 494283
27492 494283 175995 642911 166330 -541241 -689089 147185 242958 343731 254026 -844784
27482 -844784 -890055 9198 -382682 -869055 -849559 -303387 310459 469177 57132 -88086
27472 -88086 26662 -410506 178060 433234 -147654 -224989 -191275 -489349 -29952 -152109
27462 -152109 250017 -314255 -778311 -597094 -645585 -1403428 -1533263 -542414 370883 937528
27452 937528 761975 424181 -78788 -505139 -450792 -282934 -159997 -397486 -154290 1097886
27442 1097886 952041 131688 -976335 -341777 -1533 99238 397090 -479690 -660419
27433 -660419 -158996 501692 40571 61788 -345656 -707129 -813431 -867406 -633799 -491276
$$ packed form
27502f59304O47892o83276j99192M33124K45365L89436Q4606q0281K73289M2624
27492D94283l18288M66916m76581p07571j47848Q36274R5773J00773q9705j098810
27482h44784m5271Q99253l91880m86373J9496N46172O13846J58718m12045j45218
27472h8086J14748m37168N88566K55174n80888p7335L3714k98074M59397j22157
27462a52109M02126n64272m64056J81217m8491p57843j29835R90849R13297N66645
27452I37528j75553l37794n02969m26351N4347J67858J22937k37489K43196J252176
27442A097886j45845q20353j108023O34558L40244J00771K97852q76780j80729
27433f60419N01423O60688m61121K1217m07444l61473j06302n3975K33607J42523
$$ plain form
27423 -491276 542754 193524 -732418 -173930 -444161 -1181342 -681646 -608082 -574223 -473509
27413 -473509 -489305 -402653 -791070 -451933 -675999 -491820 -409565 -618175 -862810 -853053
27403 -853053 -431759 -8534 -239364 -407659 138391 -297641 -673845 -948436 -290066 -588729
27393 -588729 -1036610 -805669 -814910 -19379 318029 78211 -606038 -763615 -835472 -525930
27383 -525930 -156855 192651 207974 -77688 -879001 -1601697 -887178 -369473 -96866 570264
27373 570264 257806 -117740 200467 159044 -380898 59101 -73226 -540506 274204 787379
27363 787379 -206945 35749 233548 51124 -843322 -636899 -635523 -454714 -394065 -335981
27353 -335981 -1112771 -1247778 -619355 -804931 -426159 -337641 163109 -7668 -561426 115603
$$ packed form
27423d91276J034030l49230r25942N58488k70231p37181M99696P3564L3859J00714
27413d73509j5796Q6652l88417L39137k24066J84179Q2255k08610k44635R757
27403h53053M21294M23225k30830j68295N46050m36032l76204k74591O58370k98663
27393e88729m47881K30941r241P95531L37408k39818o84249j57577p1857L09542
27383e25930L69075L49506J5323k85662q01313p22696P14519N17705K72607O67130
27373E70264l12458l75546L18207m1423n39942M39999j32327m67280Q14710N13175
27363G87379r94324K42694J97799j82424q94446K06423J376J80809O0649N8084
27353c35981p76790j35007O28423j85576L78772Q8518N00750j70777n53758O77029
$$ plain form
27343 115603 109622 77923 788033 476264 -123690 -278261 -145462 -527086 -348348 151487
27333 151487 -619063 -908060 -1339552 -1369892 -499072 13585 535175 514884 538359 62296
27323 62296 -116192 -155963 70048 605860 798969 720177 222903 -252002 347920 687843
27313 687843 793531 329730 -48636 -244395 -159927 -467296 -942343 -395890 -280175 -94775
27303 -94775 -559404 -656778 -1094059 -480521 -480595 -507851 -8635 -137748 57430 533685 548343
27292 548343 284981 65668 -684286 -360603 -188258 -212702 -457602 -15292 445316 -355308
27282 -355308 -69462 320947 454317 440120 564460 899178 675874 671127 110138 -90904
27272 -90904 -386499 112810 -4147 -130338 -251315 -632082 25215 393515 313507 143759
$$ packed form
27343A15603n981l1699P10110l11769n99954j54571J32799l81624J78738M99835
27333A51487p70550k88997m31492l0340Q70820N12657N21590k0291K3475m76063
27323F2296j78488l9771K26011N35812J93109p8792m97274m74905N99922L39923
27313F87843J05688m63801l78366j95759Q4468l07369m75047N46453J15715J85400
27303i4775m64629r7374m37281O13538p4k7256M99216j29113J95178M76255J4658
27292E48343k63362k19313p49954L23683J72345k4444k44900M42310M60608q00624
27282c55308K85846L90409J33370j4197J24340L34718k23304m747n60989k01042
27272i0904k95595M99309j16957j26191j20977l80767O57297L68300q0008j69748
$$ plain form
27262 143759 308918 -344897 -1020099 -501408 -315395 -802244 -997544 -504944 -302933 266310
27252 266310 914558 1086205 1483523 1037558 64921 -87325 319875 -31795 620824 813428
27242 813428 47089 -73630 429040 1338739 501294 -156365 -156443 127888 437985 147190
27232 147190 -216527 -556150 -537814 790946 443936 1415071 1129444 648093 242660 -197819
27222 -197819 -170417 -538064 141198 612658 841531 113707 -47729 203786 -7498 -201607
27212 -201607 45344 728976 970047 505956 -118422 -487003 -394098 -398598 158836 -165263
27202 -165263 -535748 -339619 -543992 -927708 -822452 -572437 -646637 -184092 -249052 -828774
27192 -828774 -641251 -1016323 -988890 -12059 -308280 -152850 -220389 457821 198214 -84352
$$ packed form
27262A43759J65159o53815o75202N18691J86013m86849j95300M92600K02011N69243
27252B66310O48248J71647L97318m45965r72637j52246M07200l51670O52619J92604
27242H13428p66339j20719N02670R09699q37445o57659p8K84331L10097k90795
27232A47190l63717l39623J8336J328760l47010R71135k85627m81351m05433m40479
27222a97819K7402l67647O79262M71460K28873p27824j61436K51515k11284j94109
27212b01607K46951O83632K41071m64091o24378l68581R2905m500N57434l24099
27202a65263l70485J96129k04373l83716J05256K50015p4200M62545o4960n79722
27192h28774J87523l75072K7433R76831k96221J55430o7539O78210k59607k82566
$$ plain form
27182 -84352 -360433 -58086 317946 708709 954784 942036 904519 1089174 1779734 1769220
27172 1769220 935344 76546 -62028 495502 1132235 1111775 55754 -221939 -372081
27163 -372081 -767890 -759191 -48539 80806 930240 848576 385026 1279050 1540845 1369359
27153 1369359 629389 202957 -378509 29554 -41807 -582542 -161317 -306051 127453 1023365
27143 1023365 832550 1067615 1237055 823711 677111 1311370 1288394 331986 -19583 843908
27133 843908 1560187 2029436 2117478 1722443 1150797 1312424 1551827 2443736 2746388 2495674
27123 2495674 2611892 2971836 3360839 3182043 2524385 2540782 3080160 3479385 3639688 3275303
27113 3275303 2746510 1807401 1764794 2864385 2504737 3230827 3751987 2786085 2234586
$$ packed form
27182h4352k76081L02347L76032L90763K46075j2748l7517J84655O90560j0514
27172A769220q33876q58798j38574N57530O36733k0460j056021k77693j50142
27163c72081l95809Q699P10652J29345Q49434q1664m63550Q94024K61795j71486
27153A369359p39970m26432n81466M08063p1361n40735M21225j44734M33504Q95912
27143A023365j90815K35065J69440m13344j46600O34259k2976r56408l51569Q63491
27133H43908P16279M69249Q8042l95035n71646J61627K39403Q91909L02652k50714
27123B495674J16218L59944L89003j78796o57658J6397N39378L99225J60303l64385
27113C275303n28793r39109m2607J099591l59648P26090N21160r65902n51499
$$ plain form
27104 2234586 2461322 2568550 2094463 1937097 1661975 1686778 854666 -100781 201785 449175
27094 449175 31390 408966 688233 627202 1264893 1374925 860768 314113 449070 444443
27084 444443 247455 1028441 1310317 1427029 1029101 792300 1258065 1116430 787049 863651
27074 863651 579826 505717 1465942 1102553 1108236 746985 767010 982270 783514 1358818
27064 1358818 1412469 1336667 1242762 1326413 1222557 1768009 2944017 3104777 2119630 1497826
27054 1497826 1397680 1776530 2595085 2750987 2308024 2505011 2050228 1888226 1818255 1238306
27044 1238306 1079790 1061578 1483087 1584594 1757835 2376857 2879510 2371347 2305853 2165641
27034 2165641 1576953 1575619 2083698 2006897 1796395 2094519 2201523 2047121 2907948 2970308
$$ packed form
27104B234586K26736J07228m74087j57366k75122K4803q32112r55447L02566K47390
27094D49175m17785L77576K79267o1031O37691J10032n14157n46655J34957m627
27084D44443j96988P80986K81876J16712l97928k36801M65765j41635l29381P6602
27074H63651k83825p4109R60225l63389N683l61251K0025K15260j98756N75304
27064A358818N3651p5802r3905Q3651j03856N45452J176008J60760r85147o21804
27054A497826j00146L78850Q18555J55902m42963J96987m54783j62002o9971n79949
27044A238306j58516j8212M21509J01507J73241O19022N02653n08163o5494j40212
27034B165641n88688j334N08079p6801k10502K98124J07004j54402Q60827O2360
$$ plain form
27024 2970308 2548315 2426857 3417931 4382398 3948091 4046043 4630563 4919782 5252019 5490595
27014 5490595 6541410 6849196 7548843 7707066 8107950 9291308 10680163 11747512 13529072
27005 13529072 15298588 17319276 19423530 22316122 26439449 30652508 36923717 45050744
26997 45050744 55958804 71467024 93504138 126473098 168324683 206825337 222469516
26990 222469516 213958491 205499791 215853074 241669788 265351407 267478551 251689861
26983 251689861 239587398 250528719 291699864 356851232 419301454 440214319 412990096
26976 412990096 382137534 383549042 415761625 444379944 427755619 365371884 299564962
26969 299564962 258430995 246827547 255692510 270394687 269080028 247282462 223380373
$$ packed form
27024B970308m21993j21458R91074R64467m34307R7952N84520K89219L32237K38576
27014E490595J050815L07786O99647J58223M00884J183358J388855J067349J781560
27005A3529072J769516K020688K104254K892592M123327M213059O271209Q127027
26997D5050744J0908060J5508220K2037114L2968960M1851585L8500654J5644179
26990B22469516q511025q458700J0353283K5816714K3681619K127144j5788690
26983B51689861j2102463J0941321M1171145O5151368O2450222K0912865k7224223
26976D12990096l0852562J411508L2212583K8618319j6624325o2383735o5806922
26969B99564962m1133967j1603448Q864963J4702177j314659k1797566k3902089
$$ plain form
26962 223380373 215013316 222713663 230464616 217058384 180043935 138652784 106331529
26955 106331529 84335835 68809994 57420308 48846289 42451916 37609519 33646068
26948 33646068 29430346 25984194 22710703 20581677 18032920 16914336 16020977 15331571
26940 15331571 14247957 13101031 12136162 12265188 12164861 11172670 10530385 9299621 8624345
26931 8624345 7719081 6594310 6975669 5688289 5146508 5284050 4632409 4878762 4701033
26922 4701033 4505538 4134411 3912719 3420891 2658557 2290030 2398758 2718639 3328724
26913 3328724 3382517 3615222 2798978 3002153 2679222 2637929 2990760 2847957 1946732 1747578
26903 1747578 1707206 1155129 1882383 1748362 1145817 2041044 2283812 1913203 957250 1429136
$$ packed form
26962B23380373q367057P700347P750953j3406232l7014449m1391151l2321255
26955A06331529k1995694j5525841j1389686q574019o394373m842397l963451
26948C3646068m215722l446152l273491k129026k548757j118584q93359o89406
26940A5331571j083614j146926r64869J29026j00327r92191o42285j230764o75276
26931H624345r05264j124771L81359j287380n41781J37542o51641K46353j77729
26922D701033j95495l71127k21692m91828p62334l68527J08728L19881O10085
26913C328724N3793K32705q16244K03175l22931m1293L52831j42803r01225j99154
26903A747578m0372n52077P27254j34021o02545Q95227K42768l70609r55953M71886
$$ plain form
26893 1429136 1858853 1171634 1740641 2800178 2240018 1975336 1857552 1655481 1818660
26884 1818660 1396138 660046 378158 -102230 230670 231363 556076 848111 775827 618366
26874 618366 -15772 111618 1000 519932 295167 368525 284989 367160 835120 1840148
26864 1840148 1556827 850154 362268 783006 1072925 1132462 978470 755720 453399 352113
26854 352113 999013 1486118 796691 755993 573211 1296307 1435110 45474 -359375 340959
26844 340959 530761 468910 364293 133007 773102 865093 981724 963567 837511 943980
26834 943980 352485 575437 145498 252167 382006 509452 429159 53355 983878 743049
26824 743049 568699 798829 691219 1507525 1609276 830283 -236551 -446444 120644
$$ packed form
26893A429136M29717o87219N69007J059537n60160k64682j17784k02071J63179
26884A818660m22522p36092k81888m80388L32900O93L24713K92035p2284j57461
26874F18366o34138J27390j10618N18932k24765P3358q3536Q2171M67960J005028
26864A840148k83321p06673m87886M20738K89919N9537j53992k22750l02321j01286
26854C52113O46900M87105o89427m0698j82782P23096J38803j389636m04849P00334
26844C40959J89802o1851j04617k31286O40095R1991J16631j8157j26056J06469
26834I43980n91495K22952m29939J06669J29839J27446q0293l75804R30523k40829
26824G43049j74350K30130j07610Q16306J01751p78993j066834k09893N67088
$$ plain form
26815 120644 350279 899172 954615 802432 1317527 737780 1281930 1634897 1526082 1096082
26805 1096082 842781 721431 1039375 1447240 2399972 1653316 1410289 1264370 2038064
26796 2038064 2781253 2970991 2205350 1505807 1889409 1945287 2349415 2579090 2109566 1262391
26786 1262391 676359 1811266 2295058 2339455 2276116 982899 751862 1626899 1854290
26777 1854290 1667994 1814598 1862622 1974206 1529051 800816 976711 222553 462168 211179
26767 211179 329476 -87 45267 193110 -423848 -120612 379022 84032 -226555 168773
26757 168773 -777695 -1149503 -156417 135286 134457 601483 849038 729475 216196 -83093
26747 -83093 -922554 -54499 484740 581769 1011660 579486 237761 555768 382846 252116
$$ packed form
26815A20644K29635N48893N5443j52183N15095n79747N44150L52967j08815m30000
26805A096082k53301j21350L17944M07865R52732p46656k43027j45919P73694
26796B038064P43189J89738p65641o99543L83602N5878M04128K29675m69524q47175
26786A262391n86032J134907M83792M4397o3339j293217k31037Q75037K27391
26777A854290j86296J46604M8024J11584m45155p28235J75895p54158K39615k50989
26767B11179J18297l29563M5354J47843o16958L03236M99634k94990l10587L95328
26757A68773r46468l71808R93086K91703q29M67026K47555j19563n13279k99289
26747h3093q39461Q68055N39239R7029M29891m32174l41725L18007j72922j30730
$$ plain form
26737 252116 582269 604218 492942 774041 292066 113858 -391763 321348 588728 149456
26727 149456 -22235 -1208971 -449644 -134975 354329 377561 -85360 308958 11920 -374384
26717 -374384 -787470 -1013902 -829320 -162132 -57686 -1055457 -827989 -409223 -690550 -263093
26707 -263093 -174797 279073 288241 404955 737367 543390 -216573 -665426 -468134 -740870
26697 -740870 -669288 317179 696146 137018 -613813 -1425734 -1673572 -946727 -452888 -1065195
26687 -1065195 -530322 -455719 -156631 61922 -289061 -194737 -46759 -788199 -102033 -203650
26677 -203650 -122607 178668 183055 979988 713069 -74005 -733232 -609224 -143357 125278
26667 125278 512279 428122 345999 57358 -152864 -368097 -472774 -787394 -452465 -525258
$$ packed form
26737B52116L30153K1949j11276K81099m81975j78208n05621P13111K67380m39272
26727A49456j71691j186736P59327L14669M89304K3232m62921L94318k97038l86304
26717c74384m13086k26432J84582O67188J04446r97771K27468M18766k81327M27457
26707b63093Q8296M53870R168J16714L32412j93977p59963m48853J97292k72736
26697g40870P1582R86467L78967n59128p50831q11921k47838P26845M93839o12307
26687a065195N34873P4603K99088K18553l50983R4324J47978p41440O86166j01617
26677b03650Q1043L01275M387P96933k66919p87074o59227J24008M65867K68635
26667A25278L87001q4157q2123k88641k10222k15233j04677l14620L34929p2793
$$ plain form
26657 -525258 -802809 -156450 341966 165903 275480 169609 -262647 -228768 -99981 1111452
26647 1111452 404389 -250615 69022 255067 53552 328763 114831 -270594 -7419
26638 -7419 -248506 -429828 -406613 -559078 -713206 -583788 -633938 -867922 -719443 -981190
26628 -981190 -646200 -1092092 -274062 152985 -569691 -359835 30430 -263412 100576 94406
26618 94406 -378078 -563450 -532747 -384798 318393 549465 -50878 291805 382442 177
26608 177 -489359 -209770 -356744 56441 693160 933586 659355 209658 -354865 -955992
26598 -955992 -444142 -362648 -338176 -120739 -345439 -928291 -1240201 -161669 1220278 1281540
26588 1281540 138318 -715566 -773756 -488063 -136089 565122 431676 676433 434750
$$ packed form
26657e25258k77551O46359M98416j76063J09577j05871m32256L3879J28787J211433
26647A111452p07063o55004L19637J86045k01515K75211k13932l85425K63175
26638g419k41087j81322K3215j52465j54128J29418n0150k33984J48479k61747
26628i81190L34990m45892Q18030M27047p22676K09856L90265k93842L63988o170
26618I4406m72484j85372L0703J47949P03191K31072o00343L42683R0637l82265
26608A77m89536K79589j46974M13185O36719K40426k74231m49697n64523o01127
26598i55992N11850Q1494K4472K17437k24700n82852l11910J078532J381947O1262
26588A281540j143222q53884n8190K85693L51974P01211j33446K44757k41683
$$ plain form
26579 434750 313059 -830388 -894274 -67443 542553 738693 326208 116180 186672 17361
26569 17361 -108222 -354415 -1055373 -1115606 -687361 -385873 494219 1054299 335237 380897
26559 380897 173566 44072 58974 -958882 -1187732 -580154 -990382 -1299567 -1475320 -1541670
26549 -1541670 -2784669 -2257384 -1267637 -428402 -951357 -1448751 -876478 -42793 -178166
26540 -178166 -891044 -689259 285155 831625 699322 316236 321704 228126 -101682 -306478
26530 -306478 -1952 1321223 416988 -406665 -532505 -561511 -193436 -445446 65208 155388
26520 155388 -149890 -541098 -1433286 -1269166 -802914 -889098 -671361 -1253787 -665367 -272417
26510 -272417 -141439 375719 619580 943768 1016607 23526 -558894 -1299337 -709863 157198
$$ packed form
26579D34750j21691j143447o3886Q26831O09996J96140m12485k10028P0492j69311
26569A7361j25583k46193p00958o0233M28245L01488Q80092N60080p19062M5660
26559C80897k07331j29494J4902j017856k28850O07578m10228l09185j75753o6350
26549a541670j242999N27285R89747Q39235n22955m97394N72273Q33685j35373
26540a78166p12878K01785R74414N46470j32303l83086N468r3578l29808k04796
26530c06478L04526J323175r04235q23653j25840k9006L68075k52010N10654R0180
26520A55388l05278l91208q92188J64120M66252q6184K17737n82426N88420L92950
26510b72417J30978N17158K43861L24188P2839r93081n82420p40443N89474Q67061
$$ plain form
26500 157198 -67614 267641 88193 704300 664929 169354 145373 21472 -446480 -561425
26490 -561425 -325191 -531732 -1361162 -1782720 -1166440 -81489 -418768 -1276967 -597823
26481 -597823 55051 215616 211937 -147151 -387890 -297375 369060 956038 108120 -272366
26471 -272366 -519976 -255842 -864922 -1048620 -1034851 -1045083 -142468 546470 858421 1321842
26461 1321842 1520744 996441 352216 250590 -292706 -592661 549823 1413435 864602
26452 864602 721637 325391 85409 227917 459428 213266 -346613 -258968 82974 -90177
26442 -90177 390630 -471978 -445290 -410001 -222849 -646939 -1274700 -975082 -120539 -515828
26432 -515828 -762506 -23847 -26884 218223 -123343 -1504418 -936727 -388795 -326602 -184811
$$ packed form
26500A57198k24812L35255j79448O16107l9371m95575k3981j23901m67952j14945
26490e61425K36234k06541q29430m21558O16280J084951l37279q58199O79144
26481e97823O52874J60565l679l59088k40739R0515O66435N86978q47918l80486
26471b72366k47610K64134o09080j83698J3769j0232R02615O88938L11951M63421
26461A321842J98902n24303o44225j01626n43296k99955J142484Q63612n48833
26452H64602j42965l96246k39982J42508K31511k46162n59879Q7645L41942j73151
26442i0177M80807q62608K6688L5289J87152m24090o27761K99618Q54543l95289
26432e15828k46678P38659l037K45107l41566j381075N67691N47932O2193J41791
$$ plain form
26422 -184811 -695456 -691109 -232983 209228 275350 -91395 -204188 -242639 -760329 -1284218
26412 -1284218 -1048809 -728352 -646793 -787321 -496347 -33889 161589 360269 452406 445283
26402 445283 -306398 -32389 -306452 -316782 313186 63509 -508774 -546160 464872 150421
26392 150421 385818 514380 -75888 -110650 348976 -368753 -20220 87855 -583255 -441213
26382 -441213 -183706 -1205324 -1039623 -303581 -427924 -519438 -637369 -427631 284796 -197248
26372 -197248 -970214 -1127686 -1092011 -773456 -382776 -326207 -874332 -1093545 -589782 -767582
26362 -767582 -1089659 -305561 285236 522943 250531 369524 441248 581910 7603 355203
26352 355203 698802 1008097 850674 -377841 -890654 -475074 -156034 -166140 491073 -19387
$$ packed form
26422a84811n10645M347M58126M42211O6122l66745j12793l8451n17690n23889
26412a284218K35409L20457Q1559j40528K90974M62458J95478J98680R2137p123
26402D45283p51681K74009k74063j0330O29968k49677n72283l7386J011032l14451
26392A50421K35397J28562n90268l4762M59626p17729L48533J08075o71110J42042
26382d41213K57507j021618J65701P36042j24343r1514j17931K09738P12427m82044
26372a97248p72966j57472L5675L18555L90680N6569n48125k19213N03763j77800
26362g67582l22077P84098N90797K37707k72412J18993P1724J40662n74307L47600
26352C55203L43599L09295j57423j228515n12813M15580L19040j0106O57213n10460
$$ plain form
26342 -19387 -659148 -676051 -1030116 -1082820 -1007704 -1091188 -949565 -414809 -546257 119842
26332 119842 -444580 -226683 -373860 160954 511253 -51726 -154990 -111745 -199431 -224053
26322 -224053 18641 511422 440517 152057 197340 304593 -48273 549482 317215 -681567
26312 -681567 -20667 759048 630275 173434 -170606 -1221701 -1975302 -654499 267564
26303 267564 527206 132098 175590 -302796 -879949 -979457 -768580 -197393 118163 222586
26293 222586 526904 190367 -279868 -646295 -976810 -704904 -927205 -589347 -589818 -690728
26283 -690728 -664217 -211452 486815 356133 -382535 -752694 -681917 -183278 26057 -644250
26273 -644250 -1542447 -578835 68521 -414966 -231310 7223 -480666 -484261 225388 -89243
$$ packed form
26342a9387o39761j6903l54065n2704P5116q3484J41623N34756j31448O66099
26332A19842n64422K17897j47177N34814L50299n62979j03264M3245q7686k4622
26322b24053K42694M92781p0905k88460M5283J07253l52866N97755k32267r98782
26312f81567O60900P79715j28773m56841l44040j051095p53601J320803R22063
26303B67564K59642l95108M3492m78386n77153r9508K10877N71187L15556J04423
26293B22586L04318l36537m70235l66427l30515K71906k22301L37858m71j00910
26283f90728K6511M52765O98267j30682p38668l70159P0777M98639K09335o70307
26273f44250q98197R63612O47356m83487J83656K38533m87889l595P09649l14631
$$ plain form
26263 -89243 -214162 -650586 -738318 -680701 -400491 -767856 -619937 -241966 -872197 -775598
26253 -775598 214670 -283287 322599 321821 240450 170765 -156197 -171428 -257590 -103880 116023
26242 116023 -821886 -1299807 -679134 -976982 -597591 -1064302 -1049227 -835818 -545186 -285577
26232 -285577 56312 -50163 783404 993952 463135 -237980 108511 -164035 -695476 -678290
26222 -678290 -254979 -553411 -998478 -1495697 -1454199 -426648 732508 297784 -169216
26213 -169216 -652727 -54852 -101855 709043 1268051 1371678 1360632 603038 827295 724650
26203 724650 699249 972585 794557 104031 246903 824274 409025 75102 -572427 -5522
26193 -5522 -200157 -553150 -543005 169366 435672 326947 802881 632392 353339 -1108484
$$ packed form
26263h9243j24919m36424q7732N7617K80210l67365J47919L77971o30231R6599
26253g75598R90268m97957O05886p78q1371o9685l26962j5231q6162J53710K19903
26242A16023r37909m77921O20673k97848L79391m66711J5075K13409K90632K59609
26232b85577L41889j06475Q33567K10548n30817p01115L46491k72546n31441J7186
26222f78290M23311k98432m45067m97219M1498J027551J159156m34724m67000
26213a69216m83511N97875m7003Q10898N59008J03627j1046p57594K24257j02645
26203G24650k5401K73336j78028o90526J42872N77371m15249l33923o47529N66905
26193e522j94635l52993J0145P12371K66306j08725M75934j70489k79053j461823
$$ plain form
26183 -1108484 -179995 38750 271507 258360 -411947 280152 337752 -267464 -777533 -749165
26173 -749165 -920935 -677777 -236065 -313834 354527 329958 584843 -1824 -96131 246396
26163 246396 397182 -48777 -182259 -255019 -155507 -20497 -130278 64022 276470 62931
26153 62931 -17647 250166 -234588 -540938 -301395 -381176 3487 -390391 -605752 -136226
26143 -136226 -247865 140319 -486254 424667 183792 -130458 57023 -427874 -328383 16780
26133 16780 -601515 -338403 236973 -6224 -182691 -422788 -422531 -255563 -801091 -623607
26123 -623607 -708107 -721249 114202 235472 -285434 -442679 -975323 -942399 -593341 -974423
26113 -974423 -643075 -597773 -487356 -462759 -460675 -217304 -941211 -564082 -521014 -7248
$$ packed form
26183a108484R28489K18745K32757j3147o70307O92099N7600o05216n10069K8368
26173g49165j71770K43158M41712p7769O68361k4569K54885n86667r4307L42527
26163B46396J50786m45959j33482p2760R9512J35010j09781J94300K12448k13539
26153F2931q0578K67813m84754l06350K39543p9781L84663l93878k15361M69526
26143a36226j11639L88184o26573R10921k40875l14250J87481m84897R9491L45163
26133A6780o18295K63112N75376k43197j76467k40097K57J66968n45528J77484
26123f23607q4500j3142Q35451J21270n20906j57245n32644L2924L49058l81082
26113i74423L31348M5302J10417K4597K084K43371p23907L77129M3068N13766
$$ plain form
26103 -7248 -129062 -115885 73339 -515800 -190333 168730 -184488 -1005246 -441381 2066
26093 2066 -325268 -691262 -31495 802951 392753 22241 501049 304667 416344 -214882
26083 -214882 -204870 -214292 290856 412108 660743 486282 523124 306314 442655 553559
26073 553559 132423 -267536 57150 4466 551667 284825 -1094369 -531535 -330624 -669212
26063 -669212 -269786 399714 -61129 -38705 -93896 -283193 578365 153788 470931 946657
26053 946657 419940 -607631 -641966 -796816 -121093 567433 654182 479098 901789 775228
26043 775228 -41976 -350422 47510 578284 1059999 263327 -506459 8714 901143 728781
26033 728781 -737821 -754452 -323552 -111868 -483409 -862530 -141202 37905 554054 162284
$$ packed form
26103g248j21814J3177J89224n89139L25467L59063l53218q20758N63865M43447
26093B066l27334l65994O59767Q34446m10198l70512M78808j96382J11677o31226
26083b14882J0012r422N05148J21252K48635j74461L6842k16810J36341J10904
26073E53559m21136l99959L24686n2684N47201k66842j379194N62834K00911l38588
26063f69212L99426O69500m60843K2424n5191j89297Q61558m24577L17143M75726
26053I46657n26717j027571l4335j54850O75723O88526Q6749j75084M22691j26561
26043G75228q17204l08446L97932N30774M81715p96672p69786N15173Q92429j72362
26033G28781j466602j6631M30900K11684l71541l79121P21328J79107N16149l91770
$$ plain form
26023 162284 -308005 257553 775597 457075 -642183 -910986 -1348289 -849204 -300958
26014 -300958 -618997 -376965 -592858 -443102 -146462 -472587 -322566 -433313 -12512 179816
26004 179816 41712 -817239 -1106998 -122605 -363762 -519221 -198806 116541 468083 121151
25994 121151 -318476 85311 -223098 191977 583734 -179759 -584971 -211387 92722 542862
25984 542862 -273270 -974046 258857 330792 -629683 -434780 -138391 -578598 -298993 111737
25974 111737 -136519 -141632 227180 -344135 -696302 570624 944816 700526 499146 89377
25964 89377 505711 -331199 181784 -178842 -881437 -917213 -983823 -617645 -243994 307577
25954 307577 -116999 -258975 -518937 -285294 -39624 -335369 -650041 -408185 -298531 260126
$$ packed form
26023A62284m70289N65558N18044l18522j099258k68803m37303M99085N48246
26014c00958l18039K42032k15893J49756K96640l26125J50021j10747M20801J92328
26004A79816j38104q58951k89759R84393k41157j55459L20415L15347L51542l46932
25994A21151m39627M03787l08409M15075L91757p63493m05212L73584L04109M50140
25984E42862q16132p00776J232903P1935r60475J94903K96389m40207K79605M10730
25974A11737k48256n113L68812n71315l52167J266926L74192k44290k01380m09769
25964H9377M16334q36910N12983l60626p02595l5776o6610L66178L73651N51571
25954C07577m24576j41976k59962K33643K45670k95745l14672K41856J09654N58657
$$ plain form
25944 260126 785238 805765 524219 112031 93528 317130 223721 -485831 -165598 447371
25934 447371 549972 375360 767946 928691 577325 901985 656504 424252 1045077 1240845
25924 1240845 1541798 1149388 1191059 1290285 907005 840430 -71686 -692872 -622155 -348936
25914 -348936 -828970 -790717 -452267 -155304 71217 147565 243501 530352 342801 -872394
25904 -872394 -611591 -752402 -1188465 -154358 874712 1499069 1095168 772721 235701
25895 235701 104365 467551 -22524 -550763 -900575 64134 864504 -138936 -797332
25886 -797332 -771620 -170973 -159097 -458395 163090 95977 -2050 -326092 -644974 -439663
25876 -439663 -989615 -354800 226675 163018 360285 -124120 134776 -338637 41884 251438
$$ packed form
25944B60126N25112K0527k81546m12188j8503K23602r3409p09552L20233O12969
25934D47371J02601j74612L92586J60745l51366L24660k45481k32252O20825J95768
25924A240845L00953l92410M1671R9226l83280o6575r12116o21186P0717K73219
25914c48936m80034L8253L38450K96963K26521P6348R5936K86851j87551j215195
25904h72394K60803j40811m36063J034107J029070O24357m03901l22447n37020
25895B35701j31336L63186m90075n28239l49812R64709Q00370j003440o58396
25886g97332K5712O00647J1876k99298O21485o7113r8027l24042l18882K05311
25876d39663n49952O34815N81475o3657J97267m84405K58896m73413L80521K09554
$$ plain form
25866 251438 291185 879735 781875 420230 -171159 -95610 -597788 -1060666 -1158685 -989596
25856 -989596 -477117 284401 720844 298480 305893 570605 -182814 -543196 152971 451553
25846 451553 448817 450729 -7197 -585603 -1268869 -562204 280795 463740 -170512 -566548
25836 -566548 -673011 -89613 302923 158733 43899 178460 632847 651645 969353 777807
25826 777807 353849 -94806 376223 540728 228347 -702667 -967642 -1166191 -938327 -742752
25816 -742752 296003 13257 -1052990 -726687 -50918 451897 -116313 -62875 -206912
25807 -206912 215843 1186287 989528 744467 941379 410398 -44338 354695 582489 164553
25797 164553 247099 -202306 492137 285016 119220 262296 644997 364930 265401 -452765
$$ packed form
25866B51438L9747N88550r7860l61645n91389P5549n02178m62878r8019J69089
25856i89596N12479P61518M36443m22364P413K64712p53419l60382O96167K98582
25846D51553k736J912m57926n78406o83266P06665Q42999J82945o34252l96036
25836e66548j06463N83398L92536j44190j14834J34561M54387J8798L17708j91546
25826G77807m23958m48655M71029J64505l12381r31014k64975j98549K27864J95575
25816g42752J038755k82746j066247L26303O75769N02815n68210N3438j44037
25807b06912M22755R70444j96759k45061J96912n30981m54736L99033K27794m17936
25797A64553Q2546m49405O94443k07121j65796J43076L82701k80067r9529p18166
$$ plain form
25787 -452765 -1252344 -649381 67461 -298260 -444566 -623947 -344969 148971 62163 361275
25777 361275 662070 297891 -169724 -276453 -141771 -582538 -784306 -434561 60146 684137
25767 684137 698756 695847 894333 738334 379846 447379 140869 -208921 -107951 171855
25757 171855 117713 251734 314183 333263 -279090 -166236 58428 -4924 278961 -241643
25747 -241643 57548 95941 -412226 -497610 -660343 -769436 -673777 -369536 557361 891969
25737 891969 -99149 -246904 -436225 -4249 -20858 -379319 274803 759519 978476 1184784
25727 1184784 1654512 977112 357143 320287 222157 634557 -184344 119134 -110124 -1158641
25717 -1158641 -543866 -384320 -788868 -426432 -623042 -300793 -265375 -571805 -112625 -541882
$$ packed form
25787d52765p99579O02963P16842l65721j46306j79381K78978M93940q6808K99112
25777C61275L00795l64179m67615j06729J34682m40767k01768L49745M94707O23991
25767F84137J4619k909J98486j55999l58488O7533l06510l49790J00970K79806
25757A71855n4142J34021O2449J9080o12353J12854K24664o3352K83885n20604
25747b41643K99191L8393n08167q5384j62733j09093R5659L04241R26897L34608
25737H91969r91118j47755j89321M31976j6609l58461O54122M84716K18957K06308
25727A184784M69728o77400o19969l6856r8130M12400q18901L03478k29258j048517
25717a158641O14775J59546m04548L62436j96610L22249L5418l06430M59180m29257
$$ plain form
25707 -541882 -1012209 -783260 -431836 -225211 -711330 -839140 161771 428825 -106082
25698 -106082 -355525 231276 527595 98978 -482577 -1364466 -1059793 -825412 -360747 -215949
25688 -215949 -236403 -455295 -911001 -742627 -386130 -562873 -375463 -579450 -891703 -734285
25678 -734285 -1351093 -1484903 -1351436 -1113635 -1270167 -931608 101195 74271 8159 -62593
25668 -62593 634285 842983 -240980 -77394 -107097 -648714 -1149708 -709370 104130 -8037
25658 -8037 624497 20743 -303074 -585004 -671952 -1118632 -1272739 -701285 -465009 -701604
25648 -701604 -509697 222293 3064 -225094 -438750 -122396 -312346 177976 -233034 11750
25638 11750 129804 171989 -320749 -364327 -414829 221156 279196 671783 697926 -178732 -537091
$$ packed form
25707e41882m70327K28949L51424K06625m86119j27810J000911K67054n34907
25698a06082k49443N86801K96319m28617n81555q81889L04673K34381M64665J44798
25688b15949k0454k18892m55706J68374L56497j76743J87410k03987l12253J57418
25678g34285o16808j33810J33467K37801j56532L38559J032803k6924o6112p0752
25668f2593O96878K08698j083963J63586k9703n41617n00994M40338Q13500j12167
25658h037O32534o03754l23817k81930q6948m46680j54107N71454K36276k36595
25648g01604J91907P31990k19229k28158k13656L16354j89950M90322m11010K44784
25638A1750J18054M2185m92738m3578n0502O35985N8040L92587K6143q76658l58359
$$ plain form
25627 -537091 -839182 -627751 -925896 -817737 -658530 -928774 -728078 -347577 58962 774402
25617 774402 788198 561314 1212568 1562532 1003779 252850 361470 662696 -100394 -793875
25607 -793875 -453216 -262206 195979 -159917 -275646 -44497 -63866 -503638 -613169 -199570
25597 -199570 136123 441813 1223969 274892 -480283 -449266 -173370 -254353 -350070 296484
25587 296484 562269 847709 305027 201155 -326946 -961451 -843490 118472 154574 76298
25577 76298 258702 -448728 -277315 162009 -210682 -444226 -15815 -224129 -631164 -651042
25567 -651042 -852397 121773 699384 656494 -152390 210364 79691 -44203 286848 -155282
25557 -155282 -1163527 -873621 -279929 214572 -459 69736 27660 174766 88396 214253
$$ packed form
25627e37091l02091K11431k98145J08159J59207k70244K00696L80501M06539P15440
25617G74402J3796k26884O51254L49964n58753p50929J08620L01226p63090o93481
25607g93875L40659J91010M58185l55896j15729K31149j9369m39772j09531M13599
25597a99570L35693L05690P82156r49077p55175L1017K75896q0983r5717O46554
25587B96484K65785K85440n42682j03872n28101o34505J17961R61962L6102p8276
25577G6298J82404p07430J71413M39324l72691k33544M28411k08314m07035j9878
25567f51042k01355R74170N77611m2890q08884L62754j30673j23894L31051m42130
25557a55282j008245K89906N93692M94501k15031P0195m2076J47106q6370J25857
$$ plain form
25547 214253 716539 1231029 881624 352563 -498878 183811 809991 702983 692590 -257542
25537 -257542 -1415152 -1253965 -940352 -1429016 -963319 -213578 -113724 -847773 -1174614 -1043634
25527 -1043634 -169629 -421507 -115272 394455 452299 143309 492359 -250404 -867545 -980739
25517 -980739 -589740 -287130 -188235 -141478 -388301 -796258 -297425 -42337 51726 -106798
25507 -106798 -300532 256041 199074 -724988 -359089 -10047 -33972 -629497 -736991 -110111
25497 -110111 -72393 82922 136139 45872 424614 566245 148242 93281 -228556 -469952
25487 -469952 494884 85268 -159069 237566 283345 -362643 -916181 -434254 21083 379692
25477 379692 1146418 1077832 91389 298631 -330328 -455879 -504369 -289023 354520 510160
$$ packed form
25547B14253N02286N14490l49405n29061q51441O82689O26180j07008j0393r50132
25537b57542j157610J61187L13613m88664M65697P49741R9854p34049l26841J30980
25527a043634Q74005k51878L06235N09727N7844l08990L49050p42763o17141j13194
25517i80739L90999L02610R8895M6757k46823m07957M98833K55088R4063j58524
25507a06798j93734N56573n6967r24062L65899L49042k3925n95525j07494O26880
25497a10111L7718J55315N3217r0267L78742J41631m18003n4961l21837k41396
25487d69952R64836m09616k44337L96635M5779o45988n53538M81927M55337L58609
25477C79692P66726o8586r86443K07242o28959j25551m8490K15346O43543J55640
$$ plain form
25467 510160 -251174 -217536 337362 353095 -4158 229221 -120144 173248 -268237 -129157
25457 -129157 -686268 -347793 29718 -219193 70079 21580 72595 358050 322057 575356
25447 575356 351859 516330 823712 689343 869023 452699 214 -416636 -893475 -509890
25437 -509890 -403783 -100508 402249 -284 716504 905206 549604 -422489 -547604 -798006
25427 -798006 -714029 -453477 -835761 -808345 -320712 -206973 73551 29570 -52839 69095
25417 69095 -172670 -94027 -431341 -440931 -35501 -523881 -131205 46408 -278812 -154226
25407 -154226 -625263 -801722 -1041794 -797336 -1202039 -678767 -574313 -1005053 -181487 263516
25397 263516 369508 232418 759954 685463 1253006 882608 -161267 112710 648887 -279837
$$ packed form
25467E10160p61334L3638N54898J5733l57253K33379l49365K93392m41485J39080
25457a29157n57111L38475L77511k48911K89272m8499N1015K85455l5993K53299
25447E75356k23497J64471L07382j34369J79680m16324m52485m16850m76839L83585
25437e09890J06107L03275N02757m02533P16788J88702l55602r72093j25115k50402
25427g98006Q3977K60552l82284K7416M87633J13739K80524m3981q2409J21934
25417F9095k41765P8643l37314r590M05430m88380L92676J77613l25220J24586
25407a54226m71037j76459k40072K44458m04703N23272J04454m30740Q23566M45003
25397B63516J05992j37090N27536p4491N67543l70398j043875K73977N36177r28724
$$ plain form
25387 -279837 -218005 -91644 -262151 -532731 -1125704 -1078683 -1122366 -598700 101818 865859
25377 865859 511378 171290 660209 533700 278071 226967 -794040 -792117 -1023288 -680285
25367 -680285 12977 89779 193198 630342 298239 492383 1013029 813994 127352 -252549
25357 -252549 -20035 -460384 -140146 293136 534330 69908 -531660 48258 58391 -69431
25347 -69431 437442 1130392 961395 62237 -56562 -618759 -544565 -928181 -478504 -559364
25337 -559364 -560596 -182583 -368861 -1035719 -453677 493657 145630 -71429 -411629 -193774
25327 -193774 -211490 -867446 -1116235 -295009 -25545 -178149 85823 396834 -632062 -543433
25317 -543433 -63209 314723 255429 -940083 -1422172 -1551826 -885733 -275467 382623 444635
$$ packed form
25387b79837O1832J26361j70507k70580n92973M7021m3683N23666P00518P64041
25377H65859l54481l40088M88919j26509k55629n1104j021007J923k31171L43003
25367f80285O93262P6802J03419M37144l32103J94144N20646j99035o86642l79901
25357b52549K32514m40349L20238M33282K41194m64422o01568N79918J0133j27822
25347f9431N06873O92950j68997q99158j18799n62197P4194l83616M49677q0860
25337e59364j232L78013j86278o66858N82042R47334l48027k17059l40200K17855
25327a93774j7716o55956k48789Q21226K69464j52604K63972L11011j028896Q8629
25317e43433M80224L77932n9294j195512m82089j29654O66093O10266O58090O2012
$$ plain form
25307 444635 98613 -7857 -458613 -492613 -596246 -247830 -81679 -380022 -109247 -599515
25297 -599515 -491101 -575631 -1229181 -986039 -1499658 -779885 -1103144 -849467 -309461 -195082
25287 -195082 -224258 145791 -43986 42179 -101123 -380250 -873690 -1103534 -703707 -380635
25277 -380635 164554 640607 -181745 -269426 -321679 16553 -617733 -882035 -395976 355403
25267 355403 136497 -337044 -232042 -231648 121053 213538 305786 845622 574031 -387306
25257 -387306 -703509 -881964 -204116 -126754 -807123 -313214 562055 -17917 -1124627 -820637
25247 -820637 159538 712214 603676 471569 1045335 257957 618193 576559 309680 -173648
25237 -173648 -442884 -54993 170711 -63576 -139800 -182657 133193 623438 985203 67326
$$ packed form
25307D44635l46022j06470m50756l4000j03633L48416J66151k98343K70775m90268
25297e99515J08414q4530o53550K43142n13619P19773l23259K53677N40006J14379
25287a95082k9176L70049j89777Q6165j43302k79127m93440k29844L99827L23072
25277c80635N45189M76053q22352q7681n2253L38232o34286k64302M86059P51379
25267C55403k18906m73541J05002L94L52701R2485R2248N39836k71591r61337
25257c87306l16203j78455O77848P7362o80369M93909Q75269n79972j106710L03990
25247h20637R80175N52676j08538j32107N73766p87378L60236m1634k66879m83328
25237a73648k69236L87891K25704k34287p6224m2857L15850M90245L61765r17877
$$ plain form
25227 67326 -335167 -454270 107346 -211869 115945 644884 219042 -36056 -179434 -566639
25217 -566639 -575026 -459508 -26390 -13520 613038 561948 471408 -24833 361860 470358
25207 470358 687982 136958 -459525 -374984 -191235 806851 476454 -112061 -411187 -1218206
25197 -1218206 -740239 66753 303868 -458851 -668099 683181 362410 301566 286268 -234613
25187 -234613 -671874 -614289 -211952 375181 635447 237253 -521502 -240611 42166 234275
25177 234275 -418842 -833296 -2457 310631 1070459 910803 116276 -920682 -1164376
25168 -1164376 217203 942453 469370 87067 383324 200787 -71325 233240 26403
25159 26403 -428676 -683785 -334521 104094 72157 451504 220077 -627277 -867467 -1213138
$$ packed form
25227F7326m02493j19103N61616l19215L27814N28939m25842k55098j43378l87205
25217e66639q387J15518M33118J2870O26558n1090r0540m96241L86693J08498
25207D70358K17624n51024n96483Q4541J83749R98086l30397n88515k99126q07019
25197a218206M77967Q06992K37115p62719k09248J351280l20771o0844j5298n20881
25187b34613m37261N7585M02337N87133K60266l98194p58755K80891K82777J92109
25177B34275o53117m14454Q30839L13088P59828j59656p94527j036958k43694
25168a164376J381579P25250m73083l82303K96257j82537k72112L04565k06837
25159B6403m55079k55109L49264M38615l1937L79347k31427q47354k40190l45671
$$ plain form
25149 -1213138 -620041 -263496 -154529 10919 71971 669317 795287 -236354 -654083
25140 -654083 -467235 92508 -275283 -344135 -554952 -562355 -322194 524354 808168 485588
25130 485588 -449556 -449878 -274994 -260579 394529 789417 755365 573278 483081 359697 -315749
25119 -315749 -422199 -300154 48041 18571 -722456 -703416 -247379 321786 787541 321186
25109 321186 -6458 28375 -437662 -473921 399646 751470 739578 539397 -62996 216294
25099 216294 345228 595734 481432 343552 650633 749068 -48905 -51618 131244 -1079109
25089 -1079109 -1636880 -677368 -566852 -718702 604293 396275 -93895 526499 763581
25080 763581 -587143 -293054 234737 -288798 -634875 -124570 309627 601661 343167
$$ packed form
25149a213138N93097L56545J08967J65448O1052N97346J25970j031641m17729
25140f54083J86848N59743l67791o8852k10817p403K40161Q46548K83814l22580
25130D85588r35144l22J74884J4415O55108L94888l4052j82087r0197j23384o75446
25119c15749j06450J22045L48195k9470p41027J9040M56037N69165M65755m66355
25109C21186l27644L4833m66037l6259Q73567L51824j1892k00181o02393K79290
25099B16294J28934K50506j14302j37880L07081R8435p97973k713J82862j210353
25089a079109n57771R59512J10516j51850J322995k08018m90170O20394K37082
25080G63581j350724K94089N27791n23535l46077N10305M34197K92034k58494
$$ plain form
25071 343167 209260 108950 -150713 -167593 -244668 -334382 -73897 -243303 -315882 42230
25061 42230 164164 -446968 -288776 250734 634493 -60455 -416912 968822 774505 73659
25051 73659 -127845 -390920 -421608 -344698 -413066 -120422 458328 -234286 -1039205 -688401
25041 -688401 -776650 -1717858 -1992468 -1211915 -890781 -556881 -154829 323945 532582 286164
25031 286164 404277 185067 -370475 -330996 -292070 -654215 -80925 -212203 -241883 -138430
25021 -138430 -298076 -52067 -120749 -846544 -539540 158682 -80788 -308274 -170245 407958
25011 407958 397779 215587 5520 484874 -596832 -350920 547343 94770 -806310 -584487
25001 -584487 -269145 -254260 -146365 -361791 -364757 -434386 -640970 -214044 585075 -100473
$$ packed form
25071C43167j33907j00310k59663j6880p7075q9714K60485j69406p2579L58112
25061D2230J21934o11132J58192N39510L83759o94948l56457J385734j94317p00846
25051G3659k01504k63075l0688P6910o8368K92644N78750o92614q04919L50804
25041f88401q8249r41208k74610P80553L21134L33900M02052M78774K08637k46418
25031B86164J18113k19210n55542L9479L8926l62145N73290j31278k9680J03453
25021a38430j59646K46009o8682p25795L07004O98222k39470k27486J38029N78203
25011D07958j0179j82192k10067M79354j081706K45912Q98263m52573r01080K21823
25001e84487L15342J4885J07895k15426k966o9629k06584M26926P99119o85548
$$ plain form
24991 -100473 -142486 62211 577130 705108 -125451 -74918 -289173 -283536 346880 119899
24981 119899 -76507 -242415 -655734 -753594 -328874 -308037 -744847 -855913 -56204 -32560
24971 -32560 -264057 -223302 -215200 -94780 -485835 -676011 -107216 -337249 -820938 -502509
24961 -502509 -88325 -682490 -771219 -531807 -761128 -759078 313884 299163 -228243 -684315
24951 -684315 -747388 -592245 -567204 -259878 -250821 274125 -814932 -1053264 -237714 122797
24941 122797 -685957 -618011 -602072 -136611 -569670 -1018266 -1090955 -1046773 -744914 -741570 -882379
24930 -882379 -1032222 -124511 -104833 -101640 526365 150126 237428 501440 450396 -65887
24920 -65887 -547082 -28298 702052 908796 907000 568586 794234 476992 776244 385192
$$ packed form
24991a00473m2013K04697N14919J27978q30559N0533k14255N637O30416k26981
24981A19899j96406j65908m13319r7860M24720K0837m36810j11066P99709K3644
24971c2560k31497M0755Q102J20420l91055j90176N68795k30033m83689L18429
24961e02509M14184n94165q8729K39412k29321K050J072962j4721n27406m56072
24951f84315o3073J55143K5041L07326R057N24946j089057k38332Q15550L60511
24941A22797q08754O7946J5939M65461m33059m48596p2689M4182L01859L344j40809
24930h82379j49843R07711J9678L193O28005l76239Q7302K64012n1044n16283
24920f5887m81195N18784P30350K06744j796l38414K25648l17242K99252l91052
$$ plain form
24910 385192 1088325 1166674 1344201 1070844 543281 -307583 -798668 -217098 463198 -41590
24900 -41590 -1540595 -909411 -98438 802714 586504 664549 747605 454226 -20360 213642
24890 213642 -97575 -467227 -606834 -519571 -285425 185271 467040 -65878 -671661 -726870
24880 -726870 -584112 39257 480901 218175 -688328 -728383 -496144 30937 341146 -767345
24870 -767345 -1035134 -751003 -447242 -575791 -58926 824800 -419263 -808675 -526179
24861 -526179 -538484 527741 208740 -374936 -211551 159436 -384829 -241617 -395089 -913677
24851 -913677 -1048810 -349449 -142181 -294861 505488 624349 655820 675285 223266 346355
24841 346355 335424 455503 467612 239096 194024 40276 -345623 -119766 290812 83191
$$ packed form
24910C85192P03133P8349J77527k73357n27563q50864m91085N81570O80296n04788
24900d1590j499005O31184Q10973R01152k16210P8045Q3056k93379m74586K34002
24890B13642l11217l69652j39607Q7263K34146M70696K81769n32918o05783n5209
24880g26870J42758O23369M41644k62726r06503m0055K32239N27081L10209j108491
24870g67345k67789K84131L03761j28549N16865Q83726j244063l89412K82496
24861e26179j2305J066225l19001n83676J63385L70987n44265J43212j53472n18588
24851i13677j35133O99361K07268j52680Q00349J18861L1471J9465m52019J23089
24841C46355j0931J20079J2109k28516m5072j53748l85899K25857M10578k07621
$$ plain form
24831 83191 -569046 -694576 -871611 -829317 54702 449871 879894 903153 361080 82080
24821 82080 -36455 -828550 -617388 291581 -87569 631182 1336624 905281 524696 460485
24811 460485 410766 -691949 -499593 -290810 106071 1083246 680374 301107 -31512 814330
24801 814330 415052 -730735 -847798 -716930 -790286 -397361 23607 32757 487206 232985
24791 232985 -370724 -441653 51426 -484000 -721789 -1299858 -717476 277834 522218 204418
24781 204418 -876034 -819670 -91906 211700 -262386 387382 281269 -168469 50309 122999
24771 122999 -1080048 -172032 498060 -186166 81853 105171 -30064 258044 144914 -394498
24761 -394498 -52925 58516 -206471 -234356 -199406 -450408 128528 -143990 -153972 -27433
$$ packed form
24831H3191o52237j25530j77035M2294Q84019L95169M30023K3259n42073k79000
24821H2080j18535p92095K11162R08969l79150P18751P05442m31343l80585o4211
24811D60485m9719j102715J92356K08783L96881R77175m02872l79267l32619Q45842
24801H14330l99278j145787j17063J30868p3356L92925M20968R150M54449k54221
24791B32985o03709p0929M93079n35426k37789n78069N82382R95310K44384l17800
24781B04418j080452N6364P27764L03606m74086O49768j06113m49738K18778P2690
24771A22999j203047R08016O70092o84226K68019K3318j35235K88108j13130n39412
24761c94498L41573J11441k64987k7885L4950k51002N78936k72518r982J26539
$$ plain form
24751 -27433 -69893 -482640 159963 320011 166982 907797 817730 837646 750861 607735
24741 607735 839574 425663 100282 -340960 -500119 -415413 -805711 -719895 -566645 309156
24731 309156 20901 5594 -63479 186322 480768 833598 -316826 -582946 -661944 -375456
24721 -375456 -857389 -481544 40591 64133 -106441 -265375 -435345 -525503 -322362 6882
24711 6882 189860 607046 683613 -337661 -5440 -87233 -370087 -648283 -408985 533592
24701 533592 398454 -89090 -215134 -132295 -190224 -985207 -1228371 -419516 242186 840616
24691 840616 705208 31727 -242484 192894 270225 210382 1026758 684462 374895 606947
24681 606947 40849 -3209 713452 -57716 233163 748645 492701 -301078 -444198 -794822
$$ packed form
24751b7433m2460m12747O42603J60048j53029P40815r0067J9916q6785j43126
24741F07735K31839m13911l25381m41242j59159Q4706l90298Q5816J53250Q75801
24731C09156k88255j5307o9073K49801K94446L52830j150424k66120p8998K86488
24721c75456m81933L75845N22135K3542j70574j58934j69970r0158K03141L29244
24711F882J82978M17186P6567j021274L32221q1793k82854k78196K39298R42577
24701E33592j35138m87544j26044Q2839n7929p94983k43164Q08855O61702N98430
24691H40616j35408o73481k74211M35378P7331n9843Q16376l42296l09567K32052
24681F06947n66098m4058P16661p71168K90879N15482k55944p93779j43120l50624
$$ plain form
24671 -794822 -657365 -1020639 -1004448 -270252 274395 521423 292140 535044 202006 552115
24661 552115 401691 298370 535467 582969 648521 312491 -12063 -611131 -925377 -228343
24651 -228343 76311 141736 -282649 -103553 412300 193360 -521667 600175 953585 321748
24641 321748 488759 305379 867714 825833 214846 -79953 -191643 102606 428829 -236137
24631 -236137 -799589 -476023 -669490 191928 712743 -88854 102814 -360310 -482326 -518390
24621 -518390 -600762 -46317 -114369 -263313 -36624 -77303 476385 660802 126227 -369051
24611 -369051 582714 950833 633624 336509 209552 462681 268668 -23619 43891 21741
24601 21741 99450 337775 -97213 -21777 -134416 -126038 -13589 65659 -597819 47655 564119
$$ packed form
24671g94822J37457l63274J6191P34196N44647K47028k29283K42904l33038L50109
24661E52115j50424j03321K37097M7502O5552l36030l24554n99068l14246O97034
24651b28343L04654O5425m24385J79096N15853k18940p15027J121842L53410o31837
24641C21748J67011j83380N62335m1881o10987k94799j11690K94249L26223o64966
24631b36137n63452L23566j93467Q61418N20815q01597J91668m63124j22016l6064
24621e18390q2372N54445o8052j48944K26689m0679N53688J84417n34575m95278
24611c69051R51765L68119l17209k97115j26957K53129j94013k92287O7510k2150
24601B1741P7709K38325m34988P5436j12639Q378J12449P9248o63478O45474N16464
$$ plain form
24590 564119 -309245 -696783 -244710 -293471 -248499 -721263 -336771 198949 350458 -386394
24580 -386394 -913154 236712 1009768 584999 -214134 145278 590250 448676 -222328
24571 -222328 -417569 91644 282654 -178570 86979 107793 196164 70358 308840 509388
24561 509388 710907 586561 708098 -46465 -767821 -928344 -661670 395143 187159
24552 187159 211555 209165 94483 -1000226 -417965 133713 -121865 -356981 380493 796198
24542 796198 -203779 -807593 -783871 -366492 374754 621099 383953 254352 -723608 -884371
24532 -884371 -458032 -233912 -3452 531190 826582 730549 16425 101897 627982 904626
24522 904626 1058113 -351350 -713851 -451842 -66374 -123098 -233276 324471 316142 46265
$$ packed form
24590E64119q73364l87538M52073m8761M4972m72764L84492N35720J51509p36852
24580c86394n26760J149866P73056m24769p99133L59412M44972j41574o71004
24571b22328j95241N09213J91010m61224K65549K0814Q8371j25806K38482K00548
24561E09388K01519j24346J21537p54563p21356j60523K66674J056813k07984
24552A87159K4396k390j14682j094709N82261N51678k55578k35116P37474M15705
24542G96198r99977o03814K3722M17379P41246K46345k37146j29601r77960j60763
24532h84371M26339K24120K30460N34642K95392r6033p14124Q5472N26085K76644
24522I04626J53487j409463l62501K62009L85468n6724j10178N57747q329k69877
$$ plain form
24512 46265 -74888 449663 -269623 -766090 -444705 -274164 57939 27049 -247944 -637141
24502 -637141 -439658 121159 -453772 -477371 -485381 -22454 -48923 -699323 -342572 -500480
24492 -500480 -990806 -1060459 -805598 -29954 580954 -72998 -153004 96088 77896 -213543
24482 -213543 -2377 28732 103502 -420470 370689 52349 399109 498401 -97753 -403468
24472 -403468 -130062 35858 -601799 -81724 567294 -110157 -210301 -248330 -106526 44054
24462 44054 -256614 -725904 -512393 -254677 -149776 -667885 490156 414342 29198 -59159
24452 -59159 570269 335242 557674 322570 46832 -210020 -446740 18064 6187 -154525
24442 -154525 -14534 -433636 -126256 -20197 300516 -610105 -453212 -64191 13314 23606
$$ packed form
24512D6265j21153N24551p19286m96467L21385J70541L32103l0890k74993l89197
24502f37141J97483N60817n74931k3599q010M62927k6469o50400L56751j57908
24492e00480m90326o9653K54861P75644O10908o53952q0006K49092j8192k91439
24482b13543K11166L1109P4770n23972P91159l18340L46760R9292n96154l05715
24472d03468K73406J65920o37657N20075O49018o77451j00144l8029J41804J50580
24462D4054l00668m69290K13511K57716J04901n18109J158041p5814l85144q8357
24452e9159O29428k35027K22432k35104k75738k56852k36720M64804j1877j60712
24442a54525J39991m19102L07380J06059L20713r10621J56893L89021P7505J0292
$$ plain form
24432 23606 -379236 -1150719 -1457208 -777908 212888 660169 726572 416229 -42474 -754626
24422 -754626 -192515 152974 -459054 -317984 -214527 222348 161091 368690 62460 433314
24412 433314 692434 821379 884420 964123 128957 -596560 -421526 211852 -91841 -370939
24402 -370939 114607 338821 473343 410524 648671 574215 583960 1080821 1427638 813450
24392 813450 51362 -661586 -338952 -181889 -957588 -277967 636194 391692 158270 103280
24382 103280 546635 668411 584088 270115 983 -4835 923643 648713 803348 980264
24372 980264 471159 879324 1469033 1643663 1692389 1332173 214187 -219124 146150 106690
24362 106690 185795 303630 760946 616552 525335 402403 -442989 -35048 164116 274968
$$ packed form
24432B3606m02842p71483l06489O79300R90796M47281O6403l10343m58703p12152
24422g54626N62111L45489o12028J41070J03457M36875o1257K07599l06230L70854
24412D33314K59120J28945O3041P9703q35166p25517J75034O33378l03693k79098
24402c70939M85546K24214J34522o2819K38147p4456R745M96861L46817o14188
24392H13450p62088p12948L22634J57063p75699O79621R14161k44502k33422n4990
24382A03280M43355J21776q4323l13973k69132n818R28478k74930J54635J76916
24372I80264n09105M08165N89709J74630M8726l60216j117986m33311L65274l9460
24362A06690P9105J17835M57316j44394r1217j22932q45392M07941J99164J10852
$$ plain form
24352 274968 532901 1415691 1348011 482487 -213308 -221184 118073 472705 173257 -171000
24342 -171000 -709285 -328556 521778 142286 -771798 -702004 389921 1109708 987661 1386374
24332 1386374 927911 435536 735254 531152 -178277 177879 109106 274503 167987 695160
24322 695160 837044 953084 666812 374836 925353 258073 -745928 -864467 -136969
24313 -136969 498661 165341 -429456 -662576 -2865 607718 772356 552632 487749 995381
24303 995381 1048885 1042268 955312 325587 442761 -148648 -392738 -529964 -876077 -596185
24293 -596185 -693267 -683924 -1084247 -914521 -458173 -539579 -610234 95575 205634 -480897
24283 -480897 -616907 -773549 -735833 -624 375511 669542 96692 -632432 -617201 -86125
$$ packed form
24352B74968K57933Q82790o7680q65524o95795p876L39257L54632k99448l44257
24342a71000n38285L80729Q50334l79492r14084O9794J091925P19787j22047L98713
24332A386374m58463m92375K99718k04102p09429L56156o8773J65397j06516N27173
24322F95160J41884J16040k86272k91976N50517o67280j004001j18539P27498
24313a36969O35630l33320n94797k33120O59711O10583J64638k19724o4883N07632
24303I95381N3504o617q6956o29725J17174n91409k44090j37226l46113K79892
24293e96185r7082R343m00323J69726M56348q1406p0655P05809J10059o86531
24283d80897j36010j56642L7716P35209L76135K94031n72850p29124J5231N31076
$$ plain form
24273 -86125 -143387 74334 68885 -556739 264205 452433 14349 -19520 -332016 3753
24263 3753 399915 501794 825129 1080683 748377 -235400 -853091 -960543 237116 664257
24253 664257 293420 238838 223520 306298 -446704 -711615 -813203 -688731 -544282 -509044
24243 -509044 -209907 47428 301648 -432807 -532520 -461942 475685 342301 301231 -124584
24233 -124584 -522166 -807043 -901246 292982 384735 541879 222824 574862 884502 752177
24223 752177 701332 550346 18511 673659 1209774 1183383 548222 693773 26508 69294
24213 69294 172596 -40561 -166019 -322125 -233781 -68117 -171108 -558242 -1252393 -525998
24203 -525998 52766 334876 -53808 174116 278488 -126983 301104 700303 945178 8303
$$ packed form
24273h6125n7262K17721n449o25624Q20944J88228m38084l3869l12496L35769
24263C753L96162J01879L23335K55554l32306r83777o17691j07452J197659M27141
24253F64257l70837n4582j5318Q2778p53002k64911j01588J24472J44449L5238
24243e09044K99137K57335K54220p34455r9713P0578R37627j33384m1070m25815
24233a24584l97582k84877r4203J194228R1753J57144l19055L52038L09640j32325
24223G52177n0845j50986n31835O55148N36115k6391o35161J45551o67265M2786
24213F9294J03302k13157j25458j56106Q8344J65664j02991l87134o94151P26395
24203e25998N78764K82110l88684K27924J04372m05471M28087L99199K44875r36875
$$ plain form
24193 8303 -86901 259051 -453644 196007 286068 557104 135196 -468425 -479704 -107940
24183 -107940 157173 857660 634493 300069 -269246 -32545 -243826 -238449 380220 417025
24173 417025 514483 1271075 1280209 1000274 704807 812975 1071966 265773 -344571 150066
24163 150066 1003057 1038638 666819 647652 163064 -50141 286910 379913 324363 -315769
24153 -315769 -627027 -645504 -431696 -607468 -442771 296337 1007788 260074 75328 251163
24143 251163 726013 260890 271189 -20018 472573 804643 890890 1115049 1321592 1153350
24133 1153350 1531553 887722 364579 353140 65432 -114974 99982 -63008 -215832 -622364
24123 -622364 -140896 240970 247176 882067 420951 523531 1049543 1217063 1019980 852762
$$ packed form
24193H303r5204L45952p12695O49651R0061K71036m21908o03621j1279L71764
24183a07940K65113P00487k23167l34424n69315K36701k11281N377O18669L6805
24173D17025R7458P56592R134k79935k95467J08168K58991q06193o10344M94637
24163A50066Q52991L5581l71819j9167m84588k13205L37051R3003n5550o40132
24153c15769l11258j8477K13808j75772J64697P39108P11451p47714j84746J75835
24143B51163M74850m65123J0299k91207M92591L32070Q6247K24159K06543j68242
24133A153350L78203o43831n23143j1439k87708j80406K14956j62990j52824m06532
24123f22364M81468L81866O206O34891m61116J02580N26012J67520j97083j67218
$$ plain form
24113 852762 1249576 1470270 1258435 280173 247332 333951 740697 647601 358992 836788
24103 836788 808610 30270 154 516882 787895 -68094 -486477 -815610 -1109917 -626674
24093 -626674 -610587 -903856 -21869 820041 486385 -537418 21937 -121633 -713857 -763627
24083 -763627 -615043 -85956 -395631 283503 311201 41110 -462257 -1353404 -705907 354501
24073 354501 254029 -148472 -385796 -150084 692039 544236 680446 705348 175030 -134961
24063 -134961 361036 873263 1263008 -139137 -531506 273012 361003 94843 46165 -55925
$$ packed form
24113H52762L96814K20694k11835r78262l2841Q6619M06746r3096k88609M77796
24103H36788k8178p78340l0116N16728K71013q55989m18383l29133k94307M83243
24093f26674J6087k93269Q81987Q41910l33656j023803N59355j43570n92224m9770
24083g63627J48584N29087l09675O79134K7698k70091n03367q91147O47497J060408
24073C54501j00472m02501k37324K35712Q42123j47803J36210K4902n30318l09991
24063a34961M95997N12227L89745j402145l92369Q04518Q7991k66160m8678j02090
$$ [...]
##END NTUPLES=NMR SPECTRUM
##END=
