##TITLE=19F_EC-3173
 CDCl3. 24 sc
 15.1.2019
##JCAMPDX= 6.0         $$ Bruker NMR JCAMP-DX V2.0
##DATA TYPE= NMR SPECTRUM
##DATA CLASS= NTUPLES
##ORIGIN= UXNMR, Bruker Analytische Messtechnik GmbH
##OWNER= root
$$ XWIN-NMR		Version 3.5
$$ Tue Jan 15 15:29:42 2019 Russian Standard Time (UT+4h)  she@DPX200
##.OBSERVE FREQUENCY= 188.290927
##.OBSERVE NUCLEUS= ^19F
##.ACQUISITION MODE= SIMULTANEOUS
##.ACQUISITION SCHEME= undefined
##.AVERAGES= 24
##.DIGITISER RES= 16
##SPECTROMETER/DATA SYSTEM= spect
##.PULSE SEQUENCE= zg
##.SOLVENT NAME= DMSO
##.SHIFT REFERENCE= (INTERNAL, DMSO, 0, 98.3737)
##AUDIT TRAIL= $$ (NUMBER, WHEN, WHO, WHERE, WHAT)
$$ ##TITLE= Audit trail, XWIN-NMR		Version 3.5
$$ ##JCAMPDX= 5.01
$$ ##ORIGIN= Bruker BioSpin GmbH
$$ ##OWNER= she
$$ F:/spectra/data/she/nmr/f19/1/pdata/1/auditp.txt
$$ ##AUDIT TRAIL=  $$ (NUMBER, WHEN, WHO, WHERE, WHAT)
(   1,<2019-01-15 15:28:50.46 +0400>,<she>,<DPX200>,
      <created by zg, POWCHK disabled, PULCHK disabled
       configuration hash MD5:
       00 E9 B6 7A A2 85 ED C7 34 08 36 98 17 FE 4E 26
       data hash MD5: 64K
       0D 2D DE 35 2E 02 76 ED 69 E7 47 D5 F5 B1 B4 4F>)
(   2,<2019-01-15 15:28:52.79 +0400>,<she>,<DPX200>,
      <Start of raw data processing
       efp BC_mod = 2 LB = 1 FT_mod = 6 PKNL = 1 PHC0 = 1693.143 PHC1 = 41.75593 SI = 64K 
       data hash MD5: 64K
       2A 19 67 62 35 9B E1 08 42 CD 45 19 41 E2 DA 93>)
(   3,<2019-01-15 15:28:55.68 +0400>,<she>,<DPX200>,
      <abs ABSG = 5 
       data hash MD5: 64K
       67 22 43 27 53 E3 8F FE DD D9 D1 AA 2C BE F9 AE>)
(   4,<2019-01-15 15:29:10.04 +0400>,<she>,<DPX200>,
      <pk PHC0 = -2.42582 PHC1 = 0 
       data hash MD5: 64K
       33 54 54 E5 D3 CD 8F E2 0F DC 0E A0 56 0B 85 8C>)
(   5,<2019-01-15 15:29:13.23 +0400>,<she>,<DPX200>,
      <abs ABSG = 5 
       data hash MD5: 64K
       A0 7A CE 17 B4 7F 5E 91 B7 49 4F 63 48 6B 6F 5B>)
$$ ##END=
$$ 
$$ hash MD5
$$ AB 3E B1 F1 BD DF 0D D1 44 EA 72 5C 33 EB 01 3D
##$RELAX= 
##$RELAX= 
##$RELAX= 
##$RELAX= 
##$RELAX= 
##$RELAX= 
##$RELAX= 
##$RELAX= 
$$ Bruker specific parameters
$$ --------------------------
##$DU= <F:/spectra>
##$EXPNO= 1
##$NAME= <f19>
##$PROCNO= 1
##$TYPE= <nmr>
##$USER= <she>
##$AMP= (0..31)
100 100 100 100 100 100 100 100 100 100 100 100 100 100 100 100 100 100 
100 100 100 100 100 100 100 100 100 100 100 100 100 100 
##$AQSEQ= 0
##$AQ_mod= 1
##$AUNM= <au_zg>
##$AUTOPOS= <>
##$BF1= 188.310428
##$BF2= 200.13
##$BF3= 200.13
##$BF4= 200.13
##$BF5= 200.13
##$BF6= 200.13
##$BF7= 200.13
##$BF8= 200.13
##$BYTORDA= 1
##$CFDGTYP= 0
##$CFRGTYP= 5
##$CHEMSTR= <none>
##$CNST= (0..31)
1 1 145 1 1 1 1 1 1 1 1 1 1 1 1 1 1 1 1 1 1 1 1 1 1 1 1 1 1 1 1 1 
##$CPDPRG= <>
##$CPDPRG1= <>
##$CPDPRG2= <>
##$CPDPRG3= <>
##$CPDPRG4= <mlev>
##$CPDPRG5= <mlev>
##$CPDPRG6= <mlev>
##$CPDPRG7= <mlev>
##$CPDPRG8= <mlev>
##$CPDPRGB= <>
##$CPDPRGT= <>
##$D= (0..31)
0 1.3 0 0 0 0 0 0 0 0 0 0 0.25 0 0 0 0 0 0 0 0 0 0 0 0 0 0 0 0 0 0 0 
##$DATE= 1547551729
##$DBL= (0..7)
$$ [...]
##$SUBNAM3= <"">
##$SUBNAM4= <"">
##$SUBNAM5= <"">
##$SUBNAM6= <"">
##$SUBNAM7= <"">
##$SUBNAM8= <"">
##$SUBNAM9= <"">
##$SW= 251.107818259711
##$SWIBOX= (0..15)
0 1 0 0 0 0 0 0 0 0 0 0 0 0 0 0 
##$SW_h= 47281.3238770686
##$TD= 65536
##$TD0= 1
##$TE= 0
##$TE2= 300
##$TE3= 300
##$TEG= 300
##$TL= (0..7)
0 120 53 12 22 120 120 120 
##$TP= (0..7)
150 150 150 150 150 150 150 150 
##$TP07= 0
##$TPNAME0= <>
##$TPNAME1= <>
##$TPNAME2= <>
##$TPNAME3= <>
##$TPNAME4= <>
##$TPNAME5= <>
##$TPNAME6= <>
##$TPNAME7= <>
##$TPOAL= (0..7)
0.5 0.5 0.5 0.5 0.5 0.5 0.5 0.5 
##$TPOFFS= (0..7)
0 0 0 0 0 0 0 0 
##$TUNHIN= 0
##$TUNHOUT= 0
##$TUNXOUT= 0
##$USERA1= <user>
##$USERA2= <user>
##$USERA3= <user>
##$USERA4= <user>
##$USERA5= <user>
##$V9= 5
##$VALIST= <valist>
##$VCLIST= <CCCCCCCCCCCCCCC>
##$VD= 0
##$VDLIST= <DDDDDDDDDDDDDDD>
##$VPLIST= <PPPPPPPPPPPPPPP>
##$VTLIST= <TTTTTTTTTTTTTTT>
##$WBST= 1024
##$WBSW= 4
##$XGAIN= (0..3)
0 0 0 0 
##$XL= 0
##$YL= 0
##$YMAX_a= 59305
##$YMIN_a= -13163
##$ZGOPTNS= <>
##$ZL1= 120
##$ZL2= 120
##$ZL3= 120
##$ZL4= 120
##$ABSF1= 98.37372
##$ABSF2= -152.7273
##$ABSG= 5
##$ABSL= 3
##$ALPHA= 0
##$AQORDER= 0
##$ASSFAC= 0
##$ASSFACI= 0
##$ASSFACX= 0
##$ASSWID= 0
##$AUNMP= <proc_1d>
##$AZFE= 0.1
##$AZFW= 5
##$BCFW= 0
##$BC_mod= 2
##$BYTORDP= 0
##$COROFFS= 0
##$CY= -3
##$DATMOD= 1
##$DC= 0
##$DFILT= <>
##$DTYPP= 0
##$F1P= 0
##$F2P= 0
##$FCOR= 0.5
##$FTSIZE= 65536
##$FT_mod= 6
##$GAMMA= 0
##$GB= 0
##$INTBC= 1
##$INTSCL= 8.653935e-10
##$ISEN= 128
##$LB= 1
##$LEV0= 0
##$LPBIN= 0
##$MAXI= 10000
##$MC2= 0
##$MEAN= 0
##$ME_mod= 0
##$MI= 0.4277144
##$NCOEF= 0
##$NC_proc= -6
##$NLEV= 6
##$NOISF1= -61.99997
##$NOISF2= -62.99997
##$NSP= 0
##$NTH_PI= 0
##$NZP= 0
##$OFFSET= 98.37372
##$PC= 1
##$PHC0= 1690.717
##$PHC1= 41.75593
##$PH_mod= 1
##$PKNL= yes
##$PPARMOD= 0
##$PSCAL= 0
##$PSIGN= 0
##$REVERSE= no
##$SF= 188.296044280273
##$SI= 65536
##$SIGF1= -61
##$SIGF2= -65
##$SINO= 3.502647
##$SIOLD= 65536
##$SREGLST= <1H.CDCl3>
##$SSB= 0
##$STSI= 65536
##$STSR= 0
##$SW_p= 47281.3238770685
##$SYMM= 0
##$S_DEV= 0
##$TDeff= 65536
##$TDoff= 0
##$TI= <>
##$TILT= no
##$TM1= 0
##$TM2= 0
##$TOPLEV= 0
##$USERP1= <user>
##$USERP2= <user>
##$USERP3= <user>
##$USERP4= <user>
##$USERP5= <user>
##$WDW= 1
##$XDIM= 65536
##$YMAX_p= 348431787
##$YMIN_p= -5483048
$$ End of Bruker specific parameters
$$ ---------------------------------
##NTUPLES= NMR SPECTRUM
##VAR_NAME=  FREQUENCY,     SPECTRUM/REAL,   SPECTRUM/IMAG
##SYMBOL=    X,             R,               I
##VAR_TYPE=  INDEPENDENT,   DEPENDENT,       DEPENDENT
##VAR_FORM=  AFFN,          ASDF,            ASDF
##VAR_DIM=   65536,         65536,           65536
##UNITS=     HZ,            ARBITRARY UNITS, ARBITRARY UNITS
##FACTOR=    0.721466756344984, 1,           1
##FIRST=     18523.3820098237, 0,            0
##LAST=      -28757.9418672448, 0,           0
##MIN=       -28757.9418672448, -5483048,    0
##MAX=       18523.3820098237, 348431787,    0
$$ Real data points
##PAGE= N=1
##DATA TABLE= (X++(R..R)), XYDATA
$$ [...]
30062I9372o95443O0084q04661K8632J526868j18184j311719p95042N71485P15205
$$ 99372 -596071 -535987 -1340648 -1312016 214852 96668 -1215051 -2010093 -1438608 -723403
30052g23403N26344k088756k8323K234075R90263L71868j169061J079443r41621
$$ -723403 -197059 -2285815 -2314138 -80063 910200 1282068 113007 1192450 250829
30043B50829q08684j662173Q88121k41509j640490K62964r9155K164175o76024
$$ 250829 -557855 -2220028 -1331907 -1573416 -3213906 -2950942 -3050097 -885922 -1561946
30034a561946l20884J020867P46534K36688j036003j005067o93620O3920K13134
$$ -1561946 -1882830 -861963 -115429 121259 -914744 -1919811 -2613431 -2549511 -2336377
30025b336377K502583J157641j223076p56251o57474q44426l02347l74141Q51915
$$ -2336377 166206 1323847 100771 -655480 -1312954 -2157380 -2459727 -2833868 -1981953
30016a981953O08785P4367k02564L46509j60071o25621m06842J28767M93792J268425
$$ -1981953 -1373168 -1298801 -1501365 -1154856 -1314927 -1940548 -2347390 -2218623 -1724831 -456406
30006d56406j344998l33449J522634R98362p7685l112611n35268J607169L92822
$$ -456406 -1801404 -2134853 -612219 386143 308458 -2804153 -3339421 -1732252 -1339430
29997a339430k1339o17601o02157L37261m35016m61572M52261N18940j68752K88187
$$ -1339430 -1360769 -1978370 -2580527 -2243266 -2678282 -3139854 -2687593 -2168653 -2337405 -2049218
29987b049218J52077j21003N08653K24404j839713j995071O58270K137211K03620
$$ -2049218 -1897141 -2018144 -1509491 -1285087 -3124800 -5119871 -4461601 -2324390 -2120770
29978b120770J674494J076694j052526j87015P15256m48447K31032m03958P12071
$$ -2120770 -446276 630418 -422108 -609123 106133 -342314 -111282 -515240 196831
29969A96831j664734j522236J462961j664644K52160j195073L2724K576467R65679
$$ 196831 -1467903 -2990139 -1527178 -3191822 -2939662 -4134735 -4102011 -1525544 -559865
29960e59865j218033n40041J760125O85798J22452j320094K98856j71071j928503
$$ -559865 -1777898 -2317939 -557814 127984 250436 -1069658 -770802 -941873 -2870376
29951b870376k28280K099071J014639k961598o2606J417295J53365O9073J120602
$$ -2870376 -3098656 -999585 15054 -2946544 -3009150 -1591855 -1438490 -1369417 -248815
29942b48815L92114J191065O18172m48017k163805j774344M6857J203964J532133
$$ -248815 143299 1334364 1952536 1504519 -659286 -2433630 -2386773 -1182809 349324
29933C49324o83041n35337k77211J05295J349287m02255l57667p21553M33110
$$ 349324 -333717 -869054 -1146265 -1040970 308317 -93938 -451605 -1173158 -740048
29924g40048n7978o01689k58523n94590r96898N41586J595757j75394m33039K60126
$$ -740048 -798026 -1399715 -1658238 -2252828 -3249726 -2708140 -1112383 -1287777 -1720816 -1460690
29914a460690p82449j6114O97664l17471M63362J480852J18155N42926o63250
$$ -1460690 -2243139 -2259253 -1561589 -1879060 -1415698 65154 183309 726235 62985
29905F2985n59795R5509j46193k305289j708605M60077J315729n35487r89686
$$ 62985 -496810 -401301 -547494 -2852783 -4561388 -4101311 -2785582 -3321069 -4310755
29896d310755M52498Q07070N17775K200387J243323k348363N57571R36635N4727
$$ -4310755 -3858257 -3051187 -2533412 -333025 910298 -1438065 -880494 56141 110868
29887A10868M60756M06768j046056J281752j861927q81935M3469k80506J006712
$$ 110868 571624 978392 -67664 1214088 -647839 -1529774 -1486305 -1766811 -760099
29878g60099M40749j166143m36690k61204Q44895M71975q5909k5439M70274L55928
$$ -760099 -319350 -1485493 -1922183 -2183387 -1338492 -866517 -952426 -977865 -507591 -151663
29868a51663M88971M46091O74141K11757m83551k886940J91421p35861M0334J041911
$$ -151663 337308 783399 1457540 1669297 1185746 -1701194 -1509773 -2245634 -2205300 -1163389
29858a163389m43325k38115J98578l77308Q28894p93353r77258K351027L34138
$$ -1163389 -1606714 -1844829 -1646251 -2023559 -1194665 -1988018 -2965276 -614249 -280111
29849b80111r62482j08221R16884o89015p79654p40842R21052R9849j340187l03378
$$ -280111 -1242593 -1350814 -433930 -1122945 -1902599 -2643441 -1722389 -1622540 -2962727 -3266105
29839c266105P81541J056744M02017K20230J583631m08868J99833O93437m72640
$$ -3266105 -2484564 -1427820 -1025803 -805573 778058 369190 569023 1262460 789820
29830G89820j68420R81666q77342j798924j036990k929441J94763J595691o7878
$$ 789820 621400 1603066 725724 -1073200 -2110190 -5039631 -4844868 -3249177 -3317055
29821c317055m67855K96503J794655P24046J105666k94139m28386R42459L09428
$$ -3317055 -3784910 -3488407 -1693752 -969706 135960 -158179 -586565 355894 665322
29812F65322j727853j268688R56581J68189O79156R8832R80215k2490r55770p19675
$$ 665322 -1062531 -2331219 -1374638 -1206449 -527293 -428461 551754 529264 -426506 -1146181
29802a146181p17551N27987M40420r13093m32718m08899J322245l63555o40225
$$ -1146181 -1863732 -1335745 -895325 -1808418 -2241136 -2650035 -1327790 -1691345 -2331570
29793b331570O88845J9938J53497J399435p71017q85710L97539K1127P78874j98729
$$ -2331570 -1642725 -1622787 -1469290 -69855 -840872 -1726582 -1329043 -1307916 -529042 -727771
29783g27771j137543j124196K012786J326316p86539J61162k76867J81027L87295
$$ -727771 -1865314 -2989510 -976724 349592 -436947 -275785 -552652 -371625 15670
29774A5670p66204k219480M99163O68674k00633R58J007354j17634j747142R88389
$$ 15670 -750534 -2970014 -2470851 -1802177 -2002810 -2001852 -994498 -1112132 -2859274 -1870885
29764a870885L28837J246523O77143j454683m45649J283362K60099k44896q1294
$$ -1870885 -1542048 -295525 381618 -1073065 -1518714 -235352 24747 -220149 -301443
29755c01443P42885N0068m08334m38137P63409P78349l11061n68916Q00432k11958
$$ -301443 441442 491510 83176 -354961 408448 1186797 875736 306820 1107252 895294
29745H95294j218720k184805J48400J563913l54828n07393K8140P85857l6661
$$ 895294 -323426 -2508231 -2359831 -795918 -1150746 -1658139 -1629999 -844142 -880803
29736h80803j60247j58452l56081q4939P26314k82837j685433q79325J103163
$$ -880803 -1041050 -1199502 -1555583 -1640522 -914208 -1197045 -2882478 -3761803 -2658640
29727b658640J421439J634522O56984j643837k89017J874825l65465k025358J87978
$$ -2658640 -1237201 397321 1054305 -589532 -878549 996276 630811 -1394547 -1206569
29718a206569q70482j477062J070727n11326J646140J447870j929042m29258J088974
$$ -1206569 -2077051 -3554113 -2483386 -2994712 -1348572 99298 -1829744 -2259002 -1170028
29709a170028q16188Q61511n06421L8505K88356J153424J20746L88290o97413
$$ -1170028 -1986216 -1124705 -1631126 -1592621 -1304265 -150841 -30095 358195 -339218
29700c39218m23816j69689J9078J05968j85744P65272L93030J85756j023939o10417
$$ -339218 -763034 -932723 -913645 -807677 -993421 -228149 164881 350637 -673302 -1283719
29690a283719L39534J316645N17379j601056K37669j367757j775889O10417N12450
$$ -1283719 -944185 372460 889839 -711217 -473548 -1841305 -3617194 -3006777 -2494327
29681b494327K91522m10221n59156J006484j391969J389314K416779P96570l91884
$$ -2494327 -2202805 -2613026 -3172182 -2165698 -3557667 -2168353 248426 1044996 653112
29672F53112r31926q65297P43921o48847j40688k445m52962l02942q89921L76789
$$ 653112 -278814 -1144111 -400190 -1049037 -1189725 -1192170 -1645132 -1948074 -2837995 -2461206
29662b461206Q21407M54524O34134J809634o85094k731638P89564J431042N77505
$$ -2461206 -1639799 -1185275 -551141 1258493 573399 -2158239 -1368675 62367 639872
29653F39872j341670j580880Q71537o02793n25301N92002J357129o58410j954125
$$ 639872 -701798 -2282678 -1411141 -2013934 -2539235 -1947233 -590104 -1248514 -3202639
29644c202639Q10563J214105L93820P74692k312762O06604m33718N01199J207408
$$ -3202639 -2392076 -1177971 -784151 -9459 -2322221 -1715617 -2149335 -1648136 -440728
29635d40728m73453o17574p27664K83332M47594J061124j80738M98418L20420
$$ -440728 -914181 -1531755 -2259419 -1976087 -1528493 -467369 -648107 -149689 170731
29626A70731k172797m28842L64945m10587R57145Q90961N92348R06716J09014
$$ 170731 -2002066 -2430908 -2065963 -2476550 -1519405 -628444 -36096 870620 979634
29617I79634O3036j162869k31804j60354k003243j201614K097695J424274j665500
$$ 979634 1042670 -120199 -352003 -512357 -2515600 -3717214 -1619519 -195245 -1860745
29608a860745o24449N13089J640042L00315n24998Q73772l76482L11662Q07252
$$ -1860745 -2485194 -1972105 -332063 -31748 -556746 317026 -59456 252206 1059458
29599A059458j420993j026534j493459k05732J296711J79216J71464L41193o2469
$$ 1059458 -361535 -1388069 -2881528 -3087260 -1790549 -1611333 -1439869 -1098676 -1161145
29590a161145l39066q03352J438506R98965o03258j312068O74127J261487J68536
$$ -1161145 -1500211 -2303563 -865057 133908 -469350 -1781418 -1107291 154196 322732
29581C22732j759840o05936J238761Q5027m89967O62041q20986j355211O69980
$$ 322732 -1437108 -2043044 -804283 -719256 -1209223 -547182 -1368168 -2723379 -2053399
29572b053399N39933K57750M95017J033175N49829L03323r81852J139937r7050
$$ -2053399 -1513466 -1255716 -760699 272476 822305 1125628 143776 1283713 1186663
29563A186663J101398j30739q32626J398031j180542p24461n73749j839138j492224
$$ 1186663 2288061 2157322 1324696 2722727 1542185 817724 243975 -1595163 -3087387
29554c087387P65468K374903r65564r74992r34603J199929N29001q91316l43783
$$ -3087387 -2321919 52984 -912580 -1887572 -2822175 -1622246 -1093245 -1984561 -2328344
29545b328344J156935J001622l36333N65501k97836p83960n64795n23682K5160
$$ -2328344 -1171409 -169787 -506120 59381 -238455 -1022415 -1587210 -2110892 -2085732
29536b085732P38354J162913m56912j748819O68724J666483l46238j78667N37367
$$ -2085732 -1347378 -184465 -641377 -2390196 -1721472 -54989 -401227 -579894 -42527
29527d2527j05689j94611M72189n47108j56232R99825m2182k191528p04156r88665
$$ -42527 -148216 -342827 129362 -417746 -573978 425847 383665 -1807863 -2512019 -3500684
29517c500684q7883K245199r9426J138444q66827j277341P29204J056007Q02088
$$ -3500684 -3588567 -1343368 -1442794 -304350 -1171177 -2448518 -1719314 -663307 138781
29508A38781k70560r87401q37515O33697o34920q83409l95528J110371N92658
$$ 138781 -131779 -1119180 -1956695 -1322998 -1957918 -2841327 -3236855 -2126484 -1533826
29499a533826N07831m11654l09639q04797m69199M94087J840482l41098j366418
$$ -1533826 -1025995 -1437649 -1747288 -2552085 -3021284 -2527197 -686715 -1027813 -2394231
29490b394231J26595P71866q56887K07925q33702N13385M80163K05564n6207j89206
$$ -2394231 -2267636 -1495770 -2352657 -2144732 -2978434 -2465049 -1984886 -1779322 -1835529 -2024735
29480b024735N36631J35451J198477L94119j757419k44421N67087l7060k54297
$$ -2024735 -1488104 -1352653 -154176 239943 -1517476 -1761897 -1194810 -1231870 -1486167
29471a486167P46786p11280J058303P64110L7032o41856p09062L22059O72600
$$ -1486167 -739381 -1450661 -392358 371752 408784 -233072 -942134 -620075 52525
29462E2525j89581j061126J45154j476757L31278J048025J147170p48028N54507
$$ 52525 -137056 -1198182 -1053028 -2529785 -2198507 -1150482 -3312 -751340 -196833
29453a96833J113316J087841p60682j784577R36847R48053n04960o31345q6704
$$ -196833 916483 2004324 1243642 -540935 395912 1343965 839005 207660 120956
29444A20956Q03066p13910r65395M35386j181343O88520O59137l00186N87194
$$ 120956 924022 210112 -755283 -319897 -1501240 -812720 -153583 -453769 133425
29435A33425q2693n43670L52021l19228l80470l98866o72898k94499j99363n67101
$$ 133425 50732 -492938 -140917 -460145 -840615 -1239481 -1912379 -2206878 -2406241 -2973342
29425b973342J330841n19543J79430J194588r16952j88464P73759J84531j06364
$$ -2973342 -1642501 -2162044 -1982614 -788026 -1704978 -1893442 -1119683 -935152 -1041516
29416a041516J084277l44763k07539O93300m8967j25517j14991k044218n44469
$$ -1041516 42761 -302002 -509541 183759 134792 9275 -105716 -2149934 -2694403
29407b694403k34949J982084M64752M90863r87838j538458L17969l57638m95383
$$ -2694403 -2929352 -947268 -482516 8347 -979491 -2517949 -2199980 -2557618 -3053001
29398c053001O22767J329116R92519p88768m76333O48018l22525j758894j39023
$$ -3053001 -2430234 -1101118 -108599 -897367 -1373700 -725682 -1048207 -2807101 -2946124
29389b946124O06510P9577P15048J297619k52025O72400j049399J257857P48253
$$ -2946124 -2339614 -2260037 -1544989 -247370 -499395 173005 -876394 381463 1129716
29380A129716j022143q75569l24804j9094M79745l08702R32134Q93345o61231
$$ 1129716 107573 -767996 -1092800 -1111894 -632149 -940851 -8717 884628 223397
29371B23397J464370j56850k77739r2471r30251j282161J58327j032298N77068
$$ 223397 1687767 1530917 1253178 1160707 230456 -1051705 -893378 -1925676 -1348608
29362a348608J467035J20319j101385j30300j4415p7455M84788m11786L6572L00465
$$ -1348608 118427 238746 -862639 -992939 -1007354 -1084809 -600021 -1011807 -975235 -674770
29352f74770o15496J04186R03849r5665k71775J30504j012347l19708J641450
$$ -674770 -1290266 -1186080 -282231 -377896 -649671 -519167 -1531514 -1851222 -209772
29343b09772K40013r59453j790484Q65974J794949M72647n52173o72080m43444
$$ -209772 30241 -929212 -2719696 -1853722 -58773 413874 -138299 -810379 -1253823
29334a253823J47432J610686l68659k469811m54807J478425K306274J176447j200186
$$ -1253823 -1106391 504295 135636 -2334175 -2788982 -1310557 995717 2172164 971978
29325I71978j137335j080491Q27394M57038N94529l54597r59790J653721k90668
$$ 971978 -165357 -1245848 -418454 38584 633113 278516 -681274 972447 681779
29316F81779j703265r98716R3949J548731j558563N70968L79986R4301j63645
$$ 681779 -1021486 -2020202 -1926253 -377522 -1936085 -1365117 -985131 -890830 -1054475
29307a054475p71308o9452j552599J88232K009616q89151M71910k50266j075464
$$ -1054475 -1825783 -1895235 -3447834 -3259602 -1249986 -2139137 -1667227 -1917493 -2992957
29298b992957k24591K33932P71660j416380P79671J360245R35627j147713o58530
$$ -2992957 -3217548 -2983616 -2211956 -3628336 -2848665 -1488420 -552793 -1700506 -2359036
29289b359036J559811J588759m33137q21925N84782L98669m89302J5992j260036
$$ -2359036 -799225 789534 356397 -465528 119254 517923 28621 44613 -1215423
29280a215423M19602j145269P86612R59154J42609q87379r32813J563625J134821
$$ -1215423 -795821 -1941090 -1154478 -195324 -52715 -940094 -1872907 -309282 825539
29271H25539P52908N94910l74364k120111j426206J95489P93428K63661M48155
$$ 825539 1578447 2173357 1798993 -321118 -1747324 -1551835 -758407 -494746 -46591
29262d6591m06875k660098Q96397O98604p88805n40611j0086K41794J788481J037055
$$ -46591 -453466 -3113564 -2217167 -1518563 -2307368 -2847979 -2858065 -2616271 -827790 209265
29252B09265j016117r58259J105798n25971r4298n35444P63794p82806Q70160
$$ 209265 -806852 -1765111 -659313 -1185284 -1279582 -1815026 -1051232 -1834038 -963878
29243i63878l3322j114367Q40794j68322o62566r46002l82382O82996p33982O15575
$$ -963878 -997200 -2111567 -1270773 -1439095 -2101661 -3047663 -3430045 -2747049 -3481031 -2865456
29233b865456K287291K3875p52436o94943K64922L37027P0856o33941M56859R58986
$$ -2865456 -578165 -554290 -1306726 -2001669 -1736747 -1399720 -1328864 -1962805 -1505946 -546960
29223e46960P7345n64654j161133l2052l14797J861483k96902j460511n98994
$$ -546960 -469615 -1034269 -2195402 -2227454 -2542251 -680768 -977670 -2438181 -3037175
29214c037175L8611M45512J026586p3113O35167J419987j14642q84439L68842
$$ -3037175 -2998564 -2553052 -1526466 -1599579 -964412 455575 340933 -543506 -174664
29205a74664j240836J07568J033558o84791J57072L00317n85329n85971n39767
$$ -174664 -1415500 -1307932 -274374 -959165 -802093 -501776 -1087105 -1673076 -2212843
29196b212843P96432l85525L05151n39627R19881j298593k89438K242107L2005
$$ -2212843 -1416411 -1801936 -1496785 -2036412 -1116531 -2415124 -2704562 -462455 -430450
29187d30450n67965j05339j070515L56816m57155j296135O34603J835959m79016
$$ -430450 -998415 -1103754 -2174269 -1817453 -2274608 -3570743 -2936140 -1100181 -1579197
29178a579197j222657J64798L73805N19020L08019j008099m95744J092478m2247
$$ -1579197 -2801854 -2637056 -2263251 -1744231 -1436212 -2444311 -2940055 -1847577 -1889824
29169a889824Q09570J81264J74543n65002q13667j015907R90551J184379p76939
$$ -1889824 -1080254 -898990 -724447 -1289449 -2103116 -3119023 -2128472 -944093 -1721032
29160a721032j97111j91057j11565J38034N05973K556344j230064r93187L7458
$$ -1721032 -1918143 -2109200 -2220765 -2082731 -1576758 979586 -250478 -1243665 -1206207
29151a206207r4983J35941N78233k02554m34469l76270N29524p24589r23427J824078
$$ -1206207 -1301190 -1165249 -587016 -789570 -1224039 -1600309 -1070785 -1795374 -2718801 -894723
29141h94723J107610k9728r37069j979702q00151J044986P11091j018690J411933
$$ -894723 212887 183159 -753910 -2733612 -3533763 -2488777 -1777686 -2796376 -1384443
29132a384443Q72539J103306O36776k058785R16899j23275P9102p4398k34102
$$ -1384443 -511904 591402 1228178 -830607 86292 -36983 42119 -32279 -266381
29123b66381P99795o49596j305013n36659N34926J98129k56962K030503k18214
$$ -266381 533414 -116182 -1421195 -1957854 -1422928 -1224799 -1481761 548742 330528
29114C30528o75309q93555J52051m40057m91954J202760J010193m77291j221037
$$ 330528 -344781 -1238336 -1086285 -1526342 -2018296 -815536 194657 -282634 -1503671
29105a503671M15698N78011n65932o16557j097329P78981J96169J622987P131
$$ -1503671 -1087973 -509962 -1075894 -1692451 -2789780 -2010799 -1814630 -191643 -184512
29096a84512P44483J23057j39549l22297j746629J419773k3464M9838n62375k51880
$$ -184512 559971 683028 543479 221182 -1525447 -105674 -129138 -79300 -641675 -893555
29086h93555M2736l0333j608031n19117j195846J346698n00544Q09387J501238
$$ -893555 -850819 -881152 -2489183 -3008300 -4204146 -2857448 -3357992 -2548605 -1047367
29077a047367j010917l81586j72609Q68341n65677N2123J062560N3323O15807
$$ -1047367 -2058284 -2439870 -2612479 -1744138 -2309815 -2257692 -1195132 -1141809 -526002
29068e26002j60821q97888j37117L75135O975K45444J32647j217190M29512K032646
$$ -526002 -686823 -1584711 -1721828 -1346693 -1339718 -1094274 -961627 -2178817 -1749305 283341
29058B83341q2701L79078L887r57318J62590L74238r43950j503548K33807J31129
$$ 283341 200640 579718 583605 -373713 -211123 163115 -780835 -2284383 -2050576 -1919447
29048a919447P89995O60685J96897R0523J57280J013389r82920j04273n29312
$$ -1919447 -1129452 -468767 -271870 -181347 -24067 989322 6402 -97871 -627183
29039f27183r82272j273854l94921Q18528L24932Q461N20352j083781k06465J342791
$$ -627183 -1609455 -2883309 -3278230 -2459702 -2134770 -2126309 -1605957 -2689738 -2896203 -1553412
29029a553412J771420j201131p58273R69556j12511p27837o3707l58836K32925
$$ -1553412 218008 -983123 -1741396 -771840 -884351 -1612188 -1675895 -2034731 -1801806
29020a801806P51639J744434j220178l98121p84990j34117J381513p31744j310585
$$ -1801806 -1050167 694267 -525911 -924032 -1709022 -1843139 -461626 -1193370 -2503955
29011b503955J977615k76251L30843L2227k69312Q04287j84221r20466M03746
$$ -2503955 -526340 -802591 -471748 -439521 -708833 95454 -88767 -1009233 -605487
29002f05487l74707j701734J392961M44769m33148O30397l78984J17996J86160
$$ -605487 -980194 -2681928 -1288967 -844198 -1277346 -646949 -1025933 -907937 -721777
28993g21777l80869Q3006P95112J451440p01284n16015J060190k491544N15460
$$ -721777 -1102646 -1019640 -224528 1226912 525628 9613 1069803 -1421741 -906281
28984i06281J956174m4499j536016o5051l03159q51975n45592m68475K033516
$$ -906281 1049893 1005394 -530622 -595673 -898832 -1750807 -2296399 -2764874 -731358
28975g31358Q75467q89484j713341J935798K160539j36745k062994m81892R76409
$$ -731358 144109 -745375 -2458716 -522918 1637621 1500876 -562118 -1044010 -67601
28966f7601K76185j45191l74460j43004j046576m21974Q32394r21559N1309Q90611
$$ -67601 208584 63393 -311067 -454071 -1500647 -1922621 -1090227 -2011786 -1960477 -1069866
28956a069866m08707k15297J759387M1044j106954P94062n00690j09515J096507
$$ -1069866 -1478573 -1693870 65517 106561 -1000393 -206331 -707021 -816536 279971
28947B79971j697459k438725J67563p0819J244J621813P84567q58357N44990J40340
$$ 279971 -1417488 -3856213 -3688650 -3759469 -3758225 -2136412 -1351845 -2210202 -1665212 -1524872
28937a524872L25116j216966J502646J95434j127553J83044J21940m59343J603025
$$ -1524872 -1199756 -2416722 -914076 -718642 -1846195 -1663151 -1541211 -2000554 -397529
28928c97529o43669j475433q0593J107801P80477M3873l38130J233161j72882
$$ -397529 -1041198 -2516631 -2597224 -1489423 -708946 -665073 -1003203 229958 57076
28919E7076j020350R53618k92464l79627L8721P7188k093140J752342J73436j129731
$$ 57076 -963274 -9656 -302120 -681747 -643026 -565838 -2658978 -906636 -733200 -1862931
28909a862931M77446l94145O4278J576632p79771M41339M37572q58737j81583
$$ -1862931 -1385485 -1779630 -1715352 -138720 -918491 -477152 -39580 -898317 -1079900
28900a079900M51513j70791m54053n14329J784015N42068j692541O12901O43901
$$ -1079900 -628387 -799178 -1253231 -1767560 16455 558523 -1134018 -521117 122784
28891A22784N58713q81996l24457K76726m62447m51998k08044m9166j466270l25469
$$ 122784 681497 -200499 -524956 -248230 -710677 -1162675 -1370719 -1419885 -2886155 -3211624
28881c211624J040141J00076N56397P15834R37984n48681J319936j250939k77410
$$ -3211624 -2171483 -2071407 -1515010 -799176 138808 -409873 910063 -340876 -618286
28872f18286l42457l04023j56102q00833J470530n98471j43951L47010P02967
$$ -618286 -960743 -1264766 -1420868 -2221701 -751171 -1349642 -1493593 -1146583 -443616
28863d43616m50725k961439L47964J893225l19305Q42527m36799J085400j07032
$$ -443616 -894341 -3855780 -3507816 -1614591 -1933896 -1091369 -1528168 -442768 -549800
28854e49800L20680J012303j630771K60587j05824n7752M67655j04983n8391n28952
$$ -549800 -229120 783183 -847588 -587001 -692825 -750577 -282922 -387905 -446296 -975248
28844i75248J78874n31900o25535j56164J82347n13017J589321K23682J035175
$$ -975248 -796374 -1328274 -1953809 -2109973 -1927626 -2440643 -851322 -627640 407535
28835D07535J728162j102058k447056J333195m33333J22157J743262j043068k108331
$$ 407535 2135697 1033639 -1413417 -80222 -513555 -391398 1351864 308796 -1799535
28826a799535J587454J655189J34212r44584j199764J99808l41191q25645M58078
$$ -1799535 -212081 1443108 1577320 632736 -567028 -367220 -708411 -1534056 -1075978
28817a075978K90686O21528m27387J02950K33913k1617O30507O72961j333211
$$ -1075978 -785292 -163764 -591151 -488201 -254288 -275905 354602 1027563 -305648
28808c05648j758417K86845K565279n04415k358102O91801J82537n1622J80517
$$ -305648 -2064065 -1777220 788059 283644 -2074458 -1382657 -1200120 -1251742 -1071225
28799a071225k57808l85697L01161n93627L80340K43049m71706m55230L82274
$$ -1071225 -1329033 -1714730 -1413569 -2007196 -1626856 -1383807 -1855513 -2310743 -1928469
28790a928469J249227j29270l75056p17950Q85831L79817J709238O41572k454036
$$ -1928469 -679242 -808512 -1183568 -1901518 -1015687 -635870 1073368 1714940 -739096
28781g39096O09496l73697j713377k6214R97814K15970k362452K33495Q26276
$$ -739096 -129600 -503297 -2216674 -2242888 -1245074 -1029104 -3391556 -3158061 -2331785
28772b331785k36293r59099j03242J219843O81925j62819O00048K116044n01042
$$ -2331785 -2568078 -3527177 -3630419 -2410576 -1728651 -1891470 -1291422 824622 323580
28763C23580q09063j248979K3057P18296o95349J074345q3174j365589K39805
$$ 323580 -485483 -1734462 -1711405 -993109 -1688458 -614113 -697287 -2062876 -1823071
28754a823071R29002P51633m21681L34593N1128m50454k15335r66067j409766
$$ -1823071 -894069 -142436 -564117 -229524 -178396 -628850 -844185 -1810252 -3220018
28745c220018R73639M07098K31646j97788J286817L20867n85332p20380P0425
$$ -3220018 -2246379 -1839281 -1607635 -1805423 -518606 -197739 -783071 -1503451 -1433026
28736a433026j737192N82826O02430Q65702J377946j995782M03873J419313j427507
$$ -1433026 -3170218 -2587392 -1984962 -1119260 258686 -1737096 -1333223 86090 -1341417
28727a341417m3429p12442k38594J879636k01827p69071K31443L55658L4435q27877
$$ -1341417 -1384846 -2097288 -2335882 -456246 -658073 -1427144 -1195701 -840043 -805608 -1633485
28717a633485o6492O40212M3085k99726r69900R39172J523441M79464k555890
$$ -1633485 -1699977 -1059765 -1016680 -1316406 -2286306 -1347134 176307 655771 -1900119
28708a900119r82099J95568K93565l37051R19294J938253J052900j07296j224275
$$ -1900119 -2882218 -2686650 -2393085 -2730136 -1810842 127411 1180311 1073015 -151260
28699a51260l01694R41128n72764K50032J033411k400551p78014o21675M78415
$$ -151260 -452954 488174 -84590 165442 1198853 -1201698 -1979712 -2601387 -2122972
28690b122972p93593J282421J263808Q10622J38947L88134J70407K51516q31635
$$ -2122972 -2916565 -1634144 -370336 440286 579233 967367 1137774 1389290 557655
28681E57655o36499l43691n29964o74351Q44562K83235k47496o8938J356094k59885
$$ 557655 -78844 -422535 -952499 -1626850 -782288 -499053 -746549 -815487 540607 280722
28671B80722j555024j292964j39660j30108k40395O49503J333484k90032p17423
$$ 280722 -1274302 -2567266 -2706926 -2837034 -3077429 -2427926 -1094442 -1384474 -2101897
28662b101897m87361J34567q40320J496521J019233P35120p35607k42919r72567
$$ -2101897 -2589258 -2454691 -3295011 -1798490 -779257 -44137 -779744 -1022663 -1995230
28653a995230m81000M52787J77614J627278k30205N11147n61839j109297R51565
$$ -1995230 -2476230 -2023443 -1845829 -218551 -448756 62391 -499448 -1608745 -657180
28644f57180k7433K58006j76145N75296O86190j226420k74733j177713m36043
$$ -657180 -684613 -426607 -602752 -27456 658734 -567686 -842419 -2020132 -2456175
28635b456175p21361k3538K083306j006023j807055o0605J361985R53640M40642
$$ -2456175 -3177536 -3201074 -1117768 -2123791 -3930846 -3991451 -2629466 -1675826 -1235184
28626a235184n36031R40840m93991j07599N46793j064706r35434K455056k88190
$$ -1235184 -1771215 -830375 -1324366 -1431965 -885172 -1949878 -2885312 -430256 -718446
28617g18446n0193m10971j107469N00528j52389J019168J36042n04274l00005
$$ -718446 -768639 -1179610 -2287079 -1786551 -1938940 -919772 -783730 -1288004 -1588009
28608a588009l96738k28992l75792r56906K91824K004383J35670p43548R56151
$$ -1588009 -1984747 -2213739 -2589531 -3546437 -3254613 -1250230 -1114560 -1858108 -901957
28599i01957k74028k42200R06362n88291m21370n33872J499445l54369k010654
$$ -901957 -1175985 -1418185 -511823 -1100114 -1521484 -2055356 -555911 -910280 -2920934
28590b920934J451308L31800m99313L34852O29783l26427j023907J208527M22012
$$ -2920934 -1469626 -1137826 -1637139 -1302287 -672504 -998931 -2022838 -814311 -392299
28581c92299r52135m84132n36457Q0848q78288L3336l63269o89632O18905R38867
$$ -392299 -1344434 -1828566 -2365023 -2284175 -3162463 -3129127 -3492396 -4182028 -3563123 -2624256
28571b624256j10749J175943N27625n8815j077106O69228N91492K65276q47066
$$ -2624256 -2735005 -1559062 -1031437 -1090252 -2167358 -1498130 -906638 -641362 -1488428
28562a488428L47998n91302o38901P87243n66890N66292O03049l09127l86346
$$ -1488428 -1140430 -1731732 -2370633 -1583390 -2150280 -1583988 -980939 -1290066 -1676412
28553a676412p68437P23350K92155j903834J72234K106027j199549n57830J003878
$$ -1676412 -2444849 -1721499 -1429344 -3333178 -3160944 -1054917 -2254466 -2812296 -1808418
28544a808418J431114j65953m30311Q1372j166695q00918q50831J037134Q89437
$$ -1808418 -377304 -543257 -973568 -892196 -2058891 -2859809 -3710640 -2673506 -1784069
28535a784069M1297j181289n8545J642075J604047J111038O03840K45506j504251
$$ -1784069 -1742772 -2924061 -2982606 -1340531 263516 1374554 1978394 2223900 719649
28526G19649p39448n07212m84079j863689J448953J704632N03365k085650J3364
$$ 719649 -19799 -527011 -1011090 -2874779 -1425826 278806 782171 -1303479 -1290115
28517a290115J445331j38194o47549k700988P29820J905618O62931J837359O5090
$$ -1290115 155216 17022 -630527 -3331515 -2601695 -696077 -33146 1804213 1869303
28508A869303n49835j357379L17724m33221n47933P5612K93133n54508q56014
$$ 1869303 1319468 -37911 279813 -153408 -701341 -625729 -332596 -887104 -1743118
28499a743118o23663r2713o46746R28120K66527Q79715J063694l33745r43433
$$ -1743118 -2366781 -2459494 -3106240 -2178120 -1911593 -1031878 31816 -301929 -1245362
28490a245362l79123m30246q0482J639522P53451n87110j345163l65986l26409
$$ -1245362 -1624485 -2054731 -2135213 -495691 257760 -329350 -1674513 -2040499 -2366908
28481b366908n67379J884097P05915j029176P39168j56158n75353q72234N1391
$$ -2366908 -2934287 -1050190 -344275 -1373451 -634283 -790441 -1365794 -2238028 -2186637
28472b186637k10430r29649J621404O30986K74910J85052r67805K98813J446571
$$ -2186637 -2397067 -3326716 -1705312 -1074326 -799416 -614364 -1582169 -1283356 163215
28463A63215k68838J171663l95656j939357M96558N21867L710k153524n2178R34732
$$ 163215 -105623 1066040 670384 -1268973 -772415 -250548 -246838 -2400362 -2452540 -1517808
28453a517808K487823j756984m76505n7009N55743j73517o91803K09050j243846
$$ -1517808 970015 -786969 -1263474 -1320483 -764740 -938257 -1630060 -1421010 -2664856
28444b664856L34372P00272K51105l09233n87721L9648J1081n81376l33063L008488
$$ -2664856 -2330484 -1630212 -1379107 -1688340 -2276061 -2236413 -2225332 -2806708 -3139771 -131283
28434a31283P65079o535p46972k531060K068981l26008j996154K468058l75064
$$ -131283 633796 627261 -119711 -2650771 -581790 -907798 -2903952 -435894 -810958
28425h10958M73408N24199p4387p35601k090040L80103J204921K82322m08290
$$ -810958 -337550 186649 112262 -623339 -2713379 -2333276 -1128355 -846033 -1254323
28416a254323j97695K964108j151993j620062n46577p56195N63960J426850Q12999
$$ -1254323 -1452018 1512090 360097 -1259965 -1806542 -2562737 -1998777 -571927 241072
28407B41072N9637J954q4501J767455r55170k291142J305128q62767q74327K67155
$$ 241072 300709 302663 218162 1985617 1030447 -1260695 44433 -818334 -1692661 -1425506
28397a425506l52539J183624l3411O64566l75115p3537m87210M97632R55937p43501
$$ -1425506 -1778045 -594421 -627832 36734 -338381 -411918 -899128 -401496 554441 -189060
28387a89060M58030r9801p36193l01035L7942M7476J061933k210826q30544p29674
$$ -189060 268970 169169 -567024 -868059 -830117 -782641 279292 -1931534 -2762078 -3491752
28377c491752R77467J209856j03130o59677k1017M28649K99320m0268N8388J081057
$$ -3491752 -2514285 -1304429 -1407559 -2067236 -2088253 -1659604 -1360284 -1400552 -1342164 -261107
28367b61107K15681l35044j525503O23094L88376p04778j17444M38522K9814J059761
$$ -261107 -45426 -380470 -1905973 -1282879 -894503 -1599281 -1716725 -1278203 -1248389 -188628
28357a88628r90354Q26247o39219k39817N39051k57204j564208j067957K299048
$$ -188628 -1178982 -352735 -991954 -1231771 -692720 -949924 -2514132 -3582089 -1283041
28348a283041o2759n3907o2367m85190J576817K84787N25329L68459j941439m90515
$$ -1283041 -1345800 -1399707 -1462074 -1947264 -370447 -85660 439669 808128 -1133311 -1623826
28338a623826N45461M90615k03525j048617n23661O32857J87193N44584J049978
$$ -1623826 -1078365 -587750 -791275 -1839892 -2363553 -1730696 -1543503 -998919 51059
28329E1059J79899j081146q79434r93655M82741O05834K87733M16439Q26103M98025
$$ 51059 230958 -850188 -1729622 -2723277 -2240536 -1634702 -1346969 -930530 -104427 393598
28319C93598M75225j6160o70953K3379o13047L65871N85205j35095m6759N79644
$$ 393598 868823 852663 181710 205089 -407958 -42087 543118 408023 361264 940908
28309I40908k132558R02227j036572k44560M45750J279010o36305j153086J896815
$$ 940908 -1191650 -289423 -1325995 -1570555 -1124805 154205 -482100 -1635186 261629
28300B61629L33174m52688o77127K51138J202499o50547l08427k0412J55646k44001
$$ 261629 594803 142115 -535012 -283874 918625 268078 -40349 -60761 94885 -149116
28290a49116m24026j22674Q22037P79299m64943J42546j786017m8714J150767
$$ -149116 -573142 -695816 126221 905520 440577 583123 -1202894 -1251608 -100841
28281a00841O5063M97240L08560n45057m83558q58682j262430J308387J926345
$$ -100841 -35778 461462 770022 224965 -258593 -1117275 -2379705 -1071318 855027
28272H55027k7706m93336j256835l54993K50050L11015N30216K07798l71839K25605
$$ 855027 827321 333985 -922850 -1277843 -1027793 -716778 -186562 21236 -350603 -124998
28262a24998P3559O4379k98896N36186J116j005986l02404j462P38150k68765
$$ -124998 -51439 12940 -285956 250230 251346 -754640 -1057044 -1058506 -320356 -589121
28252e89121j04656O95760J045028K12892n06q86452o23023l72035K61415m67738
$$ -589121 -693777 1983 1047011 1259903 1259397 372945 -250078 -622113 -360698 -828436
28242h28436J96407R68485N30411Q09289r19296L97816L66828M26819j321821
$$ -828436 -632029 336456 866867 1676156 756860 1154676 1521504 1948323 626502
28233F26502j799505J87457j89006j03239M03826J46600m13789J125873q46064
$$ 626502 -1173003 -985546 -1174552 -1277791 -873965 -727365 -1141154 -15281 -861345
28224h61345L5035M26320K3498j080568j469051J052564N12480J05113J597726
$$ -861345 -826310 -399990 -376492 -1457060 -2926111 -1873547 -1361067 -1255954 341772
28215C41772J287612p88438r53884l3386r68226k29178j662839R26197Q93234
$$ 341772 1629384 840946 -112938 -146324 -1114550 -1343728 -3006567 -2080370 -1187136
28206a187136O21318J556770j867117r02653j84105j02650k74982O91646L63736
$$ -1187136 -565818 990952 -876165 -1778818 -1962923 -2065573 -2340555 -1648909 -1285173
28197a285173o32250N21102P94103j263836k40021L99923m79644j075631J269786
$$ -1285173 -1917423 -1396321 -602218 -1866054 -2106075 -1706152 -2185796 -3261427 -1991641
28188a991641O90784m60168j39486M3047L07371m92785K26302M9051N34159n28521
$$ -1991641 -1300857 -1761025 -1900511 -1857464 -1550093 -2042878 -1816576 -1767525 -1233366 -1761887
28178a761887m9453J384505N8244N76360j162565L32494O47795J93950l01259
$$ -1761887 -1811340 -426835 -368591 207769 -954796 -622302 25493 219443 -81816
28169h1816k28349n12244O41366n38244P6328l11319J2358O64776n84296q95979
$$ -81816 -310165 -822409 -181043 -719287 -642959 -954278 -941920 -277144 -861440 -1757419
28159a757419j54733J951295J721014k195393j148110n49142M56173l45333N33460
$$ -1757419 -1912152 39143 1760157 -435236 -1583346 -2132488 -1676315 -2021648 -1488188
28150a488188P47165p6228o80324o72972J093091l08175J00566N25408r17568
$$ -1488188 -741023 -817251 -1497575 -2170547 -1077456 -1385631 -1285065 -759657 -1677225
28141a677225R75169J809496k19534J19906n03607k123533k81935K60384M87849
$$ -1677225 -702056 1107440 887906 1007812 504205 -1619328 -1901263 -1640879 -1153030
28132a153030L78948O37247P50257r86872j671693J669892j316107r43751R85454
$$ -1153030 -774082 -136835 613422 -373450 -2045143 -375251 -1691358 -2635109 -1649655
28123a649655P71710P60533n35326n36277k18354p3622N47597J135261J88501
$$ -1649655 -877945 -117412 -652738 -1189015 -1407369 -1480991 -933394 201867 390368
28114C90368m83940p2091Q30637q63808j08857j43821m14466l91145r90969O20905
$$ 390368 -93572 -165663 664974 -198834 -307691 -451512 -865978 -1257123 -2248092 -1627187
28104a627187P77017j082173L5856N7277N37095p4850L41925R45293P41826j174675
$$ -1627187 -850170 -1932343 -1896487 -1839210 -1302115 -1376965 -1035040 -89747 652079 -522596
28094e22596j37362j96181j265808k65794O58246M53876L48192j211590P68227
$$ -522596 -659958 -856139 -2121947 -2387741 -1729495 -1275619 -927427 -2139017 -1370790
28085a370790Q64888j355567L27386J406147O710J359205j126422j610352L62363
$$ -1370790 -505902 -1861469 -1534083 -127936 -121226 1237979 111557 -1498795 -1136432
28076a136432r70671J08055J482763j03367r04673j35842P69350m650q63154m4231
$$ -1136432 -2107103 -1999048 -516285 -619652 -1524325 -1660167 -890817 -895467 -1758621 -1802852
28066a802852J007780j35096j53637p21902J363205L2298K69790q97409P31597
$$ -1802852 -795072 -930168 -1083805 -1805707 -442502 -410204 -140414 -1037823 -306226
28057c06226N27971O16404J223794o31175r39818m75534n86328R31563N66053
$$ -306226 221745 838149 2061943 1430768 490950 15416 -570912 360651 926704
28048I26704r53605o80738Q96908r280o57346o70049M68627j1512j424510J070640
$$ 926704 -26901 -707639 189269 179989 -477357 -1147406 -678779 -690291 -2114801 -1044161
28038a044161p6328Q94913k7198j850861Q38420J452576o78032l0097p22701p94239
$$ -1044161 -1120489 -225576 -252774 -2103635 -1265215 187361 -490671 -520768 -1243469 -2037708
28028b037708O92606O79324M04426m32514j013913j892940o33958K495098P22113
$$ -2037708 -1345102 -665778 -261352 -693866 -1707779 -3600719 -4234677 -1739579 -1017466
28019a017466R0051j082114J576827M96626N14703J98548j248884q75135N80078
$$ -1017466 -927415 -2009529 -432702 63924 578627 777175 -471709 -1346844 -766766
28010g66766K52231m66227Q62645q71736J56809R9739j35519k69132J007873m21206
$$ -766766 -514535 -980762 -118117 -989853 -833044 -733305 -868824 -1137956 -130083 -551289
28000e51289j099262j229274J39577J151328K10346p54905j47094K08688J327964
$$ -551289 -1650551 -2879825 -2740248 -1588920 -1378574 -2133479 -2280573 -2071885 -743921
27991g43921M12828n25728j703504k83680N40089k5238n52955M94984J042856
$$ -743921 -331093 -856821 -2560325 -2844005 -2303916 -2329154 -2882109 -2387125 -1344269
27982a344269J522445j172125l78658N80281J716754J263227p29954j37848j554612
$$ -1344269 178176 -993949 -1372607 -792326 924428 2187655 1457701 1319853 -234759
27973b34759j704043P51409R31490r10490P67083j277314m18582O43257K836582
$$ -234759 -1938802 -1187393 -255903 -1166393 -399310 -1676624 -2095206 -1451949 1384633
27964A384633k010516N5692j016109J434028J543434R53935q89300N87243l33444
$$ 1384633 -625883 -570191 -1586300 -152272 1391162 2345097 1455797 2043040 1709596
27955A709596j434414J416230p19376p03315N6230N04008p32489J153484M91563
$$ 1709596 275182 1691412 972036 268721 324951 828959 96470 1249954 1741517
27946A741517j511544n53124r76379J61517J68126n56145J164747j179045P28824
$$ 1741517 229973 -323151 -1299530 -1138013 -969887 -1526032 -361285 -1540330 -811506
27937h11506J562042q20768k96483J15348k0825o21847p60505n28815l00869j58935
$$ -811506 750536 -70232 -366715 -251367 -272192 -894039 -1654544 -2183359 -2484228 -2643163
27927b643163M51267l54485J765199O23182j252520j73136j27973J016689K079114
$$ -2643163 -2191896 -2546381 -781182 -158000 -1410520 -1583656 -1711629 -694940 1384174
27918A384174l87418q61505j411037k8099N54778K09176O62718J37842J193583
$$ 1384174 996756 135251 -1275786 -1303885 -749107 -539931 122787 260629 1454212
27909A454212m2097J513253j303371q37125r12972J05963L79087K53175k35691
$$ 1454212 1412115 2925368 1621997 784872 -128100 -22137 356950 610125 374434
27900C74434M59952K16642R73020j854609j215531j903893J688219p9416J213696
$$ 374434 834386 1051028 2024048 169439 -1046092 -2949985 -1261766 -1341182 -127486
27891a27486l75349p71524J79972p4316J731594J577406j27405k113535r69328
$$ -127486 -502835 -1274359 -1094387 -1168703 562891 2140297 2012892 -100643 -1069971
27882a069971l56037R40819k72021N96382l97399k81702o98224m57560J599037
$$ -1069971 -1426008 -485189 -757210 -160828 -558227 -839929 -1538153 -1995713 -396676
27873c96676N51909r40262j406685N07474K341932K83116j745232o37892J80067
$$ -396676 155233 -785029 -2191714 -1684240 657692 940808 -804424 -1442316 -1262249
27864a262249p48205r10081L25892j08315P13002Q74368n30893j14037P73790
$$ -1262249 -2010454 -2920535 -2594643 -2702958 -1989956 -1115588 -1646481 -1760518 -986728
27855i86728l43376M08822O53253L05823Q53255n27698j811956j03103J163043
$$ -986728 -1330104 -921282 -268029 37794 891049 363351 -1448605 -1551708 -388665
27846c88665k37440K68965j9921n64926M26472Q50364q1824m78880m70764j50581
$$ -388665 -626105 -357140 -377061 -941987 -515515 334849 253025 -225855 -696619 -847200
27836h47200L06406J65039o72068P45738p0704q25271K14658N43737l14972R03224
$$ -847200 -540794 -375755 -1047823 -302085 -372789 -1198060 -983402 -439665 -754637 148587
27826A48587K14674j949246L02765K52808P34203L52068K45209J61926Q82622
$$ 148587 363261 -1585985 -1283220 -1030412 -296209 55859 301068 462994 1345616
27817A345616l70487J40508j282506J0767k55686r85398J8239J70977Q95673N28547
$$ 1345616 975129 1115637 -166869 -156102 -411788 -1397186 -1378947 -1207970 -312297 216250
27807B16250J7943n0555O5312O89632K6299J5708p68864M97352p39954n21654
$$ 216250 234193 183638 248950 938582 964881 980589 211725 709077 -30877 -552531
27797e52531K05104M15120j55082k42998k44483m55907J851327j16207m76146
$$ -552531 -347427 67693 -87389 -330387 -574870 -1030777 820550 704343 228197
27788B28197L23279K02059l15742j26505J27122o99575J889261J164770j86739
$$ 228197 551476 753535 437793 311288 438410 -261165 1628096 2792866 2606127
27779B606127j618138j075667q40433K74078j664553J009311J12404o79695N06749
$$ 2606127 987989 -87678 -928111 -654033 -2318586 -1309275 -1196871 -1876566 -1369817
27770a369817J77546J240170k09887j684710j64859k06207P41788L47834L40521
$$ -1369817 -1192271 47899 -161988 -1846698 -2011557 -2217764 -1475976 -1128142 -787621
27761g87621l90968J80325L62511m09832M52419R92562j206075p1976q25087N86499
$$ -787621 -1178589 -998264 -635753 -1045585 -593166 399396 -806679 -878655 -1703742 -1117243
27751a117243K054737n63184m04985n69823k29291L3486p08044J544142P81687
$$ -1117243 937494 374310 -30675 -600498 -829789 -796303 -1504347 39795 821482
27742H21482q38356k21202n9743q97013J050339Q44990J34420p01738j149077
$$ 821482 -16874 -238076 -297819 -1194832 -144493 700497 834917 133179 -1015898
27733a015898J88017J311805j431390j431002P39435J348536L64671m56838j97446
$$ -1015898 -827881 483924 -947466 -2378468 -1639033 -290497 74174 -382664 -580110
27724e80110k31119l35788L25120Q50654q80013j013619L24431J736089P12434
$$ -580110 -811229 -1147017 -821897 28757 -851256 -1864875 -1540444 195645 908079
27715I08079j586151r70124J084956J170287j410916k15266r10017L00823J545333
$$ 908079 -678072 -1648196 -563240 607047 -803869 -1019135 -1929152 -1628329 -82996
27706h2996j701732j385400M37683j135143J242664R91395O85054J069786P91219
$$ -82996 -1784728 -3170128 -2732445 -3867588 -2624924 -1633529 -948475 121311 912530
27697I12530M54409j766685m45772J220239K46951N7583k29416j18341j925426
$$ 912530 1366939 -399746 -845518 374721 621672 679255 449839 331498 -1593928
27688a593928J231787R08575r80896l00411o86490Q95455L62541j436867l63327
$$ -1593928 -362141 546434 -434462 -734873 -1421363 -525908 -163367 -1600234 -1963561
27679a963561q48440N82954k13711N13273Q82066j94538j45888p97672J607052
$$ -1963561 -2812001 -2229047 -2442758 -1929485 -1047419 -1241957 -1387845 -2185517 -578465
27670e78465r7615L05847O78267L61456k34381J226910j16993j546691J49796
$$ -578465 -676080 -370233 308034 669490 435109 1662019 1545026 -1665 148131
27661A48131J287893P47900p10324p94935l06553K9665O23808Q41039J22034J40813
$$ 148131 1436024 2183924 1473600 678665 372112 401777 1025585 1866624 1988658 2129471
27651B129471l72704k87877J250035N61355l01614o38767J71866o31488j438762
$$ 2129471 1756767 1468890 2718925 3280280 2978666 2339899 2511765 1880277 441515
27642D41515j800802o24798j99975J22958O85171M22388k15417j343711P45217
$$ 441515 -1359287 -1984085 -2184060 -2061102 -1375931 -953543 -1168960 -2512671 -1767454
27633a767454J155693J016764p65894j643655K7492l69743J180184J459708j08860
$$ -1767454 -611761 405003 -360891 -2004546 -1977054 -2346797 -1166613 293095 184235
27624A84235j064291j73200n55862m49598J046009J94659L20493K93017J67831
$$ 184235 -880056 -1053256 -1609118 -2058716 -1012707 -818048 -497555 -204538 -36707
27615c6707M67784o69912n76491M01911p40332j246569J460886J13222n0201J76503
$$ -36707 431077 -238835 -815326 -413415 -1153747 -2400316 -939430 -826208 -876409 -699906
27605f99906o41748l09382K00933K38514N10269M94547j295513J082442J409013
$$ -699906 -1341654 -1651036 -1450103 -1211589 -701320 -206773 -1502286 -419844 989169
27596I89169l87226l627k16481n77455J72582q8192P38730P6210M90326q10774
$$ 989169 601943 598316 381835 -195620 -23038 -111230 627500 703710 1194036 383262
27586C83262j571672j269974K032983J864780r7129p63723n91910j58333o15053
$$ 383262 -1188410 -2458384 -425401 1439379 1342250 578527 -13383 -171716 -786769
27577g86769m78125L66874k91084l04288q32250l10758N46506k27948Q02324l44173
$$ -786769 -1264894 -898020 -1189104 -1493392 -2325642 -2636400 -2089894 -2317842 -1515518 -1859691
27567a859691O33668O18038Q54102J90907k11891l91081J77949j16259m75225
$$ -1859691 -1226023 -607985 246117 437024 225133 -165948 12001 -104258 -579483
27558e79483l10673M92711j272469N45572J716609O98365L87976j343060p67627
$$ -579483 -890156 -397445 -1669914 -1124342 592267 1290632 1678608 335548 -432079
27549d32079Q41356r77751k18961n55411M30252j5361J207904M10599n17893j31151
$$ -432079 409277 -568474 -787435 -1342846 -912594 -927955 279949 690548 172655 41504
27539D1504J84094n53755J041803J279519j68079p99067P01210N88214p06759
$$ 41504 225598 -328157 713646 1993165 1825086 1026019 1727229 2315443 1608684
27530A608684j739209l29315O86372Q40793n40511j10766K76274k12528n34023
$$ 1608684 -130525 -459840 226532 1067325 526814 416048 692322 479794 -54229
27521e4229Q68657M23323j92484k49726N96446L8688K87142j190569o03063j34954
$$ -54229 814428 1237751 1045267 795541 1391987 1430675 1717817 527248 -75815 -210769
27511b10769L21110j020340N33076Q31173L98511n64983L28046N96882L21160
$$ -210769 110341 -909999 -376923 454250 852761 287778 615824 1212706 1533866
27502A533866O41966j337852m18625J050676j281645m02177o3161P74843R77857
$$ 1533866 2175832 837980 419355 1470031 188386 -213791 -276952 497891 1475748
27493A475748n83989k39609N85423J411565k09341j642215Q31372J83094j297698
$$ 1475748 891759 652150 1237573 2649138 2439797 797582 1628954 1812048 514350
27484E14350M51271j40832m54905N94934J881092K612786l04865j030071m78432
$$ 514350 965621 824789 369884 964818 2845910 5458696 5153831 4123760 3645328
27475C645328k82616J56340R60478J404423O52890r16200j1048K12159K075615
$$ 3645328 3362712 3519052 4479530 5883953 6536843 5620643 5609595 5821754 7897369
27466G897369L57721o58077q58394J091635J476633J134682R4472J63147m17278
$$ 7897369 8255090 7597013 6738619 7830254 9306887 10441569 10536041 10699188 10281910
27457A0281910m96507K90026P89723K77204q45090j96883R51661K56243m78112
$$ 10281910 9785403 10075429 10865152 11142356 10297266 10100383 11052044 11308287 10830175
27448A0830175k444140j415621O92203O83047N33568r13752j948304N42260j59188
$$ 10830175 8386035 6970414 7662617 8345664 8879232 7965480 6017176 6559436 6400248
27439F400248m30050q97583l66127k84855j437721J081975l05475n59004K64228
$$ 6400248 5970198 5072615 4706488 4421633 2983912 4065887 3760412 3201408 3465636
27430C465636j679644J549434Q4531j200090j51707J15407N98946l73963n06532
$$ 3465636 1785992 3335426 3419957 2219867 2068160 2183567 2782513 2408550 1902018
27421A902018o26544L48925M57975N00313j68661p30427m66545N59817O39618
$$ 1902018 1275474 1624399 2082374 2582687 2414026 1683599 1217054 1776871 2416489
27412B416489k7100m07675n90098O38647q09612P47648j85357J099828m15430
$$ 2416489 2389389 1981714 1391616 2030263 1220651 1968299 1782942 2882770 2467340
27403B467340P88556J092638o50571m40746P63425o49207j406113K369346L61167
$$ 2467340 3255896 4348534 3697963 3257217 4020642 3371435 1965322 4334668 4695835
27394D695835L58067o25216r04241P9722P11199J654741k667330o12025J582007
$$ 4695835 5053902 4428686 3524445 3604167 4315366 5970107 3302777 2690752 4272759
27385D272759R00426q65644o86686p2802J347639p32561q4571M42549q12710K112934
$$ 4272759 5173185 4307541 3620855 3548053 4895692 4163131 4078560 4521109 3708399 5821333
27375E821333J224196l38528n75005M55135P75438q77938r67465K87976J555607
$$ 5821333 7045529 6707001 6131996 6587131 7362569 6484631 5517166 5805142 7360749
27366G360749K90008K17698N72065K114530J014728R75158k68562K378899L752098
$$ 7360749 7650757 7868455 8440520 10555050 11569778 12544936 12276374 14655273 18407371
27357A8407371K378599O232393N309837O456866J0530948J5832335L0377656M4832426
$$ 18407371 20785970 27018363 32328200 38785066 49316014 65148349 95526005 140358431
27349A40358431K9360866j0002958k9326087j3460824J5020999L6550300K6711487
$$ 140358431 169719297 159716339 130390252 116929428 131950427 168500727 195212214
27342A95212214j2251590k7541418j0488180J4433150M9195617Q0898005N8273581
$$ 195212214 182960624 155419206 144931026 159364176 208559793 289457798 347731379
27335C47731379j8623071o6883357l7837014J7790277O1837455M4416118l3856497
$$ 347731379 329108308 262224951 224387937 242178214 304015669 348431787 314575290
27328C14575290q1177602o2347109k4847286L516188K9882100K5703158j3403927
$$ 314575290 233397688 171050579 146203293 149719481 179601581 205304739 191900812
27321A91900812l9364624k6616330K881846K7257464K2762849j9165990m7083798
$$ 191900812 152536188 125919858 128801704 156059168 178822017 159656027 112572229
27314A12572229l7875697k1230873j4301778j0566455n998263k650141l018947
$$ 112572229 74696532 53465659 39163881 28597426 22599163 19949022 16930075
27307A6930075r65583k267205k400151j327112q88468l30021j150925j193875
$$ 16930075 15964492 13697287 11297136 9970024 9081556 8751535 7600610 6406735
27299F406735j778298R03946J289977j327933j8146q58710k163374R03508J832423
$$ 6406735 4628437 5532383 6822360 5494427 5476281 4617571 2454197 3357705 5190128
27290E190128j231642j394262j389630N79297K99792l64838P65789J077737o021
$$ 5190128 3958486 2564224 1174594 1753891 2053683 1688845 2454634 3532371 3526350
27281C526350J196028j50278j012460k30474j195537q74130l496q15922M31018
$$ 3526350 4722378 4572100 3559640 3329166 2133629 1259499 1256003 440081 871099
27272H71099J724099j500368q55414N9428K90969J70098O12127O31289j075898
$$ 871099 2595198 1094830 239416 298844 589813 759911 1372038 2003327 927429
27263I27429q36347J217183j1509J81526M33749J78681m10578j289766J493467
$$ 927429 91082 1308265 1296756 1478282 1912031 2090712 1680134 390368 1883835
27254A883835J735548r42403n94966n83056Q06968J348939J81551n9856N44718
$$ 1883835 3619383 2676980 2082014 1498958 2305926 3654865 3836416 3776560 4321278
27245D321278R7617j200603l27598p15810n14028K026068Q87180k64878k67433
$$ 4321278 4418895 3218292 2890694 2174884 1660856 3686924 4574104 4309226 4041793
27236D041793j831966k02285R11833k48593j175002K101160k47992j041862R40842
$$ 4041793 2209827 2007542 2919375 2670782 1495780 3596940 3348948 2307086 3247928
27227C247928J260125r93658Q58726K71851j870545j340328j99042J23406J294254
$$ 3247928 4508053 3514395 4373121 4644972 2774427 1434099 1235057 1358463 2652717
27218B652717J125395j72130J30185n40105m28292j245983l68085J425646j52944
$$ 2652717 3778112 3605982 3736167 3196062 2767770 1521787 1153702 2579348 2426404
27209B426404j22171Q61187l59112j943253O842j194503L38171M19181j053765
$$ 2426404 2304233 3165420 2806308 863055 869897 -324606 13565 432746 -621019
27200f21019k40741J49798J36726K85346R10244L52475J67813j668698J381979
$$ -621019 -861760 -711962 -575236 -289890 620354 972829 1140642 -528056 853923
27191H53923R34932N40730j311149M01584j225065q19444J94590K348792J201932
$$ 853923 1788855 2329585 1018436 1420020 194955 -624489 -429899 1918893 3120825
27182C120825p47468J038204K53692j902186j772139Q66140J401163k442748j330989
$$ 3120825 2373357 3411561 3665253 1763067 -9072 857068 2258231 -184517 -1515506
27173a515506J51401J963813k19952m85267r40480J020066K03132M48340J038518
$$ -1515506 -1364105 599708 379756 -105511 -1045991 -25925 177207 625547 1664065
27164A664065j12381J37743n26388k30872J089117j874391J229019P35286M94648
$$ 1664065 1551684 1689427 1163039 932167 2021284 146893 1375912 2111198 2605846
27155B605846q61898k84507j38737r9756J487692m51343P911L90468n78891M78749
$$ 2605846 1743948 1459441 1320704 1220948 2708640 2257297 2265208 2655676 2076785 2555534
27145B555534N20765k14600r01902l46007q13202j806510Q17730J577482j33754
$$ 2555534 3076299 2861699 1959797 1613790 800588 -1005922 -188192 1389290 1255536
27136A255536q06898N82442n08570j78955J782591J63285q79454l80815J4044
$$ 1255536 448638 1031080 522510 343555 2126146 2289431 1409977 1029162 1043206
27127A043206j834270k93228K83160K134162M36315O08093n45364j626216j243897
$$ 1043206 -791064 -1084292 -801132 1333030 1769345 2377438 1832074 205858 -1038039
27118a038039N88833J143978N27130p37627P90118j032682p88514R21468m95808
$$ -1038039 -449206 694772 1221902 484275 1274393 241711 -546803 374665 -121143
27109a21143J75124p99713R59738l81233J34329J565536l60844k91556j134669
$$ -121143 53981 -745732 214006 -167227 -32898 1532638 1171794 880238 -254431
27100b54431q50687R75439n3607j019223o41136J174127M98669k97935R57806
$$ -254431 -1105118 -129679 -183286 -1202509 -1843645 -669518 -170849 -468784 489022
27091D89022J481881o60350o39640n59098j027058O33729J946875Q86418J50595
$$ 489022 1970903 1310553 670913 111815 -915243 -281514 1665361 2551779 2702374
27082B702374m00456l94750j379509N86783L20871j301625n67476o62862q23877
$$ 2702374 2301918 1907168 527659 1114442 1435313 133688 -433788 -1096650 -1920527
27073a920527R31257J306207J881775n54182o81689J1158m60634R2844m58796
$$ -1920527 -989270 316937 2198712 1644530 962841 973999 513365 606209 147413
27064A47413N97755p19818n19094m98800l35005J061822r8820m90906R60202J174899
$$ 147413 745168 25350 -493744 -992544 -1327549 -265727 -364547 -855453 104749 1279648
27054A279648o02221j371730l81445M89164P73092M58998r03073l12443O72634
$$ 1279648 677427 -694303 -1075748 -586584 186508 645506 -257567 -570010 102624
27045A02624K72483Q27380j315371j198300J411601l00904k85417O22349J82382
$$ 102624 375107 1202487 -112884 -1311184 100417 -200487 -485904 136445 318827
27036C18827P45798r49796k195097Q73701J23795j303231J133398K195958K58039
$$ 318827 1064625 114829 -2080268 -1206567 -1082772 -2386003 -1252605 943353 1201392
27027A201392j119330r34878K41891J77320K86555M82787o11748P1872o72862
$$ 1201392 82062 -852816 -610925 -433605 -147050 335737 -276011 -204139 -877001
27018h77001O84113J74919p26002l35346O26605r33239r00900J370585J994814
$$ -877001 -192888 -17969 -743971 -1079317 -452712 -1385951 -2286851 -916266 1078548
27009A078548j344197J01129N66286m00252j097002k42038n89939K52400M80489
$$ 1078548 -265649 -164520 401766 1514 -1095488 -1337526 -1927465 -1675065 -1194576
27000a194576O38020L18781J03740m97830j85266m11217O21523l0606p4973r75016
$$ -1194576 -556556 -237775 -134035 -631865 -817131 -1228348 -606825 -637431 -712404 -1687420
26990a687420m85543J50452R95673O88720l5726m76324l60991J85158Q81845m70764
$$ -1687420 -2172963 -2022511 -1026838 -338118 -373844 -850168 -1211159 -1026001 -144156 -614920
26980f14920J696j18254p13311M47117k07799m87654j138868J209425J44078K56792
$$ -614920 -613224 -731478 -1444789 -997672 -1205471 -1693125 -2831993 -1622568 -1478490 -1221698
26970a221698P23823n89385j538946o16357J738128J857130m9388j751091J51995
$$ -1221698 -497875 -1087260 -2626206 -3242563 -1504435 352695 303307 -1447784 -1295789
26961a295789M62819P36743j32042J5272p96394m70007n8177P3663l02338J666582
$$ -1295789 -832970 -96227 -228269 -212997 -1009391 -1479398 -1537575 -1463912 -1766250 -99668
26951i9668J686695p83002j013011r14462m70247l44733j733574J319770J389073
$$ -99668 1587027 804025 -208986 -1123448 -1593695 -1938428 -3672002 -2352232 -963159
26942i63159J162281p59607m59231R45347P18383p10657j687079m22788j026859
$$ -963159 199122 -560485 -1019716 -74369 644014 -66643 -1753722 -2176510 -3203369
26933c203369n05198J633998J528534K181131j33610j458267J480715J92208o63008
$$ -3203369 -3708567 -2074569 -546035 1635096 1501486 43219 1523934 1716142 1053134
26924A053134j121678r9945Q63438O29679j32101j055027k880135n93185J859595
$$ 1053134 -68544 -168489 694949 1324628 1192527 137500 -2742635 -3335820 -1476225
26915a476225j60313J307965J47480J69675j284576k32430L46820Q74786p65365
$$ -1476225 -1636538 -328573 -181093 -11418 -1295994 -1528424 -1181604 -306818 -1072183
26906a072183M58510J211889P11527j519862n93636Q71649r68935o73168J221206
$$ -1072183 -613673 598216 1309743 -210119 -803755 67894 -901041 -1574209 -353003
26897c53003J653094k046011p9278O54171r11319j269512M55708O41142N51771
$$ -353003 1300091 -745920 -825198 -171027 -1082346 -2351858 -1896150 -1255008 -703237
26888g03237n72703J21588p13793o10797q30711K351061R57577q07043Q16978
$$ -703237 -1275940 -1154352 -1868145 -2478942 -3309653 -958592 -1015 -808058 8920
26879H920L9602k106167J036869K31750q06042j25103J53635M68200K78497P71224
$$ 8920 48522 -2057645 -1020776 -789026 -1595068 -1720171 -1566536 -1098336 -819839 -48615
26869d8615m32489j047461O18985J674413j306690j32060J93601j88270J050340
$$ -48615 -481104 -1528565 -909580 764833 -541857 -673917 -480316 -668586 381754
26860C81754P78632k36499K24425k638173L66389J982808M97615J304780O35612
$$ 381754 1160386 923887 1148312 -1489861 -1123472 859336 1356951 2661731 3297343
26851C297343r62084j188278j489634j433108L38411p38631L14250J8383J105633
$$ 3297343 2335259 1146981 -342653 -1775761 -1437350 -2175981 -1861731 -1843348 -737715
26842g37715j87553P0957j27588m93725J103939O11757j20122j369177K25998
$$ -737715 -925268 -854311 -981899 -1475624 -371685 240072 119950 -1249227 -1023229
26833a023229L31475l11567Q98344P55247j121948n87547J373348j575428j809215
$$ -1023229 -691754 -1003321 -104977 650270 -471678 -1059225 314123 -1261305 -3070520
26824c070520J047740J520333l65796J97643J121543K8011n41767k378815P10146
$$ -3070520 -2022780 -502447 -868243 -670600 450943 478954 -62813 -2441628 -1731482
26815a731482J433268P85166J62618j308588O14494J02875j995359j07857m46744
$$ -1731482 -298214 486952 649570 -659018 -44524 58351 -1937008 -2044865 -2491609
26806b491609q62394J465324n4760J429234J381045P66117J092423M08616j054765
$$ -2491609 -3354003 -1888679 -1943439 -514205 866840 1632957 2725380 3133996 2079231
26797B079231j779427n17530o89989J071830q54783K64421N0653q71709j071238
$$ 2079231 299804 -217726 -907715 164115 -690668 -426247 -375594 -1247303 -2318541
26788b318541J70462j025141J267368M66805o91234K106372k42897l93696N16981
$$ -2318541 -2148079 -3173220 -1905852 -1439047 -2130281 -23909 -266806 -660502 -143521
26779a43521l01473l90952q3488m41077J196466o91574j313795p42288J174205
$$ -143521 -444994 -835946 -919434 -1360511 -164045 -855619 -2169414 -2911702 -1737497
26770a737497P59481J348224R00150K54550k12097k535559p71834O98541o6m29395
$$ -1737497 -978016 370208 1270358 1524908 1312811 -1222748 -1994582 -1296041 -1296107 -1725502
26760a725502m18651J240826J491305q83033M38475L96995R39432l66707k368848
$$ -1725502 -2144153 -903327 587978 -295055 143420 540415 1479847 1113140 -1255708
26751a255708j55016L5666J695112L12707k113511K74707j050580j79234R76814
$$ -1255708 -1410724 -1375058 320054 632761 -1480750 -1206043 -2256623 -2435857 -1459043
26742a459043N05624J94861l28578R55927k82945j903183n480O10590m66138M19247
$$ -1459043 -953419 -758558 -1087136 -131209 -414154 -2317337 -2322817 -1712227 -2178365 -1759118
26732a759118K55151J022562k23996J257987j115510n56161r51144O89569J193555
$$ -1759118 -1503967 -481405 -705401 552586 -562924 -1119085 -2070229 -1380660 -187105
26723a87105r33011o96789L4512K62359O43874K60987M47852L84258J281703j585235
$$ -187105 -1120116 -1816905 -1782393 -1520034 -876160 -615173 -167321 216937 1498640 -86595
26713h6595o38997K21118j683768J122716k43374j212115M27780k38792M67306
$$ -86595 -725592 -504474 -2188242 -1065526 -1308900 -2521015 -2093235 -2332027 -1864721
26704a864721K707302n75469q62906J207182j195742K62257R9678M15269q62006
$$ -1864721 842581 267112 -595794 611388 -584354 -322097 -222419 192850 -669156
26695f69156L91832j375121j349452o95699O14989P6514M24197J862966K236918
$$ -669156 -277324 -1652445 -3001897 -3697596 -3082607 -3006093 -2581896 -718930 1517988
26686A517988P18141p72813j455404l64573n08047p35044N56965Q56788J414891
$$ 1517988 2236129 1463316 7912 -356661 -864708 -1599752 -1042787 -185999 1228892
26677A228892l311j9575j067297M4499J553778j136095n36708r43351J324530
$$ 1228892 1225581 1206006 138709 183208 1736986 600891 64183 -879168 445362
26668D45362j027529l64079O52470P59438k09629l56128j480195q48J999558R39627
$$ 445362 -582167 -946246 -293776 465662 256033 -100095 -1580290 -1581138 418420 1358047
26658A358047J52904j844248L61570j392342Q07255N9921j824029n57847r3921
$$ 1358047 1510951 -333297 28273 -1364069 -556814 -496893 -2320922 -2878769 -2972690
26649b972690K241540j57216p07453J188148n01270L45787R202J313504k7860
$$ -2972690 -731150 -888366 -1595819 -407671 -908941 -563154 -553952 759552 731692
26640G31692L92483j869006M69438O39108j511213l21630k94919n49104p56373
$$ 731692 1124175 -744831 -275393 363715 -1147498 -1469128 -1764047 -2313151 -3069524
26631c069524l41229J654411J477130r62984J090224J40062j626058K78462M80558
$$ -3069524 -3410753 -1756342 -279212 -1242196 -151972 -11910 -1637968 -1359506 -878948
26622h78948L37303j880415P64106Q16328M6660j355046k32023J373279o83783
$$ -878948 -541645 -2422060 -1657954 -841626 -794966 -2150012 -2382035 -1008756 -1692539
26613a692539q96965o85246O59467K97449J536333l22723n20165N55413j122786
$$ -1692539 -2589504 -3274750 -2615283 -2317834 -781501 -1104224 -1624389 -1068976 -2191762
26604b191762k87950N17618O93863J690303K63263j179332K87966J315553q94811
$$ -2191762 -2479712 -1962094 -1268231 422072 685335 -493997 -206031 1109522 214711
26595B14711k3468p18209Q4729O52122r59158J37240M38641p6423j632492k86917
$$ 214711 191243 -526966 -442237 209885 -749273 -612033 -173392 -249815 -1882307 -2169224
26585b169224o15864J81189J323328n46194M10856J10261J575665Q03663j101434
$$ -2169224 -2785088 -2603899 -1280571 -1826765 -1415909 -1305648 270017 1073680 -27754
26576b7754j012317k13540J82082J008449K08398K10433j008027L44822R01569
$$ -27754 -1040071 -1253611 -1071529 -63080 145318 355751 -652276 -307454 594115
26567E94115j83891j564000O25763p31774j57884k03344M96553j18580j437454
$$ 594115 410224 -1153776 -528013 -1259787 -1417671 -1621015 -1124462 -1243042 -2680496
26558b680496J283411P2281r46174P1685K218532m107o60812J334649M98171q49803
$$ -2680496 -1397085 -1324804 -2270978 -2199293 19239 15132 -645680 688969 1187140 337337
26548C37337J501017k07671Q99959j901721j8261q55427j176080O52891K23116
$$ 337337 1838354 1630683 2530642 628921 610660 -244767 -1420847 -767956 -544840
26539e44840P49184q92294j454105K79600N10693J394313J003154L51262q73648
$$ -544840 204344 -687950 -2142055 -1862455 -1351762 42551 1045705 1396967 523319
26530E23319m83378K26489P79264l16457n42611O49827m91915n33958j403788
$$ 523319 39941 266430 1045694 729237 186626 836453 344538 -189420 -1593208
26521a593208o66563o5453L64403J152368J662257O14306L83480j122154p06006
$$ -1593208 -2259771 -2325224 -1960821 -808453 853804 1468110 1851590 729436 23430
26512B3430J441303j288579j247863M63122q71224O27041P64667l27918J266533
$$ 23430 1464733 176154 -1071709 -608587 -1479811 -852770 -88103 -416021 850512
26503H50512q12779m01744Q22012p17190J501032m38796L6127M14670j027293
$$ 850512 37733 -364011 458001 -259189 1241843 803047 839174 1253844 226551
26494B26551J303885K90055j001780m48349p56450J383723Q38277k249920M22907
$$ 226551 1530436 1820491 818711 370362 -386088 997635 1835912 -414008 8899
26485H899K069801J494207k27657j369493l35249q69196q10059r98878j512890
$$ 8899 2078700 3572907 3345250 1975757 1640508 771312 -38747 -1037625 -2550515
26476b550515J312559R38371M98180j198606J061188J352697P51341R4316k4771
$$ -2550515 -1237956 -299585 198595 -1000011 61177 1413874 2165215 2259531 2234760
26467B234760J6699j264031R30504N28227j018064k88469J437604p89405p28951
$$ 2234760 2251459 987428 1917932 2446159 1428095 1139626 2577230 1787825 1058874
26458A058874K64996M29525k58505j89388o86754j684520n76468J392637k94798
$$ 1058874 1323870 1753395 1494890 1305502 618748 -1065772 -1642240 -249603 -544401
26449e44401j138590J730638p40308j233159K652504O1982r74451Q74183j267126
$$ -544401 -1682991 47647 -692661 -1925820 726684 788666 -185785 688398 -578728
26440e78728l85640J55339K139542J057735j560946j258284N08j21352M96021
$$ -578728 -964368 -809029 1330513 2388248 827302 -430982 -430474 -551826 -55805
26431e5805M33529k73842J45382J13679N2180M16615j267811l272021Q65488q2765
$$ -55805 377724 103882 249264 362943 415123 831738 -436073 -3708094 -2842606 -2925371
26421b925371p31388L53894L502Q8934J762133K279819j786932N45027l73191
$$ -2925371 -3656759 -3302865 -3299363 -3210429 -1448296 831523 -955409 -410382 -783573
26412g83573N05062J529054N93098m25428k389398R93558j31041q12919K69234
$$ -783573 -278511 1250543 1843641 1418213 -971185 22373 -108668 -921587 -652353
26403f52353l70711j268487Q65028J444280m14315j016721K41810n65137r55142
$$ -652353 -1023064 -2291551 -1426523 17757 -396558 -1413279 -1171469 -1736606 -2691748
26394b691748K15531J788522P29299Q05947j689320m37815M22130J512979L72251
$$ -2691748 -2476217 -687695 41604 847551 -841769 -1279584 -857454 655525 1027776
26385A027776N58042k216031j440745J213218P75899l07248J004575j36386m13113
$$ 1027776 1585818 -630213 -2070958 -857740 -81841 -389089 615486 479100 65987
26376F5987N79507J086389R054k882210j562509J276961Q79922J73186K08171
$$ 65987 645494 1731883 1740937 -1141273 -2703782 -1426821 -546899 -373713 -165542
26367a65542l00044r18934J75523J102731J117023q21593j587203K99694j06746
$$ -165542 -465586 -1384520 -1208997 -106266 1010757 189164 -1398039 -1098345 -1205091
26358a205091N11858J59565P24399R29323N15524K507j211438n87521q42443j284014
$$ -1205091 -693233 -533668 190731 1120054 1635578 1638085 426647 -160874 -1003317 -2287331
26348b287331J131921P94790m79820j18284n54042M4296N61941j166816l763J237052
$$ -2287331 -1155410 -360620 -840440 -958724 -1512766 -1468470 -906529 -2073345 -2077108 -840056
26338h40056N99767J151681m79424j789450k51835J019135o69114q49010L10157
$$ -840056 -240289 911392 431968 -1357482 -1609317 -590182 -1259296 -2108306 -1798149
26329a798149n06290J17785J515598N07720l64628l47284Q9115j097955M83509
$$ -1798149 -2304439 -2186654 -671056 -163336 -527964 -875248 -786133 -1884088 -1400579
26320a400579L12824k86675j484364k35451J208693K0911l47950P65919J059889
$$ -1400579 -1087755 -1374430 -2858794 -3094245 -1885552 -1864641 -2212591 -1446672 -386783
26311c86783r25939P09776o62940O40428j59652P74264K48019j224597L49493
$$ -386783 -1312722 -602946 -1265886 -625458 -785110 -10846 237173 -987424 -637931
26302f37931R84546j962310r54525J765498J116100J11421m02892J083495j614648
$$ -637931 346615 -1615695 -2570220 -804722 311378 422799 19907 1103402 -511246
26293e11246j70573M13569o77712m08401O60274J969834l24766j919425j520610
$$ -511246 -681819 -268250 -945962 -1354363 -694089 1275745 950979 -968446 -2489056
26284b489056J933984K99363q42271m21225m09934J093474J425178M50732q24122
$$ -2489056 -555072 -255709 -1097980 -1519205 -1929139 -835665 589513 1040245 216123
26275B16123l09632l79136P56158k28548J15504k8822j369842N40829J215972
$$ 216123 -93509 -472645 283513 54965 170469 141647 -1228195 -687366 528606
26266E28606k348409l18358L27639Q14219P09584p49819k106181M08117J859460
$$ 528606 -1819803 -2138161 -1810522 -996303 -286719 -1036538 -3142719 -2734602 -875142
26257h75142K44993n45673K0971p95839o85645K244049q70225L08401P42222M29260
$$ -875142 -630149 -1175822 -1154851 -1950690 -2636335 -392286 -1262511 -954110 -211888 217372
26247B17372J182747p37441o79519M98149m47351l24304j237639j38333J130284
$$ 217372 1400119 662678 -16841 481308 33957 -290347 -1527986 -1666319 -536035
26238e36035J279750N25444q07875q6154l00870J281331k54980M89348k69691
$$ -536035 743715 1269159 461284 375130 74260 1355591 1100611 1589959 1320268
26229A320268o01902K5400j374680J06586k81486j238423K55888K416900j795211
$$ 1320268 718366 743766 -630914 -524328 -805814 -2044237 -1788349 628551 -1166660
26220a166660J100955o6466q65833q32242m61462m67542j145186J094002R71810
$$ -1166660 -65705 -132171 -998004 -1830246 -2291708 -2759250 -3904436 -2810434 -1838624
26211a838624L58267p7986K82833n10062K60017m2765o58197J598615Q14382o62337
$$ -1838624 -1480357 -1558343 -1275510 -1785572 -1525555 -1568320 -2226517 -627902 186480 -475857
26201d75857j235976N02289j006753M00695j92400l11097J860184j0368K06084
$$ -475857 -1711833 -1209544 -2216297 -1815602 -2008002 -2319099 -458915 -469283 -263199
26192b63199m09590R44792j168727K09459J317741k0050j8614j94664j33625J41809
$$ -263199 -672789 272003 -896724 -687265 630476 610426 591812 397148 263523 405332
26182D05332K41345N40942o91087R5668J50045m05612k02478j444967M03062r41822
$$ 405332 646677 1187619 496532 592200 742245 336633 134155 -1310812 -907750 -1849572
26172a849572M46827J380490K43572j345016Q22644K004426n60522o37312K91213
$$ -1849572 -1402745 -22255 221317 -1123699 -301055 1703371 1142849 505537 796750
26163G96750j104172p1237J30787L66118Q9757O24792j121712K26382Q2577J353685
$$ 796750 -307422 -378659 -247872 118246 208003 832795 -288917 -62535 20042 1373727
26153A373727L13800j262113j163109M55563p7058K12130l62000J075240k12648
$$ 1373727 1687527 425414 -737695 -282132 -359190 -147060 -509060 566180 353532
26144C53532j76063J927562m74139o86023N23943j690153R8604J69716n4054j312450
$$ 353532 177469 2105031 1630892 944869 1468812 -221341 -122737 46979 -7075 -1319525
26134a319525o9805J248863k03375K98317o21302k59201O09654n24426l5262J640735
$$ -1319525 -1389330 -140467 -343842 -45525 -666827 -926028 -316374 -840800 -876062 764673
26124G64673j251176q67826N91019O91870L64623L47101n8457K70072q23103q614
$$ 764673 -486503 -1354329 -763310 -71440 293183 640284 581827 851899 28796 20182
26114B0182r78681Q24842j635639j033035Q44616P75858L17537J605054n51452
$$ 20182 -958499 -133657 -1769296 -2802331 -1957715 -1181857 -864320 740734 189282
26105A89282k79253Q827n8569J237959n66507j257121J755379N01133j097574
$$ 189282 -89971 -81144 -139713 1098246 531739 -725382 1029997 1531130 433556
26096D33556J445394J04512j602891j508910j418063K647573J788801k11721m69690
$$ 433556 1878950 1983462 380571 -1128339 -2546402 101171 1889972 1678251 1208561
26087A208561n37371j435120L24657P548l06214q99416n17618N95240O76618N65599
$$ 1208561 671190 -763930 -439273 -431725 -737939 -1637355 -2154973 -1559733 -883115 -317516
26077c17516k67217k47392J89286J846810L02124j924329r37202J458292J542621
$$ -317516 -584733 -832125 -642839 1203971 1506095 -418234 -1355436 102856 1645477
26068A645477m88361j215519L41251m67919K00173n72291k18777L5332L72792
$$ 1645477 1157116 -58403 282848 -185071 15102 -557189 -775966 -740634 -367842
26059c67842n5705n00411J183683r5088m35459r50096m39750R28191l64000r23483
$$ -367842 -423547 -923958 259725 164637 -270822 -1220918 -1660668 -732477 -1096477 -2019960
26049b019960J283729L68785l96092K12873N51629p6394m77740J096808j215312
$$ -2019960 -736231 -367446 -763538 -550665 964 -75430 -553170 543638 -671674
26040f71674j153622M84209J122309k63136m30611K71238l88028M08487M44861
$$ -671674 -1825296 -1341087 -218778 -481914 -912525 -641287 -1029315 -620828 -175967
26031a75967j30578K69029j401720q58293R66518N97911j36348L87498J264411
$$ -175967 -306545 -37516 -1439236 -2297529 -1331011 -733100 -869448 -481950 782461
26022G82461j415277j246778J209282J005900K02525o45174N24664L12594j142715
$$ 782461 -632816 -1879594 -670312 335588 538113 -107061 417603 730197 -412518
26013d12518j079731j115309P94185J739814k5499J442025j302837k636044N81175
$$ -412518 -1492249 -2607558 -1813373 -73559 -99058 1342967 40130 -2595914 -2014739
26004b014739J333027l75197p68046J922391P488j786995k92837J714446j033369
$$ -2014739 -681712 -1056909 -1824955 97436 104924 -1682071 -1974908 -260462 -1293831
25995a293831p51819J70830J621730o02887j53312p2219J146995N17914m25881
$$ -1293831 -2045650 -1874820 -253090 -855977 -1009289 -1081508 65487 583401 157520
25986A57520r56119L16193q1346Q7442m34762j209604Q07096J579857P02010r05645
$$ 157520 -798599 -482406 -563752 -476310 -911072 -2120676 -1313580 266277 968287 62642
25976F2642j17850q38263R6756K84371l63143K95961J476503O31415k020637L60197
$$ 62642 -55208 -893471 -796715 -512344 -875487 -579526 896977 1528392 -492245 -132048
25966a32048R32760p25738n19682q98964n95052m18920l63440R02239Q12486J687896
$$ -132048 800712 74974 -444708 -1343672 -1938724 -2357644 -2721084 -1818845 -1006359 681537
25956F81537j33420q85156K56698R41077j640207j245187o13909M883J576067
$$ 681537 548117 -337039 -80341 860736 -779471 -2024658 -2638567 -2633684 -1057617
25947a057617j11426q50177J17245J538726N69341p04558l83737r11524j048812
$$ -1057617 -1169043 -2019220 -1901975 -363249 206092 -498466 -882203 -1793727 -2842539
25938b842539J98062K515814j14360j117379J365466J06172k088765q8977J514637
$$ -2842539 -2644477 -128663 -243023 -1360402 5064 111236 -1977529 -2066506 -551869
25929e51869Q61567r67499j056804R9046M86762o20675k46324k94911J520940
$$ -551869 309698 -657801 -1714605 -1615559 -1128797 -1749472 -1995796 -2290707 -769767
25920g69767M9483l47671m29227n12212o97446N47792K63476J659909p8877M7385
$$ -769767 -720284 -1067955 -1497182 -2009394 -2706840 -2159048 -1895572 -235663 -314540 -267155
25910b67155j346081Q80985l55429m84199N65490L1153P72075r88210J562830
$$ -267155 -1613236 -732251 -1087680 -1571879 -1006389 -975236 -203161 -1191371 371459
25901C71459o03594j117099q1034L28068K48909m72782r30810J962892J161193
$$ 371459 -232135 -1349234 -1430268 -1102200 -853291 -1326073 -2256883 -293991 867202
25892H67202n75048L63059J151219j775141k707748m91670J075730M05823O34579
$$ 867202 292154 655213 1806432 31291 -2676457 -3168127 -2092397 -1686574 -1051995
25883a051995l62197N95502N43234J007455m61099p2738n04520o06871o31076
$$ -1051995 -1414192 -818690 -275456 731999 270900 198162 -306358 -913229 -1544305
25874a544305J154055p84344j105285n27654L67887P99968J02188k46121J50450
$$ -1544305 -390250 -1174594 -2279879 -2807533 -2439646 -1639678 -1537490 -1783611 -1633161
25865a633161J129195L76412P42405p73986n85870r67831n81842m2892j538785
$$ -1633161 -503966 -127554 614851 -159135 -745005 -1712836 -2294678 -2337570 -3876355
25856c876355M63619l82804J382305j92208J486244N20406j475717k88298J183383
$$ -3876355 -3412736 -3795540 -2413235 -2605443 -1119199 -598793 -2074510 -2362808 -1179425
25847a179425J219236k345883P0772M78698M51558j303801N36556K07886K52240
$$ -1179425 39811 -2306072 -2235300 -1756602 -1305044 -2608845 -2072289 -1864403 -1612163
25838a612163n75118L66995j70420O99649R08270O93118j422490N96913P74221
$$ -1612163 -2187281 -1820286 -1990706 -1291057 -382787 310331 -1112159 -515246 258975
25829B58975k033738R55682J573781L99323k66454O1099m86726r0693L18743j158188
$$ 258975 -1774763 -819081 754700 1154023 887569 948668 461942 371249 689992 -468196
25819d68196Q24147p62300o42481r89815k33743J401967l48657P88555q84216
$$ -468196 355951 -406349 -1048830 -2038645 -2272388 -870421 -1219078 -430523 -1314739
25810a314739P8245K96659Q8828J72174Q25569j370898p16993j76087N42372Q30864
$$ -1314739 -1236494 -939835 -851007 -678833 146736 -1224162 -1941155 -2117242 -1574870 -744006
25800g44006n89110j052377J168630J43150m58023J322160O68703r63874j40341
$$ -744006 -1333116 -2385493 -1216863 -1073713 -1531736 -209576 459127 -504747 -645088
25791f45088K65863K53342J36745L31719o98487j079567n63683q10041r4421J320467
$$ -645088 -379225 -125883 10862 342581 -355906 -1435473 -1999156 -2809197 -2903618 -1583151
25781a583151L53522r42712Q1844J061091M9786P86957j37099p22394N84699k42461
$$ -1583151 -1229629 -2172341 -2090497 -1029406 -979620 -192663 -329762 -1052156 -467457 -709918
25771g09918J355109K94578n44931J249268R89128j418408k651361M92575O07919
$$ -709918 645191 939769 394838 1644106 2633234 1214826 -1436535 -943960 -336041
25762c36041J515971J372232j326226k548539P45134K83962K56321k89005J456016
$$ -336041 1179930 2552162 1225936 -1322603 -577469 -293507 -37186 -326191 1129825
25753A129825o99360j309613O94723Q01640l53354j093724O4779R56000l6640
$$ 1129825 430465 -879148 -184425 617215 263861 -829863 -765084 190916 154276
25744A54276J57315L643j12897n59999M14692O90069j693931R02161N98253o04900
$$ 154276 311591 315234 202337 -357662 57030 747099 -946832 -44671 553582 -51318
25734e1318J97911J73281r42474j372033L48636k39241P60987r2026J575752L74658
$$ -51318 146593 319874 -622600 -1994633 -1645997 -1885238 -1124251 -1216277 359475 734133
25724G34133r93518r9529l76940R63761J95620L49529J546152j29960j224724
$$ 734133 -259385 -358914 -735854 227907 423527 773056 2319208 2189248 964524
25715I64524Q15670q75803j581605p55154J214770p90778j024256J086187j73434
$$ 964524 1780194 904391 -677214 -1432368 -217598 -1008376 -2032632 -946445 -1119879
25706a119879q66432K660103q86671j463729K56096K08668N84004m70661J99707
$$ -1119879 -1986311 673792 -212879 -1676608 -1420512 -1211844 -627840 -1098501 -898794
25697h98794J495998m20624j308115r93473J008801O68948R28403j18624j216605
$$ -898794 597204 176580 -1131535 -2125008 -1116207 -447259 481144 362520 -854085
25688h54085J528716n81810R93262r67076j280004N29515o5514n17208l25519
$$ -854085 674631 92821 1086083 119007 -1160997 -631482 -696996 -1214204 -1539723
25679a539723l11240L36058P45215q83536J82199m16401j56598O11421k72321
$$ -1539723 -1850963 -1514905 -769690 -1653226 -1471027 -1887428 -2044026 -1432605 -1704926
25670a704926m40016P70936R17954n32238J495295j73809q29185O45180k21979
$$ -1704926 -2144942 -1374006 -456052 -988290 507005 333196 -495989 149191 -72788
25661g2788k07682r08174m3763J87167J154529q8039J373230p61769k471789n46460
$$ -72788 -280470 -1188644 -1232407 -1045240 109289 21250 1394480 632711 -1839078 -2385538
25651b385538O44994j013794Q8995K227667o38057o16516q62301o63584J53567
$$ -2385538 -1740544 -2754338 -2665343 -437676 -1075733 -1692249 -2554550 -3218134 -3064567
25642c064567J591694N25913m40535j454133k87710P72845O3878J501112Q54483
$$ -3064567 -1472873 -946960 -1387495 -2841628 -3129338 -2356493 -2292615 -791503 62980
25633F2980J57842K273433j694676l088002Q96964J417364r79791r37951K07022
$$ 62980 220822 2494255 799579 -2288423 -1391459 25905 -953886 -1891837 -1684815
25624a684815Q81433k46735P69182J863302j591395k146199Q75199o9801J061024
$$ -1684815 -803382 -1050117 -280935 1582367 -9028 -2155227 -1280028 -1349829 -288805
25615b88805k04367N99930J094408J08769k575917j288104L471Q9041P06623N86130
$$ -288805 -493172 106758 1201166 1309935 -1265982 -2554086 -2550615 -2461574 -1754951 -1168821
25605a168821J488349J462867k038200k83275l90445n06987N18638k73410k4432
$$ -1168821 319528 1782395 -255805 -539080 -929525 -1436512 -917874 -1191284 -1215716
25596a215716r96744j62018j86294P49100N39218m65424J441631J054609J68791
$$ -1215716 -2212460 -2374478 -2560772 -1811672 -1272454 -1737878 -296247 758362 927153
25587I27153j135811O70819j76662J434183n82527l0242j180800m21612r0959
$$ 927153 -208658 462161 285499 1719682 1137155 1106913 -73887 -495499 -586458
25578e86458P73774J057959p87890n28291Q22378l43729j667233j118391j80343
$$ -586458 187316 1245275 457385 -70906 751472 407743 -1259490 -2377881 -2558224
25569b558224J599694j116693Q13797R52555m53679l66552N64285k39820m55999
$$ -2558224 -958530 -2075223 -1261426 -308871 -762550 -1129102 -564817 -804637 -1260636
25560a260636j83351m49152O65302K29817J25266P82739J672568j935307m40049
$$ -1260636 -1443987 -1893139 -1227837 -998020 -872754 -90015 1582553 -352754 -792803
25551g92803K888361J0410k202219q92586Q19559J143637q63185q11895Q10666
$$ -792803 2095558 2105968 -96251 -988837 -169278 974359 111174 -700721 109945
25542A09945R42360l35209n91059j239090K80366K004018q49378o28790J9441
$$ 109945 1052305 717096 126037 -1113053 -832687 1171331 321953 -306837 -287396
25533b87396n07456M8401N12701Q2268J37314M66209n48923k66684L65895O25453
$$ -287396 -794852 -746451 -233750 -151482 -14168 452041 -96882 -363566 2329 627782
25523F27782N69474j52073r41654J84753j49286o07743j289080J012851N45015
$$ 627782 1197256 1045183 103529 288282 138996 -468747 -1757827 -744976 -199961
25514a99961Q51970l57008j024137J68211Q56850Q61134o55953p17678j1734J61002
$$ -199961 652009 295001 -729136 -560925 295925 1157059 501106 -216572 -228306 -67304
25504f7304l2278n04995j703525k40233K418981M39617o51941q37123P0459l32018
$$ -67304 -99582 -604577 -2308102 -2548335 -129354 310263 -341678 -1178801 -1108342 -1440360
25494a440360J72259p2061j48140J173779N6848M06084N61089q30002q04331N24670
$$ -1440360 -1268101 -1340162 -1488302 -314523 -257675 148409 709498 -120504 -924835 -400165
25484d00165o79298j63182K97675l74394L92441R68462m63228m95013O08260O177
$$ -400165 -1079463 -1242645 -944970 -1319364 -926923 41539 -421689 -916702 -308442 -302265
25474c02265l87184J240628j09845j032653m39836p85099k96330N3525k37055
$$ -302265 -689449 551179 441334 -591319 -1031155 -1816254 -2112584 -2059059 -2296114
25465b296114n01861R56154J709566j230253k253154K100026J002722r90092R37048
$$ -2296114 -2797975 -1841821 -132255 -1362508 -3615662 -1515636 -512914 -1503006 -565958
25456e65958j95887r35542q00369M14427J680180m44876L8069J480986k78891
$$ -565958 -761845 -1697387 -2497756 -2083329 -403149 -848025 -809956 671030 392139
25447C92139N85607o25124j082013j559685J395206J587289o16676O28982m81756
$$ 392139 977746 352622 -729391 -2289076 -893870 693419 76743 705725 223969
25438B23969m05774K20067n77646r40784j7343M74762J232452L2736l32990l43218
$$ 223969 -181805 38262 -539384 -1480168 -1497511 -1022749 209703 242439 -90551 -433769
25428d33769M77376J696303k436778j589461Q34723K232202J415380o04132k022659
$$ -433769 43607 1739910 -696868 -2286329 -1451606 780596 2195976 1591844 -430815
25419d30815J27001J623731O54299p58934N6998j768984n17400l3430k0724J214741
$$ -430815 -303814 1319917 1974216 1215282 1272280 -496704 -1014104 -1047534 -1068258 146483
25409A46483j605288N20017O06593K07375Q04068j16547k068271P2819j02180
$$ 146483 -1458805 -938788 -332195 -124820 679248 562701 -1505570 -1432751 -1534931
25400a534931o22831J448951J585472n85399J33858j086895O1990j83980o45661
$$ -1534931 -2157762 -708811 876661 291262 425120 -661775 -599785 -783765 -1429426
25391a429426O96080k04975j90403J37228J34545p73942J026949K429797M98377
$$ -1429426 -733346 -938321 -1128724 -991496 -856951 -1630893 -603944 1825853 2324230
25382B324230j179574j21615Q36248K44039L90713k151811j414911r61861J385123
$$ 2324230 1144656 1023041 1859289 2103328 2494041 342230 -1072681 -2034542 -649419
25373f49419o13616J454253j85098l13500J137628l25432o56025P41199J77165
$$ -649419 -1263035 191218 6120 -307380 830248 504816 -151209 589990 767155
25364G67155n5887M09002p77274j611668j835766P58214K099260K303173l56783
$$ 767155 711268 1120270 342996 -1268672 -3104438 -2346224 -246964 2056209 1699426
25355A699426p25986K07300j331851o38600J617643k60377J00331r19985k29034
$$ 1699426 973440 1180740 -151111 -789711 827932 567555 667886 -252099 -481133
25346d81133L62759P49561q45323q09766r1840N9982L72385p58450M87206j89629
$$ -481133 -118374 631187 -214136 -1023902 -1115742 -1055760 -683375 -1441825 -954619 -1144248
25336a144248J53277J620461j470893j019374Q41184J369346J593942K57784j506115
$$ -1144248 -990971 629490 -841403 -1860777 -1019593 349753 1943695 2201479 695364
25327F95364p30291l93380j282208Q70644Q90304p92567J78065J356044q81476
$$ 695364 -34927 -428307 -1710515 -839871 50433 -742134 -564069 791975 -89501
25318h9501O43989K142797p25632j541840M56879o86000K96528j555280p67834
$$ -89501 554488 2697285 1971653 429813 886692 200692 497220 -1058060 -1825894
25309a825894o06490L53379M1827N04083J189220J153929l85667j605602K33010
$$ -1825894 -2432384 -2079005 -2037178 -1533095 -343875 810054 424387 -1181215 -948205
25300i48205K580170R30944k397333k92065p32002L40636o62518J18623j339218
$$ -948205 1631965 2562909 165576 -126489 -858491 -517855 -1180373 -1061750 -2400968
25291b400968r21042K047820O35613m48629j233504j137287O1437M38421K98616
$$ -2400968 -3322010 -1274190 -638577 -1087206 -2320710 -3457997 -3396560 -2958139 -2659523
25282b659523J254586K136592q61568m02574N22314l76935p15058k94484o49758
$$ -2659523 -1404937 731655 -129913 -532487 -10173 -387108 -1102166 -1396650 -2046408
25273b046408Q65794J680711j11134m64629P48653j381969j106114j895466J428893
$$ -2046408 -1180614 500097 388963 -75666 672987 -708982 -1815096 -3710562 -2281669
25264b281669J299853l41266m26208R82544l14835J191557j108647j201647L27261
$$ -2281669 -981816 -1323082 -1749290 -766746 -1081581 109976 -998671 -2200318 -1873057
25255a873057R86111j74407q62386O69195J393220p50094j270044Q75803L32412
$$ -1873057 -886946 -1061353 -1923739 -1254544 138676 -611418 -1881462 -1005659 -673247
25246f73247n76149q53847R30375N67298K6762L9301J16377r80805R26204K25463
$$ -673247 -1249396 -2103243 -1172868 -605570 -578808 -539507 -423130 -1403935 -477731 -252268
25236b52268J15741N65662o82160K30015k18103J164552Q62240j878485p25972
$$ -252268 -136527 429135 -253025 -23010 -241113 923439 1785679 -92806 -818778
25227h18778l83662J569877J10603j049743o93031Q11425P27150L81926m74857
$$ -818778 -1202440 367437 478040 -571703 -1264734 -453309 273841 655767 180910
25218A80910l41511K4583J895690M06848j458928n32825R5211j899821P99358
$$ 180910 -160601 -136018 1759672 2166520 707592 174767 269978 -1629843 -830485
25209h30485K084903o96725N2088j480484J328851j407766j921950N4531J76999
$$ -830485 1254418 557693 609781 -870703 458148 -949618 -2871568 -2817037 -2640038
25200b640038J222355J719833q6517j97025P34909M13139l02790k44389N179K67459
$$ -2640038 -1417683 302150 215633 18608 753517 1166656 863866 619477 624656 892115
25190H92115m33862Q80704r12616q17017K90530L28869J94383P16786N30872O17673
$$ 892115 458253 1338957 426341 -390676 -100146 228723 423106 1139892 1670764 2288437
25180B288437k454460J16306j692320o39977Q45110Q3083J036666J177880O30862
$$ 2288437 -166023 -49717 -1742037 -2382014 -1536904 -1453821 -417155 760725 1391587
25171A391587r72318n92118M25652l16674j92948J13317j405890J082609Q64669
$$ 1391587 419269 -172849 252803 -63871 -256819 -143502 -1549392 -466783 397886
25162C97886m0637n40005n31930J74778p74430J60126q27913J666071P76282P927
$$ 397886 357249 -182756 -714686 -539908 -1314338 -1154212 -1982125 -316054 460228 468155
25152D68155L80277q50218n00535o90137M06447K157344P5540J306729j584550
$$ 468155 848432 -1786 -502321 -1192458 -786011 1371333 1446873 2753602 1169052
25143A169052j033898K8784R94649j662749O28609l9611j25991m81251j419475
$$ 1169052 135154 163938 1158587 -504162 124447 84836 -41155 -522406 -1941881
25134a941881j124296J666130N11126n99831p29287J245975P00736K1835P13242
$$ -1941881 -3066177 -1400047 -888921 -1488752 -2218039 -972064 -271328 -249493 463749
25125D63749j07581n16012k74829K06173j333377k88447P80147M69564M25323
$$ 463749 356168 -159844 -434673 -228500 -1561877 -1850324 -1070177 -600613 -175290
25116a75290M652R64149r57148m70650Q97140p76545J381400Q43304j502489j469821
$$ -175290 -170638 793511 -163637 -634287 262853 -513692 867708 1711012 208523 -1261298
25106a261298l35916Q40314O51166q9162J559277j348542J35578o54029j80757
$$ -1261298 -1597214 -756900 -105734 -194896 1364381 15839 151417 -502612 -683369
25097f83369k26638R4019Q19729l77671l61697j283992L3544J394355K46385l03716
$$ -683369 -910007 -815988 3741 -373930 -735627 -2019619 -1986075 -591720 -345335 -649051
25087f49051J96336J54493P52020m8424j851560l31835K222702M56840j210880
$$ -649051 -452715 -298222 453798 405374 -1446186 -1778021 444681 901521 -309359
25078c09359L46350K77830j764858q27308P88074J377655J345343m72669j61140
$$ -309359 36991 314821 -1450037 -2277345 -1489271 -111616 1233727 761058 599918
25069E99918P27140O68804J28588j462108M94024P68031r64715L00191P14691
$$ 599918 1327058 1995862 2124450 662342 1156366 1924397 959682 1259873 1974564
25060A974564j577393j361542K191451k00159k09271j62825O374J243848k155030
$$ 1974564 397171 -964371 1227080 1026921 817650 654825 661199 1905047 -249983
25051b49983l6351o85784l3885K021135M97772o73123j480328M78632O86314j017503
$$ -249983 -286334 -972118 -1006003 1015132 1512904 839781 -640547 -161915 524399 -493104
25041d93104J00929J124524p85986o334k31814L90890R73074j011934n72822N38401
$$ -493104 -392175 732349 -53637 -59971 -291785 99105 1072179 60245 -512577 25824
25031B5824m35114J6277n85730J462080m06652M32891J129013m82522l91163j343609
$$ 25824 -409290 -393013 -978743 483337 76685 509576 1638589 1156067 764904 -578705
25021e78705M73132O11936j107228M96167J612858l17736j045213q42420Q29667
$$ -578705 -105573 506363 -600865 -104698 1508160 1190424 145211 -697209 132458
25012A32458o80461j148040j57209K67483j13413J79222J676688Q61043k45250
$$ 132458 -548003 -1696043 -1853252 -1585769 -1699182 -1519960 156728 1017771 772521
25003G72521j091272o47131N5966l26433j110537P04273O23771J068277j62026
$$ 772521 -318751 -965882 -909916 -1236349 -2346886 -1642613 -1018842 49435 -112591
24994a12591L64137j034194l19847L11377J545085q08026q20168R2968q2409j329690
$$ -112591 251546 -782648 -1102495 -791118 753967 -54059 -874227 -781259 -863668 -2193358
24984b193358Q85482L88215J98286R78287Q53251m02523j440659k37933K42960
$$ -2193358 -1307876 -919661 -721375 256912 1110163 707640 -733019 -970952 -727992
24975g27992L89657L14160J04800j32540N90531j651037M88295M80575L98412
$$ -727992 -338335 -24175 80625 -51915 538616 -1112421 -624126 -143551 254861
24966B54861n77826N94786m25950o24685l07615m15617L68345K40286N51127R70478
$$ 254861 -322965 271821 -154129 -778814 -1086429 -1502046 -1133701 -893415 -342288 628190
24956F28190o59056r85022K71691M33488m41168M31029n96932Q793K47613M18693
$$ 628190 -30866 -1015888 -744197 -310709 -751877 -320848 -917780 -908987 -661374 -242681
24946b42681Q92735n29779N46401n01464m02907J456953j421802J818664J05684
$$ -242681 650054 120275 666676 165212 -237695 1219258 -202544 1616120 1721804
24937A721804l167298M50617J601941P9319l46092M98114O86596m29083o62330
$$ 1721804 -1445494 -994877 607064 686383 340291 838405 1525001 1095918 433588
24928D33588m63428L86239J005109j177140J13523l57154p18457l43592L61947
$$ 433588 -29840 356399 1361508 184368 297891 -59263 -777720 -1121312 -759365
24919g59365R8822M79417Q57306K74047j140061l8520R90223j828278N54314Q51677
$$ -759365 -660543 -181126 676180 950227 -189834 -228354 761869 -1066409 -512095 339582
24909C39582j26459r51128K23872J111685L86807j515048M14781O85615P5215
$$ 339582 213123 -738005 -514133 597552 984359 -530689 -115908 569707 644922
24900F44922L97313K5490o29913J30372p61611j011116M85904Q0315k11659o41586
$$ 644922 1042235 1067725 437812 568184 -193427 -1204543 -718639 -638324 -849983 -1491569
24890a491569Q32514J447453j90351J019723k43403m77982J232614l01581L07061
$$ -1491569 -659055 788398 598047 1617770 1374367 896385 2128999 1827418 2134479
24881B134479q37887J69780L65325l23208J316852k073033k56847j299445J537973
$$ 2134479 1296592 1466372 1831697 1508489 2825341 752308 495461 -803984 733989
24872G33989J85146M74800k77362j071504M93809L31293M57431m49348L74062
$$ 733989 919135 1393935 1116573 45069 538878 870171 1327602 878254 1252316
24863A252316k76688p09452J397785K6970j099099N55145R01743j306496k460228
$$ 1252316 975628 266176 1663961 1690931 591832 1146977 2048720 742224 -1718004
24854a718004k13660L13492J70085k05060J95859j7364P12356j077458l31915
$$ -1718004 -1931664 -1618172 -1448087 -1653147 -1457288 -1474652 -762296 -1839754 -2171669
24845b171669J874581K43946L89868r78608J43789J411534n36283r82224n57822
$$ -2171669 -297088 -53142 336726 -641882 -498093 913441 377158 -605066 -1162888
24836a162888K50989J35945k029490r9837R63506Q04843P22972j163006J991716
$$ -1162888 -911899 -775954 -2805444 -2905281 -1941775 -1136932 -413960 -1576966 414750
24827D14750J384560L86900j373651m05814L88079j63717O0036k25517q63069
$$ 414750 1799310 2186210 812559 406745 794824 631107 691143 465626 -397443
24818c97443P06916o56205o26593k7050j484829l21934P68037N81905J714627
$$ -397443 309473 -346732 -973325 -1000375 -2485204 -2807138 -2039101 -1457196 257431
24809B57431k180886p05989K344498M69724J447197J683196o67512K9405o18486
$$ 257431 -1923455 -2629444 -284946 184778 1631975 3315171 2647659 2677064 2058578
24800B058578l27936N63893j16380K0861k76638r40505l96787K81719J576559
$$ 2058578 1730642 2294535 2178155 2199016 1922378 981873 585086 866805 2443364
24791B443364J032572j860231j78894j640538P5958K15130N77889k4104l52903
$$ 2443364 3475936 1615705 1436811 -203727 -127769 87361 665250 641146 288243
24782B88243R37814n37198k063945r3514N75083J098227M46376M0234K63154M2344
$$ 288243 1226057 688859 -1375086 -1468600 -893517 204710 651086 691320 954474 996818
24772I96818j234134m47286O01161L86221K171077j519247O73850j42957j359165
$$ 996818 -237316 -684602 -83441 302780 2473857 954610 1628460 1485503 126338
24763A26338j126192L44978k40471J17363O82194p54988m33247N54723J986283
$$ 126338 -999854 -654876 -895347 -777984 -95790 -850778 -1284025 -729302 1256981
24754A256981J310507j573000r38844O53590J10529m84910q50505k74794K24394
$$ 1256981 2567488 994488 55644 709234 819763 334853 -515652 -790446 -566052
24745e66052l8340R69821O42886L78025p00609o57914J88269j147612m54481N73184
$$ -566052 -604392 365429 1008315 1386340 685731 27817 216086 -931526 -1386007 -812823
24735h12823j110810Q11593J442808O18372N06750J715039j97662j363344j421559
$$ -812823 -1923633 -1112040 330768 949140 1455890 3170929 2973267 1609923 188364
24726A88364J26501j7793p47090J53115J75289j208397L15809q69201o03759J632994
$$ 188364 314865 297072 -450018 -296903 -121614 -1330011 -1014202 -1883403 -2487162 -854168
24716h54168K55822M43306J368238J10953r92382Q01598J089821j065245j138456
$$ -854168 -598346 -155040 1213198 1324151 331769 1133367 2223188 1157943 19487
24707A9487j088395r78374J470791PJ03999j7171O97407m07787j23495K73729
$$ 19487 -1068908 -2047282 -576491 -576484 -472485 -489656 207751 -200036 -323531 -49802
24697d9802m17440K300662r15374k13978L36351o39069K46436P95894p2588j624821
$$ -49802 -467242 1833420 918046 704068 1040419 401350 647786 1443680 1371092 -253729
24687b53729l72743K02482K59358l914R52971K32248M27358M11912R90504j947854
$$ -253729 -626472 -423990 -164632 -168546 784425 1016673 1444031 1855943 2846447 898593
24677H98593R14196j295860j463137O85370K71632m15944L36655j52543J550436
$$ 898593 1812789 516929 -946208 -260838 10794 -405150 -68495 -221038 1329398
24668A329398J20065j491548M9991K346q9591R25179k16792n40114J005132j087142
$$ 1329398 1449463 -42085 7906 10252 -79339 845840 629048 88934 1094066 6924
24658F924k92679J224962O06625j319338J069055P4646k006918j22928l2679M04956
$$ 6924 -285755 939207 1545832 226494 1295549 1370195 -636723 -759651 -792330 -387374
24648c87374j178313n10648N29743q99697Q42742Q54592K85830R58089m92662
$$ -387374 -1565687 -2076335 -1546592 -2446289 -1603547 -748955 -463125 494964 2302
24639B302J22475j40845K53425J258692N91550j655585O8765n66239q76303N90072
$$ 2302 124777 -16068 237357 1496049 2087599 432014 500779 -65460 -941763 -351691
24629c51691j461571O09633J11900M18426k80564l72629L41850k74049J128196
$$ -351691 -1813262 -1203629 -1091729 -673303 -953867 -1326496 -984646 -1258695 -130499
24620a30499L10737j993466m0738K13354J081858R25670j43218r22061r00904
$$ -130499 180238 -1813228 -1853966 -1640612 -558754 366916 223698 -698363 -1599267
24611a599267r65856n75350P64011K91438J061344J808624J920617j727807j741314
$$ -1599267 -2565123 -3140473 -2376462 -2085024 -1023680 784944 2705561 977754 -763560
24602g63560j234704P72956o78487K11356j049491L61336L93986J285045N2660
$$ -763560 -1998264 -1225308 -1903795 -1692439 -2741930 -2380594 -1986608 -701563 -648903
$$ [...]
##END NTUPLES=NMR SPECTRUM
##END=
