##TITLE=19F_EC-3172
 CDCl3. 24 sc
 11.1.2019
##JCAMPDX= 6.0         $$ Bruker NMR JCAMP-DX V2.0
##DATA TYPE= NMR SPECTRUM
##DATA CLASS= NTUPLES
##ORIGIN= UXNMR, Bruker Analytische Messtechnik GmbH
##OWNER= root
$$ XWIN-NMR		Version 3.5
$$ Fri Jan 11 14:25:21 2019 Russian Standard Time (UT+4h)  she@DPX200
##.OBSERVE FREQUENCY= 188.290927
##.OBSERVE NUCLEUS= ^19F
##.ACQUISITION MODE= SIMULTANEOUS
##.ACQUISITION SCHEME= undefined
##.AVERAGES= 24
##.DIGITISER RES= 16
##SPECTROMETER/DATA SYSTEM= spect
##.PULSE SEQUENCE= zg
##.SOLVENT NAME= DMSO
##.SHIFT REFERENCE= (INTERNAL, DMSO, 0, 98.3737)
##AUDIT TRAIL= $$ (NUMBER, WHEN, WHO, WHERE, WHAT)
$$ ##TITLE= Audit trail, XWIN-NMR		Version 3.5
$$ ##JCAMPDX= 5.01
$$ ##ORIGIN= Bruker BioSpin GmbH
$$ ##OWNER= she
$$ F:/spectra/data/she/nmr/f19/1/pdata/1/auditp.txt
$$ ##AUDIT TRAIL=  $$ (NUMBER, WHEN, WHO, WHERE, WHAT)
(   1,<2019-01-11 14:24:04.35 +0400>,<she>,<DPX200>,
      <created by zg, POWCHK disabled, PULCHK disabled
       configuration hash MD5:
       00 E9 B6 7A A2 85 ED C7 34 08 36 98 17 FE 4E 26
       data hash MD5: 64K
       48 62 B6 F2 9E 43 D0 77 D5 EF 42 59 A9 BA F9 E4>)
(   2,<2019-01-11 14:24:12.21 +0400>,<she>,<DPX200>,
      <Start of raw data processing
       efp BC_mod = 2 LB = 1 FT_mod = 6 PKNL = 1 PHC0 = 1693.899 PHC1 = 41.75593 SI = 64K 
       data hash MD5: 64K
       DE 3D D8 CF 3F F9 E2 CD E1 65 9B C2 E0 8B 8F 67>)
(   3,<2019-01-11 14:24:30.84 +0400>,<she>,<DPX200>,
      <pk PHC0 = -0.7563442 PHC1 = 0 
       data hash MD5: 64K
       24 B8 81 26 7F 6D D7 A1 94 65 98 D2 4A CC 00 E6>)
(   4,<2019-01-11 14:24:34.70 +0400>,<she>,<DPX200>,
      <abs ABSG = 5 
       data hash MD5: 64K
       8A 13 5A BB 93 92 2D 14 D6 1A 24 5C 3F 42 AE B8>)
$$ ##END=
$$ 
$$ hash MD5
$$ 31 85 BE 02 54 3A C3 45 05 BF A0 02 E9 9A CE 35
##$RELAX= 
##$RELAX= 
##$RELAX= 
##$RELAX= 
##$RELAX= 
##$RELAX= 
##$RELAX= 
##$RELAX= 
$$ Bruker specific parameters
$$ --------------------------
##$DU= <F:/spectra>
##$EXPNO= 1
##$NAME= <f19>
##$PROCNO= 1
##$TYPE= <nmr>
##$USER= <she>
##$AMP= (0..31)
100 100 100 100 100 100 100 100 100 100 100 100 100 100 100 100 100 100 
100 100 100 100 100 100 100 100 100 100 100 100 100 100 
##$AQSEQ= 0
##$AQ_mod= 1
##$AUNM= <au_zg>
##$AUTOPOS= <>
##$BF1= 188.310428
##$BF2= 200.13
##$BF3= 200.13
##$BF4= 200.13
##$BF5= 200.13
##$BF6= 200.13
##$BF7= 200.13
##$BF8= 200.13
##$BYTORDA= 1
##$CFDGTYP= 0
##$CFRGTYP= 5
##$CHEMSTR= <none>
##$CNST= (0..31)
1 1 145 1 1 1 1 1 1 1 1 1 1 1 1 1 1 1 1 1 1 1 1 1 1 1 1 1 1 1 1 1 
##$CPDPRG= <>
##$CPDPRG1= <>
##$CPDPRG2= <>
##$CPDPRG3= <>
##$CPDPRG4= <mlev>
##$CPDPRG5= <mlev>
##$CPDPRG6= <mlev>
##$CPDPRG7= <mlev>
##$CPDPRG8= <mlev>
##$CPDPRGB= <>
##$CPDPRGT= <>
##$D= (0..31)
0 1.3 0 0 0 0 0 0 0 0 0 0 0.25 0 0 0 0 0 0 0 0 0 0 0 0 0 0 0 0 0 0 0 
##$DATE= 1547202243
##$DBL= (0..7)
120 120 120 11 120 120 24 19 
##$DBP= (0..7)
150 150 150 150 150 150 150 150 
##$DBP07= 0
##$DBPNAM0= <>
##$DBPNAM1= <>
##$DBPNAM2= <>
##$DBPNAM3= <>
##$DBPNAM4= <>
$$ [...]
##$SUBNAM3= <"">
##$SUBNAM4= <"">
##$SUBNAM5= <"">
##$SUBNAM6= <"">
##$SUBNAM7= <"">
##$SUBNAM8= <"">
##$SUBNAM9= <"">
##$SW= 251.107818259711
##$SWIBOX= (0..15)
0 1 0 0 0 0 0 0 0 0 0 0 0 0 0 0 
##$SW_h= 47281.3238770686
##$TD= 65536
##$TD0= 1
##$TE= 0
##$TE2= 300
##$TE3= 300
##$TEG= 300
##$TL= (0..7)
0 120 53 12 22 120 120 120 
##$TP= (0..7)
150 150 150 150 150 150 150 150 
##$TP07= 0
##$TPNAME0= <>
##$TPNAME1= <>
##$TPNAME2= <>
##$TPNAME3= <>
##$TPNAME4= <>
##$TPNAME5= <>
##$TPNAME6= <>
##$TPNAME7= <>
##$TPOAL= (0..7)
0.5 0.5 0.5 0.5 0.5 0.5 0.5 0.5 
##$TPOFFS= (0..7)
0 0 0 0 0 0 0 0 
##$TUNHIN= 0
##$TUNHOUT= 0
##$TUNXOUT= 0
##$USERA1= <user>
##$USERA2= <user>
##$USERA3= <user>
##$USERA4= <user>
##$USERA5= <user>
##$V9= 5
##$VALIST= <valist>
##$VCLIST= <CCCCCCCCCCCCCCC>
##$VD= 0
##$VDLIST= <DDDDDDDDDDDDDDD>
##$VPLIST= <PPPPPPPPPPPPPPP>
##$VTLIST= <TTTTTTTTTTTTTTT>
##$WBST= 1024
##$WBSW= 4
##$XGAIN= (0..3)
0 0 0 0 
##$XL= 0
##$YL= 0
##$YMAX_a= 62336
##$YMIN_a= -13522
##$ZGOPTNS= <>
##$ZL1= 120
##$ZL2= 120
##$ZL3= 120
##$ZL4= 120
##$ABSF1= 98.37372
##$ABSF2= -152.7273
##$ABSG= 5
##$ABSL= 3
##$ALPHA= 0
##$AQORDER= 0
##$ASSFAC= 0
##$ASSFACI= 0
##$ASSFACX= 0
##$ASSWID= 0
##$AUNMP= <proc_1d>
##$AZFE= 0.1
##$AZFW= 5
##$BCFW= 0
##$BC_mod= 2
##$BYTORDP= 0
##$COROFFS= 0
##$CY= -3
##$DATMOD= 1
##$DC= 0
##$DFILT= <>
##$DTYPP= 0
##$F1P= 0
##$F2P= 0
##$FCOR= 0.5
##$FTSIZE= 65536
##$FT_mod= 6
##$GAMMA= 0
##$GB= 0
##$INTBC= 1
##$INTSCL= 8.653935e-10
##$ISEN= 128
##$LB= 1
##$LEV0= 0
##$LPBIN= 0
##$MAXI= 10000
##$MC2= 0
##$MEAN= 0
##$ME_mod= 0
##$MI= 0.4277144
##$NCOEF= 0
##$NC_proc= -6
##$NLEV= 6
##$NOISF1= -61.99997
##$NOISF2= -62.99997
##$NSP= 0
##$NTH_PI= 0
##$NZP= 0
##$OFFSET= 98.37372
##$PC= 1
##$PHC0= 1693.143
##$PHC1= 41.75593
##$PH_mod= 1
##$PKNL= yes
##$PPARMOD= 0
##$PSCAL= 0
##$PSIGN= 0
##$REVERSE= no
##$SF= 188.296044280273
##$SI= 65536
##$SIGF1= -61
##$SIGF2= -65
##$SINO= 3.502647
##$SIOLD= 65536
##$SREGLST= <1H.CDCl3>
##$SSB= 0
##$STSI= 65536
##$STSR= 0
##$SW_p= 47281.3238770685
##$SYMM= 0
##$S_DEV= 0
##$TDeff= 65536
##$TDoff= 0
##$TI= <>
##$TILT= no
##$TM1= 0
##$TM2= 0
##$TOPLEV= 0
##$USERP1= <user>
##$USERP2= <user>
##$USERP3= <user>
##$USERP4= <user>
##$USERP5= <user>
##$WDW= 1
##$XDIM= 65536
##$YMAX_p= 432321723
##$YMIN_p= -14795751
$$ End of Bruker specific parameters
$$ ---------------------------------
##NTUPLES= NMR SPECTRUM
##VAR_NAME=  FREQUENCY,     SPECTRUM/REAL,   SPECTRUM/IMAG
##SYMBOL=    X,             R,               I
##VAR_TYPE=  INDEPENDENT,   DEPENDENT,       DEPENDENT
##VAR_FORM=  AFFN,          ASDF,            ASDF
##VAR_DIM=   65536,         65536,           65536
##UNITS=     HZ,            ARBITRARY UNITS, ARBITRARY UNITS
##FACTOR=    0.721466756344984, 1,           1
##FIRST=     18523.3820098237, 0,            0
##LAST=      -28757.9418672448, 0,           0
##MIN=       -28757.9418672448, -14795751,   0
##MAX=       18523.3820098237, 432321723,    0
$$ Real data points
##PAGE= N=1
##DATA TABLE= (X++(R..R)), XYDATA
$$ [...]
32145 -1732628 -2153086 -3973362 -4613004 -3222054 -1703209 -1531625 -1953148 -1672321 -823829
32136 -823829 -614178 271486 -1087405 -1438116 -2008608 -2434653 -2144056 -1639580 -2797247
32127 -2797247 -2972567 -1855714 -1013279 -1671110 -2907268 -1653387 -726643 -906034 -1204493
32118 -1204493 -1890081 -1908273 -2202270 -3111468 -2540044 -2024087 -2224985 -2520556 -1902574 -2045221
32108 -2045221 -833437 320497 -139306 -1279562 -773278 -928573 46498 -780396 -1004450
32099 -1004450 -1492440 -949056 1104940 1482395 295997 138740 -1242737 -1561061 -1040234
32090 -1040234 -1319830 -2736914 -1971915 -2347499 -2654479 -1385770 -165721 -1472885 -2970777
32081 -2970777 -1947308 -915403 -1176919 -2348414 -1740831 -2029624 -2262512 -2643147 -2788459
32072 -2788459 -1924425 -2569463 -1686784 -1535927 -2348292 -1528029 -1027493 -751772 -1391094
32063 -1391094 -2762049 -1641277 -1496455 -1615151 -1658980 -203554 175155 684792 689674
32054 689674 779216 472745 533309 -939773 -2997694 -1855513 -1173153 -1056159 -273236
32045 -273236 -1221966 -2264042 -3015344 -1617592 -1107507 -711294 -433478 -280168 -1492223
32036 -1492223 -1980474 -1560847 -2721234 -2102264 -1209272 -2566859 -3695954 -1951463 -1205615
32027 -1205615 182978 649481 1353 357931 870318 265193 743646 1508501 1190115
32018 1190115 -1029706 -3322542 -2049902 -1092888 -2177628 -2517901 -2864765 -1446994 -2529802
32009 -2529802 -2294722 -1240108 -1111376 -1146916 -1246138 -2125648 -838936 -1128830 776799
32000 776799 1433827 -304083 -847758 919580 501014 -1805063 -1680531 -1559539 -427261
31991 -427261 457342 -712171 -562210 -241934 -711423 -90966 -938378 -522892 -780813
31982 -780813 -1567841 230373 -705130 -1749629 -2323828 -1670042 -1414093 -1482175 20150
31973 20150 1076393 -1036939 -1511610 -1907649 -1489889 -1688974 -779682 1871952 1376707
31964 1376707 222105 -1061110 -559026 -1136499 -2350773 -3246818 -3998942 -3999182 -2348520
31955 -2348520 -2599689 -3005459 -2429637 -1662440 -1963255 -2093441 -3290793 -3334352 -1605908
31946 -1605908 -2209416 -2540668 -2121037 -1359931 232705 850451 178684 540939 -754137
31937 -754137 -1831432 -2913412 -3551048 -1381394 -1923965 -2122374 -737529 182504 1058845
31928 1058845 -438767 -418331 -377923 -1110516 -2059323 -1443570 -1595608 -1084063 -867490 833796
31918 833796 177466 574197 92011 -1714902 -3069203 -3329843 -978998 -1155971 -1423172
31909 -1423172 -1390782 -1255567 -937289 301849 486302 -906907 -2044597 -1398734 -382946
31900 -382946 -1383483 -1116871 -1822097 -1705842 -1481147 -268098 -505316 -950042 -694647
31891 -694647 640157 264567 -1336257 -1610803 -1629461 -1638924 -689580 170394 -668182 -1296053
31881 -1296053 -1233638 -1334897 -480068 1267267 2095465 727748 409046 -1032432 -811338
31872 -811338 -2183364 -2726489 -1242385 -1792737 -964581 -656859 -967862 -88199 -28558
31863 -28558 -1697708 -1202723 -863184 -845985 -603626 -73694 279095 -172257 -786887 -1873310
31853 -1873310 -2987960 -1761436 -431155 209168 -1399511 -2060454 -1660455 -562978 -1286912
31844 -1286912 -2099862 -1130474 -763082 -661919 -2345238 -1216176 -306871 -1538393 -1317023
31835 -1317023 -1101167 492404 408797 -365891 144869 1241440 726353 -1578146 -89643
31826 -89643 -411476 -1095928 -1801779 -2117997 -1232899 -1019582 -680326 189450 27472 -809626
31816 -809626 -1266882 -1334495 -1115629 -3062631 -2617121 -1313871 -708794 -1397353 -732137
31807 -732137 -577441 -661271 -647030 -480495 -369067 -1049456 -934621 -223942 -993151 -236858
31797 -236858 404782 -1482682 -603163 745268 598990 184911 824192 153401 -915198
31788 -915198 -53996 -1442897 -1537590 -1529372 -285370 811541 734449 1271698 947519 502433
31778 502433 -853763 -1145482 -931630 -829505 -896401 -1078019 -1445008 -2751190 -2535866
31769 -2535866 -3177521 -2005348 -1017697 -1345563 773925 -31336 -1944835 -2291153 -564647
31760 -564647 -637725 -829175 -1095573 229839 1161542 196611 -1143093 -1162365 -1125601 -1625979
31750 -1625979 -1701803 -1365406 444756 1340389 1158608 51180 -1195605 86288 -1458121
31741 -1458121 -2776914 -158511 1373208 588572 109565 -408871 -436267 -729077 -110250
31732 -110250 -812915 31973 18079 -314960 -758892 -1620043 -1960213 -550543 -504222 -949590
31722 -949590 -938470 -1451218 -1405126 -2275181 -2967397 -2462643 -2205581 -1133021 -1537272 -1569112
31712 -1569112 -1059897 -1994924 -2140107 -1313249 -2105355 -259633 1347347 1680933 955429
31703 955429 -233275 191526 343026 -1403762 -2965181 -3893710 -2829557 -2565791 -961477
31694 -961477 -640980 -1076707 -1368545 -949725 -2650742 -2959227 -3251096 -3881663 -2112956
31685 -2112956 -2184525 -2597367 -1582884 -2785774 -3043472 -2247444 -1541716 -1594579 -2735281
31676 -2735281 -2102236 -1503763 -1952447 -458920 -214963 -142869 -383624 -230676 30084
31667 30084 60361 1093161 548723 -834728 -313320 -879935 -921423 -5639 -149392 -216594
31657 -216594 -563757 -1200917 37257 778395 -411574 -331664 561890 -2110105 -2563194
31648 -2563194 -1234941 -980463 -1719468 -417047 -183272 -2210390 -1702805 -2445372 -1249080
31639 -1249080 79088 -693212 54 -929095 -3443137 -3841265 -2716658 -1619644 -2333462
31630 -2333462 -1350616 -13424 169565 433796 -411230 -958683 -551871 -1028662 55420
31621 55420 -624498 -1954409 -3346858 -3165942 -1953943 -1552686 -2189335 -1720710 -1486065
31612 -1486065 1064834 930183 333371 -391561 -519395 -1272908 -2329531 -3103925 -1588171
31603 -1588171 -2106849 -1492342 -257353 -789586 -1826405 -1738365 -499582 699104 -480629
31594 -480629 -1665086 -1543311 -1304272 -2102309 -2618592 -2519432 -1926417 -2703600 -1735735 -1617899
31584 -1617899 -2664093 -2202709 -3038273 -4336115 -4142560 -2276408 -995934 -2130540 -2102950
31575 -2102950 -2276459 -1386449 664322 1985717 996448 -49897 -1051245 -1661075 -188579
31566 -188579 136183 -1841249 -1772222 -2258879 -1428834 -544095 -192937 -490556 181478 1336386
31556 1336386 -138015 -782284 -111256 262208 -886492 -691413 747292 32090 257284
31547 257284 -794786 103927 506954 412052 553567 -637680 -1222648 -932478 -855337 -1510958
31537 -1510958 36228 192074 -1772194 -1637906 -1252690 -2205356 -1754512 -1473134 -404163
31528 -404163 1607521 -1224637 -2256281 -578953 -268803 -1193369 -2152615 -1266608 -1124116
31519 -1124116 -2893495 -2754561 -500321 -1422909 -2023675 -1739823 -53343 757959 -1747831
31510 -1747831 -640098 -450871 -1082405 -2612714 -1472407 -865096 -2966252 -1841187 -1696052
31501 -1696052 -1062171 295657 -473618 -1234327 -1552828 -689696 -2410862 -3509055 -661413
31492 -661413 80895 -727066 -794077 -2029405 -2489049 -1451243 647992 -207612 -1078150
31483 -1078150 -2353595 -2449633 -1841883 -1952541 -1837577 -1857991 -727651 -425663 -63789
31474 -63789 -892546 -912204 -222159 -167005 -109282 -372362 -769497 10444 -482797 -1249283
31464 -1249283 -1827959 -2686831 -986483 -1003440 -897543 -643054 -1156154 -1393658 -1277682
31455 -1277682 -333195 89252 -901208 -785748 -425505 123287 1576562 -579291 -3112670
31446 -3112670 -2224746 -1468539 -1146005 -988319 -739292 -1235801 -2499128 -754469 -1034380
31437 -1034380 -464858 -89097 -693319 -906571 -574919 841212 -625067 42351 -891084
31428 -891084 -2650434 -2157983 -1505849 -1607134 -935295 -1779805 -840371 -974380 -1426332
31419 -1426332 -1964654 -1801826 -974616 37093 -1320260 -1520882 51519 275969 -52749
31410 -52749 -775570 -2083871 -2881474 -2899891 -1111276 144304 -547394 -1091319 -2022406
31401 -2022406 -2209756 -562453 -273926 -683778 -409719 -1185263 -1379491 -1682978 -1229018
31392 -1229018 597861 492658 -499579 -1703683 -1588641 -1797400 -2660590 -739848 -33111
31383 -33111 113707 563668 -520538 -767000 -1075029 -3182971 -2380681 -1841707 -2109916
31374 -2109916 -2429074 -2465535 -3007349 -2590450 -1737980 -2569670 -1522465 -1175200 289971
31365 289971 565843 -160631 125694 781827 -137190 -1720857 -1178087 -1613524 -1049863
31356 -1049863 -2150870 -3175108 -3018235 -2621304 -2438713 -2597926 -1646617 -2871700 -3720425
31347 -3720425 -2184386 -1871419 -1139491 -528772 153507 -154487 -751840 -2757969 -2076622
31338 -2076622 -1201054 -388702 -373932 -1670805 -2109014 -1255386 -653920 -1344981 -1526486
31329 -1526486 -1198716 -1360875 -2806685 -2490032 -1913342 -1108271 -1441189 -2476576 -2492980
31320 -2492980 -2612166 -4112428 -3169027 -2265424 -45683 -66709 -2037619 -2553099 -1825546
31311 -1825546 249804 -1511541 -2177166 -2459545 -1917382 -1884195 -2683493 -3861468 -3181706
31302 -3181706 -1392985 -220203 -1862941 -2467276 -1783887 -1677518 -2062280 -2216440 -1729146
31293 -1729146 -92284 -1035213 -376788 -407122 -1695643 -862335 -811705 -436919 -1068674
31284 -1068674 -81025 871135 1626072 549898 -231777 111204 -525601 -1441485 -1728557
31275 -1728557 -1203293 -1459837 -367395 -112010 -561771 -936973 -1198261 -1040559 -2248997
31266 -2248997 -2836068 -1205508 -1894140 -1501798 215509 -170969 -492131 -2050313 -2611383
31257 -2611383 -1087232 -269404 -945283 -849766 -1244868 -1307556 -571424 -274958 -692965 -1592648
31247 -1592648 -1509579 -445929 54724 -2355627 -2168612 -1530021 194886 776223 -677675
31238 -677675 -1620610 -657441 -1548537 -1024149 -1263701 -1288136 -1031153 -1211079 -612424 -209881
31228 -209881 -1268357 -1388814 -387590 -805246 -1272969 -1451572 -1729946 -1370596 292076
31219 292076 -185405 -1576802 -2470501 -3256187 -3336801 -3147848 -1824322 -1287171 -539955
31210 -539955 -1164742 -795883 408894 743158 -419745 -2363905 -1821799 -1708884 181755
31201 181755 123827 -334045 -1425024 -703125 -1215602 -3234955 -1992637 -733683 -950467
31192 -950467 -1679759 -853458 -512761 -1088289 -2181218 -2846154 -2705537 -1709390 -1550437
31183 -1550437 -1590025 -1062295 -140579 1036994 489351 -442224 -629009 1353136 946020
31174 946020 -1312352 -1732318 -1256796 -1745202 -2711866 -2324375 -881281 -784700 -317588
31165 -317588 368789 -386264 -1271099 -409016 1261159 -45285 -1971519 -1670240 -1629147
31156 -1629147 -2413076 -2483943 -1458746 -241785 -445432 -1391078 -715821 -1182058 -2025328
31147 -2025328 -2326129 -834358 -625719 792448 -274668 -1000293 -1588322 -348465 1104514
31138 1104514 412900 -94148 -504291 -940246 -2285398 -2740366 -1357972 -711801 -163882
31129 -163882 -846589 245390 450473 -725838 -675903 -568498 -602316 -545570 -731837 -425154
31119 -425154 -458862 243845 -133964 -42834 -785363 -1282900 -2011616 -318432 639862 110586
31109 110586 576803 1385595 1409342 275772 277242 -609762 -1065001 -1786842 -1087368 -2500702
31099 -2500702 -585291 -1029989 -1832424 -1598945 -2045424 -1172258 -1455026 -1803171 -1971322
31090 -1971322 -2013610 -3064067 -2925693 -1729272 -1666454 -2782380 -3749413 -2784046 -1771500
31081 -1771500 -1620868 -811539 -683074 -390729 29067 -407076 1226663 -65412 -1065765
31072 -1065765 -1083243 -692753 -450360 -1088561 -1792501 -474781 -234628 -1514802 -1760135
31063 -1760135 -1570731 -1717271 231782 2303504 2686770 172968 -693768 -341729 496742
31054 496742 -540548 -1250811 -2012086 -1953121 -2349112 -775460 -1222616 -2217202 -1078502
31045 -1078502 -1733054 -2806100 -1699972 -119166 119740 -290648 -1372941 -955459 -2763115
31036 -2763115 -2380261 -2646247 -2486543 -1681254 -2461249 -3482345 -2371974 -1091733 -1076953
31027 -1076953 -130100 -2043216 -1913049 -1788485 -1600438 -417674 -852948 -2138105 -3861720
31018 -3861720 -3409988 -2677076 -2758174 -1126785 -452242 -369076 -2843614 -3333041 -872276
31009 -872276 -175771 145883 74279 -560795 829323 816125 -70807 505430 -1420467 -3236372
30999 -3236372 -1801804 -2043943 -2621377 -1543735 -967667 -443879 -207725 514572 -2191587
30990 -2191587 -2671976 -4033071 -3819151 -771520 19217 -1527611 -1726550 -1177913 -1091247
30981 -1091247 -1996141 -2248521 -2047014 -2187586 -1668349 -1258078 -1985777 -2436979 -1053869
30972 -1053869 -1310200 -1282266 -1991445 -305814 48524 -1155266 -2128860 -2536368 -2068905
30963 -2068905 -350994 -23790 -1484447 -3056873 -2407987 -942225 -954427 -856573 -304222
30954 -304222 214525 1145756 -144914 -1236405 -881908 1065299 1714903 361517 642003
30945 642003 -614407 -99948 -386195 -1579009 -1714287 -1792055 -1056335 -703410 -1041717
30936 -1041717 -829516 -872518 -1518221 -773482 -957644 1539241 498842 -31092 -1014332
30927 -1014332 -1572015 -1769180 -2561130 -1975026 -2134069 -2238473 -977914 -1344871 -905613
30918 -905613 554728 -697317 -2170190 -2116646 -2241104 -838962 -864800 -1832973 -1628778
30909 -1628778 -1919833 -1092347 -1068282 -720864 -627294 -1264487 -726709 1473096 333819
30900 333819 214614 402956 -632543 -617472 -947318 -1372364 315045 300005 306783 -411873
30890 -411873 292104 450063 248464 -1572209 -1358360 -1308709 -1600621 -661588 167878 61867
30880 61867 -111686 -2112243 -1930888 -1256239 -471871 452881 322838 -552941 -1018464 -660875
30870 -660875 -2172155 -1839605 -879158 -1461061 -2046971 -1912629 -1600952 -1538451 -1428423 -498926
30860 -498926 -907145 -432899 320376 -607815 -228878 -556359 474862 188820 -678790
30851 -678790 -1610685 -1682215 -998767 -1133731 -765225 -19334 -374351 167822 327323 -1249360
30841 -1249360 492723 200464 521814 125724 -1305464 -1879670 -1158922 -2152345 -1636733
30832 -1636733 -1127050 -1705587 -1046561 413654 -139095 -1348457 -2944688 -1510836 608776
30823 608776 865636 312948 -1077200 -2092731 -2495410 -1936974 -358868 -1168780 -1082014
30814 -1082014 -743352 -669726 -395845 -271089 -860351 -231007 -15049 -257697 -603667 -892236
30804 -892236 -947640 -1304521 -201541 -817375 -904450 -1162817 -944018 -905369 -2065129 -495706
30794 -495706 -610796 -319347 416542 -420900 -692759 -923287 -1638049 -336738 -29723
30785 -29723 295036 357346 -222703 -1445494 -2022226 -1569691 -2676616 -2499806 -3432218 -2041524
30775 -2041524 -1736416 -2257339 -2412413 -1762654 -670880 -1159366 -1118651 -1037485 -1641460 -1096506
30765 -1096506 -1868034 -3034281 -2057825 -820302 -639744 -257004 376 662240 -390481
30756 -390481 -2310338 -3032175 -3366449 -3440137 -1286629 -924064 -1151375 -1582083 -2716354
30747 -2716354 -2955611 -2382525 -2737237 -2562235 -1204092 -1472412 -3113607 -3487908 -2349232
30738 -2349232 -294824 -1248958 -1667412 -529377 -301345 386927 -152480 -2279472 -3207995
30729 -3207995 -2230621 -292122 111730 -1938406 -1602112 -1191911 -438657 -2133427 -2081084
30720 -2081084 -2108317 -2433651 -3049913 -3842773 -3401740 -3025710 -1182478 101618 228159
30711 228159 -267082 -566094 -2393921 -3270631 -1470903 -368726 -711959 574573 942711
30702 942711 1143366 -19982 -102076 -985089 -1324577 -532564 -477894 -1478637 -2061146 -1483262
30692 -1483262 -1398719 -999410 -1110775 -1326881 -1916170 -1344591 -2110820 -2760270 -2955435 -2997225
30682 -2997225 -1707527 -1390003 -2179333 -2344280 -759970 -463323 -1931855 -2617771 -1663911
30673 -1663911 -1170375 -1298702 -2092219 -3257570 -2815303 -2058428 -610825 1205600 636373
30664 636373 -748109 -1061670 -1857371 -1516353 452484 486882 -409656 -1255737 -2655097
30655 -2655097 -3214074 -2735254 -1415575 319581 453445 21133 -241907 -1243909 -2030505
30646 -2030505 -1197632 578661 787829 1048327 1271078 1184856 -570817 -922391 -430371
30637 -430371 -769795 -1489655 -2781757 -2702155 -2805564 -1887773 -649789 341877 767545
30628 767545 -1100709 -1578817 90707 -719757 -331802 -1043871 -2708749 -3126353 -1979784
30619 -1979784 -1861111 -2146935 -1630666 -743714 -2619425 -3135207 -1854346 -2400614 -1892332
30610 -1892332 -2419445 -2022665 -1589165 -1107875 -428844 -1551180 204599 2583199 1357106
30601 1357106 2642867 1598784 -347829 113363 -1135198 -966722 -100425 -509041 -1841138
30592 -1841138 -917547 1116367 796530 -1752006 -375208 580201 781842 -859962 -7840611
30583 -7840611 -5768889 -4162963 -3728509 -2538719 -1707876 -792504 -861480 -932013 -1560941
30574 -1560941 -3031980 -2937856 -637386 -598020 -884430 -1652193 -1751825 -1553105 -1328536 -621090
30564 -621090 -741404 -1735871 -2383596 -2133267 -865545 -1452755 -2411747 -1822065 -1221709
30555 -1221709 -1893043 -828789 -967431 -1345324 -69461 -365314 -2888022 -3812455 -3207847
30546 -3207847 -1328300 -1790403 -1576247 -1446823 -1218318 -1422329 -1682674 -2393954 -599474
30537 -599474 -739453 -2234263 -2367501 -1624486 -1747054 -1985898 -2383719 -1796986 -1911295
30528 -1911295 -2550714 -2601825 -2340834 -1231979 -1167041 -1463267 -864294 -1016421 -725910 141611
30518 141611 -154237 -2121849 -2479769 -1099047 -856723 -2144569 -2182559 -1166899 -511260
30509 -511260 -1884205 -1417076 -1516409 -1955866 -2029976 -1736826 -354297 -367027 -424934 -371052
30499 -371052 1218973 1403346 485447 812955 377198 -481025 -704580 -1184214 -780383
30490 -780383 475622 -664442 -757459 694722 684726 599011 1258656 348892 -87179 517210
30480 517210 -44231 409780 -649433 -2198908 -1397218 -862834 -1492199 550244 1994950
30471 1994950 1896195 1260060 524344 195512 417593 -1282293 -2218192 -2122592 -1545505 -1462172
30461 -1462172 -1960121 -2582576 -2233664 -2482201 -1781361 -1360242 -1725894 -2179251 -1658185
30452 -1658185 -1090625 -174970 -1852764 -3525818 -2889717 -2092513 -2451758 -2771527 -2480980
30443 -2480980 -2967573 -1967229 -1584279 -3353017 -2532762 -1497125 -1271562 -1839415 -2378481
30434 -2378481 -2054461 -1680618 -2630262 -2943959 -3386980 -2300372 -75062 731076 -873161
30425 -873161 -1665918 -859993 -260453 -105533 1733 -1100403 -1233575 -802455 -850532 -2505245
30415 -2505245 -3141184 -923983 -324172 -423103 -1324899 -2291829 -2718723 -4459806 -5555940
30406 -5555940 -3464530 -2537461 -1931329 -2609444 -2955614 -2411912 -2449778 -3346844 -1199966
30397 -1199966 350749 -1928332 -1939562 -2203250 -2150299 -1955307 -2024347 -2798694 -1678665
30388 -1678665 -2989929 -3184476 -3009783 -1925935 -2344476 -5500940 -14699859 -10341661 -2036928
30379 -2036928 -1834302 -1251692 -2268508 -2366119 -3733096 -918234 168234 1216221 1170684
30370 1170684 2945977 1175621 -543709 -958643 -1385811 -2133495 -1826185 249447 -408554
30361 -408554 -2118544 -1643433 -1556143 -1113820 -699482 -847497 -870725 -2300600 -3222657 -2690336
30351 -2690336 -3106255 -2685074 -3956651 -4061374 -3765932 -1940209 -432547 -2729073 -2873311
30342 -2873311 -2172715 -1690084 -2399832 -3514818 -2342945 -1074322 -1883586 -3375721 -2159383
30333 -2159383 -2808267 -2887947 -3795180 -3595971 -3066529 -3561681 -2495148 -1644282 -1953098
30324 -1953098 -1616756 -1190282 -146324 -548891 -465395 -1148952 -2414510 -2134403 -2264369
30315 -2264369 -1229749 476688 470955 -497956 -1507681 -1396127 -1540571 -2031157 -1872871
30306 -1872871 -1243272 -2141958 -839267 -82246 -339243 -69045 -1098634 -1609560 -2080968
30297 -2080968 -3224008 -2302638 -1392337 -1560837 -1513115 -141479 -990527 -77889 -59797
30288 -59797 172583 686103 458684 712191 -66282 147659 -778563 -6114 -994436 -1892275
30278 -1892275 -859275 -986367 -535363 598476 -285682 -2255631 -2538240 -1343985 -162765
30269 -162765 980595 75966 12296 274491 -362843 -2106838 -2026414 -2387780 -1513840 -1007367
30259 -1007367 -432808 325999 603681 -538554 -1518424 -928237 -2272926 -1854147 288586
30250 288586 -293223 -1661118 -1837233 -2525610 -2687527 -1584327 -792812 69798 466494
30241 466494 -985590 -2174091 -2745640 -3155573 -2421407 -2738141 -3499873 -2848096 -1038524
30232 -1038524 -63534 -394855 -948017 -1834659 -740227 -236430 1486062 -288108 -1461994
30223 -1461994 -6453355 -14795751 -8238833 -3976031 -4339186 -3891910 -2832923 -3768100 -2896920
30214 -2896920 -1882713 -384041 -441407 -784346 -1519939 -1818336 -2479981 -2612401 8270
30205 8270 -213023 -2002534 -2187178 -1318058 -203953 -597791 -1256448 -1256151 -813366 -1137954
30195 -1137954 -1763517 -825457 190076 -248444 -96999 -379681 -85188 -758258 -1067651
30186 -1067651 -1050843 -1565249 -1921811 -2585366 -2928623 -3594779 -2742497 -2320161 -3224685 -2703657
30176 -2703657 -2044632 -1241051 -1634812 -1946293 -874369 -1285149 -1519933 -1266803 -2673109
30167 -2673109 -2358641 -1241629 -918447 -1117350 -1328097 -2035525 -2035321 -338124 -1165150 -1868790
30157 -1868790 -1622252 -1796135 -2152159 -2859315 -3056885 -1497172 -2645381 -3387071 -1725757
30148 -1725757 -1240665 -2012276 -863483 97801 -801338 -1212989 -1947125 -3673227 -2186966
30139 -2186966 -2294986 -2029543 -1857390 -1841300 -1448478 -277689 -1023458 -2374568 -2009966
30130 -2009966 -986419 -1856768 -1794984 -900300 -2086359 -1976924 -1064236 -720179 -2615248
30121 -2615248 -3120789 -3352731 -2722360 -2337951 -2271423 -2927292 -3161275 -1174228 -230842
30112 -230842 139515 317184 -1246413 -761723 927865 -503772 -1554575 -1094419 -1738495
30103 -1738495 -1959157 -2490560 -2949961 -1074891 -651821 199248 49321 -1844596 -2396983
30094 -2396983 -2968487 -3560383 -2671089 -1895179 -1774930 -2595282 -2407991 -3023895 -2968873 -1157418
30084 -1157418 -1063523 -2164977 -1411182 -1036739 -1294454 -1913584 -851913 -755530 -1538535
30075 -1538535 -2501014 -3259295 -775772 -1977084 -3102083 -3089078 -2877573 -1952644 -191377
30066 -191377 -270941 -1425677 -1475216 -2372452 -2603345 -787860 -74311 907538 -346497
30057 -346497 -1097217 252913 899787 405630 -933430 -1608223 -2441651 -1854942 -1713884
30048 -1713884 -2026096 -3664291 -3001133 -2198701 -1644394 -1452061 -1665606 -544296 -757216
30039 -757216 -1212849 -1843859 94262 1199931 -1056841 -3278776 -2041412 -1507755 -1499872
30030 -1499872 -2836761 -1938621 -1679567 -1232441 -1083951 -617419 -558135 -546682 -1250494 -1898789
30020 -1898789 -2014617 -1838149 -1402500 -1687884 -398832 -915499 -2512655 -2508950 -1954810
30011 -1954810 -1933598 -2179004 -2183885 -1029116 -1841701 -3269705 -2084479 -1181088 -1264432 -1137850
30001 -1137850 -613910 -2398327 -2689729 -2262587 -2166321 -1857467 -1344331 -1344546 -666146 -914739
29991 -914739 -659978 -1654270 -2261991 -189719 1221744 -652329 -1036183 637571 527109
29982 527109 -1320559 -1335398 -1114959 -2304078 -2204111 -1596827 -2273087 -3030427 -998083
29973 -998083 -1077591 -1003757 -1427947 -557528 -1122062 -1622714 -1317059 -1612656 -483440 -142214
29963 -142214 -1183778 -2152692 -507088 -104175 -1929291 -577851 -292650 -1062831 -1144926
29954 -1144926 -885398 -706247 -1538423 -1883965 -2317440 -1549048 -2101845 -1351123 -1734055
29945 -1734055 -946517 1439183 2008700 -857313 -2329933 -1502496 -1716796 -1528205 -2692414
29936 -2692414 -1727657 -568346 -425842 -106340 -522227 -1993957 -2290181 -2486797 -2582765
29927 -2582765 -2752489 -3545214 -2540292 -1675269 -3678101 -2342345 -2072507 -1876118 -2240730
29918 -2240730 -1996331 -1766493 -2359594 -3144550 -2681645 -2369441 -1119516 -1254824 -2462000
29909 -2462000 -2110283 -1364283 -1189982 -1203558 -2122502 -1299287 -580980 -392957 -801523 -1090577
29899 -1090577 -758192 -626693 707662 1455317 658492 -46848 64550 127452 -737884
29890 -737884 -1565328 -3265236 -3556939 -3529132 -1680487 -659841 -1366961 -2570090 -2271922
29881 -2271922 -400344 1244169 -342243 -1189829 -1557668 -1248010 19964 -1224457 -3415308
29872 -3415308 -1275104 -152523 442817 -314826 -2709792 -2748041 -1990993 -2522852 -2286278
29863 -2286278 -509307 -10324 123548 -1038643 -2451875 -2843823 -2847082 -1083054 367776
29854 367776 -801089 -943245 -687144 -1182847 -1901887 -1019806 -545575 -315351 -456652
29845 -456652 -474249 -1478073 -1693722 -41530 -560017 -2195119 -335846 970119 32650
29836 32650 55686 53011 -2194854 -628178 642964 333698 -776170 -1505671 -1283602 -1633972
29826 -1633972 -1460055 -70833 -673953 -846280 -747733 -1205904 -741261 209782 -1406867
29817 -1406867 -3282561 -3370664 -3356668 -2735908 -1716912 -1300676 -801107 -1648622 -2639678
29808 -2639678 -1944986 -1498283 -2939361 -2316614 -1564006 -326852 -1186710 251029 -15725
29799 -15725 -1489958 -959807 -1103520 -1366707 -2134493 -1620990 -1516833 -832312 -210370 -843993
29789 -843993 -1853733 -2051834 -3201039 -2272957 -1825648 -1365126 65631 574190 87427
29780 87427 -1284715 -1037540 -1020077 312934 -214448 -1379824 -882342 455338 -1193788
29771 -1193788 -1740710 -1776180 -1798170 -1427665 -1750525 -1738865 -1101335 -2698465 -1505597 -996513
29761 -996513 -2507011 -3822437 -3945393 -3541694 -3119660 -2862036 -2342159 -2052500 -2595108
29752 -2595108 -1723134 -294328 -201676 -1043600 -1143009 -800349 -1749420 -929435 -1818728 -2353562
29742 -2353562 -2541604 -1684268 -2738413 -2068976 -1167547 -1060831 -1050723 -449801 -537047 -1189648
29732 -1189648 -686299 -392347 -394644 -1139697 -1343707 -2141146 -1636492 -659492 -610967 -1917342
29722 -1917342 -1996990 -1845380 -2893413 -4161233 -3629344 -2720046 -1013654 -234771 -1728368
29713 -1728368 -1276284 385051 209506 581361 2493705 809345 -1248246 -11733 -937409
29704 -937409 -2109409 -3194058 -2840429 -658344 588809 72204 -1093098 -1436649 -1907493
29695 -1907493 -3666414 -4359171 -1709870 -1464935 -653015 1222892 398265 -1245793 -514880
29686 -514880 -404515 -2762726 -2831774 -2760399 -2681137 -1987805 -2515832 -1923903 -1486465 -1546681
29676 -1546681 -1293814 -1917851 -3723001 -3808134 -2571318 -1846454 -2720064 -2082343 -1326857
29667 -1326857 -1331788 -1434017 -436430 407244 -448103 477800 91435 -1478776 -1925877 -492106
29657 -492106 55870 -1194780 -1730141 -2784231 -3922460 -3998915 -4503758 -4790802 -4752170
29648 -4752170 -3699188 -3474738 -2050298 -1647283 -2482912 -1544452 924442 583172 1217701
29639 1217701 504501 -1025993 -777496 -644013 -1943668 -2507341 -2155813 -1141344 -750019
29630 -750019 -1504970 -2388406 -2057741 -1915261 -2207055 -2778914 -3431432 -1175722 1464228
29621 1464228 606433 -32507 -1094071 -1644193 -1387036 -479580 -972942 -1525581 -1086634
29612 -1086634 -1554654 -2463352 -1325753 1089685 1180828 -296339 316803 76130 -1193516
29603 -1193516 -1610254 -1727318 -1403045 -1326914 -916747 126467 163427 1130133 1712056 1745236
29593 1745236 430187 -1281258 -586534 -669780 -2312528 -3115018 -1982011 -1156876 -2972632
29584 -2972632 -3308832 -1989829 -1154670 -1752074 -23163 194000 -1531345 -1238598 -668546
29575 -668546 -605940 -432245 -2062213 -2815067 -853868 -1401269 -639156 115606 -1378990
29566 -1378990 -1593884 -820338 662378 -253468 -712721 -729763 -1257019 -2064754 -1457146
29557 -1457146 -1714053 -1247004 -1649341 -1952670 -2148789 -2308111 -1635014 -626600 -1613212
29548 -1613212 -2562309 -3564564 -4388244 -2575834 -1139116 -586886 -990554 -2843896 -2272506
29539 -2272506 -1378971 -1748956 -2180728 -597817 -441934 -1332925 -922071 -191733 -634921
29530 -634921 -962684 -1729478 -704345 -1748055 -2169824 -2063578 -1131620 -980076 -733505
29521 -733505 -188385 -24829 193607 -788029 -489065 -1136848 -1413587 -705157 -975391 -481732
29511 -481732 -359893 -1005011 101658 1478182 33615 -1745394 -1759330 -1209076 -285420
29502 -285420 -294623 -2360133 -3140046 -2118110 39548 716892 2339594 2215382 644485
29493 644485 1001492 154167 -1337290 -461778 -966197 693950 1545152 235471 -317740
29484 -317740 -711284 -2312003 -3152453 -3280475 -2584168 -1777062 -1598493 -274128 -564596
29475 -564596 -1559925 -2166370 -1526539 -1842733 -1356611 -1518093 -1704090 -2064101 -2295353 -2310943
29465 -2310943 -1648866 -630758 -773538 -1246093 -1951474 -2312470 -1924867 -1658617 -990404
29456 -990404 -1857862 -2077366 -1719195 -1022905 -1979239 -2358491 -1619596 -1591661 -286595 810768
29446 810768 2474819 856272 -938527 -1423146 -1779693 -1164546 -1642891 -1757273 -1024554
29437 -1024554 443152 732164 248303 -121461 -749033 -1787003 -1468399 -547611 -1288919
29428 -1288919 -2346054 -2755490 -2878965 -1972837 -2050296 -2194000 -785140 859858 11892
29419 11892 -133618 -1236985 -1231238 -3549348 -2893490 -1795000 -994918 -80428 410846 885635
29409 885635 548629 -53316 -1414025 -1809373 -954158 -1433155 -252878 -651155 352318
29400 352318 503105 -867052 -1682311 -200805 -2134449 -1756996 -1225448 -2276485 -210420
29391 -210420 -843143 -113738 -655142 -780486 -335291 -879286 -1331168 -1270548 -1657629 -1275432
29381 -1275432 -925414 -2239470 -2138478 -3869850 -4592666 -3045114 -2618883 -1047059 593867
29372 593867 643534 -643787 -858866 -516863 693523 1013938 552012 -335292 -817483
29363 -817483 -83868 1864793 1424914 1629264 19721 -110073 -374321 -1767217 -1155139
29354 -1155139 -3410528 -2550409 -1527660 -1927823 -2030929 -642267 -1908851 -2681739 -1848867
29345 -1848867 -1521897 113762 158484 -387424 211474 -109932 -690673 -868907 -950153 -1291187
29335 -1291187 -1619742 -2008731 -1175372 -580754 -436103 -1130123 -684727 -409821 -1644534
29326 -1644534 -2645665 -2988814 -2609666 -1557118 -2005891 -1697576 -1240634 -1920926 -1060122
29317 -1060122 -2014377 -2879667 -2679998 -1209262 -432510 -140975 -1153643 -661167 531678
29308 531678 -882744 -1981347 -1302005 -273531 -1200766 -612930 269042 564872 -716027
29299 -716027 -2211495 -2060574 -1115276 -1972910 -2244868 -3101415 -1058315 588719 613723
29290 613723 61837 -148226 851895 555160 -1208959 -1399414 -1551436 -2025828 -747792
29281 -747792 -956925 -1981017 -3010589 -1812064 -390008 -328359 -455742 -866648 -741354
29272 -741354 -1099574 -914999 -1260495 -638550 -1412035 -1497666 395565 2343078 1793153
29263 1793153 -217703 -1352334 -778592 178267 155866 -122731 -2511964 -1570096 -193968
29254 -193968 -1053387 -2922259 -2921814 -1316343 -1406999 -2990187 -2686090 313801 -184481 339533
29244 339533 -564694 -1181420 -1426334 -1652711 -591785 -57128 -822735 -2595587 -1843478
29235 -1843478 -403146 -782818 -791527 -1405646 -229792 908901 88476 518282 -413149
29226 -413149 -475870 -349067 -278266 352222 -1644670 -1661466 -784598 -1074592 -737387 -21689
29216 -21689 160766 -491627 -1263469 -496890 502662 -268881 -1011095 -443430 334984 -922663
29206 -922663 -550123 457037 -64381 -452585 -1986347 -2960217 -2405471 -2424495 -2408860 -2332514
29196 -2332514 -2185353 -1073466 -1068725 -1692643 -1153129 -1736433 -1372617 -2126340 -2932089 -2611993
29186 -2611993 -2767924 -4262019 -4047005 -2962119 -2896987 -3117067 -919915 190269 -954167
29177 -954167 -1290814 -1254287 -472615 979274 -170815 -824255 132444 -1257722 -2176449
29168 -2176449 -2908714 -3190537 -3722301 -2420681 -1895925 -1970249 -2476846 -2689555 -902084
29159 -902084 -450064 -1934425 -1542545 -66706 -519898 -1386435 -1317343 383839 729417
29150 729417 637959 -991034 -3165086 -1360167 129292 354287 -1193228 -457687 -2006757
29141 -2006757 -3086009 -2152287 -1836705 -2656811 -2204992 341278 683712 816074 351974
29132 351974 -155371 17654 -1664741 -1350561 -1534155 -1679298 -640806 -1727356 -1662784
29123 -1662784 -564290 -1875320 -1030281 -44038 873192 1719180 617415 346929 -401005
29114 -401005 78000 340772 -120288 -317964 -539198 -959310 -1526619 -2220915 -2341080 -1385521
29104 -1385521 -302766 -571567 -228316 -200514 -211869 239037 -984787 -1986957 -1769336
29095 -1769336 -561818 -1099654 -1580247 -965014 -372215 136562 -700988 -1770534 -576142
29086 -576142 -625164 -683115 75924 303042 -1779178 -1212408 307473 -320968 -970745 -1300046
29076 -1300046 -1462021 -419894 -811212 -1757591 -3193587 -3623176 -2575679 -1874576 -2332445
29067 -2332445 -3499243 -3815679 -2398340 -1879259 -824422 -998086 -1244631 -2520319 -2808263
29058 -2808263 -1206519 -1312612 -1286861 -1460539 -1905357 -1506862 -962395 -1756056 -1828273 -2393534
29048 -2393534 -3080794 -2589092 -1295861 -628261 -388295 -466505 158876 41699 -159045
29039 -159045 1061077 951593 -1656932 -571630 -121375 -370165 -158890 149371 -410302
29030 -410302 -401316 864925 1033230 532405 197245 -2247574 -1813851 -2287071 -1967651 -1437143
29020 -1437143 -595792 -910055 -1340543 375050 -122790 -270210 -1487531 -1679129 -2610584
29011 -2610584 -3978319 -3234982 -3452344 -3458217 -3253987 -3602141 -2665600 -2257936 -1973839 -1347657
29001 -1347657 -1420695 -2532674 -1355355 -292642 -691776 -675192 -994006 -1375687 -398324
28992 -398324 -741928 -1779449 -2180643 -453841 -1342566 -1762170 1171942 1794050 1359413
28983 1359413 -302124 -2280363 -2008730 -1306545 -688589 -292023 -2038038 -1031586 -1547864
28974 -1547864 -2081065 -1772712 -1845650 182328 733349 265810 586486 -853231 -863597
28965 -863597 267233 7644 -957703 -2826581 -3592076 -3280496 -2934630 -2912106 -2711538
28956 -2711538 -1356116 -1106818 -1856171 -857946 -574872 -18364 1158628 753440 45
28947 45 236802 99348 -773060 -1455295 -2260763 -2711960 -1963558 -1213921 -1252846 -1109708
28937 -1109708 -2079144 -2302581 -922264 93397 -421002 -2464825 -2622926 -2105402 -660933
28928 -660933 -344252 -1480583 -1109034 -1461499 -112490 -735984 62944 -547940 -753940
28919 -753940 -1484431 -4184591 -3394008 -1978981 -1157880 -1365808 -2333469 -1453263 -366070
28910 -366070 -724905 -905731 -2085546 -1466038 -1663338 -1319227 -744523 -2232702 -3258785
28901 -3258785 -2682766 -1966193 -291278 -726722 -1158492 -1400303 -1163277 -673195 -2019785
28892 -2019785 -1817928 -3402311 -2723785 -1672686 -1694404 -1758404 -1491765 -1772934 -1594279
28883 -1594279 -264494 -665673 -524583 -951137 -1462933 -1381515 -1640093 -2110723 -1831300
28874 -1831300 -3273579 -2506765 -2753119 -2309434 -989725 -1600803 -2698741 -2585921 -2089685
28865 -2089685 -589109 -1759746 -2063386 -1331103 -1693387 -1653398 -1295636 -1680085 -2475581
28856 -2475581 -3258515 -2361647 -1412073 -80925 939548 679129 -1737121 -1773924 1084069
28847 1084069 674390 445450 -648002 -1500410 -966047 -68890 606934 367816 -2770135
28838 -2770135 -1876452 -1377826 -2461654 -1011404 612827 -5735 79830 -1115352 -797452
28829 -797452 307699 -206252 479590 2030527 -176113 -515444 -2225746 -2460888 -3257028
28820 -3257028 -1853087 -371212 117298 -815826 -903887 -970193 -1826725 -822534 -1011137
28811 -1011137 -1981490 -470513 -827773 -607156 -1376349 -2906534 -3003645 -1832967 -2425122
28802 -2425122 -2237857 -1296032 -2092166 -1762882 -1136329 -1670877 -1249442 -1703484 -935838
28793 -935838 -400777 -767900 113032 1769630 -774267 -2612388 -2604751 -1391712 -508272
28784 -508272 421404 -1877402 -1548776 -1374696 -2077921 -2557829 -2937389 -1346284 -993361
28775 -993361 -1284599 -2095006 -2285678 -3320299 -3419188 -1455003 -1000871 -1093340 -1665050 -1927693
28765 -1927693 -1393946 -968906 -2377492 -2377428 -2024392 -2881426 -3035785 -2802608 -1369721 -1359130
28755 -1359130 -157009 713779 260550 -51073 698811 33901 -1986417 -2828316 -1343143
28746 -1343143 -834023 -462674 -2201176 -2646755 -1466534 -3052980 -3077523 -1555456 -1622768
28737 -1622768 -747153 317755 -1471637 -2770950 -1948738 -1971761 -1509362 874395 179790
28728 179790 -1482865 -3805758 -3616491 -1939017 327969 -179336 101665 386388 -1500972
28719 -1500972 -1576245 -1748298 -2601900 -2786604 -2136250 -1474921 -806770 -235980 1768112
28710 1768112 -419263 -1080988 -468458 -1210777 -1488080 -1088633 -1595529 -790446 -924680
28701 -924680 -795987 -1250891 -720212 -88140 -1545387 -737451 -946894 -1847725 -1777276 -2415743
28691 -2415743 -3709656 -4409971 -2052968 464936 -1276284 -2431641 -888644 85291
28683 85291 1365200 817561 -2270496 -2832033 -1835245 -3411340 -2965866 -3057232 -3608964
28674 -3608964 -2747607 -2966766 -1458641 -1391419 -2203138 -689811 -1575461 -2059007 -1920548
28665 -1920548 -2117931 -2889199 -2360316 -1148919 -1267332 -1343903 -2434027 -1420745 -555877
28656 -555877 -1517203 -2667180 -1742883 -2266080 -1221845 -628666 -735674 -425305 -1275620
28647 -1275620 -1109779 -1154412 -2498615 -2409765 -2765812 -1714829 -3313169 -3237052 -1744256
28638 -1744256 -73180 -1514405 -1305154 -857823 -2010147 -1787385 -1551165 -1437376 -348434
28629 -348434 301084 508951 -241301 -778688 -756578 145716 -395982 -82239 -54205 -1473693
28619 -1473693 -1336112 -674997 -1555644 -1276038 -827233 -864094 -498245 -806893 -390999 516173
28609 516173 -644214 -1830132 -1935569 -2816377 -2200389 -2343876 -1402263 45308 93456
28600 93456 -1956736 -2985181 -2037962 -2286831 -2223947 -446809 -14200 -974060 -244663
28591 -244663 -872049 -2309254 -1916008 -675786 -106077 -1721082 -554283 -1030207 -2609336
28582 -2609336 -2380393 -1059892 -578987 -319578 732493 136144 -1533668 -970270 -1801333
28573 -1801333 -4832317 -2060184 -2101548 -2898116 -1501539 -9041 -924694 -1904009 -1087170
28564 -1087170 -2325004 -1835918 -1463361 -768627 -276620 524117 792478 -529324 -938438
28555 -938438 -2318435 -2430489 -1076594 1034189 281696 464196 37135 536953 -235966
28546 -235966 -59739 311469 -690230 -1079253 -967496 -3691985 -3263990 -1544855 -227688
28537 -227688 -1954042 -1380767 -705031 -1429992 414198 909959 -1171285 -2329134 -2408714
28528 -2408714 -1314373 446424 -773307 -263408 -1259949 -1171687 -1232114 -1768051 -2368730
28519 -2368730 -2414019 -1752534 -106523 -71957 -1856939 -1891236 -1661046 52007 -595706
28510 -595706 -424870 53902 -148724 1156434 606043 -1472225 -2789026 -2586348 -1548329
28501 -1548329 -1046722 -337498 806266 120312 -783713 -2112599 -1834609 -1999171 -3026071
28492 -3026071 -1528283 1160360 -340988 -1395320 -1085912 -276268 -629126 -1422173 -1895543
28483 -1895543 -736509 -999130 -910398 -514915 -676358 -1418081 -1156404 1102048 -64690
28474 -64690 -641768 -1034834 -1544793 -1698678 -445387 -467258 1511709 2786706 747447
28465 747447 327139 -574213 -698431 -65669 -718220 -1104308 -2654107 -3363974 -1882557
28456 -1882557 -1491156 -1019566 -1554535 -560539 -1339457 -1804420 -1890917 -1808026 -1631555 -1396678
28446 -1396678 -2085954 -2910572 -2342554 -2381837 -3336411 -1650938 -1108036 -923689 -777466
28437 -777466 -345052 -881591 -2043407 -3052500 -2843869 -2862526 -1855100 -2010112 -2587746
28428 -2587746 -1429017 218891 634428 -422562 -130586 1035721 924464 404520 -1064592
28419 -1064592 -1627867 -1306504 -1888087 -1451163 -429320 -1211457 -1741193 -1956570 -1341676
28410 -1341676 -1483806 -194561 1386481 132599 433996 1059093 -959798 -687037 -1005675
28401 -1005675 -797383 134073 -277722 505075 -2296432 -3499544 -2220759 -1733760 -2615851
28392 -2615851 -2091309 -2154552 -1601007 170944 1055221 -103549 -1415419 -1912268 -1482317
28383 -1482317 -2046964 -1781934 -722945 -634477 -389104 903596 1955010 495085 -6792
28374 -6792 -421920 -553972 -254093 -729232 -570826 169830 -587025 -217596 -31324 -1756789
28364 -1756789 -2423254 -1212672 -2645200 -2600650 -2011015 -2501807 -3233419 -1108586 -444276
28355 -444276 -2387506 -2615367 -137786 -488951 -1152693 -666180 -1073578 -1050899 -412946
28346 -412946 -538116 -178862 -359975 300509 -1531382 -1768107 -1445271 -1210053 538288
28337 538288 -882158 -1751347 -1761392 -1019180 -541879 613548 1298857 -767100 -1281489
28328 -1281489 -10850 195854 21009 -34355 379493 794995 241710 227313 -326421 -1270312
28318 -1270312 -2069063 -1111606 323036 -1735933 -2356862 -1654406 -1749251 -444895 258247
28309 258247 1106396 194480 -1325229 -419272 -890542 -1535040 -1862088 -2670301 -2352913
28300 -2352913 -286030 -51583 -1548276 371238 -1279470 -1577675 -486520 -73056 -773367
28291 -773367 -2030954 -953881 -807006 -2133620 -3712016 -1943162 -995226 -120186 582509
28282 582509 -356686 -578339 -850540 -672471 -817192 -63373 -1148787 -931018 -175118
28273 -175118 803250 682693 -600184 -2544679 -3187804 -1879926 140074 7959 -1227701
28264 -1227701 -1273479 -1139859 -1934822 -2197397 -2627608 -1191550 288813 210563 -1636633
28255 -1636633 -2059616 -1681368 -1770493 -808626 -1344652 -1901331 -2842839 -2270608 -2222567 -2168866
28245 -2168866 -1882218 -2423903 -2065828 -2152699 -1624119 -1508387 -229365 1064803 -679517
28236 -679517 -2620372 -2675250 -1483930 -996132 -1901177 -1853302 -1870826 -2734106 -1901607 -591154
28226 -591154 -126716 -844562 -1388106 -1271747 -2131884 -2041739 -2573556 -2686451 -2413020 -1252995
28216 -1252995 -175527 536701 -5887 -956571 -945132 107526 -768353 -551916 -1148488
28207 -1148488 -1224929 -1716910 -110240 1211854 1419127 1679244 418363 -1006458 -291595
28198 -291595 -348013 -1224343 -1129173 -1679982 -3080539 -2910562 -3162700 -2500507 -2724305 -2892416
28188 -2892416 -1488437 301471 489192 -872978 -876889 -2067826 -1671419 -1241315 -1933630
28179 -1933630 -1542590 -394192 -300038 -1264734 -2186352 -1602671 -805512 -1619820 -1996703
28170 -1996703 -2404202 -2511168 -1376113 -31339 1102197 -722779 -2741329 -3176778 -1822930
28161 -1822930 -294827 -365876 -633418 -482028 -1527306 -1584705 -578315 -437841 -850225
28152 -850225 -1543135 -2209203 -2112852 -1339975 -313283 540386 1622179 -93805 1055421
28143 1055421 1466755 77005 318892 650101 -172478 -1472369 -1708544 -763815 -481805
28134 -481805 -1514531 -1829622 -1929366 -1501229 -58098 -770681 -302424 -404665 -1649861
28125 -1649861 -1926451 -1944273 -816285 -942150 328505 468178 372591 -114147 -1411979
28116 -1411979 -1639720 -2471168 -3048541 -3073985 -2547642 -1308786 -2227611 -2515670 -2575702 -2137703
28106 -2137703 -2118912 -3751524 -3839844 -4932174 -4218266 -2780645 -2640827 -1045450 -1339588
28097 -1339588 -2049629 -2157435 -2049379 -2724585 -1121618 -766703 -668364 1390407 2010575
28088 2010575 -359086 -1979176 -263605 -2059039 -1528765 -708142 -1064849 -1203476 102703
28079 102703 -134743 550680 537791 -647708 -1057603 -621385 -1296069 -594317 -291415 -818706
28069 -818706 -32218 10324 -683902 -1702926 -2482115 -835260 -689359 -1402206 -1464394 -1918838
28059 -1918838 -1834574 -2434870 -2491299 -3493334 -3418035 -931892 -794461 -1667392 -3332816
28050 -3332816 -3341123 -2594107 -1564791 -573476 -235485 565123 764637 -319902 -213831
28041 -213831 -773491 -2387377 -2865697 -2407698 -1569697 -921942 -2121145 -2940239 -2457962
28032 -2457962 -1637468 -2614722 -3047326 -1427259 -1305015 -3069781 -2890050 -1891423 -1662152
28023 -1662152 -1642495 -1661972 -843550 -1012249 502497 -196725 -1987913 -2765512 -1449880
28014 -1449880 -673216 -1521557 -1592933 -929301 293038 -888049 422167 1945148 939424
28005 939424 -1074339 -1973385 -1566846 -2595885 -1161391 -2038529 -3253844 -539053 807277
27996 807277 60294 -791505 -817414 -627112 -1488287 -2548145 -2209861 -600696 -393889
27987 -393889 159493 387464 958205 1258880 -1043838 -1666333 -1662487 -1289741 -2004411 -1212514
27977 -1212514 261312 -392907 -962699 -791322 -2426609 -988915 -272965 -1775793 -1370871
27968 -1370871 491899 472154 -1284630 -1676223 -34374 833864 574573 -277127 711107
27959 711107 -78067 -354866 -631816 -1672309 -1214063 -878401 -105880 631444 127467
27950 127467 -484097 -1497766 -1378523 -578973 680308 438120 138076 -170253 -1722426
27941 -1722426 -176595 -897964 -1214985 -1614078 -1253188 -354448 -860593 -1885834 1103
27932 1103 -764171 -371637 -610761 -2215928 -1440014 -1393788 -1118619 -112087 -586313 -525306
27922 -525306 -1320666 -1778583 240513 1645002 1519145 944248 141311 619369 -1063281
27913 -1063281 110317 895704 -871287 -501123 805451 2010125 1596689 357491 -387630
27904 -387630 -1775930 -980316 -661844 -696072 322966 594818 241387 274415 -1846549
27895 -1846549 -2188303 405423 -597555 -3198721 -2589624 -1768334 -1941430 -1155530 -864954
27886 -864954 -1357720 -1525745 -3262917 -3380237 -1962430 -2373561 -2174273 -2066993 -1614078
27877 -1614078 -2406787 -2244581 -1083563 -1393333 -367350 -1312993 -1462791 -1112677 -1816428
27868 -1816428 -1438537 -1038220 -718548 -2537897 -1286912 1073728 463224 -270154 -272950
27859 -272950 -1176970 -1558381 -602643 -72652 -931574 -3438052 -2447096 -754666 404153
27850 404153 937923 -594993 -1423764 439233 571822 -919314 -988368 -334263 -585507
27841 -585507 -706745 -1344534 -1715105 -1615750 -2502989 -1633140 -1381219 -1714968 -3349177 -1388351
27831 -1388351 -686056 -755661 -1720535 -2930330 -1673307 -913635 -44288 -1006882 -743375
27822 -743375 -1555796 -858165 -636913 -1496013 -450343 -603943 712442 1915967 1581265
27813 1581265 1604541 380702 -418477 1109161 -998335 -1834512 -2083250 -101709 -935799
27804 -935799 -306759 -40495 -1677931 -1649828 -1179818 -1397684 -1054863 647340 511335
27795 511335 -377459 -1565090 -1684825 -1775960 -57866 578807 -320499 -913557 -1325442
27786 -1325442 -886289 -658497 -660817 499108 -654336 -610587 -74148 -32137 -839259 -342110
27776 -342110 -541805 -551548 152698 -296913 -1509039 -490231 -426251 -396943 -750288 -1869506
27766 -1869506 -582058 613487 -266822 -45996 -26213 -1178831 -1622122 -1507065 -1278497
27757 -1278497 -2274495 -2681584 -2281195 -2905463 -1989210 -1587779 -1528052 -1715411 -1480805 -2749370
27747 -2749370 -1987254 -412480 -100123 -1628828 -1047673 -684242 -805514 102718 477642
27738 477642 668157 -37968 850343 -238868 -1681932 -783187 -559809 -224026 -1501648
27729 -1501648 -466988 461539 -910567 -495349 641023 222757 438070 2466178 890229
27720 890229 -265904 223510 -847306 -1406737 -1470125 -930954 -1395243 -1570195 -601970
27711 -601970 -458726 60494 795207 744089 -257484 153945 164069 -2407774 -1549599 -1839418
27701 -1839418 -1671110 -2360236 -3534598 -2526562 -2552736 -3653527 -4655152 -3944203 -1641853
27692 -1641853 -1054873 -976841 -1127857 -1056957 -605867 -90932 742549 749890 639687 412491
27682 412491 -524040 -2440346 -1365281 -490928 -135351 1087250 24681 314740 262590
27673 262590 850644 389373 -1137347 -1202554 -1529518 -793301 314351 498111 754898
27664 754898 1237652 1383724 573928 -792440 -1864556 -1955411 -897768 -652340 -988221
27655 -988221 -747186 -2184610 -2160561 -817311 -1280448 -1824614 -2973643 -1779496 -1639146
27646 -1639146 -1475840 -472498 825438 1884820 1482332 1982095 1979817 708047 -382990
27637 -382990 -1192231 -2496536 -492208 56987 -894001 -967781 -1227267 -1325757 -799187 63544
27627 63544 -261366 -984935 -398641 -1021677 -903619 -687135 -1411097 -258048 -258336 186388
27617 186388 -561708 -767371 268443 1537617 864165 -363448 -2279902 -2918449 -410869
27608 -410869 -2589315 -2525775 -106183 233615 46748 -886874 -774434 -304799 -1645993
27599 -1645993 -1264894 -948596 -726679 -36230 1118577 53340 145086 1685219 1869837
27590 1869837 1276548 1670827 293487 -935972 -278944 -258396 27327 -366656 -698984
27581 -698984 -1115566 -479408 -1333873 -2196068 -2010919 -1579462 -1634944 -2145544 -902415 -836739
27571 -836739 116481 -753502 -695351 -437598 -791717 -365976 -999008 -1784502 -1105904 -638271
27561 -638271 -790589 -385758 1406870 1866005 628177 249804 728397 603177 -984120
27552 -984120 -848929 -740341 -413949 -418632 -2159994 -1934956 -995245 -163489 1097418 1990365
27542 1990365 -905369 -743244 636458 1938326 2158346 797405 -439730 -1014612 -348978
27533 -348978 -1424958 -1158721 -2976977 -2155344 -747449 -1244407 -369166 -475600 -274412
27524 -274412 250409 1416 -689600 -145939 1110396 -134820 513372 334246 121551
27515 121551 1556464 979588 -517297 -508214 1881488 2047799 340112 571972 760323
27506 760323 806841 1782036 112460 299773 1485830 687105 1876546 1511229 116042
27497 116042 792443 1482519 -57151 -26452 459309 1611754 1225697 214929 516714
27488 516714 1463450 1972804 2175813 1032475 268710 -1725393 -1930238 -1124592 449866
27479 449866 858375 1376163 1284011 991779 -433039 -1467736 -502859 1530964 -140023
27470 -140023 -952083 -532905 696761 1486378 777017 183193 1581571 919314 903215
27461 903215 -70818 769541 1958036 1279744 3074528 2873441 2839420 3926917 3480724
27452 3480724 4655919 5532067 4065888 3259441 2799369 2155547 2493606 2732279 3776555
27443 3776555 4088180 5872836 3938077 2809022 3431166 5535419 6879642 6441787 6590437
27434 6590437 5418033 4967029 6404785 6344714 6984593 5828914 7020144 6929306 6950912
27425 6950912 7978007 9090461 10387142 9955919 7749024 6801268 7384314 7578584 7021076
27416 7021076 6497305 5734992 5908461 6998917 6586511 4741373 5012010 5265609 4039503
27407 4039503 2523045 1846771 3130537 3515534 3384088 2614842 2659697 1886293 1750043
27398 1750043 832085 1376177 1927713 1886415 550642 925255 1842795 2067562 1508777
27389 1508777 534440 806023 1726764 596303 751055 1860635 1915419 1126120 1804814
27380 1804814 3486316 2599357 3334674 2371152 437579 1809018 1596705 2155995 1349983
27371 1349983 1262522 -176045 -181844 937351 -317016 851186 1073640 1085034 1527074
27362 1527074 851564 2028288 3233631 2972507 4071192 3681769 3784005 5588196 5763765
27353 5763765 3672935 3075056 3288774 3758628 1061379 1255658 2360595 2829928 2378267
27344 2378267 2659131 4666343 2553228 1757386 2031944 1291223 2290559 2057029 2594424
27335 2594424 3478893 4279449 4956251 4871089 5298370 4136387 2668704 2672320 4455570
27326 4455570 4247876 5155796 6516344 5874723 5261451 6946108 7730071 7324291 7781426
27317 7781426 6568057 8543229 10302000 12343495 12706089 15287083 17506578 19199493
27309 19199493 23737834 29384370 35247402 43087734 54780630 74532859 112333966 168329947
27301 168329947 205365443 193793243 156006595 141684127 161829705 209338634 242756860
27294 242756860 227206780 186558307 168958280 186074717 247075128 350627863 425564651
27287 425564651 401896319 316401650 268583884 294078365 374228785 432321723 391277711
27280 391277711 287025843 209310284 179605149 186503173 223847435 255254731 239810827
27273 239810827 190733039 158816972 164391607 199009907 225817664 204076133 145132731
27266 145132731 96571636 70348170 55886443 43123993 34580744 30081103 26096770
27259 26096770 22575759 20958921 18505207 15860716 14323379 11732237 10135796 9501120
27251 9501120 9750554 9378432 9225457 8284087 7534853 6865539 5906392 7587367 7368819
27242 7368819 6957155 7117771 7197448 6213200 4112455 3503964 3992774 4748210 3996691
27233 3996691 3008422 2999428 3494659 2773219 2080619 764262 1668157 3840157 3884014 2781457
27223 2781457 1308865 1797851 925378 795350 1950043 2999685 4062543 3693638 2202192
27214 2202192 2413770 3258306 2741417 2172965 2716627 5063584 6487772 5268946 3324414
27205 3324414 2544672 3579273 4826699 3862141 2863642 3901210 3194820 4935655 5380305
27196 5380305 5009089 4674958 4404091 4260034 4696557 3946476 3565709 4148639 2684597
27187 2684597 2510688 2664007 1409525 2866350 1604879 1150966 1615951 1157580 1528774
27178 1528774 3161894 5049211 4263215 3503437 2576382 2697560 1649783 1954596 2095527
27169 2095527 2623285 2650956 2471575 3388380 4121613 3118272 1747746 1259930 -236378
27160 -236378 453037 2529539 1914889 1705763 1720888 2045197 947694 -721491 -364538
27151 -364538 1951319 2954448 1900290 2396058 2974797 1835814 1199558 -372527 -2714798
27142 -2714798 -2006616 708694 461916 258220 -1155194 -899228 775120 1964784 422759
27133 422759 -783702 -1580365 -1177034 -615673 138294 -619988 -1713574 -1093988 -115662
27124 -115662 1718124 767133 563967 -71586 121690 1124876 -197550 318200 -442587
27115 -442587 -2454 1294006 1618044 2450724 3119432 2635436 1336985 2410284 1774948
27106 1774948 3094057 2155583 2687099 1320778 1937733 2515492 2164646 1331613 512603
27097 512603 945371 1589751 775533 1538417 2340823 1920638 3012061 943543 -639642
27088 -639642 156500 2908109 3984571 2163189 1320631 800670 712210 797146 -90744
27079 -90744 174784 1383082 446136 -58014 -359787 -991895 -729148 1171373 -305043
27070 -305043 -1980533 -3426549 -1104978 672557 1167088 1207887 1453636 63119 55373
27061 55373 1117187 1845327 952663 -683495 -500975 -706237 -769514 86847 41800 294994
27051 294994 1086966 1199457 423517 -428610 542373 1020604 119030 -272847 1549244
27042 1549244 1055486 -535766 -1234715 -1643976 -1069835 76190 -444888 -1270807 -555513
27033 -555513 453788 39299 -323409 -12177 725882 1449674 978815 85058 -248972
27024 -248972 -2147670 -1866241 -3253872 -2383292 -480064 46156 654434 -320710 -283110
27015 -283110 998162 899604 -1153886 -1687418 -1639383 -1693457 -29491 -1474215 -2924149
27006 -2924149 -1761539 34506 482569 379333 -929820 -332591 -37699 -328151 865326
26997 865326 1339685 1506716 788834 -136157 -372773 -1434701 -1111429 -641076 -354783
26988 -354783 -1607493 -1157808 -758198 -683003 -2261685 -2540322 -1959340 -636978 -2568542
26979 -2568542 -4330005 -3630780 -2308543 -1857200 -553172 400415 1217706 986914 -1772089
26970 -1772089 -1471986 -946966 -97470 189538 674859 -101094 -439953 -907520 -467706
26961 -467706 591355 -776306 -959582 -930237 -1254805 1034825 3342133 3399415 2419445
26952 2419445 2032552 1777133 842137 1416527 1901405 2622157 1588302 303893 -1095405
26943 -1095405 -407315 351464 1428871 547535 -407452 303825 1904887 1697470 156093
26934 156093 -711421 713005 716910 1092333 1140948 596351 731514 1167970 -640230 -1309623
26924 -1309623 -780670 -1777834 -2405197 -2646917 -1741557 -1954153 -2773403 -2254592 -2246946 -1057041
26914 -1057041 -794026 -28306 292567 5874 -1232772 -1736662 -2057458 -556032 -1018122
26905 -1018122 -724492 -2461301 -1855002 -57930 -1679430 -2534149 -1639882 -1881802 -2073996
26896 -2073996 -673089 -396223 -959559 -719702 -1372097 -1082171 -1285532 -537651 -586151
26887 -586151 -2547812 -263144 1736768 1620740 1595981 1745245 2921085 2307908 1511479
26878 1511479 1133708 -222786 -854241 33321 1478248 327481 341981 373625 -635511
26869 -635511 -934115 -1333934 -1974706 -1870565 -1607866 -2046630 -920912 590012 536178
26860 536178 228178 -59761 -596129 -1127192 -1310719 -1511917 -2417694 -1506371 469893
26851 469893 1355344 605497 608829 365929 232645 -134743 172895 -608581 -1690867 -648342
26841 -648342 -1252521 -1817823 -1543150 -1771013 -1846761 -678446 -922777 850427 -220539
26832 -220539 -2277136 -1150906 51491 -279468 -687749 -1358752 -543485 -211757 -2065737
26823 -2065737 -2014042 -1740424 -894676 -46263 404239 276457 94852 -272312 -1664558
26814 -1664558 -2227978 720482 -48412 -1067328 -1093452 -226653 -35383 -538539 -222604
26805 -222604 315937 2134383 221949 -948246 -1461081 -1122297 -1233518 358192 78472
26796 78472 1005622 2309417 930965 72868 413644 1331151 1753423 329935 527090
26787 527090 1668775 664648 248847 1724840 3282297 2317431 769220 -910233 -1907629
26778 -1907629 -1371830 -1847208 -2557868 -2224467 -830684 1873348 2974983 1982602 890124
26769 890124 -239800 -475801 -5206 627206 359483 -737725 -757121 -2380379 -2699533
26760 -2699533 -1643957 -1085866 -441792 -250706 -641636 276787 -629898 -718452 -1347565
26751 -1347565 -658786 -114341 -1858020 -3547687 -3351944 -2756730 -2084244 -472442 -2390979
26742 -2390979 -4487130 -1840566 -978778 -396392 -1081445 -1131956 -725378 -277325 -150196
26733 -150196 -1320291 -2179512 -1314325 -1205523 -1427590 -2315890 -893402 562242 906735
26724 906735 -875672 -1231391 -1320413 -676045 -762759 118172 -642984 -1662480 -763740 -997257
26714 -997257 -1251635 -752341 -906258 -727836 -1136571 270396 -857879 -1272171 -899520
26705 -899520 -1564473 -1730602 -531658 1209724 2008671 1356740 -1170776 -2082584 -1329218
26696 -1329218 -1442369 -591510 740283 230299 -1670826 -1108166 420940 -64290 -905415
26687 -905415 -1925150 -2430891 -1672678 -392922 -800917 -205344 -235362 -819920 -221549
26678 -221549 1291934 -66901 -1759246 -1272646 -1209349 -1454947 -1340156 -1594843 -1914154
26669 -1914154 -699010 217421 -496012 -826565 -180117 1257367 638994 -1429272 -2883166
26660 -2883166 -3285528 -892362 -382275 -39218 249105 638524 961247 847322 -1818428
26651 -1818428 -1243256 1250012 -575248 -1188732 -409360 -699228 -1960223 -662334 593232
26642 593232 -72951 621876 911194 -1659028 -2535090 -312301 192461 -1349365 -915358
26633 -915358 417781 1362151 922636 296304 -737077 -1292562 -598128 -598935 -1279605 -606416
26623 -606416 -989957 -2427909 -1495354 719123 845491 650965 230191 436102 542569
26614 542569 212865 1800430 2068863 49790 -627471 -951603 -99673 -196074 -688400
26605 -688400 -2285677 -2305763 -1720106 -1254032 -473596 -680638 -781393 -986357 -1416158 42944
26595 42944 -69466 -1379999 -1120898 -1301984 -347762 -61923 952406 588768 155126
26586 155126 383420 -1225626 445812 184262 -269383 149517 238110 -983946 -1794950
26577 -1794950 -2031530 -352311 -502662 -740726 65279 -224981 194492 -1006566 -1843065
26568 -1843065 -1092640 221540 27177 -1348823 -575555 -211413 -109171 607733 -306899
26559 -306899 -96929 -631161 -1531581 -620772 -1729547 -744791 1004607 1325026 806642
26550 806642 -1106517 -755085 304692 620012 1752942 1172639 1204492 165132 -768455
26541 -768455 -1149150 -1109493 -1134267 -2001469 -2697584 -4106468 -3607753 -1291510 -847907 -2188413
26531 -2188413 -596096 -1814059 -2026942 -450642 -763558 -1891436 -1961148 -1735335 -1322190
26522 -1322190 -846450 327307 859808 621845 -280485 -1996848 -2199495 -1619891 -260804
26513 -260804 -1091448 -156697 -456178 -994158 416083 -835682 -1500381 -1215626 -1484987
26504 -1484987 -163862 480127 1329795 552070 -1559764 -1958372 -1997810 -1240625 -1444132
26495 -1444132 -1721860 -2383782 -1827158 -914243 -717084 -680776 -323669 -414267 640427 687377
26485 687377 -304954 -775937 -334715 99707 -549859 -319962 453245 523401 -1112271 -1309468
26475 -1309468 -1673987 -1455808 -149472 294780 -803922 -2217080 -1434371 -1542547 262786
26466 262786 777930 1316729 2355778 151935 -1706862 -2455475 -2577976 -2241717 -1677976
26457 -1677976 -164790 -1471911 -1400864 -500635 -2110674 -2360583 -1549249 -11270 -250980
26448 -250980 -781437 -237428 756702 -510157 -71516 1085709 271768 -677929 394837
26439 394837 1282469 -3140 528815 507967 31678 245975 -418231 -1196666 -709648 -592849
26429 -592849 -1253548 812146 1380066 -1329407 -3353782 -2727685 -892897 -242749 -901187
26420 -901187 -2579699 -1873164 -2757209 -1213641 -953716 -759199 53767 -621445 5150
26411 5150 -333227 -752228 -973409 -370922 1765739 -397577 -836247 -610714 -1078130 -1082014
26401 -1082014 146381 -483250 -1739486 -436656 -829929 -516314 355601 344472 429721
26392 429721 1820335 623084 851209 863095 627006 802951 278853 -313744 -288587 -116857
26382 -116857 675593 -82577 -1024808 -641687 716572 1028113 -102878 -1596007 -1501361
26373 -1501361 -457320 -1309261 -1546232 -1270695 -1624501 -1648430 -782179 563684 1225009
26364 1225009 1807594 -30298 177837 -72526 -440680 -866834 -1785262 -1834712 -831572
26355 -831572 25837 -547486 -1961957 -1294830 -1879925 -2786883 -2000940 -400525 -557290
26346 -557290 -906439 -690120 223874 -562692 -1314612 -203411 585525 -435110 -514206
26337 -514206 756932 455427 -765614 -2714858 -2679354 -2251586 -1128448 -1888820 -2253702
26328 -2253702 -3047948 -2554598 -2682931 -2681220 -1797434 -2774611 -3544445 -3322127 -2190651 -453618
26318 -453618 287236 -1098009 -12779 214558 -376183 -686551 -504143 762143 -117598
26309 -117598 -465243 -98463 -219345 734206 1160933 1045954 148815 -2125346 -549069
26300 -549069 1329779 -446122 -2583847 -1294190 160817 -22299 452456 655662 -4146
26291 -4146 218393 961603 -184165 -1165906 -1968868 -1233744 -203134 375003 779962 1339116
26281 1339116 -791322 -2137840 -2646024 -1872987 -848519 -338521 1072872 605338 -101668
26272 -101668 -663582 225460 1485239 868377 -279118 -274295 -1815103 -677155 245113
26263 245113 1444012 1278971 1206083 477359 251658 547589 1606147 725913 302929
26254 302929 -609966 755198 313520 278314 796956 -477800 -46222 211695 911651
26245 911651 -823816 -1134574 -2547436 -2737773 -1905968 -1076205 -489910 -279574 405587
26236 405587 258989 -462086 -202613 264022 778000 -377457 -428800 -1002751 -296077 -166461
26226 -166461 -1628013 -1532151 -556901 -1360305 -2203750 -1691909 -1601999 -2461595 -1533020 -325982
26216 -325982 -554323 -777975 -1252343 -1283709 -399344 -787823 574601 1323970 172769
26207 172769 -1534388 -821751 252270 -1518896 -1585267 -1222231 -473919 -890374 -922022
26198 -922022 -1635127 -1898611 -642797 -246457 -1003863 -2398278 -1065286 -646324 -797495
26189 -797495 386071 728136 -255165 -59463 -884811 -1661258 -89027 -180777 -475016
26180 -475016 1027370 182940 -1371819 -89999 -544698 -423240 237717 -258526 -211527
26171 -211527 143835 -962532 -1341240 -663818 -209386 222960 1063997 827818 -436217
26162 -436217 -790356 102282 130701 1083562 1574790 -63273 -1709563 -2120108 -485439
26153 -485439 -500190 -173741 457517 1187166 494664 1617157 1346329 11484 -804642
26144 -804642 523666 1702027 567394 682143 536630 1433556 27201 -1471249 52699
26135 52699 -72662 -555572 -1382025 -1426449 -649977 -508206 -298258 -265232 -651766 -1043784
26125 -1043784 -1343810 -1835187 -2297913 -897314 -691365 -3125861 -2832910 -548566 -597305
26116 -597305 -1334101 -974400 -322705 -993457 -997599 -339075 610588 834497 131949 -11013
26106 -11013 -1002914 -1651936 -1584695 -113485 523366 -308886 -1443417 -2150033 -911222
26097 -911222 -1842648 -2120553 -3140645 -903364 -1498281 -2314475 -930409 -436443 -2111017
26088 -2111017 -1665806 -1069818 -597383 -628055 -1511150 -926495 -1451357 -2807158 -1847481
26079 -1847481 -1347567 -885519 -1393747 -1113837 615559 74610 -1405310 489000 559493
26070 559493 -135436 598127 122288 729418 -234511 -649336 -160374 -1839479 -344601
26061 -344601 -455838 -1184564 -1448442 -1690151 -1867775 -1891713 -1739632 -2956623 -642416
26052 -642416 -853863 -2395683 -1752844 -633868 -859716 -1960531 277485 679923 -626907
26043 -626907 -281487 -1077724 -1676987 -564696 -542348 -1269619 -1965692 -1104928 166371
26034 166371 -491102 -666626 670838 38414 -466797 -1037922 -333214 578283 1715202
26025 1715202 1251656 72955 -823272 -1048885 -1426229 -2170221 -1727005 -1200081 21273
26016 21273 -73566 -1084491 -1244544 556544 482261 -1598847 -2509216 -1277007 -197666
26007 -197666 522571 55816 -1167497 -1984974 -1303766 -1466826 -1905405 -1452594 -1556388
25998 -1556388 -1121073 -434451 -1022800 -797795 -9216 -1518880 -2362039 -2026324 -1614089
25989 -1614089 -1927710 -1945290 -82893 -21053 -95026 -255198 -771173 541466 526403 1122442
25979 1122442 30452 331104 -766262 -387129 -528708 85785 1090654 570918 1078181
25970 1078181 665357 -671 -1134720 -2464038 -1894015 -686123 -1422915 -2357937 -1246396
25961 -1246396 -1195075 -1216294 -577155 -1023029 -225391 467269 1490877 -336705 -1200212
25952 -1200212 -1999880 -3043705 -3013113 -1984865 -1404877 -2646242 -2809526 -443236 465420
25943 465420 -1008176 -1252989 -610690 -10194 -1558309 -1290432 54609 1563214 1717648
25934 1717648 1341244 -618074 -350397 715208 -1023712 -2241037 -1113778 -1108827 -177071
25925 -177071 1896595 1118456 -288153 -914 686364 509197 629047 1148233 1237379
25916 1237379 624478 -1083819 -1127144 -322684 547135 1335641 780995 529492 -211991
25907 -211991 -1465106 -2108692 -601142 -475320 -1634272 -1308259 -1093110 -169194 -1454980
25898 -1454980 -968756 -1007612 -2135327 -2619530 -2211929 -558814 -926246 -2451384 -1929969
25889 -1929969 -2096561 -1666797 -48969 97417 433795 541570 -241894 604791 1733644
25880 1733644 518166 -1081224 -977605 -561375 -1495636 -1042783 -242769 11823 732570
25871 732570 1793664 2094371 1252846 -736974 -1305557 -765953 1771287 1775949 755553
25862 755553 107532 442922 380184 1319767 400298 789405 500197 1126282 808267 362040
25852 362040 -968099 -1335844 -725002 -295819 -211101 -1984306 -1469628 -165458 -120165
25843 -120165 539395 935771 526041 977380 636183 292940 -350995 -1399447 60752
25834 60752 595887 147151 -508298 -781356 500304 454408 -71598 794159 -553774 -1827106
25824 -1827106 -2963744 -1483387 -320812 743184 434237 551444 2225777 2040027 67056
25815 67056 -504927 -1770779 -1555372 -2088601 -339770 128641 1205099 1052241 755431
25806 755431 1399808 798245 588508 487531 -394822 330796 -148816 -1040522 -1282441 -1136103
25796 -1136103 -24446 941157 914400 437339 -1118555 -561034 -1125064 -1012172 -1732538
25787 -1732538 -985877 609775 1631734 214171 -1898317 -3284506 -1720732 -427117
25779 -427117 -122768 -306733 311781 993286 557158 102145 -597716 -1194794 -2022569 -2132268
25769 -2132268 -919432 -1736989 -990327 -29906 838067 1873474 846069 -24210 -262236
25760 -262236 343136 -677681 -1899071 -2123625 -1264881 -436635 -887569 -1229590 -1486296
25751 -1486296 -1887299 -815863 1260249 -219591 -769960 -1191275 -219354 373396 -376726
25742 -376726 840093 -768004 -224145 -1161572 -2157798 -3318058 -2451073 -740464 792760
25733 792760 1636744 2330777 2636346 898114 -157029 -615637 -1792144 -880314 542614
25724 542614 1340821 -69839 137087 1072940 51749 -587357 -153730 654795 228201
25715 228201 -1652932 -869860 -480492 -2034607 -1387079 -1029674 -2584932 -1784144 -852598
25706 -852598 -1027642 -1169790 -390896 -278559 -735286 -937981 -1562522 97957 1765717
25697 1765717 1191006 198031 -1840640 -2312614 -3583804 -1694293 -358595 -314761 -966584
25688 -966584 -438433 -522492 -2540648 -1781595 -2048049 -1339156 -1084048 -1359286 -624138 -931998
25678 -931998 581413 2480036 1496750 1103473 -1249809 -1721143 -1528053 -822158 -772520
25669 -772520 -270534 -92978 -730366 155035 413030 -672706 -1281624 -244272 -1176217
25660 -1176217 -1783184 -1076827 -823616 -2150882 -890783 -1215117 -1359463 -1103607 543292
25651 543292 -153077 -1239869 213807 691844 1543793 1216255 -389604 -1925079 -1241265
25642 -1241265 -1478482 -291107 958132 1172726 780046 1312328 618568 -1663817 -1417827
25633 -1417827 448671 553214 -183875 -60292 -1047445 -848556 -40703 685573 435011
25624 435011 -546913 -1093311 -207809 -539674 198834 1355837 1294510 1417750 -77159
25615 -77159 905141 530683 -3098919 -1858886 -225935 -1023515 -855318 -1265856 -469821
25606 -469821 1015777 316024 831985 2453109 2349911 1405102 -277857 -1372191 -2176085
25597 -2176085 -2824837 -1386762 -978480 -392139 -285495 241252 -815313 -1535802 524208
25588 524208 1010279 1333645 1722087 291316 -809006 -184342 -1158734 -1605409 -1911336
25579 -1911336 -1347334 -1817522 -1802333 -1856758 -40761 -865304 -582598 -394583 -1971636
25570 -1971636 -1040488 43242 915868 1684591 1027299 -559687 1254876 1536278 2028116
25561 2028116 1998296 313958 308079 -122100 -33181 299597 703270 187067 496711 947560
25551 947560 1184617 -403239 -1348480 -1238566 -952182 550244 1122442 513437 -279358
25542 -279358 -473013 606408 250253 566212 312841 -1232521 -930878 -1004858 -52913
25533 -52913 -683088 -962427 -935580 120556 -467121 -134245 -298408 -1565060 -1643505 -1350294
25523 -1350294 377392 1465079 3364007 2936445 280185 -732127 -757806 -902383 -1414022
25514 -1414022 -1823867 -749656 -1201520 -471195 -629722 -1050453 -625364 309491 95102
25505 95102 776917 -840217 -282015 281433 106833 -919426 -1895818 -426545 120355
25496 120355 323255 369921 431362 95948 32751 1310530 166250 -930626 -618892 -429536
25486 -429536 -866086 -2557019 -2150699 -1626749 -356293 1066672 1356364 636210 247333
25477 247333 -138014 -164172 -1850888 -2382041 -1498529 -1282928 -266610 1285807 -303803
25468 -303803 -859822 -629202 -2486692 -1770220 -1566155 -1623945 -391028 1631836 1193560
25459 1193560 277387 -801496 -978456 -687326 -1583239 -1290592 -1284445 -1735084 -2275551 -778288
25449 -778288 -194609 -1074682 -2029165 -1588015 392563 -103372 -898464 -1591387 488445
25440 488445 2564288 2448235 1004751 -328112 -755200 -93181 -1372840 -916555 -1093483
25431 -1093483 -845795 -2442894 -2587459 -1088893 -1511171 -2525111 -1060213 51540 -1826337
25422 -1826337 -1112071 -1220054 -987442 -215841 -1215774 -1855245 -611907 -1305416 -725019
25413 -725019 -229780 334504 1896710 1048824 -231424 853893 -1077942 -1981861 -1979198
25404 -1979198 -1629805 -13863 -3874 -1489492 -988498 -1710036 -1915897 -574897 -952426
25395 -952426 -569623 -947255 -849053 -1221203 -521121 -927391 -1856474 -1114265 69535 823566
25385 823566 -813406 -635311 -1018449 -1625433 -375547 1638125 869813 -451647 1867148
25376 1867148 1245443 292356 1179796 -359443 -767484 -1228956 -1160508 -985587 -728494
25367 -728494 -422037 -339638 -1631105 -2612633 -2493349 -1788513 22700 39336 -332681 1422170
25357 1422170 801981 396498 1423413 266648 2128500 2526188 -222531 -810867 -1681746
25348 -1681746 -1566696 -1876608 -300887 -1096006 170416 185284 144099 338648 -52191
25339 -52191 -1285562 -3329239 -3013379 -1235807 234968 -296940 -377040 394223 -69480
25330 -69480 -1301902 -1955482 -1706464 -2501436 -837166 -1644247 -1951596 915582 2224264
25321 2224264 567656 498406 144302 502736 1952770 1695944 372251 399818 655527
25312 655527 1020777 134837 -650106 758272 1942349 807539 42193 -413243 -864552
25303 -864552 654877 2366656 2142443 1605980 444145 -1049415 -1738541 -2718414 -1853636
25294 -1853636 -744281 704602 -73548 -1780857 -1967466 -1668881 -1349959 525017 -168282
25285 -168282 -545747 -487027 233434 -585505 -58151 1493947 770047 -35695 -704735 -735160
25275 -735160 -478276 640326 -364555 -1494179 -2216426 -2508034 -53159 957666 -348233
25266 -348233 -1258684 -883147 -352779 -813114 -1791120 -1078962 -518812 -1175491 -593981 -1232138
25256 -1232138 311893 867258 1261069 92859 -1479984 -1476508 -917317 -1130242 -739565
25247 -739565 -128723 -360098 -1675995 180231 278963 -1201587 -1256231 -2095532 -1772458
25238 -1772458 -36533 1440780 2771198 2493736 446286 1451917 2015755 -243450
25230 -243450 -828328 541126 1879892 449359 398460 184626 386476 -778027 -2211954
25221 -2211954 -1949160 -1433471 -276656 -1205015 -755643 121803 -344106 767725 1718051
25212 1718051 225496 1091583 1147044 -884740 -985086 -1426052 -2270420 -2364290 -1152848
25203 -1152848 -917925 -864079 368158 1978886 1195296 -237432 -700555 -826399 -750051
25194 -750051 -660891 193200 114745 549254 126844 1464815 2093161 -174592 -89226 942638
25184 942638 971431 983326 689316 -421426 -1906009 -1290084 635649 -990216 -718042
25175 -718042 -686776 -75141 535177 406167 -1438648 -1462213 -852074 -157393 113421 -832099
25165 -832099 93089 248404 -686848 -2330330 -2029034 -2416965 -3887713 -2666836 -755916
25156 -755916 -956025 -363301 412804 -294804 -1558196 470635 406678 -529824 -1218724
25147 -1218724 755787 95230 227084 227778 47340 1987148 1629059 642948 1171754 846130
25137 846130 -1148753 -1649322 -1969682 -1265175 -1225657 -1208239 -1622252 -265413 -1553473
25128 -1553473 -1921488 -333042 -16671 -554131 -940380 -1515404 351482 2513287 1465200
25119 1465200 -552895 -2290424 -2891905 -1687993 -683011 -168546 -867603 -906719 -1016290
25110 -1016290 -234580 486756 -424837 -1670474 -1963577 -1476498 432671 -552821 -809102
25101 -809102 -871705 461328 560945 -53358 -138290 1709400 1303587 768619 -697428 -392069
25091 -392069 55290 9476 1450067 3624146 2221737 1657249 1415248 32380 -725153
25082 -725153 -337091 -1039677 577795 990222 -673910 -472789 -1025384 -703917 -1454056
25073 -1454056 -2039464 -2549538 -246637 449552 -30024 -49219 -2346221 -1329080 -627544
25064 -627544 -1192055 -522259 171075 729409 737023 387349 574897 1750795 490754 470242
25054 470242 2163787 2360897 1507542 1847031 1342175 344220 620243 129556 1302850
25045 1302850 4932841 3185598 1921256 -158064 124930 -626601 -1360338 -182964 144935
25036 144935 -415432 -365929 -433296 -947915 -20248 1362719 133421 -2191940 -2181796 -1508227
25026 -1508227 -1202509 -962556 -1856656 -1494349 -77617 -886474 -2094597 -2700118 -2109219
25017 -2109219 -1018882 -1182394 -1143161 -1431488 -210552 490243 243212 567394 -671856
25008 -671856 -1066328 -1069930 -227910 -1109021 -1536162 -342668 129512 -152238 -1130016 -1526836
24998 -1526836 -1965983 -922874 -879205 314271 -513490 505355 734754 309617 -521636
24989 -521636 -1737088 -1164610 -1812862 -722577 -172546 -733468 29288 -746556 -1385168
24980 -1385168 73852 2487841 39335 -2769379 -2437267 -502879 -582305 352040 -696399
24971 -696399 569878 1427235 1104923 485254 -529649 -1725637 -1256911 1015530 97598
24962 97598 384096 -262962 -283224 541182 862132 -1041225 -2036940 -1838744 -1692129 -826822
24952 -826822 769350 786321 683136 1842795 67321 126998 -551896 333526 791165
24943 791165 -50907 -251388 889927 701805 1549459 2580161 1068010 1284329 913646
24934 913646 -531450 -602190 393104 -1772493 -2914559 -1693197 -3005471 -3079235 -2818970
24925 -2818970 -43678 -73769 260937 646506 342773 40768 1045593 1385300 1429277
24916 1429277 1455932 1289473 767466 343370 1068364 -561442 -1576911 -1039947 -327775
24907 -327775 142370 853596 -792577 -2189019 -1245967 -205717 -1889431 -2825966 -1803596
24898 -1803596 -1598166 -1295324 -1648798 -418646 1085632 -35708 -495924 -280717 -803402
24889 -803402 -624686 1736152 152278 316377 260491 -1224812 -1297510 -1100619 -1029980 -656948
24879 -656948 1083928 1251695 1270577 1095801 706096 380770 445879 995178 -283617 285302
24869 285302 906015 776723 49927 -682384 -852956 -1054364 -537569 -791611 -870014 298952
24859 298952 -260129 -419400 557752 96267 4256 -1637157 -1366022 -638210 -815246 151212
24849 151212 -787407 -2747287 -2566259 -299558 -488955 -556289 -867982 -577900 1243204
24840 1243204 2305856 1404075 896469 1230028 576852 894460 1193845 1201710 1418214 1441576
24830 1441576 956682 -141480 -1006113 -1636813 -1977802 -1299762 -1037935 599111 -819457
24821 -819457 -1650941 -965981 -413143 -243144 1225685 876899 1311710 771635 670903
24812 670903 1678659 468431 -339465 -836240 -550431 -417257 678912 55248 -681231
24803 -681231 -193660 -199979 -137782 -290464 727050 -199291 -93019 -167409 731783 194058
24793 194058 -1305639 -982797 -1513751 -1158997 -599860 -497804 -946512 -1789201 -1400510
24784 -1400510 855145 1040037 -1015844 -655619 -846170 -940542 -1088214 -397350 -1057667
24775 -1057667 -1502443 -2713446 -2577808 -2147763 -2510377 -1622758 -1913300 -905109 -287319
24766 -287319 -1111253 -845673 317958 -57247 -295758 169200 2003468 3155682 1839142
24757 1839142 628944 -652992 -296900 -815236 -2144590 -1233188 148582 1300645 1338515
24748 1338515 298312 -162223 19273 -886181 -1047247 -274805 -390929 -438188 27738
24739 27738 674092 143978 1463083 1659493 559295 -1247441 -1660884 -1135109 -1110569
24730 -1110569 -500008 -283253 -886113 -822452 -417024 641365 -591112 42400 939300
24721 939300 731240 500555 -1163812 -1047034 386288 -261132 115004 -511369 396548
24712 396548 192523 -1176440 -1020653 -631785 -1220619 -849089 -326229 -1326883 -2725544
24703 -2725544 -1869005 -147052 -1894450 -2355047 -2005010 -2416967 -2596284 -831488 -1379284
24694 -1379284 -2942283 -2466180 -1273785 -833171 -1180928 -932079 -853755 -825059 280577
24685 280577 351198 -889705 -443130 304536 1052591 650596 409302 974069 172912 -116617
24675 -116617 -543493 -1051711 -713922 590199 313497 -816612 -784228 -794096 -615393 -583249
24665 -583249 -643347 83003 1539069 1346474 991744 1219278 411094 1045710 798033 405059
24655 405059 -715908 -584978 -138783 108382 -924632 -650005 -894403 -1896819 -711272
24646 -711272 801047 112872 731604 1460313 2645938 385296 -682636 -1380014 -1328278
24637 -1328278 -499260 -881405 -824063 -1605226 -1590565 -282250 1537280 1559974 1559838 1150775
24627 1150775 -524161 309251 280547 -218643 -288623 199413 1230112 822297 129689
24618 129689 -1155436 -903331 449018 2343957 2276819 312203 -75973 -7100 1124641
24609 1124641 1823191 1656970 1707264 2176035 456583 -121425 586926 -338438 602948
24600 602948 513982 847112 273839 198766 1189979 633493 278438 375508 448485 1325020
24590 1325020 405720 -1257291 -1480854 -715135 1027965 2045908 825035 433488 1579912
24581 1579912 1076363 1131982 1233235 1361760 905322 -98181 409697 -301550 -369562 -1316189
24571 -1316189 -2368829 -935176 -526279 -245998 -448142 -752309 -723812 -2141653 -1425973
24562 -1425973 -2292764 -4498976 -2156745 -1316436 -1729131 -2124638 -2459707 -2387926 -1855016
24553 -1855016 -877228 -116653 -54048 -227655 -979337 -1517973 -1302288 -838205 -337844 670888
24543 670888 -513539 121418 448585 -956841 -218143 1014961 1667283 -515493 -1794195
24534 -1794195 381167 406976 -798792 83541 -529234 324928 1209156 1627550 1267585
24525 1267585 -724456 -971025 -752339 -1238816 449592 103878 113825 722716 696850 -95261
24515 -95261 -964029 -834891 -34411 864477 422714 295901 -495752 -362308 -649270 -2116096
24505 -2116096 -539728 670383 379664 -53144 927285 1818964 2667314 2545700 1927873
24496 1927873 -308969 -810576 -255744 -32914 -888415 -1834413 -2257345 -934354 -1326493
24487 -1326493 -1684356 -1466075 -1520040 -1383530 -1236101 157381 518605 1797869 2150716
24478 2150716 1333482 1227085 1214203 2374764 1028850 2403202 1913045 1207753 -264939
24469 -264939 -280818 1135638 542941 212040 -358552 -2081351 -810897 826774 -1888365
24460 -1888365 -2275486 679502 1471242 2038332 1057359 357292 233345 -691139 -754234
24451 -754234 -739187 -1141655 -1302246 -1809585 -1296637 -354990 376019 488013 -445403 592520
24441 592520 580086 -624545 -468576 537286 -142321 -137786 -1507131 -1714497 -2616234 -735401
24431 -735401 686811 308515 -33131 1334094 1105724 1294714 404821 -811612 337315
24422 337315 545492 282243 486672 1252320 669179 -318892 285844 805212 -193279 -6920
24412 -6920 -770449 -399615 -390482 -562354 -754343 -213680 -562827 -1470800 -957457 -1605276
24402 -1605276 -268716 -409283 181977 -97285 41680 307228 -26671 2132472 2292186
24393 2292186 605715 705388 831282 -734292 -1569771 -559316 -324081 -2043462 -1471225
24384 -1471225 -761389 -17936 1993813 793134 -884257 -367137 843584 523455 1210798
24375 1210798 706820 -96769 1092702 369926 -612375 343266 295656 755874 -440141
24366 -440141 -358230 -681692 -723467 -581541 1971590 2818078 2190439 2310999 1606746 291671
24356 291671 319693 1526943 1314118 586072 -246322 -2115039 -1475226 -1879801 -436164
24347 -436164 491969 -367061 -361617 -385591 -191314 77330 -26947 -46524 192844 227814
24337 227814 726084 484184 87722 -382885 -1502081 408399 444530 -1173444 -982375
24328 -982375 362259 1251127 1034596 452815 -350372 406821 -357830 1386888 1304701
24319 1304701 64645 353862 -1140315 -883260 -677484 -844782 -801452 -804114 273924
24310 273924 598787 642762 92039 108583 404099 740062 1010767 1538724 482664 531948
24300 531948 -494155 -2517684 -2571268 -2738416 -1224463 79289 -1187699 -2025001 -1203460
24291 -1203460 -623061 -1397024 -1467680 -1952104 -1670098 -558522 462490 490653 349983
24282 349983 293713 217850 743426 1207886 -727085 -536571 405822 365514 930716 494716
24272 494716 -744176 -1116539 -1740213 691705 1647357 1691147 1202128 993504 859680
24263 859680 1688523 2435753 2388197 102435 -894872 -4965 611142 793907 1066649 72200
24253 72200 288393 -167069 -370566 855645 1331875 2357117 863023 492542 -256820
24244 -256820 -294682 -1004335 822393 1000096 1113489 1634718 147940 -42692 -389318
24235 -389318 -901879 -1055030 -2432839 -1104722 -279805 446417 1594517 1498277 615237
24226 615237 -101496 863882 223467 741325 534462 -42204 723817 250435 768499 565142
24216 565142 284854 -520213 -578375 -622728 69781 487329 -23813 1249893 1229156 1128023
24206 1128023 2047823 -334088 -1918971 -76051 70662 -532060 -82364 -838681 535507
24197 535507 741775 -70462 -605464 -488854 -358452 -207194 -257915 -266157 -682981 8369
24187 8369 332122 -20138 933619 861836 1734834 1097893 806072 530849 1144498 1337445
24177 1337445 730935 -362860 -717482 -132882 -626839 -564761 -1352070 -949748 -559295
24168 -559295 349789 293219 873772 1406810 1021649 405139 438724 1915644 2770244 344425
24158 344425 -167796 -336360 -475607 -592001 -952622 -396022 -932538 -1870692 -986334 -243220
24148 -243220 361072 1078439 382220 -34870 338242 522219 -398223 -219598 1083850
24139 1083850 1468463 657113 -1400789 -1399999 115257 560006 151259 -864081 -416878
24130 -416878 -666284 -423444 2810233 3758874 2410236 -383506 -1194087 -600054 956975
24121 956975 1153146 1852499 2099074 1372854 600961 635562 -21195 -599441 1587092 3152099
24111 3152099 1258873 1400078 2913563 2812048 2487232 1847589 -250031 -232102 480084
24102 480084 -615695 -505758 -1451733 -1417103 -850960 162148 1582300 1153629 336322
24093 336322 -374672 -1284951 -1545757 -690298 1598954 1101955 1487618 1618594 1779802
24084 1779802 1559705 1960616 682847 651127 2521523 1379004 402484 -781302 -770215
24075 -770215 344654 415464 350213 -927427 -44727 1441918 285755 -632884 206726
24066 206726 624269 714832 1166228 1716327 2336524 2228459 674095 -668435 -2098615
24057 -2098615 -1586702 -1287024 -376554 339368 387582 1035751 -303818 512761 -320655
24048 -320655 -869318 491742 94609 -2346176 -2176514 -1695415 -268806 319577 -786175
24039 -786175 -461254 -505098 -769446 -1581422 -1447924 -595740 484295 -646696 -1025388
24030 -1025388 44263 4723 -39235 1748997 1046509 591655 -443236 -563446 434329
24021 434329 -548907 -800300 -296153 334991 262903 251832 432122 -1965406 -2189492 -805121
24011 -805121 -1014505 1304700 3210513 2035088 -30594 -1587974 -2231122 -3304802 -2905935
24002 -2905935 -1403424 -1572500 -309569 -169400 -1811129 -3771269 -4088559 -3420403 -994854
23993 -994854 41714 -727288 -326748 -84085 -771935 -988801 575263 1318985 1518650
23984 1518650 2009548 1411613 778449 282412 1341725 1502730 -123758 -1399676 -481295
23975 -481295 -778847 -705429 691786 2425359 2016468 1241803 1149424 1515582 1552862 1778291
23965 1778291 313428 401116 651678 194489 978103 1002711 1044495 632311 -95702 1062817
23955 1062817 959859 -37347 -614810 -530620 576104 -380846 -780184 -659160 616517
23946 616517 798634 403478 331102 548846 -133187 231637 -756777 -1691470 -1141307 -525972
23936 -525972 267728 582283 319587 1469261 2469251 384862 -240552 -1432341 -1097947
23927 -1097947 -1099088 -183310 495090 653102 -1378685 -939341 -997005 -1026463 1257994 2541224
23917 2541224 1506810 2048316 787029 72294 770252 -908422 -1376097 -535903 1167157
23908 1167157 -981681 -1332680 -1312537 79364 -644086 -1894438 -1861383 -93110 64329
23899 64329 -632563 1284070 1136198 -1069742 -729624 361471 -1924288 -1675934 1036128
23890 1036128 264266 161320 -160493 -497787 -653926 372874 -821978 -1772793 -312297
23881 -312297 -202828 43502 -9769 65738 -94636 -907387 -2051623 -364357 -1057293 -1295585
23871 -1295585 627043 3069102 3778348 2217639 1119170 1173839 1172214 1015257 927481
23862 927481 -1649472 -1398516 -607395 82989 971237 -625888 -1750094 -1947840 -1179713
23853 -1179713 -1394327 -1258577 -461311 397919 -1130295 -2332930 -349530 127828 -1172057
23844 -1172057 -1105397 796896 1628262 1309142 1049801 1699619 1171480 -1042215 659708
23835 659708 1473414 1591277 330780 1620245 4420341 2863387 2428314 3704140 1992314
23826 1992314 982805 1470990 966888 -152209 -718575 -1102878 359052 934735 816267
23817 816267 838473 201919 316946 1177933 163821 -388496 -29477 -847901 -425666 1507539
23807 1507539 2973906 2020317 3851306 3527913 3315096 2009381 1104296 665939 421253
23798 421253 217234 -548533 -752787 626654 316129 201249 -485527 -1014255 -495722
23789 -495722 69103 -1229956 -1003292 880067 928525 886620 1233694 1304693 2315715 3049614
23779 3049614 2729841 2043675 1752796 1065701 1870060 2133358 1334583 2708727 1542946
23770 1542946 1055278 363565 -183443 -351035 409370 1911948 2500881 2364413 1691097
23761 1691097 88953 214946 1316583 787880 1556439 1668960 1347032 2248436 1023605
23752 1023605 1614285 1299450 1088803 34823 -111723 423168 492087 313384 -1028796
23743 -1028796 -562863 597942 1399456 494753 -275167 -1386059 -2144386 -990983 -493061
23734 -493061 1247818 1465264 737454 1127142 321991 167839 811445 733762 39211 -880142
23724 -880142 -584670 1321847 987576 2087504 2247217 212163 471585 1402747 510533
23715 510533 549850 816343 762587 1497583 991359 427780 -452871 -921945 -1044674 -1097455
23705 -1097455 -1239592 -664311 534752 1290647 1394997 2681210 2434859 617786 1373026
23696 1373026 430102 590273 1943828 689650 886171 1199163 1498337 1129959 -809477
23687 -809477 -1533265 -1955833 -1108656 -126787 -197862 785084 647512 889194 -543622 -1948345
23677 -1948345 -2148101 -204823 -975053 -862339 -840849 -134719 1115951 1710380 2267052
23668 2267052 1513327 447523 -491220 921388 60982 -7769 26412 946996 1662463
23659 1662463 1176693 666789 262523 1399212 2172381 1300490 1328545 565895 -64057
23650 -64057 988876 1429887 -49416 417044 795660 1559302 1602089 -3272 -1020001
23641 -1020001 245448 141133 -1719023 -958077 -145022 877131 3891245 3032914 2230545
23632 2230545 2340121 627807 237403 575750 -779964 202433 -502903 -1192895 -262054
23623 -262054 706249 140352 -550428 -770753 -1279525 -1186911 -411434 1512089 1472050 1850583
23613 1850583 2711852 1788419 824943 -117895 279145 547917 2415304 2630953 -1059972
23604 -1059972 -785058 -1495952 -578044 457335 -147553 -1462689 195310 2106108 768424
23595 768424 -124388 -113398 -1278513 -1041704 79990 -68707 496059 1092059 1303423
23586 1303423 2045440 84216 568757 485534 1216624 2982772 1697672 444111 2449821
23577 2449821 1146119 189015 1400945 1334710 1593132 1786363 839008 -181947 -1435260
23568 -1435260 -1400523 -138733 -311981 -1357531 -359156 -492507 -245745 1086287 70041
23559 70041 -501257 -1214269 -509464 -465450 -380785 193055 469161 711283 1847354 2207579
23549 2207579 1587276 1374258 524968 -738249 -208818 486071 -844118 -2015408 -1673635
23540 -1673635 -1349528 -1173097 -1723859 -728089 1001963 1101615 537520 -119273 2215067
23531 2215067 1479816 118580 419750 -1291371 -2165465 -1075845 -637872 -417726 -1027080
23522 -1027080 -1732293 -804686 527219 2534476 1712028 -1272920 -294223 868762 1691278
23513 1691278 2637779 2226740 1627998 498297 774889 103252 472561 1665330 1251239
23504 1251239 -493454 -840360 267354 574255 -310367 749007 815350 869234 2397327
23495 2397327 1042467 -231073 720725 623901 276462 798387 1314719 770181 953563
23486 953563 1867604 2401077 2354420 -46559 407338 477322 908726 361581 1392863 1083335
23476 1083335 1557728 1551826 2685559 4310510 2413201 1226446 1325601 566945 105929
23467 105929 1501109 1185036 1599758 2401565 1257925 843429 1379276 1024552 1482840
23458 1482840 2497625 3255696 2273603 2262394 647662 1912230 1067612 216412 404326
23449 404326 1396030 1324891 457661 447474 512688 -150137 -337009 -513637 -123035 216562
23439 216562 700413 952650 2032130 1575566 -101967 -331785 622394 -1238731 -897422
23430 -897422 -391992 162876 -1803958 -2287653 -1367177 -1224787 -1096361 1023528 2742790
23421 2742790 1524685 -212685 1114671 2322539 480758 -468797 -580437 -588076 -1657460
23412 -1657460 -1153523 193155 894355 1528491 663726 1212480 1335063 224264 310903
23403 310903 246562 355856 -113847 -751422 1330276 2316527 3268897 4430358 2475439
23394 2475439 1450218 1170207 940832 788478 259213 121589 37664 -825939 -1633297
23385 -1633297 -1617117 -1403816 -1985384 -607691 578481 1105676 1959025 1556544 1959516
23376 1959516 891417 1439026 860064 1493179 2309364 1899685 503845 139239 1325210
23367 1325210 2107744 1898906 -24884 34792 294434 751751 -87824 785564 2271897
23358 2271897 3280228 3500083 1832966 -668418 290723 1658732 1418144 1171224 3079868
23349 3079868 3215345 1327497 1143441 2111297 1964195 556361 681833 860382 1970301
23340 1970301 1632721 1137007 656041 1724841 615025 -1937044 -1681962 -407025 1289817
23331 1289817 2354135 1067129 434424 -573154 -922627 -1802776 -1255465 -1766442 -2844946
23322 -2844946 -1747141 577448 1320161 735514 222836 619012 1570309 2317373 1176266
23313 1176266 137352 770438 1397200 -578140 -1118741 223595 1667781 568701 -26849
23304 -26849 -1012524 -1327213 -1710277 -614093 714659 670214 716408 774109 688232 578580
23294 578580 1145126 2093058 233339 -214934 614444 1050804 2132494 2016709 1591655
23285 1591655 1043119 1057895 131111 585746 1202067 51351 -699560 1500398 1761504
23276 1761504 1254721 2625776 879309 -473131 -957013 -1259278 -192522 -433175 -1611216
23267 -1611216 -1298568 -809164 231360 137750 -904071 96782 536800 1255589 778371
23258 778371 403596 382338 639632 -393934 -2153720 -2434762 148569 -171192 -147158
23249 -147158 -91144 -741470 -852064 -306580 -175296 230946 -521608 512851 2207921
23240 2207921 2515886 1456128 281042 1085278 1460232 231013 635435 1613504 1926816
23231 1926816 1645664 775035 -527288 261037 1346403 1392602 417223 421227 -403484 -1209298
23221 -1209298 -362212 292032 227865 -408782 -815153 -573624 -1234873 -617027 507317
23212 507317 12634 -26949 -761271 -953086 222128 -898034 -593567 475058 875182
23203 875182 700916 487308 954237 382497 889596 2303251 1296312 2042471 1261450
23194 1261450 138093 380193 1033214 -294041 -633657 595435 -366570 -684907 293983
23185 293983 1285283 233735 -164756 1999972 4417412 2390305 783604 1280548 1117775
23176 1117775 182059 -504009 -1800226 -1123369 527723 1351266 1746680 3154681 2662419
23167 2662419 2787493 2212254 1496082 1604761 1293390 1547103 1807395 1859646 888430 1563471
23157 1563471 638925 741758 1602372 447503 417952 -266517 344067 1542978 1851136
23148 1851136 425542 -170314 -861310 -290653 319344 1988175 2077271 1230091 664765
23139 664765 -489098 -524839 -326227 -402234 -758306 -422084 -129072 -343553 -530581 -844645
23129 -844645 -114924 2049915 155721 624953 1160803 -942554 -436315 310769 541531
23120 541531 131412 -109718 442183 994044 64550 -1059747 668768 133844 178797
23111 178797 -394759 -387550 974227 834784 822798 1091419 570153 -826861 369000 878343
23101 878343 1129354 537916 1159011 1181518 842891 594232 61066 -1233304 466647
23092 466647 1049382 1263336 2833854 2289662 1970192 2415765 1903039 677990 411782
23083 411782 205093 -860829 -25068 -513363 219228 2499870 2185111 1370585 273441
23074 273441 -385086 250230 213689 1341625 1114146 -286471 -503512 -1044950 -1955048
23065 -1955048 -859929 -535245 371139 449682 944563 1749473 1888545 1214561 1077673
23056 1077673 1683180 833718 1761101 2170791 2629251 2583380 720813 -99991 -270913
23047 -270913 806899 1763713 1457816 697115 -168117 429080 815687 1219652 2252811
23038 2252811 1013752 2043342 2108500 938524 1972550 598679 -102346 -1192955 254894
23029 254894 1232982 2601113 1473021 1419288 2631235 911558 -731491 1384054 1737086
23020 1737086 1368698 2301544 1927487 -939817 318221 2167734 1878603 2369465 1367313
23011 1367313 -545337 -1132318 140372 159296 -484641 -480305 1082695 1353101 657626
23002 657626 -395745 -100978 166968 -231675 -74050 861329 587263 1417816 1781196
22993 1781196 2087439 2044401 1183200 870106 -454459 1015732 2480426 1597950 844088
22984 844088 1904622 2466824 869981 -336341 588295 2114952 1776951 -101731 498251
22975 498251 1523395 2476813 2601520 983717 702760 1446475 3914473 3710544 4046220
22966 4046220 2706397 1699101 953889 -1175789 -1501574 182133 1513789 1578478 795121
22957 795121 148356 -270100 -850980 -155496 -96933 -390855 -216986 -467674 1633220 2361865
22947 2361865 1758629 594043 -53786 -130932 -1039049 201806 513591 2367063 1628993
22938 1628993 1765042 278068 -233345 -1279114 -516965 -797421 -5299 1469770 2012294
22929 2012294 1435420 1932442 1364355 -968890 -1806400 -2365121 707033 2389547 2096887
22920 2096887 1839695 2521058 2829288 1170558 1711597 1381075 308314 -329679 339698
22911 339698 1294661 1490398 701455 846841 2120310 1454898 1228165 733240 121766
22902 121766 526253 1777742 294453 302628 1341994 2222101 921859 237341 1118637
22893 1118637 862827 -925714 -208033 -346125 -46042 1867845 2003214 -473332 -783475
22884 -783475 978774 1033605 1329073 -315904 425566 -715880 -668038 130453 498470
22875 498470 222115 192241 372063 -887186 -571851 82683 -152392 -509731 -455877 -101796
22865 -101796 623336 1228682 1336194 1210966 -186082 898093 2206614 2077758 9922
22856 9922 2207680 3145294 1075315 -1112784 -1844842 27399 287389 -264005 274762
22847 274762 -889427 -326269 -258824 -1683491 -966607 -238799 -220722 616772 1642712
22838 1642712 1587999 1640111 925877 497920 1916212 1205369 851455 179825 747196 1501621
22828 1501621 1611743 1886207 324097 -210456 226603 727790 599957 1473832 2138407
22819 2138407 1776031 1098588 1321215 1110608 1882770 3139731 2650446 1509853 798166
22810 798166 969575 2390097 2503305 2451026 2056218 1192086 907809 1387401 40583
22801 40583 517049 2090548 2293065 2475621 3614989 2969382 1290688 1395723 828580
22792 828580 265748 -732087 -1039730 -63275 2206191 1028672 2184 829298 682555
22783 682555 812375 1848234 2907111 887690 -295522 411498 -1026304 -1266822 -1382824
22774 -1382824 -1232835 -1230096 -772847 206726 349138 964851 816875 258723 -1419837 291899
22764 291899 2054230 998684 197315 -942380 415282 480937 940572 1622651 1257840
22755 1257840 -492729 -452506 -878598 -1427698 -1859125 -1319489 638960 387090 946035
22746 946035 1198665 -542799 144394 1833035 3114398 3554049 3152430 2092848 -439727
22737 -439727 -1155036 -222758 426890 1330159 74688 -476446 -555148 -37998 320380 297006
22727 297006 235464 350569 1177218 1440425 1477630 871279 2442938 1541700 600922 1590306
22717 1590306 -6529 -108883 1268181 1848639 835683 551396 1336072 2238569 1924865
22708 1924865 781164 527270 1183122 1805264 1298444 2016421 659599 -1389126 -1239017
22699 -1239017 -107332 1085020 1720344 1022318 787444 1255434 2590678 1710975 684881
22690 684881 1651565 3060210 3259106 4153853 4085455 3031047 3280290 2653697 2001917
22681 2001917 1488507 72955 27425 1174939 601615 186518 1289652 1075144 136998
22672 136998 -2136938 -864901 1362748 1468016 1247428 930795 -100264 340198 54760
22663 54760 -623493 -553152 252003 1552147 1244162 -1162594 -2370502 -1897026 -361711
22654 -361711 1258063 1800812 -746859 843950 1060473 170522 -683684 -63075 36704
22645 36704 817767 1141976 234770 526948 -559255 -1034230 -1162550 -53730 2144730
22636 2144730 2894898 1014678 -469587 927784 1233197 627138 1246095 1370019 586965
22627 586965 -191662 33083 -880352 -1157695 105047 453604 312406 -532992 -15903
22618 -15903 1836281 1197306 -44168 779753 1605627 898757 1102213 1999823 1124214
22609 1124214 1075500 1106663 1757404 1859745 1249114 1352166 996490 2179022 201972
22600 201972 249130 765725 1722647 1477119 1304036 772896 968673 1037050 1076824 2186806
22590 2186806 1280263 1556284 2072628 762042 583968 1178530 1855717 2637890 4054745
22581 4054745 2930885 1811606 1740056 741955 481558 -299047 704767 1762081 1146886
22572 1146886 1041502 1184155 2813586 3098963 1856152 878610 950487 2124686 2090934
22563 2090934 1576810 1448155 1748256 2028759 2675529 3011200 965438 910606 1643045
22554 1643045 946260 735231 171055 1582786 1975861 1909768 371053 409742 1080773
22545 1080773 512881 1719511 2747240 2117228 1400306 1566282 614791 862255 -78976
22536 -78976 -571631 252359 2261848 1245678 159524 885074 777563 330737 776017
22527 776017 817341 1911529 1260045 2035466 1208403 1894667 826494 1902177 2337879
22518 2337879 273089 42119 899629 220569 633541 502308 -442094 -103667 371963
22509 371963 1696295 1433099 88629 661171 1388900 1308237 715466 1826148 1367521
22500 1367521 625985 63038 816362 919368 -691226 864216 589562 1061921 1326179
22491 1326179 88289 98008 869862 -512963 -1661941 -1846012 -1483607 -3072987 -3492778
22482 -3492778 -2231491 -1047183 -350969 373712 -743154 47804 -60567 -739377 -791756
22473 -791756 446302 1042581 1309431 1404325 1229838 2086263 1874545 255024 -885936
22464 -885936 906091 1974521 2052622 1437530 -837479 285328 1376433 1250159 1535739
22455 1535739 29725 -663064 952300 -423447 -861075 -1024992 -822145 966312 724586
22446 724586 -269766 -735955 -1293277 -684389 -672331 1885786 2021668 2122820 1367042 606573
22436 606573 491618 -1400088 -879975 -620267 419567 881198 981799 426940 903302
22427 903302 461134 716259 144691 -52745 -332217 -92537 -696033 -1396475 -1315967 -2523367
$$ [...]
##END NTUPLES=NMR SPECTRUM
##END=
