##TITLE=19F_CG-1101
 DMSO. 124 sc
 4.4.2019
##JCAMPDX= 6.0         $$ Bruker NMR JCAMP-DX V2.0
##DATA TYPE= NMR SPECTRUM
##DATA CLASS= NTUPLES
##ORIGIN= UXNMR, Bruker Analytische Messtechnik GmbH
##OWNER= root
$$ XWIN-NMR		Version 3.5
$$ Thu Apr  4 14:28:57 2019 Russian Standard Time (UT+4h)  she@DPX200
##.OBSERVE FREQUENCY= 188.290927
##.OBSERVE NUCLEUS= ^19F
##.ACQUISITION MODE= SIMULTANEOUS
##.ACQUISITION SCHEME= undefined
##.AVERAGES= 24
##.DIGITISER RES= 16
##SPECTROMETER/DATA SYSTEM= spect
##.PULSE SEQUENCE= zg
##.SOLVENT NAME= D2O
##.SHIFT REFERENCE= (INTERNAL, D2O, 0, 101.251)
##AUDIT TRAIL= $$ (NUMBER, WHEN, WHO, WHERE, WHAT)
$$ ##TITLE= Audit trail, XWIN-NMR		Version 3.5
$$ ##JCAMPDX= 5.01
$$ ##ORIGIN= Bruker BioSpin GmbH
$$ ##OWNER= she
$$ F:/spectra/data/she/nmr/f19/1/pdata/1/auditp.txt
$$ ##AUDIT TRAIL=  $$ (NUMBER, WHEN, WHO, WHERE, WHAT)
(   1,<2019-04-04 14:27:55.21 +0400>,<she>,<DPX200>,
      <created by zg, POWCHK disabled, PULCHK disabled
       configuration hash MD5:
       00 E9 B6 7A A2 85 ED C7 34 08 36 98 17 FE 4E 26
       data hash MD5: 64K
       4D B6 93 4D 9D BD E0 CF 74 FA CA C6 EC FA 4D 3D>)
(   2,<2019-04-04 14:27:58.71 +0400>,<she>,<DPX200>,
      <Start of raw data processing
       efp BC_mod = 2 LB = 1 FT_mod = 6 PKNL = 1 PHC0 = 1419.613 PHC1 = 184.5559 SI = 64K 
       data hash MD5: 64K
       F2 7A 2F D8 2C 66 49 93 A5 33 97 22 4A 5E B9 F8>)
(   3,<2019-04-04 14:28:19.29 +0400>,<she>,<DPX200>,
      <pk PHC0 = -14.02968 PHC1 = 0 
       data hash MD5: 64K
       B6 DD 2E 5D 6E BA D8 F5 39 4E 27 E6 71 DA B4 87>)
(   4,<2019-04-04 14:28:22.34 +0400>,<she>,<DPX200>,
      <abs ABSG = 5 
       data hash MD5: 64K
       96 0C DB 31 B0 BA 02 8C 20 0F BE 5F 2A 64 A9 59>)
(   5,<2019-04-04 14:28:34.18 +0400>,<she>,<DPX200>,
      <abs ABSG = 5 
       data hash MD5: 64K
       72 77 AD 43 8C 94 DD BC CD F1 2F 13 FE 5D 8D 94>)
$$ ##END=
$$ 
$$ hash MD5
$$ 4B 42 0B 8D 53 45 91 08 89 21 A9 B3 2C DD 64 5B
##$RELAX= 
##$RELAX= 
##$RELAX= 
##$RELAX= 
##$RELAX= 
##$RELAX= 
##$RELAX= 
##$RELAX= 
$$ Bruker specific parameters
$$ --------------------------
##$DU= <F:/spectra>
##$EXPNO= 1
##$NAME= <f19>
##$PROCNO= 1
##$TYPE= <nmr>
##$USER= <she>
##$AMP= (0..31)
100 100 100 100 100 100 100 100 100 100 100 100 100 100 100 100 100 100 
100 100 100 100 100 100 100 100 100 100 100 100 100 100 
##$AQSEQ= 0
##$AQ_mod= 1
##$AUNM= <au_zg>
##$AUTOPOS= <>
##$BF1= 188.310428
##$BF2= 200.13
##$BF3= 200.13
##$BF4= 200.13
##$BF5= 200.13
##$BF6= 200.13
##$BF7= 200.13
##$BF8= 200.13
##$BYTORDA= 1
##$CFDGTYP= 0
##$CFRGTYP= 5
##$CHEMSTR= <none>
##$CNST= (0..31)
1 1 145 1 1 1 1 1 1 1 1 1 1 1 1 1 1 1 1 1 1 1 1 1 1 1 1 1 1 1 1 1 
##$CPDPRG= <>
##$CPDPRG1= <>
##$CPDPRG2= <>
##$CPDPRG3= <>
##$CPDPRG4= <mlev>
##$CPDPRG5= <mlev>
##$CPDPRG6= <mlev>
##$CPDPRG7= <mlev>
##$CPDPRG8= <mlev>
##$CPDPRGB= <>
##$CPDPRGT= <>
##$D= (0..31)
0 1.3 0 0 0 0 0 0 0 0 0 0 0.25 0 0 0 0 0 0 0 0 0 0 0 0 0 0 0 0 0 0 0 
##$DATE= 1554373674
##$DBL= (0..7)
$$ [...]
##$SUBNAM3= <"">
##$SUBNAM4= <"">
##$SUBNAM5= <"">
##$SUBNAM6= <"">
##$SUBNAM7= <"">
##$SUBNAM8= <"">
##$SUBNAM9= <"">
##$SW= 251.107818259711
##$SWIBOX= (0..15)
0 1 0 0 0 0 0 0 0 0 0 0 0 0 0 0 
##$SW_h= 47281.3238770686
##$TD= 65536
##$TD0= 1
##$TE= 0
##$TE2= 300
##$TE3= 300
##$TEG= 300
##$TL= (0..7)
0 120 53 12 22 120 120 120 
##$TP= (0..7)
150 150 150 150 150 150 150 150 
##$TP07= 0
##$TPNAME0= <>
##$TPNAME1= <>
##$TPNAME2= <>
##$TPNAME3= <>
##$TPNAME4= <>
##$TPNAME5= <>
##$TPNAME6= <>
##$TPNAME7= <>
##$TPOAL= (0..7)
0.5 0.5 0.5 0.5 0.5 0.5 0.5 0.5 
##$TPOFFS= (0..7)
0 0 0 0 0 0 0 0 
##$TUNHIN= 0
##$TUNHOUT= 0
##$TUNXOUT= 0
##$USERA1= <user>
##$USERA2= <user>
##$USERA3= <user>
##$USERA4= <user>
##$USERA5= <user>
##$V9= 5
##$VALIST= <valist>
##$VCLIST= <CCCCCCCCCCCCCCC>
##$VD= 0
##$VDLIST= <DDDDDDDDDDDDDDD>
##$VPLIST= <PPPPPPPPPPPPPPP>
##$VTLIST= <TTTTTTTTTTTTTTT>
##$WBST= 1024
##$WBSW= 4
##$XGAIN= (0..3)
0 0 0 0 
##$XL= 0
##$YL= 0
##$YMAX_a= 28539
##$YMIN_a= -19461
##$ZGOPTNS= <>
##$ZL1= 120
##$ZL2= 120
##$ZL3= 120
##$ZL4= 120
##$ABSF1= 101.2514
##$ABSF2= -149.8503
##$ABSG= 5
##$ABSL= 3
##$ALPHA= 0
##$AQORDER= 0
##$ASSFAC= 0
##$ASSFACI= 0
##$ASSFACX= 0
##$ASSWID= 0
##$AUNMP= <proc_1d>
##$AZFE= 0.1
##$AZFW= 5
##$BCFW= 0
##$BC_mod= 2
##$BYTORDP= 0
##$COROFFS= 0
##$CY= -3
##$DATMOD= 1
##$DC= 0
##$DFILT= <>
##$DTYPP= 0
##$F1P= 0
##$F2P= 0
##$FCOR= 0.5
##$FTSIZE= 65536
##$FT_mod= 6
##$GAMMA= 0
##$GB= 0
##$INTBC= 1
##$INTSCL= 8.653935e-10
##$ISEN= 128
##$LB= 1
##$LEV0= 0
##$LPBIN= 0
##$MAXI= 10000
##$MC2= 0
##$MEAN= 0
##$ME_mod= 0
##$MI= 0.4277144
##$NCOEF= 0
##$NC_proc= -3
##$NLEV= 6
##$NOISF1= -61.99997
##$NOISF2= -62.99997
##$NSP= 0
##$NTH_PI= 0
##$NZP= 0
##$OFFSET= 101.2514
##$PC= 1
##$PHC0= 1405.583
##$PHC1= 184.5559
##$PH_mod= 1
##$PKNL= yes
##$PPARMOD= 0
##$PSCAL= 0
##$PSIGN= 0
##$REVERSE= no
##$SF= 188.29550247311
##$SI= 65536
##$SIGF1= -61
##$SIGF2= -65
##$SINO= 3.502647
##$SIOLD= 65536
##$SREGLST= <1H.CDCl3>
##$SSB= 0
##$STSI= 65536
##$STSR= 0
##$SW_p= 47281.3238770685
##$SYMM= 0
##$S_DEV= 0
##$TDeff= 65536
##$TDoff= 0
##$TI= <>
##$TILT= no
##$TM1= 0
##$TM2= 0
##$TOPLEV= 0
##$USERP1= <user>
##$USERP2= <user>
##$USERP3= <user>
##$USERP4= <user>
##$USERP5= <user>
##$WDW= 1
##$XDIM= 65536
##$YMAX_p= 531287930
##$YMIN_p= -712249
$$ End of Bruker specific parameters
$$ ---------------------------------
##NTUPLES= NMR SPECTRUM
##VAR_NAME=  FREQUENCY,     SPECTRUM/REAL,   SPECTRUM/IMAG
##SYMBOL=    X,             R,               I
##VAR_TYPE=  INDEPENDENT,   DEPENDENT,       DEPENDENT
##VAR_FORM=  AFFN,          ASDF,            ASDF
##VAR_DIM=   65536,         65536,           65536
##UNITS=     HZ,            ARBITRARY UNITS, ARBITRARY UNITS
##FACTOR=    0.721466756344984, 1,           1
##FIRST=     19065.1839562469, 0,            0
##LAST=      -28216.1399208216, 0,           0
##MIN=       -28216.1399208216, -712249,     0
##MAX=       19065.1839562469, 531287930,    0
$$ Real data points
##PAGE= N=1
##DATA TABLE= (X++(R..R)), XYDATA
$$ [...]
50552 -159639 -184891 -60901 60961 -45300 -47309 17241 -87087 -125317 -38181 77273 85923
50541 85923 -12147 -84949 -84809 54686 -57512 -6241 -47233 -217677 -269624 -290872 -349582
50530 -349582 -332498 -208144 -89167 -165677 -138561 23288 76121 20450 -20630 73895 -39928
50519 -39928 -112739 -191523 -42060 -130765 12211 -50634 -193509 -101248 -186114 -221597 -116770
50508 -116770 56667 -119164 -226964 -216533 -197786 -205997 -84387 -158074 23246 -39899 -40210
50497 -40210 -7339 -121016 -29034 27492 81291 133906 223858 180553 171762 16993 54135
50486 54135 17712 -16403 -56921 -148155 -209961 -209993 -172007 -102597 122487 -57591 -135669 -107806
50474 -107806 73155 -31402 -189953 53347 130359 118926 213856 295566 27059 -157177
50464 -157177 -86580 -39117 -44836 -106478 -96186 36907 -1609 -137665 -217932 -264527 -166077
50453 -166077 -66074 -11118 16622 61634 163847 167247 49572 -71546 675 -188714 -229717
50442 -229717 -213103 -150621 -129687 64195 173628 31662 -30701 -76074 -163127 94374 219398
50431 219398 107334 141787 48335 70516 -87149 -112332 -98538 -63837 -150111 -34943 107682
50420 107682 186527 61317 -59295 113348 16154 -29507 313 -133818 -67305 -12978 51862
50409 51862 -25244 -61440 -176919 -48083 21696 -47338 -88673 59090 216296 92694 -223063
50398 -223063 -297470 -4126 137094 1063 -1630 106791 109816 44813 -142929 -209035 -29114
50387 -29114 -53991 -62390 18267 -17504 -30413 203790 147493 45054 122492 192950 -8916
50376 -8916 -93811 -28382 -34340 -103173 -44197 26450 54506 113399 197575 279036 166734 56565
50364 56565 -799 51283 99208 186687 214861 29321 12092 131702 136704 -52556 -119591
50353 -119591 -213129 -131543 -23684 -69971 162516 311950 206786 88324 196091 146782
50343 146782 55724 75679 105792 -48158 -78137 -66124 -11623 43931 62641 115025 -77250
50332 -77250 -203282 17308 97331 -86079 -26156 67538 58506 -96928 -125709 -87939 50260
50321 50260 67314 159902 100042 -74134 7241 -106398 -257170 -196771 -128314 56414 -41745
50310 -41745 -241312 -143599 -1333 92236 171861 231549 248812 83080 94898 1480 -14737
50299 -14737 -146952 -239291 -160692 -230875 -178531 -98579 -95069 -174830 -134328 -101718 -121657 -19501
50287 -19501 55862 155675 80791 51417 47804 57693 101985 60143 87906 24370 -5934 -66620
50275 -66620 -12553 101382 77897 -43797 -65365 -130355 -194088 -247454 -354749 -264987 42433
50264 42433 -38269 29456 -6179 -146148 -230678 -248495 -169714 -31585 -37007 -38283 -221259
50253 -221259 -137992 -32814 -167959 -97266 -50635 -200949 -218571 -168030 -2191 40431 90677
50242 90677 103137 204502 168239 -417 84073 -17321 -49239 -57573 -114503 222 -52733
50231 -52733 -26580 -114460 -86121 112301 161472 45052 9043 -114057 -274539 -296228 -120537
50220 -120537 166059 92672 40196 5786 158071 168865 261666 243727 57849 97012 72996
50209 72996 -83641 49277 7626 -37840 -76470 -152017 -194226 -302509 -83145 -189190 -268151
50198 -268151 -223916 -247973 -139221 -259694 -178830 -80768 -178634 -273952 -320552 -173794 -101092
50187 -101092 -76776 -205821 -204223 -75278 -107823 -135135 -49070 127779 113514 118006 10890
50176 10890 -67294 92107 144114 55269 -56612 131541 21631 -56190 80256 144533 50306
50165 50306 -65125 -24416 58214 -71660 -180872 -219817 52751 83033 85965 59762 -58365
50154 -58365 -90455 -142565 -293543 -154451 86598 45749 -40547 -16892 -62877 -114421 -205402
50143 -205402 -207874 -67348 -37916 107004 104496 14032 193648 265606 29877 -134577 -159857
50132 -159857 -102082 140264 230470 153765 60929 32765 106709 188721 179517 42220 -175344
50121 -175344 -124817 -104025 115775 151093 117422 -28148 -162052 -134508 59128 -138025
50111 -138025 -155458 11001 100646 -95836 32638 84956 1532 -68760 24349 99603 73460
50100 73460 9995 -97935 -91159 4952 183462 117925 19460 86151 25332 85914 120015
50089 120015 32313 103762 49779 250975 205621 -27275 -39958 -112858 135359 60008 -76268
50078 -76268 -99524 -105926 -221241 -39144 111777 123236 70030 -121663 -181381 146 -72085
50067 -72085 -280592 -204047 -146830 -194861 -298331 -222289 -241016 -261313 -142162 -13779 51135
50056 51135 38185 -116401 -253413 -225878 -118489 -40129 114283 263813 190661 23112
50046 23112 97399 173463 276813 178718 99201 187599 136346 159295 101037 135201 14878
50035 14878 5078 -87906 -55449 110616 -72567 -134415 71200 237710 50639 -175722 49164
50024 49164 -30736 -150349 -10971 79016 171723 154799 25820 -89122 -202038 -286763 -134446
50013 -134446 17723 90954 36576 -12463 -91385 -83413 -6970 21256 -95989 -175095 -265526
50002 -265526 -153577 7774 24785 -20017 -84005 -80008 -103853 -1171 76897 28592 64498
49991 64498 -53509 -14672 -202427 -272010 -167875 16650 25952 -133361 -122147 -37 6417
49980 6417 28315 139035 241576 135887 -52282 -36602 -34043 1645 113670 42879 214588
49969 214588 223968 24094 -20804 32600 72751 138385 -44031 -124362 -204753 -216213 -215294 -313649
49957 -313649 -258837 -95215 18215 -39006 -114030 -16649 -37770 46738 -6282 -21564 -59548
49946 -59548 -139228 -258905 -204058 -158229 12740 32031 -80074 16229 118355 8653 -115637
49935 -115637 43245 18701 -19873 -39908 4791 9803 -21169 16438 100003 -7441 143924
49924 143924 -15580 -10279 -196875 -163563 -158282 -141956 -102104 -90744 -40832 111327 11917
49913 11917 -12560 207101 239319 -90060 -98469 -17108 -201584 -129632 -19950 176990 131334
49902 131334 97929 122298 58655 -141210 4959 -11049 40560 135415 48448 119324 32279
49891 32279 8467 -81173 -60195 -228 68824 121884 69902 7038 -50225 -99651 -77986 85709
49879 85709 -8190 8066 59222 -113794 -94358 73705 132982 97902 113638 260971 183487
49868 183487 50407 85274 -107486 -215696 -174873 -69716 3078 32281 -88981 -97975 161181
49857 161181 88982 -21176 -80601 -37159 -54560 -232369 -249599 -135634 -52572 -75695 -113423
49846 -113423 -174475 -49207 -10103 -25446 -14265 19677 143698 366219 355145 222591 140753
49835 140753 -63032 -176233 -157659 -142442 -173974 -283896 -79638 185 32835 -76402
49825 -76402 -97476 -107776 -86306 40691 214572 146471 -30655 112857 197254 258226 120802
49814 120802 -33762 -218461 -118516 -183133 -250840 -216087 -184787 -4949 124229 244633
49804 244633 237382 63732 -174870 -207996 -199443 -234470 -301600 -193701 139087 105364 36221
49793 36221 -3070 106488 52772 -16728 -106011 -240142 -354451 -343126 -239186 -288656 -31346
49782 -31346 136947 -54634 95120 230492 78341 -65509 -39794 25080 -105425 -24345
49772 -24345 -68648 -243692 16842 205960 34969 -14290 132206 131334 96598 136472 42709
49761 42709 -103465 -82967 -96351 86718 63382 -95082 71840 149875 36209 63378 38241
49750 38241 80454 221447 193724 237592 105774 3901 -128590 -9629 -14645 121929 182689
49739 182689 105889 95219 13281 -64008 24404 -62948 -32001 46070 65515 67691 95366 348327
49727 348327 263246 222825 222036 244084 88770 -143194 -283428 -294025 -271016 -243770 -88588
49716 -88588 -50385 -77073 -191947 -158773 -46218 -18684 -115424 -114135 -108916 3380 -63881
49705 -63881 -117794 -107969 -176806 122815 89668 176972 4584 -147825 -94966 4285 -64035
49694 -64035 40253 27520 95825 57877 117649 2949 -144552 -261830 -253162 -54471 -286300
49683 -286300 -297739 -211804 -183097 -139115 42677 204195 156253 51796 -3097 -179545 -182604
49672 -182604 -118602 12816 -149546 -167493 -89418 -7582 124808 -96560 -199132 -37263
49662 -37263 -110904 -20210 -55962 134102 162379 -20853 -80367 -67221 105696 388911 368492
49651 368492 239258 261153 163561 67440 -86005 -229348 -140589 -80041 -62896 -351624 -395522
49640 -395522 -144030 -69109 -1837 33200 -73178 -41013 -121220 27001 112365 57116 190884
49629 190884 20592 -188717 -56707 -65181 -59855 47671 81648 -391 -26497 -146833 -77191
49618 -77191 4479 -86650 -18512 28539 32144 -17352 -49790 9719 80706 85098 63331 37149
49606 37149 -144995 17841 10719 115304 107774 33142 86326 -173740 -162528 -77916 122791
49595 122791 87350 130465 247794 143612 88086 148825 -32395 -123937 -157682 -151845 -136462
49584 -136462 49471 -11292 -143069 72246 -208603 -281601 67738 84981 21983 -76695
49574 -76695 -64661 -92513 -118117 -100364 -143977 -97259 -4764 -152596 -74587 -65692 28218 167043
49562 167043 90415 64466 -26736 40652 -61062 90026 26005 -173168 -90404 70843 106301
49551 106301 -9313 -5338 21878 -3597 -38174 52253 -19505 -117661 -20891 214396 94554
49540 94554 61301 67877 107152 -110401 -176167 -65726 -51842 2133 -59933 -87414 27927
49529 27927 -17222 20027 24149 65325 144409 231803 171503 30818 -83218 -64412 -82187
49518 -82187 10947 -49476 -41549 7831 60685 -9993 189684 273209 141075 69393 -137845
49507 -137845 -143117 -194226 -102365 69400 -37904 -112490 -73247 -45079 -173980 -155057 -28462
49496 -28462 -13763 95436 146666 -95406 119500 141505 284882 283356 233879 164475 167609
49485 167609 32193 -37387 -77738 -77664 220980 -25282 -161576 -113056 126262 148216 186426
49474 186426 69564 25520 -67210 -142232 -80124 -145411 39442 -7597 9829 32227 -75307
49463 -75307 -88129 -96816 55019 73870 -4362 -17095 -100450 -98947 75760 266416 197962
49452 197962 3392 104422 110215 -90789 -247864 -254802 -96466 -133960 -73660 148801 122062
49441 122062 81966 -57687 -103012 91411 -62529 -211230 9776 -62283 20013 -32244
49431 -32244 -3490 86069 79531 61177 21420 -16310 50995 62988 73076 211568 327246
49420 327246 154317 40254 -93738 -45423 -60277 -108423 -178388 -85422 -104341 -84681 -36410
49409 -36410 83755 108727 54803 24411 80793 93354 69108 38047 72729 163690 -6323
49398 -6323 -6563 1237 -216415 -186304 -159728 -200756 116643 207890 151843 56249 63082 123657
49386 123657 47536 102264 151261 85768 30217 29402 111019 -35881 -16133 30649 179744
49375 179744 53048 89601 112497 64207 -9438 -174072 -307216 -179938 -34976 88633
49365 88633 12099 25388 -8231 -157793 -77603 1836 39814 129122 286299 196301 107752
49354 107752 26300 -137965 -32486 47681 131619 375176 287030 43853 -55180 98372
49344 98372 170275 -30722 65300 77909 85456 -98280 -186553 -47888 54742 30009 4729
49333 4729 40680 -25848 -96337 -61243 50452 -15986 197082 240820 136480 -31194 -108418
49322 -108418 -66000 -24503 35758 111785 180399 -82359 -25424 -27900 -44664 132317 46285
49311 46285 57081 78539 74101 120320 87639 179190 155357 231370 88873 58079 169562
49300 169562 60993 -158052 -190427 -77844 23416 119093 164689 211731 260355 130607
49290 130607 111050 -45012 -266728 -108308 5923 -99775 -241597 -7254 139191 -50297
49280 -50297 -81525 -166319 -28438 -23545 -32899 -143138 -70613 8733 -105446 -94480 -7414
49269 -7414 136534 11141 15984 -135144 -198487 -112578 -189513 -127622 -87880 30187 69586
49258 69586 286522 126970 -22199 163894 48933 -97488 74942 -70903 -176318 -6741
49248 -6741 48389 -29622 -106438 -136702 -109094 -80974 -151201 -135455 67491 84036 96960 -156478
49236 -156478 -300941 -197332 -2318 -1567 -138412 -245584 -110505 -34385 -21184 -19270 -79629
49225 -79629 74090 134153 202502 48429 -40212 34869 109202 75265 -85011 -56037 23779
49214 23779 -82944 -128289 41385 137152 191353 167130 -36876 -208154 -211843 -18394 142960
49203 142960 167928 71904 220694 159936 132814 83553 68292 62563 -11382 149540 190512
49192 190512 101396 -96161 -20945 39534 -18239 72152 132619 114498 12540 -77992 -17761
49181 -17761 -149623 -16449 16816 -150887 -231368 50185 196069 190021 100514 20943 75051
49170 75051 173931 69898 135944 114768 199906 -99572 -161177 -51434 -52202 -100124 -73581
49159 -73581 -93467 -86751 26555 -68783 -9692 75052 125693 48312 214048 249524 194955
49148 194955 -27429 -45157 -24480 223710 193262 10125 -98229 -70394 29641 -44688
49138 -44688 -163900 -13259 -15094 -13986 83677 -84289 -33412 140197 84230 55501 134901
49127 134901 240892 32177 -288704 -237977 2711 30353 34255 -10916 21445 -86600 -106887
49116 -106887 3870 -5821 -145675 60188 255829 87566 -104509 -133297 -80604 -2172
49106 -2172 -47257 14024 106264 34281 -91146 -89296 -144779 -206444 -96235 -84328 47481
49095 47481 28794 -133843 -172835 -62115 -110560 -40623 -8654 80795 82695 78546 -30978
49084 -30978 -83948 -6760 -63410 -135056 -178345 -72571 -147497 -227888 -246152 -125581 -129151
49073 -129151 -246588 -197060 -133788 -30900 -120180 -304774 -191740 -207545 -132830 -142213 -71250
49062 -71250 -132086 -80346 -123797 -175365 -82370 -189194 -141703 -113474 -102585 49590 158078
49051 158078 213518 170489 143128 21080 51535 54776 -99107 52886 -86478 -41200 188707
49040 188707 173243 273585 94093 -78391 92403 176315 56324 -128650 -89742 -2338
49030 -2338 -24629 -119237 -123129 -15819 -64566 -64649 33334 96669 -21796 -69631 -22599 113761
49018 113761 112857 160780 221325 166641 81980 208963 278760 280104 223014 -24724 -37090 18274
49006 18274 -89962 42693 181467 282266 240785 151503 -71333 -3146 -23145 -69542 -135581
48995 -135581 -166365 -125476 -14111 -88807 -171422 -28911 89025 142839 -101501 -191183 16033
48984 16033 62946 -33099 -198620 -204469 -105739 -112097 -97108 -101938 -56497 61572 -80581 18132
48972 18132 60584 59996 102376 -7395 158489 125070 125152 169081 97264 943 215452 121819
48960 121819 51812 74495 -6370 -111240 -125809 -50054 -72750 6463 -33111 -250004 -250379
48949 -250379 -21473 -109220 -150874 -209169 -278543 -102598 -25607 -55933 -82528 82746 74155
48938 74155 78733 224120 258977 -84833 -172734 -26835 -101302 -232729 -175560 -42596 -8856
48927 -8856 72266 125893 26757 -66627 -57868 141140 148379 24667 108971 88598 -109701 -172088
48915 -172088 -232645 -153607 -146790 -176841 -168416 -155985 -335467 -242285 -133892 -122226 -130255 -69970
48903 -69970 -179133 -169998 -73579 -54172 -19103 45417 232210 45408 -74436 -127451 -211702
48892 -211702 -153301 -65039 -70649 -114115 21679 138112 175014 -103873 -247195 -81311 14250
48881 14250 -55083 -163853 -237289 -45083 -35251 -173617 -45855 156577 23585 -106505
48871 -106505 -242119 -102116 -65194 -76466 -82893 -96484 -89606 103356 152367 -84018 -197023
48860 -197023 -147905 -139579 -56825 -242817 -186523 -1125 -187934 -281950 -204184 -170545 -250965
48849 -250965 -127943 -254393 -45392 298631 113247 93802 30937 70998 44161 -40875
48839 -40875 -1164 16133 70795 141608 194137 153743 222287 134223 88462 81840 -15752 -101892
48827 -101892 -57605 42827 180495 177606 68369 -159194 -85383 19864 -46277 -167567
48817 -167567 -109796 -98936 -216579 23928 99605 77960 44545 -60389 -6654 -47558 182873
48806 182873 255032 53572 92956 124289 242665 151314 -142328 -192205 -209327 26890 -114259
48795 -114259 -247449 -202532 -59583 56120 43044 -95100 -104650 -24753 -63040 47328 91353
48784 91353 223125 -14721 -51137 -1732 -96142 -125037 -24994 -38555 -65411 -129946 -141388
48773 -141388 -94318 -81736 44192 -47430 34926 72417 -127538 -231238 -158525 -193137 -212313
48762 -212313 14463 10997 -174975 -210417 -114586 -105699 -40822 -44861 -112220 -58599 -11089 -50662
48750 -50662 77607 35824 -49453 17551 -54606 258998 270497 57470 -15620 -138152 144563
48739 144563 186177 104433 257997 314957 263982 266104 194331 219443 124829 -32883 89425
48728 89425 98094 79345 -153974 -88459 6822 126993 144954 123046 168566 -106238 -6507
48717 -6507 190462 40244 -17952 -124419 -192560 -238558 -172103 -98912 -84181 -175370 -36251
48706 -36251 31390 -12622 8941 118316 70018 127232 116853 79487 136061 20092 -74138
48695 -74138 -23463 17055 -69107 -153033 -183949 46879 27214 -18956 15465 -71111 -185764
48684 -185764 -14224 85745 -16499 -48661 19889 96064 45787 -23544 -1226 104025 150527
48673 150527 160191 75928 -57393 -229800 -124267 -127710 -150958 -337888 -192285 -56738 67949
48662 67949 24418 128680 62141 91548 8673 -61716 -136364 -112196 -190633 -342318 -330610
48651 -330610 -27582 148033 115504 105498 21556 -81924 -85320 16933 -130794 20194
48641 20194 -1752 88627 -31496 -88694 2457 91604 -6979 -55775 -41012 156760 190252
48630 190252 -83471 -75464 67332 104687 84328 9509 -92346 10905 66392 11400 17867
48619 17867 -37912 82666 62643 86557 16714 -123691 -7590 39085 74531 -64415 -46994
48608 -46994 -21764 -52926 24109 67712 119778 63943 -52073 -172997 -308172 -318925 -374665
48597 -374665 -304180 -77495 101109 76686 163391 121591 172431 31573 72554 134813 50791
48586 50791 -28554 -49391 -116676 33944 147558 -26101 -120224 -67598 -31179 -44571 5962
48575 5962 -117869 -36734 84729 -84133 50280 -85530 -211042 -14884 17742 51027
48565 51027 -38139 -57865 111170 89854 23563 62710 -17820 -105391 -89999 -36638 -9990
48554 -9990 -99736 20462 163041 209789 -55311 169723 68835 -106811 -305602 -304720 -267321
48543 -267321 -259870 -124521 -33539 14820 -134507 -106737 -107098 16551 73703 186075 233150
48532 233150 41110 123183 27414 -7708 109335 205475 127777 126248 128613 -38968 -145519
48521 -145519 -232558 -72553 28507 -7122 10180 34200 39760 -44215 -101658 61896 134525
48510 134525 10181 -59353 -88614 -190215 -245865 -225863 13797 -46434 73514 228291
48500 228291 243722 207352 -49852 -36031 -60046 -131444 -277686 -184649 -148510 -219091 -95735
48489 -95735 -75248 -14456 170443 -108362 426 83626 -94060 -34871 1039 81127 -9719
48478 -9719 -10133 -55896 -256745 -183441 -115810 -160268 12971 157073 261948 84464 33114
48467 33114 191080 30405 -79817 53892 128756 197776 305323 150308 75945 -76462
48457 -76462 -115378 -180660 -90634 63185 26482 -24818 -10067 -176549 -195051 -171377 -224688
48446 -224688 -147476 -66718 -44724 45097 143897 -48807 -84004 -24077 -116949 -52136 -441
48435 -441 45049 37307 -61764 -55817 132926 -55750 -130949 2415 85780 251777 176216 114434
48423 114434 217898 149158 151820 101669 -39897 -23028 -111017 -107091 -89842 18779 -47776
48412 -47776 -143436 -169628 16619 64984 23521 -144822 -128489 6576 -80324 101819 309073
48401 309073 -1847 -64325 -90062 83403 252353 230320 241310 282410 68011 785 112522
48390 112522 145240 105734 67237 -160666 -24946 27906 182589 175412 -59982 -344857 -402091
48379 -402091 -193952 -133841 50819 -110956 -159834 -35132 -89089 7833 -67671 -174676
48369 -174676 114937 111563 -54599 -156647 -223222 -168058 -142601 -95423 -8121 -19909 110644
48358 110644 144813 74190 15766 -11080 -92693 -417143 -353188 -280046 -59650 58644 136722
48347 136722 -41656 8021 2902 -130446 -127221 76720 88848 -17244 211983 327226 225465
48336 225465 139404 9318 -83373 -129677 -21772 -91058 -115626 -113019 -115359 -20432 -130818
48325 -130818 -136293 -134127 -92856 -124314 -247287 -227576 -197396 -7902 164763 6452 28277
48314 28277 72105 141413 142133 -52279 -113468 -41152 -118646 -166746 -95512 -129450 -139779 -42975
48302 -42975 92879 6581 -50947 -227714 -212219 -94064 2704 77568 95484 -62453 -177491
48291 -177491 6008 233165 247780 177105 21947 60472 39545 -64419 -22154 -47396 -65912
48280 -65912 -113185 -22706 -116779 -93773 -61897 794 -56724 -198829 -312077 -399144 -382249
48269 -382249 -221958 -110444 -33284 -109261 47836 114929 -7076 -128219 -118982 -225533
48259 -225533 -187150 146108 126207 9189 -17772 7608 -15989 -160319 -109166 -55096 -228126
48248 -228126 -233750 -6778 -26243 -41083 19283 -22216 -169865 -144377 -6738 83801 52016
48237 52016 -91803 -18653 98485 210287 73174 44178 105986 31280 -52819 -81198 164842
48226 164842 188646 210466 33650 -125542 -179891 -123256 -17970 -5236 -102334 66666 191242
48215 191242 106048 63088 147072 33015 164473 94197 17470 -32465 114003 10216 -77138
48204 -77138 -67746 -1656 -128552 -6352 7239 -90964 16025 -99852 -168975 -216838 -160677
48193 -160677 -58940 15572 16284 -3491 -265099 -206785 127311 205220 131960 55961 -141048
48182 -141048 -50964 14456 -39545 192399 93710 8600 291589 276489 258062 93708 -111932
48171 -111932 -53753 68041 40731 24083 -136428 -20072 196018 168289 186418 129197 51959
48160 51959 81483 83849 167366 154189 101925 167205 195667 -32694 -248667 -92453 11127
48149 11127 -114010 -278331 -206812 -249080 -212448 -94539 -130573 -289358 -384822 -254131 -115214
48138 -115214 -82866 -131968 -320958 -352547 -291698 -245687 -130437 8100 27504 77645 101194
48127 101194 151179 138495 97147 225065 122340 177462 9690 -116570 -131717 -11950
48117 -11950 -82765 -477249 -216981 5306 -66016 64554 -50831 1399 15480 -64045 52497
48106 52497 157063 46846 108429 129648 79045 16729 69749 -37554 -150653 -138356 22430
48095 22430 -53611 -55335 -70856 -11380 103066 138306 117252 -98540 -189058 -61553 26457
48084 26457 51438 -90413 -35135 79864 219078 240408 -30891 -279139 -58096 149046
48074 149046 72042 24961 10177 -89195 -1261 115531 1116 27499 71373 13103 63565
48063 63565 126653 -80729 -180115 -144806 -92559 111276 377259 269689 175715 134846 114338
48052 114338 37069 -65294 -269206 -292792 -150554 72638 61948 8106 221962 269822
48042 269822 101152 -82009 -211212 -151904 -19799 -122311 -116575 -257202 -351714 -226419
48032 -226419 -236844 -226734 -141863 930 41066 -34095 196119 277011 352152 474203 364951
48021 364951 145024 136755 15856 -22376 -51779 18315 -334 -74040 -218291 -123116 -118918
48010 -118918 -125768 -148230 -172289 -153566 -345157 -377959 -222694 -66109 106021 93303 20053
47999 20053 -142177 -77653 -217805 -280820 -39255 1039 84762 121882 -63153 -45328 -151973
47988 -151973 -218176 -272748 -189524 -132282 -85586 -150575 -117220 -108597 49078 150518 -17189
47977 -17189 8414 214586 237300 122611 111016 29262 -201957 -399544 -357128 -221811 16944
47966 16944 -22531 213286 287837 98064 -52653 -57805 -242128 -297870 -74201 -70658 -729
47955 -729 -40865 -1973 -22635 -178102 -195657 -244323 -439545 -417579 -184653 -141286 -104231
47944 -104231 -172583 -192671 -193997 -75231 127632 70856 -19071 40979 87055 121732 42684
47933 42684 164874 65378 -66049 -92957 -120406 -57652 188975 222792 102990 -38085 -4713
47922 -4713 -24699 2263 -49882 -85427 -193338 107317 196139 -77982 -71305 113170 149074
47911 149074 113736 131632 -78997 31219 210651 202648 89647 -39715 27484 -1458 40322
47900 40322 66104 80708 146898 -1191 -83200 -35115 -46771 118608 37752 87992 -70584
47889 -70584 -193885 -191840 -116798 -63317 13838 82250 214868 276077 143735 -28460 -213242
47878 -213242 -85882 -52458 37560 -99490 -162740 -94200 -108152 -73189 -94026 -74006 -56040
47867 -56040 1178 -89387 -27691 626 -235531 -30058 20472 -65174 -69624 11416 -123008
47856 -123008 14074 70653 26868 8981 -105112 17896 23408 -79797 -353498 -403580 -352538
47845 -352538 -233167 -234244 -376469 -222621 -50196 -58670 45458 142558 69943 71744 -131369
47834 -131369 -145140 -212814 -187499 -197020 -214255 -307443 -213621 -107483 -101468 -208952 -173368
47823 -173368 -70618 -118135 -28612 122638 117834 111814 306167 252928 156699 248383 334158
47812 334158 96444 -16426 92672 31211 61821 134706 121520 100052 163740 -27533 -43918
47801 -43918 -13332 144207 232116 324885 314208 202270 266376 139045 217896 -20707 -91108
47790 -91108 69671 148193 78888 -141234 -177160 -60123 -112746 -52602 -114170 -171725 -47113
47779 -47113 33458 -4 90936 82771 -41837 -67343 128154 127706 120637 71270 -3283 -42982
47767 -42982 20658 84702 12246 -211074 -294162 -265449 -262263 -293091 -223961 -290656 -194742 -248456
47755 -248456 -142924 21563 110037 46098 116227 -44095 -112991 74054 259401 93391
47745 93391 138960 74756 18551 49197 -92585 35791 9688 -35933 -70347 -18589 -151876
47734 -151876 -282061 -136063 -41773 -223284 -367619 -219101 -120314 -150315 -113736 -104762 -24
47723 -24 -21533 -85051 -192096 -112845 -56947 43881 190202 146452 60756 95375 59621 -395
47711 -395 12229 -21978 155891 117069 -85632 -204983 -241625 -10970 -27148 5792 -5691
47700 -5691 -151121 11275 146118 275685 135698 -5924 -108240 -119125 -19328 13749
47690 13749 54368 126498 165 -83556 130794 194857 156713 362244 168744 36311 196175
47679 196175 103907 161234 104165 -139777 -155107 -16724 29507 -110171 -85053 77890 124886
47668 124886 -10629 17931 126636 97221 138846 132301 50656 152605 166437 -63182 -280220
47657 -280220 -361087 -273920 -226134 -178530 -161915 -57101 -32941 -118526 -37447 -31027 -26691 -121459
47645 -121459 -190927 -28403 186961 199641 212978 204624 -51251 -75487 -128435 -133671 -156769
47634 -156769 -46660 -32797 38901 146583 183458 -91492 -70784 -125186 -219046 -40188 101001
47623 101001 -21867 -138830 -39178 -13731 -79741 -15505 19734 -16824 -99503 11252 152230
47612 152230 206541 33457 37275 53922 20569 65139 -139446 -198527 -15544 26491 2922
47601 2922 21592 154997 11309 19862 -187480 -226279 -146227 120956 90110 -27343 -89341
47590 -89341 -99844 36905 -47972 -67970 17380 -24192 -153594 -132391 -45936 82603 52587
47579 52587 11839 4178 8241 -135729 -100632 21715 121463 89323 -11211 -118753 -277678
47568 -277678 -222498 -9802 75104 110183 -94135 16539 16444 26133 142993 11271 82832
47557 82832 61240 -8495 175949 81093 -63565 -253555 -180066 -55591 -13127 -105647 -67131
47546 -67131 -38697 10301 -169002 -141331 41144 60915 -7238 -10554 21031 -208851 -242803
47535 -242803 -191174 -117461 -130532 -946 -96112 44404 153395 97758 112091 143162 48244
47524 48244 -8289 -28762 -123006 -61064 -94092 -143807 -63519 -4432 -225270 -308554 -150611
47513 -150611 -46480 495 79704 111815 55418 194937 159395 299003 349919 259786 180275
47502 180275 82212 59528 -83677 31327 -19729 -102040 -61435 -10432 -9141 -76377 -121018
47491 -121018 -168103 -322657 -82930 -3740 -116909 -98576 -14781 -14951 -54182 -31973 117752
47480 117752 83467 -5896 -32414 42608 209794 231965 146264 65573 241753 138418 42898
47469 42898 231409 370277 190028 127851 100705 65580 62371 147978 118935 -92950 -8675
47458 -8675 102292 -67784 -146917 -171717 -53161 -139942 -73393 15380 1129 67314 13453
47447 13453 -173594 -132248 -79379 42219 214351 -377 15732 105370 50023 31155 -27632
47436 -27632 -84289 -232237 -252691 -87965 -152001 -215599 -167422 -144475 -98585 93273 39622
47425 39622 37782 -128613 -167395 -190486 -160302 -47477 55260 -25423 -18348 131243 268529
47414 268529 168900 46174 -80817 -287776 -49771 -6135 106279 73245 126141 -41056
47404 -41056 -81545 -75255 -16666 -156582 -82121 -82221 -163257 -135418 -224487 -161391 3835 107938
47392 107938 46040 -43603 -27090 -11026 150098 264423 76675 137 -60800 85880 128113
47381 128113 -66127 -19590 212857 215607 79106 75499 39709 -108208 -195922 -157549 -100731
47370 -100731 -2515 59455 231873 213483 212616 162014 209719 29498 -80369 -187593 -256274
47359 -256274 -66861 91492 -47591 -26259 -19902 -48136 88669 143304 286550 86050
47349 86050 -87073 72467 124466 153626 92485 76242 10593 -170121 -221308 -5075 -84970
47338 -84970 -113193 51479 65926 -51305 -95303 -317972 -450277 -300219 -191696 -100587
47328 -100587 11454 7255 54647 54726 -23281 4470 -52035 358 144611 29889 -98665
47317 -98665 -37753 -103143 -265111 -378339 -194934 -208043 -222633 -533 -78331 38651 85840
47306 85840 -9859 115967 211170 56960 41321 -35080 -115268 -209954 38668 200287 101945
47295 101945 126602 169154 -7475 -36246 -81776 -102114 125285 8919 -100823 -167988 -153713
47284 -153713 -169935 -264712 -212875 -150774 -88810 -76696 -195445 -257837 -245644 -185060 -94348
47273 -94348 -32512 58892 99046 -88220 -61244 5967 39913 17369 2259 177125 365013
47262 365013 312324 227780 -21177 -51602 235962 186094 91065 42380 133296 92073 -51260
47251 -51260 -206372 -390104 -313845 -68601 72762 189809 65494 -137045 -123212 -76846
47241 -76846 -17715 51685 506 332 47914 22448 -22958 9121 105736 215017 266418 37908
47229 37908 60967 12466 -43597 120510 -135852 -158431 -123207 52386 204822 66090 174814
47218 174814 178184 -47049 -147043 89579 218908 252998 144418 164257 188973 33233 -41681
47207 -41681 76427 185568 -52037 -179186 -149939 -275111 -156536 -243768 -263923 -235192
47197 -235192 -287062 -159450 -117704 -124986 -12330 619 -130406 -167589 42367 166155 226383
47186 226383 175652 -13123 -214415 -245614 -114367 -47651 -147974 -21950 -86242 -154819
47176 -154819 -250113 -306716 -112659 -53786 -92839 2840 155719 209782 47256 -206640 -184265
47165 -184265 -61339 -141881 -81375 2693 16972 134016 37376 -68099 -117195 -40963 -50064
47154 -50064 -81133 -338054 -267631 -174673 -99305 -52141 154592 28702 -157774 -86589 -99239
47143 -99239 25205 13716 118952 149337 133260 50669 49392 93043 174648 81110 -132909
47132 -132909 -224927 -167982 -211954 -124947 -236576 -202112 9173 70812 115763 40603 118403
47121 118403 -47328 -200738 -24284 -68306 -44598 10279 -107084 -83952 -139002 -84100 -80994
47110 -80994 38457 118112 -155054 -144243 -89729 50578 -123586 -88152 283441 301807 302470
47099 302470 427100 407983 189156 181755 325967 95590 -65644 -165759 49198 68668
47089 68668 28379 36103 82057 73912 93610 94588 29894 -23176 182698 10483 -237985 -154184
47077 -154184 -175546 2724 130612 34955 -50754 19077 56640 11809 61760 -100739 -25322
47066 -25322 -7675 -113764 -262386 -362860 -311596 -196340 -31307 675 113215 468
47056 468 -27359 1928 -62522 -38282 -144392 -125917 -15076 -15641 -160139 -39316 -48747 -42181
47044 -42181 -88694 -85646 92866 -2 -36717 -153528 -33404 -145189 -86930 -50095 -141847
47033 -141847 68642 12535 -155214 -84617 -41563 130761 -9925 -42483 103722 -8729
47023 -8729 -205086 15516 -71428 100371 -4581 -105873 -278787 -211925 -132154 -48735 136440
47012 136440 -45388 168367 254915 205442 173691 92872 -39133 34537 66318 16804 -16797
47001 -16797 -151634 -259746 -170670 -30781 -50661 20344 210287 65649 -153376 -137841
46991 -137841 -18247 -117314 -71294 -119047 -289346 -68610 76134 305322 126286 -70364
46981 -70364 34446 9818 -4849 -64395 -106585 -80183 -102077 -292026 -105198 -73611 -46973
46970 -46973 240025 181367 129200 83853 67591 31213 101309 -37816 25977 -28690 -191957
46959 -191957 -275858 -126126 -48052 -74274 -58652 -122855 -270595 -151257 27529 -36763 -18432
46948 -18432 128520 234835 268495 96112 71785 238214 168755 275716 212731 114481 279522
46937 279522 239380 213618 75055 -17392 -28807 119147 91663 -168831 -193594 -186898 -96579
46926 -96579 -136123 -212993 -36888 79609 -20750 -120515 -219518 -264364 -113705 110944 115561
46915 115561 61465 -11518 59428 128395 83612 6787 182979 248192 158902 143502 157458
46904 157458 201794 14801 -87854 -32418 95868 -105342 -206654 -119427 45033 53455
46894 53455 115342 167358 68453 162218 188436 58253 77457 64765 -5697 -12959 -33213 -31164
46882 -31164 -81872 -203593 -248011 -113301 -54871 58347 65965 -13451 -98459 -20864 54622
46871 54622 49149 136375 7220 3057 -70238 -85308 20027 -45513 46858 -71655 -126223
46860 -126223 -74778 74404 45415 -4794 -108643 497 44368 63688 3061 218887 102666
46849 102666 53279 156533 261456 182819 -97991 -176713 -57907 -32926 61985 105738 60174
46838 60174 142782 120818 89272 114168 65393 88313 150740 -20243 -70152 12157 142175
46827 142175 133421 131503 -19652 -202518 -210382 -206555 -78518 130959 179065 -19843 -131736
46816 -131736 119262 123536 32919 -39970 -191226 -26860 -6211 -67407 -124984 -47820 -34355
46805 -34355 -30730 154892 155824 -3891 -96613 -75442 -68049 -18635 -20210 -31231 -194154 -170655
46793 -170655 -54568 133214 43421 -68218 96078 46612 -68490 -27568 187606 49766
46783 49766 -38776 -124735 -54647 18970 -16393 -243686 -174508 -14300 137142 88812 -34809
46772 -34809 83133 -64052 -295504 -108676 -120216 -249477 -105856 164776 186154 -45092
46762 -45092 6307 -49534 -115138 -30604 -79905 -50445 -14564 165174 178255 149438 26574
46751 26574 -68829 -37330 154778 127575 -20009 -34917 -184265 -265818 -236747 78688 227982
46740 227982 108503 4794 -176097 -121130 -18305 -262468 -305537 -273492 -198076 31693
46730 31693 34464 18738 24292 80048 9092 14475 -28852 48907 -48765 -80821 -214196 -114097
46718 -114097 -130095 -65478 -19093 -152808 -94629 -68573 -61500 -51880 -43419 -147089 -94157 -61294
46706 -61294 32428 -55211 132187 336718 205640 102151 22497 54419 108054 -118728 -191547
46695 -191547 -92320 13818 152803 120777 26135 -93818 -69463 -183525 -149566 -74005 -16583
46684 -16583 -77021 -127666 -134443 -146075 -98053 71299 126985 -6226 34373 -82122 74498
46673 74498 68572 -72095 10901 61159 105550 218503 188887 182230 274538 272798 131799 -96303
46661 -96303 -80926 -63451 69031 69915 -12140 -62448 -42542 -39680 -93496 57899 132583 34156
46649 34156 128953 152194 82440 18147 6115 177952 119433 114695 227683 178331 258242
46638 258242 120767 70352 -29400 17475 92617 43231 25948 21319 -56217 -114966 -51816
46627 -51816 -155324 -142790 -112082 193362 153118 -218388 -255915 -70319 30917 20758 -23614
46616 -23614 -11352 -6175 -75668 -169685 -270082 -44032 -46627 -111563 -55321 -122991 -16194
46605 -16194 -57000 105263 66584 23374 52078 274184 278607 170615 177526 127406 135703 64697
46593 64697 4502 48027 -116117 -238611 -33454 201893 -21193 -195344 -222381 -134530
46583 -134530 -127133 -17826 -60331 70014 65422 64479 67096 50781 -86750 -10029 186754 114161
46571 114161 83523 98512 220372 178377 1535 -130769 -227310 -222387 -172355 -157016 -190414
46560 -190414 -137174 -191475 -53847 31878 -37549 -78610 -5278 -9676 -181727 -168607 -148494
46549 -148494 -73182 -182500 -140504 -135999 -93144 -3092 11767 46779 63574 -38417 -60462
46538 -60462 -170147 -168987 -213818 54875 93630 -25694 110812 121357 29641 155295 47321
46527 47321 -96074 3409 123925 219189 317485 239729 -2339 -9515 -4459 -202231 -220492
46516 -220492 -162561 -147612 -82996 -93861 4900 96906 189917 174318 14669 -80779 -53537
46505 -53537 -63640 -335910 -234751 -62227 -172656 -290276 -374333 -242713 -207525 -66435
46495 -66435 13143 178928 44631 -87108 -69965 40423 148530 -69870 -51268 -35345
46485 -35345 7825 12433 136120 200974 46605 44859 154464 369825 293961 64703 80871
46474 80871 286510 297272 3789 26443 133638 101776 -76656 -5543 -64050 -226827 -112693
46463 -112693 -84458 71367 72261 49007 -23835 -114249 -169705 -15976 153975 27671 24940
46452 24940 136573 134914 5470 -14634 -34741 -102927 -150200 -127494 -80331 61657 82314
46441 82314 -48023 132811 244796 -97973 -173525 -123053 -56456 35042 -57183 -250529 -267737
46430 -267737 -131357 -116514 -163609 -212495 -232585 -229211 -13931 8431 -696 -76826 111478
46419 111478 -4096 -160869 -33149 -83740 -99997 -67725 -194540 -56755 36928 -148470
46409 -148470 -52111 -75622 -57939 32513 -25565 -74326 123393 91491 83564 102026 149539
46398 149539 -58174 -187832 -120053 -180161 -53652 34777 -3663 52646 19640 -131759 -180571
46387 -180571 -180103 -59985 -141871 -92900 -115840 3129 -63460 -68606 58427 -124852 -175144
46376 -175144 -194762 -281778 -253130 57557 167182 48590 -118620 -193428 -229072 16054
46366 16054 -12112 88624 115385 103493 100230 -18132 -18553 20908 124967 115632 20893 281194
46354 281194 328423 163896 9218 105141 231554 162365 -75479 -171343 437 94540
46344 94540 141875 168638 18370 85648 107730 78279 -13943 52088 164769 166383 185596
46333 185596 58245 -141907 -242825 -203734 -114528 -106954 -46372 -91279 -100964 -56867 -92934
46322 -92934 -105317 -176096 -32986 79515 -126755 -121168 4489 -8494 -15865 64722 212055
46311 212055 154345 -19148 156678 79455 14539 -112839 -168148 -129213 -20019 -11996 -1011
46300 -1011 130135 44635 -48513 -50624 -127851 -55143 -83524 -134713 -173541 -349438 -225372
46289 -225372 -53711 -33220 -54040 128337 132752 148902 119714 -3428 102059 -4457 82198
46278 82198 -12390 -52775 -20526 165169 135650 96133 44440 17843 11577 -232424 -110639
46267 -110639 111608 26848 -100018 -132398 -108637 39701 112220 98062 -53001 1270 -3381
46256 -3381 -95420 -74858 -53141 -198691 -212543 -108341 -114116 -111725 37938 137969 130202 185253
46244 185253 50061 -285052 -245154 -185757 39823 150106 90278 135884 54490 44055 57750
46233 57750 9958 3374 70103 139583 47352 -89930 -2645 36907 -1028 -176946 -90422
46222 -90422 115045 153347 101198 -10297 -69354 -103996 13384 -131197 -81083 -17841 59178
46211 59178 -50529 -121406 -10639 -30797 194704 274370 174500 -49224 -154046 7517
46201 7517 59666 149267 146382 45960 29032 -89708 -6853 141435 -130241 -323587 -272964
46190 -272964 -268222 -210510 -189721 -240345 -55323 -145147 -76557 -155106 -169997 -61449 -15455
46179 -15455 -91193 -90046 -234378 -166229 -128705 -34083 -121472 -100220 72944 21350 -70958
46168 -70958 -32542 -2886 -71999 -153557 -294729 -349543 -199521 -73984 -191586 -226368 -271987
46157 -271987 -143079 -246074 -349430 -104338 -8781 -61185 15578 158085 127590 -14723
46147 -14723 -140325 59728 70196 -5952 -40877 -52745 -140181 -102294 -21098 111109 40878
46136 40878 60630 53119 91137 78856 93233 69276 766 -183511 -141761 49490 -66790
46125 -66790 -58874 73531 15883 -168676 -99147 -31025 152024 310618 200280 123089 184044
46114 184044 128301 111448 22631 -82656 -182572 -217862 -14493 136581 55807 -123190 -145607
46103 -145607 -49012 -89634 -67918 -191806 -318406 -403452 -372099 -245811 -174034 52890 -26075
46092 -26075 -176116 -200796 -223974 -212667 -61814 -52068 63966 -61773 -176275 16539 118417
46081 118417 188452 -103321 -176531 -96355 -33946 -111325 -180450 -204064 -160004 -9455 32363
46070 32363 -180815 -148297 -27971 167496 252461 125728 23244 66172 57557 -47584 -63496
46059 -63496 2119 -104717 -125464 -31887 -25132 -123148 -226103 -251120 -232645 -146927 -197695
46048 -197695 34446 66214 8277 -56553 129460 -66946 -164362 69673 5035 46366 31551
46037 31551 -36977 147262 155112 189849 202056 74966 -21740 35264 79560 -73448 -149977
46026 -149977 -283604 -247506 -209695 -125272 -251996 -239589 -46302 -82460 -252078 -216148 -75627
46015 -75627 66736 -19596 -67775 -42915 32891 -2728 -97351 -44231 -104940 -84306 -84289 -73032
46003 -73032 97959 -16846 -109725 -184625 -170897 -133187 -109543 52829 84454 -42406 -32039
45992 -32039 97531 125210 -25907 -37577 -143265 -135089 -60979 -190333 -62277 90187 -89109
45981 -89109 -179583 -114145 -132804 -235109 -132349 6660 -5618 -119937 -109421 -99739 -130621
45970 -130621 -84133 22858 -110256 -158237 -109905 -247064 -314808 -221982 -54997 -22498 -76574
45959 -76574 -11109 -154893 -199659 -38841 -155989 -54311 -21825 70499 55584 -16267 84487
45948 84487 5424 -212726 -301383 29981 -58646 -191845 -102821 -54002 -65155 -5370 -50781
45937 -50781 61191 231915 274866 222478 201156 -29862 -116394 -244389 -259088 -216345 -76088
45926 -76088 81644 26264 65068 -48494 -131782 -244424 -178746 100943 204789 277166 192201
45915 192201 133810 42989 76055 238134 63685 83651 100834 151119 -54096 -213685 -154376
45904 -154376 10730 38005 61480 -98599 -120184 -7970 -32877 -52846 82576 -582 -58462
45893 -58462 125234 91236 -15941 -32183 -194456 -237825 -236467 -286865 -45352 -56219 -13271
45882 -13271 -30087 129766 75391 -113369 -205969 -228777 -133969 -25155 73628 118126 37423
45871 37423 -67229 56584 48585 10321 -14691 -161360 -273983 -138300 99894 176624 -66566
45860 -66566 -236905 -62292 81156 -68132 -81613 22336 179690 95755 -59705 -254768
45850 -254768 -131215 -141437 -181223 -179269 -72627 -248600 -357840 -65633 -126746 -108332 75510
45839 75510 230215 70710 -48523 -42281 -98948 -130205 -230835 51790 101959 60386 -7824
45828 -7824 -1633 65917 42009 7066 106858 43567 -11524 -161210 -235954 -62182 -36942 -76647
45816 -76647 -90555 -6250 -159107 -139254 -86739 23213 65178 -101643 -267385 -263229 -85410
45805 -85410 -42581 -220078 -110371 69019 -27777 85103 3444 -13068 96558 188197 82714
45794 82714 -24190 116177 23257 -258190 -170733 55516 42404 123791 118387 80210 144106
45783 144106 57507 -122984 -72204 -340013 -189218 -234429 -158509 -63747 -144139 -200872 -267799
45772 -267799 -209871 -44985 31349 -60135 -112167 -122312 11861 22627 32093 72680 7089
45761 7089 -53716 -165162 -169377 -151165 -337047 -183431 -205684 -182499 -149690 81449 137514
45750 137514 -101813 48337 -74493 -161832 48409 2074 39809 155860 122373 153233
45740 153233 233661 121247 107555 218869 220337 110768 167328 2721 -7020 152451 229067
45729 229067 133671 339004 166434 -40670 -42585 -68018 15431 -27682 41150 191025 217880
45718 217880 81048 195161 205779 54513 -9968 -221034 -147735 18205 50410 22827
45708 22827 -62089 -117713 -45205 -127479 -12474 24651 191696 28465 -2377 100041 126936
45697 126936 100719 92700 180739 132340 34397 -230731 -198374 -5727 -117690 -133377 -124002
45686 -124002 -82171 -32211 48971 51654 -13409 52184 150107 -21749 -61124 -79828 49391
45675 49391 10917 107460 416557 437344 376089 223301 208081 42995 131820 -61500 -131006
45664 -131006 -137918 139202 179583 59140 -15898 63861 109200 122415 139012 2223 -100410
45653 -100410 -205406 -208471 -212623 -76672 -72533 83811 162426 93689 7491 -165737 -128491
45642 -128491 21298 96728 23721 116124 123262 64593 -44363 33208 277929 365483 124544
45631 124544 -114639 -62125 5540 -66378 -211697 -142395 -4188 124806 -33165 143158
45621 143158 132390 -26210 -41379 -27975 34427 81418 -27912 46510 -16397 -122018 -1216
45610 -1216 -83511 -201573 -31737 -108153 74865 95955 215064 212773 254858 325822 259871
45599 259871 160670 18613 -102005 -69111 81664 76558 65868 71004 -60249 -103330 -288152
45588 -288152 -303887 -268740 -206170 -58939 30175 -130978 -70894 15141 55869 -99165 -198493
45577 -198493 -115904 -128748 41739 16844 -47349 -71354 -136215 -94126 -109173 91600 364252
45566 364252 352330 79413 -232099 -213090 -26065 -24267 -31998 -93828 12783 -51600 -230645
45555 -230645 -239399 -107174 -75912 -162744 -77533 34264 -93830 -84987 39138 23199 144114
45544 144114 144730 -42778 -55202 -36511 861 -140184 -250833 -57968 467 27821 63913
45533 63913 26569 -34271 -64347 58455 201596 56275 1929 66055 101984 233825 123560
45522 123560 113363 93735 87749 217482 160609 209118 193363 89950 18122 81708 20839
45511 20839 -156827 -59960 -91735 -250034 -222463 -44371 41429 -9408 -222252 -282177 29577
45500 29577 172381 76819 148379 115601 -23027 44799 -109873 74461 96485 64235 172992
45489 172992 281227 386322 226742 124678 140099 102612 305616 195835 96566 23400
45479 23400 220322 382354 346905 297598 241030 170197 141185 -90619 -236570 -153429 -111436
45468 -111436 -107939 -142465 23901 38697 116593 33627 -43496 -40749 -4605 82348 87791 -51449
45456 -51449 -210385 -156682 -97644 -45561 26169 -63862 -201603 -184120 7119 165225 126398
45445 126398 114920 65121 -109428 -23195 194085 271223 298651 208141 442199 480038 220732
45434 220732 270317 75937 -133908 -98721 288113 337278 155014 -70737 27534 152246
45424 152246 26327 -11271 -72464 60278 24870 -15385 126644 223765 48937 -42965 -42558
45413 -42558 16044 -751 765 138445 225636 213475 203581 118151 267555 191529 228521 256752
45401 256752 74247 65583 26672 98177 -77665 -126424 -90376 -149843 -143151 36250 -21797
45390 -21797 30833 33786 -3159 42926 -11424 23947 114705 187953 244540 454351 424476 200067
45378 200067 216927 183383 210749 203136 251063 151350 180411 158592 243182 205950 37220
45367 37220 28519 -44509 83801 117567 180497 174808 234919 21416 114282 290126 312633
45356 312633 34315 -120920 46210 -10112 -12809 -55302 -1831 95284 153743 130716 -115544
45345 -115544 -2800 68383 -39885 25715 -84744 29453 35601 -92850 10769 135332
45335 135332 91204 7223 46980 157800 147918 -100552 -83987 -41168 -44849 -163394 38066
45324 38066 168459 181666 151507 -131045 -41632 54767 -41266 150998 153262 82682 229267
45313 229267 167430 93681 46903 87191 121987 81678 161721 140603 206118 190772 144300
45302 144300 95021 34243 -42681 -6099 -58235 50420 120629 -66161 -33395 -180375 -221404
45291 -221404 -42815 127831 283308 162709 -102330 -93132 5611 220569 243817 44805
45281 44805 244847 353395 191157 67486 141003 249676 169123 202254 169617 -36043
45271 -36043 -116286 -149633 -26726 156662 67046 71607 168799 150601 -98421 32216 -15022
45260 -15022 -65219 -20090 -69327 -102932 -83792 34188 76982 102312 -68798 -33340 37758
45249 37758 -230986 -228072 -126075 53314 27393 -45014 -133803 -120171 68962 241741 336073
45238 336073 265870 211872 136974 82562 176485 -110295 32882 77241 -106368 32924 -73367
45227 -73367 36683 207186 50818 -84248 90017 44760 191980 122873 29538 2652
45217 2652 -172476 54021 79298 52599 37436 17928 82491 96881 69978 595 183606
45206 183606 -29354 -224364 7457 219059 100816 -55285 -183643 -183893 -19821 38658
45196 38658 -136525 -52493 -77708 -131890 9016 -58339 13319 40854 173021 240360 103923
45185 103923 214707 287881 212223 271915 185016 263334 425500 411636 315938 288957 120156
45174 120156 127112 252308 367024 299722 288814 395083 395182 327312 161229 146640 247876
45163 247876 208516 175405 176021 108094 -6600 -186116 -13628 42302 42395 -49943 -84941 -19455
45151 -19455 205994 179341 39490 -66052 -10240 204865 166728 274590 309328 168412
45141 168412 172631 60334 217504 171917 88748 119573 30776 -36131 85645 243473 274135
45130 274135 124187 -22504 37360 247626 98653 53549 88920 179900 213863 55721
45120 55721 -60367 24331 143069 52070 91729 209688 204310 32465 63265 200849 113055
45109 113055 51554 -135380 -59789 109961 190379 308644 284603 124926 176392 154715 210591
45098 210591 300676 215851 277967 161910 118125 201330 261245 246608 202252 231417 142469
45087 142469 14553 -98481 -91508 -28255 37043 113781 132038 98744 -7548 57652 145051
45076 145051 152172 141156 175784 70186 36824 170856 95278 137172 160173 65553 199292
45065 199292 318263 104604 58787 105020 148798 80898 40615 62776 173522 199519 94981
45054 94981 -13086 87104 111882 112764 360951 235100 -32462 12222 -69863 -3718 198627
45043 198627 102314 204265 60844 -53848 114305 210344 180320 151680 72227 108424 246353
45032 246353 250838 140000 131267 161198 91070 374707 377645 188029 200206 202202 94357
45021 94357 72406 71253 188092 274965 396835 409074 379689 273456 222677 146857 90561
45010 90561 52099 67835 -25531 -61798 -58941 128246 55417 81899 -44462 -57134 131531
44999 131531 154786 216316 318587 337048 263233 222322 188126 180014 282639 348638 279128
44988 279128 -11965 122308 51217 7308 94308 157814 258903 126571 149187 65021 184417
44977 184417 304039 266345 204123 139861 50737 35212 41414 107857 290884 336093 253018
44966 253018 161651 147777 243787 251697 184957 197378 166100 167503 97341 97910 236817 263107
44954 263107 108026 132923 172037 198432 -25431 80063 136066 166341 296196 232188 339936
44943 339936 176086 17724 31339 239928 359558 407088 300295 179866 171186 219084
44933 219084 293970 285050 287059 310386 333999 348505 264678 186052 294736 218668 344198
44922 344198 322682 364989 436436 294563 218708 241095 259392 313237 226086 254187 482111
44911 482111 477288 296504 306292 365699 200584 271387 389962 557936 476897 314983 308393
44900 308393 438282 490898 489003 590664 656750 605723 783825 829757 928138 1353127 1995640
44889 1995640 2540539 3104049 3075320 2468374 1791969 1099649 820182 765606 754083 558918
44879 558918 508637 657301 723548 596349 449505 618252 675868 498030 535802 580115
44869 580115 496153 372342 449001 371921 440059 526578 376867 382611 450139 589809 495405
44858 495405 352913 544307 501921 467103 482503 450931 545859 678526 703898 698284 511797
44847 511797 585313 613469 764406 740075 826093 821460 763128 700708 629048 760327 793795
44836 793795 704724 693069 711900 764839 846452 881650 907982 837489 859861 722416 797241
44825 797241 990579 1026930 961356 691658 782783 777800 990231 1199946 1207960 1137788 1051540
44814 1051540 1094063 1170077 1056415 1160760 1316228 1350133 1122542 1156658 1401035 1510014
44804 1510014 1501517 1863976 2375947 2557476 2813145 2761128 2486706 2323559 2051049 2160592
44794 2160592 2253248 2088870 1802423 1663347 1823766 2039901 2063590 2361187 2686510 2991790
44784 2991790 3049291 2962409 2760197 2755070 2716691 2875690 2970666 3082098 3165020 3419729 3653658
44773 3653658 3999189 4280874 4682498 4976506 5263710 5527045 5877043 6474195 7237855
44764 7237855 7989019 9076722 10252940 11416700 12320560 13436413 14856958 16687636
44756 16687636 18850865 21548554 24606824 28263659 32441272 37944094 44817906 53965536
44748 53965536 65645458 81256997 102150080 133398409 183099832 268311917 397792115
44741 397792115 516460076 531287930 429340122 295147819 198850365 143728097 109837838
44734 109837838 86642493 68910875 55497697 45257099 37785792 31711438 26923025
44727 26923025 22620536 19497477 16873794 14684388 12971400 11501939 10259918 9384175
44719 9384175 8459634 7651429 6856421 6178140 5581032 5326655 4875167 4608172 4400052
44710 4400052 4039741 3756837 3498567 3322180 3261909 3160073 3020449 2758917 2677522 2709677
44700 2709677 2513041 2107935 1948747 1954002 1795474 1769330 1844352 1596150 1495617 1401937
44690 1401937 1257863 1193330 1099489 1350534 1352981 1202887 1173213 983908 1064480 1051865 924258
44679 924258 1040727 1038379 891340 981852 1083241 1083056 983459 811946 777087 825898 800269
44668 800269 668080 918961 940868 579922 568004 621592 601125 438222 575453 612409
44658 612409 692000 538996 552477 606148 702271 753674 504742 407675 301914 498321 547912
44647 547912 659795 527910 327364 436396 567068 455222 345248 443019 374450 270494
44637 270494 113703 299757 241158 105640 142784 360659 350354 256191 133954 287392
44627 287392 291626 212868 159537 178592 223011 240740 193619 228036 221283 180556 164013 241361
44615 241361 297375 228030 251780 188719 90286 130653 79724 119459 164343 154036 256735
44604 256735 175584 239809 318632 336272 165233 102632 345760 319546 97635 58751 256303
44593 256303 179216 45622 74938 87573 195076 331431 362864 297673 127160 141715 166794
44582 166794 -8066 12245 57267 200596 372425 404293 304261 16863 -30935 200311
44572 200311 186783 227891 308658 244100 202901 8146 22368 250447 259440 307276 325878
44561 325878 198947 -15104 -197185 -73476 200313 115902 111807 270141 186157 88576
44551 88576 222714 222876 476713 473544 322108 428458 477563 342347 363821 254142 151426
44540 151426 317723 503978 699291 830826 936332 1269240 2043677 2771134 2992617 2630379
44530 2630379 1924348 1326564 913855 728474 687891 552596 435302 337739 504467 451526
44520 451526 409602 373166 389604 325198 111469 105525 39770 -85572 -3966 109961 14381
44509 14381 -25827 85354 -90544 150567 259871 167282 10162 117523 269682 119370
44499 119370 20182 -177807 -221068 -64663 90601 73312 -42711 40231 80291 82044 -110265
44488 -110265 66922 40493 -71281 -30916 39329 -98977 -100310 93463 -103952 -262484
44478 -262484 -333306 -198059 -57678 39959 237825 124506 83188 -83622 -153426 -60358
44468 -60358 94687 803 -4789 63374 123335 -103923 -137143 -103784 44119 11864 -31251
44457 -31251 121385 -67491 128853 454764 482377 268493 13724 259268 482704 441827
44447 441827 349261 214552 75747 238306 175777 83624 -32665 68123 267145 306503
44437 306503 215543 92826 -132012 83925 348343 250866 121977 -23599 -13249 125304
44427 125304 197775 197777 226297 105134 56823 59261 216518 315878 269662 320722 328264 145602
44415 145602 46841 130677 276630 240718 88326 50478 64346 -5382 -59701 -103395 -27791
44404 -27791 44808 154269 152211 105920 212881 152831 42205 -11391 155014 337286 251941
44393 251941 192546 304265 279325 180078 199630 366573 230283 151212 98020 29212 84723
44382 84723 -7680 -2384 -101562 -48693 21835 217707 223262 130593 -70052 42698 46997 -98902
44370 -98902 -156632 -84514 18732 215752 163946 -59987 34505 34993 186021 138214 -7839
44359 -7839 -30823 -100124 -89029 1038 -156872 -5836 44578 60405 116916 135033 163705
44348 163705 184700 70389 111706 109400 98476 -59032 -110985 -76473 -53224 -5458 -8859
44337 -8859 32581 50911 -20793 -41 60476 184834 123360 60006 45331 -121501 -96693
44326 -96693 -36457 101351 231591 160929 42918 125378 2440 -71024 -32347 35551 108854
44315 108854 100366 41369 37717 67515 -40126 19487 17738 8026 127199 215543 155031 48627
44303 48627 -166960 -194279 -465 89812 101060 126147 39102 86837 78725 34097 -6649
44292 -6649 -58039 32466 76413 -7493 -176956 -223736 -284709 -60903 185955 194612 222217
44281 222217 49223 149025 47321 112515 200756 7535 35738 -95702 24348 154589
44271 154589 4556 -401 -40390 -7314 95595 46520 66016 165396 101082 -40171 -25352
44260 -25352 18486 -7451 39015 66947 80056 59517 178258 373585 77247 -36556 -5225
44249 -5225 116166 84862 67187 118479 100656 170662 121802 -52985 -106234 62203 57535
44238 57535 -119126 -145977 56636 -20966 -255218 -64994 23756 80584 176218 82843 188857
44227 188857 124206 119812 -39670 -112261 120085 93868 84273 192079 98939 -18823 -50761
44216 -50761 22510 -25395 -64038 18733 149114 -56915 -177505 -89228 -202884 -318929 -233142
44205 -233142 -50115 35365 -46405 -20337 63110 -54091 87331 118432 210054 201108 92798
44194 92798 -13219 -160257 -11734 -36507 17890 64094 -13088 -3939 -45576 95674 87858
44183 87858 -21590 45761 -99747 -178235 13371 33122 -151694 -19000 44648 52258 187555
44172 187555 266671 132305 166279 239010 -10313 3552 194061 199992 152482 174827 139538
44161 139538 244725 149426 19224 -52207 -69583 11753 -35805 236281 202238 169157 149565
44150 149565 32632 -32502 4852 134138 194410 233277 156311 39219 16638 228540 142929
44139 142929 145720 30755 90160 209542 77057 119233 199579 42588 101360 277093 126555
44128 126555 13441 -46893 14760 147707 329544 303704 53132 54626 88102 -7983 8092
44117 8092 195782 142869 199649 113328 42850 158841 138943 54995 -23648 1856 80033
44106 80033 74726 -119200 -188905 -131424 -40955 46585 53530 -110525 -117799 -1440 -77106 16481
44094 16481 124135 12337 -39073 -50332 -29505 -11338 107936 194880 74844 108400 33425
44083 33425 233544 471845 472594 302166 115020 178453 234101 258163 347301 483043 329684
44072 329684 53584 -122487 -184387 5288 -118519 -56978 14583 4159 44316 182660
44062 182660 226295 214001 103554 14222 173310 44584 144567 280667 201816 220526 191960
44051 191960 163800 173424 160204 108853 -43014 -35374 7432 113698 224216 206841 75709
44040 75709 74737 -167400 -248633 48211 -104529 -116605 143488 211581 167162 33959 -71869
44029 -71869 -56148 -21870 74068 97293 -63681 -101933 -151079 -50990 -33248 -120748 -126535
44018 -126535 -81671 199799 308743 366804 226502 17639 76832 21524 -21387 127442
44008 127442 50341 139290 111423 127718 156262 -156613 -211825 -161943 -130622 -100788 -143619
43997 -143619 65461 52756 -76873 -60192 -22254 -110869 -11212 -162608 -90418 -89128 -393133
43986 -393133 -315687 -317692 -259652 -125266 -156335 7211 119627 -33135 -18781 27151 138128
43975 138128 174072 156258 112559 150978 -3737 -138160 -147670 68984 29247 -46618 -21146
43964 -21146 57637 -144870 -249606 -127639 59396 75412 160626 109330 10187 -99912 -24967
43953 -24967 51426 207657 224791 131972 154335 160797 235083 128123 55483 69240 -44809
43942 -44809 -143873 11859 142941 49492 41866 40278 71207 -92074 -23119 -14401 46511 -107638
43930 -107638 25085 -50389 -1242 -40591 -41147 143611 108506 42366 -134009 -172699 -216119
43919 -216119 -277569 -65958 110070 203303 241772 222133 267842 125734 73323 152965 302348
43908 302348 304904 206160 76250 206043 103181 33722 26963 131087 -51196 -71278 86608
43897 86608 125331 67302 -70738 -92959 -224312 -138384 -110135 -114928 161422 198128 -136880
43886 -136880 171741 389309 126731 -8572 -28393 -101171 -113833 -137583 12853 -39587
43876 -39587 -107288 -88854 -6806 81987 -2736 25218 106729 178484 62560 73536 -41062
43865 -41062 -115000 -95675 -70460 39031 188657 269759 -9535 -29338 -9419 144781 3958
43854 3958 -200359 -210057 -228810 29206 53121 -3658 47563 166622 64944 58885 104882
43843 104882 19534 -70974 -28320 -108807 -227171 -151942 127661 48799 -148516 -92994 2618
43832 2618 119631 84383 23881 -44106 -22180 13396 48332 47856 -5194 -51827 -94009 132675
43820 132675 156594 64869 122788 130901 32134 82910 49821 -47073 -141772 79439 108131
43809 108131 132351 48754 -22041 -66799 116430 183010 334959 184429 63081 -34051 -5033
43798 -5033 95442 67125 141568 141940 64380 -110558 -40356 -3052 -166410 -60632 -53356 84622
43786 84622 157498 267961 301916 163810 247202 348811 292832 289252 444144 246935 46703
43775 46703 -52726 -1326 156682 120512 125102 55889 97129 85736 116580 57411 -137897
43764 -137897 -199414 39035 86886 65797 -63361 26274 39103 -57739 -43961 -10723 141129
43753 141129 211466 36608 57994 157758 87172 148598 191543 55816 -195994 -165037 72148
43742 72148 137818 306269 200553 117838 45935 255807 243725 -16332 -110302 71763 78225
43731 78225 139938 61054 136929 216081 168653 55934 -72652 -238114 -137594 980 90676
43720 90676 55391 -99308 -41561 -29189 67661 102312 110312 203953 161222 85180 108266 -87175
43708 -87175 -254142 -152864 -40454 114130 207499 283896 255899 85482 -109958 -271379
43698 -271379 -181633 29747 190050 266321 221180 71057 12371 2211 15752 9684 124013
43687 124013 254661 337777 229838 37175 -44125 -41233 -7466 -6725 -130827 -177363 35225
43676 35225 63757 172006 92426 -79276 -34613 104762 30527 244841 160015 219744 112833
43665 112833 14764 177928 109741 70680 51070 78066 25676 8537 96989 -16511 -80894
43654 -80894 87440 182452 163749 138238 151090 32969 198075 217388 298286 99883 21236
43643 21236 33783 59556 -2745 128984 274474 242924 238815 41516 -58652 -51658 59053
43632 59053 38750 119242 28084 -24094 24235 32389 65660 -129830 -133050 58439 62657 162377
43620 162377 186296 25107 -86372 -120710 -44565 -170122 2025 301298 318096 94214
43610 94214 140110 289978 150985 64918 68009 50683 333356 351818 242401 216268 125268
43599 125268 -99607 -170056 -147263 36641 -12073 38409 68093 -14540 87353 151818 73707
43588 73707 225215 242539 162271 116387 104427 44236 -32152 120805 228714 229688 18246
43577 18246 -15339 77125 133037 38120 33699 171724 302713 233737 313448 471540 370024
43566 370024 166113 41020 -107605 -260875 -279510 -133146 -94808 30386 80447 -23439
43556 -23439 -23539 91321 41733 22069 122119 -26842 -27757 58973 120353 122809 66093 77676
43544 77676 99590 -113186 -28693 -155822 -53642 212688 299279 320886 153740 11537
43534 11537 -54663 28050 -16992 54923 -33500 -314806 -207979 88333 123827 84066 103373
43523 103373 167301 136701 217564 288589 187349 -65563 32747 -57272 -121103 -214128 -242415
43512 -242415 -152571 -67306 160132 164977 161038 24969 10467 35330 119674 75935 87647
43501 87647 75531 7604 32507 -90302 -7762 33914 124273 153102 -65510 -27967 -50768
43490 -50768 -117424 -53628 174302 203985 13643 49996 242086 305570 276969 206322 211082
43479 211082 21778 20529 -81162 -237075 -225870 -221634 -153852 -37370 40318 -78978 -111863
43468 -111863 33411 220451 38066 127778 269090 264101 261812 158511 -16928 -52455 -33210
43457 -33210 79101 -99359 98253 134000 -22419 -23991 -146240 -199822 -144847 -8356 -70020
43446 -70020 -151421 -139555 -91216 -119741 -43237 -78802 -15475 50198 136279 109798 103882 26509
43434 26509 21144 271724 188487 241392 278975 230280 87385 92492 92611 161220 194283 431781
43422 431781 329796 121520 165562 229849 191512 197760 24626 -41603 -51248 51482 240297
43411 240297 243735 46714 -33990 47897 -1559 -32768 -15083 158667 140261 33941 113083
43400 113083 82469 7832 203143 215263 -93283 -3047 54545 165244 146399 82347 -46849
43389 -46849 -12732 230507 259597 396090 323257 250297 3277 -2374 -20905 -32754 -50110
43378 -50110 -34955 -9901 -29678 17802 5643 9371 39272 19754 -8621 -123426 -152313 -18531
43366 -18531 -5894 -58904 -117538 -79291 -28790 -121469 20917 55865 70530 83264 97448
43355 97448 122110 62039 -78863 -197263 -144585 13744 239289 241211 319554 339262 156408
43344 156408 -63142 109452 187526 64111 26359 -19893 3549 -141496 -164578 -80766 -72597
43333 -72597 10610 211429 125157 34831 115428 -8935 -127187 5389 102196 242557 269951
43322 269951 74025 -41955 3171 95106 2080 -205882 18375 124145 254989 285252
43312 285252 133356 -47115 -81089 35489 38656 -11128 -231986 -178698 46553 194541
43302 194541 166578 26669 190184 92874 -87401 -88016 99911 229092 190354 100082 163902
43291 163902 92308 93276 106431 109221 24498 -53589 90696 60887 78278 106890 -87132 -105092
43279 -105092 -117884 -72020 -111348 -138796 -72257 -149688 -252773 -217993 -71502 -22943 32894
43268 32894 9776 -81804 -79430 29862 121789 102361 336822 168687 25514 198012 72061
43257 72061 19893 107347 80743 -68963 -79520 -15608 149004 182646 137433 73552 -184064
43246 -184064 -137091 139571 112182 86830 232638 230738 316860 190053 136581 39380 215928
43235 215928 179804 68806 1718 101494 308995 239557 47669 -3255 27397 233160 191640
43224 191640 260355 327796 236565 248991 113604 -44 52558 109502 93661 88408 -104109
43213 -104109 -245340 -55309 -15296 -21573 -115738 34896 48621 -103133 -12016 -105261 -221772
43202 -221772 -241178 -167604 -10574 124527 137772 13649 -159730 -221361 -161345 -56819
43192 -56819 56393 53958 2750 -41617 68630 168480 151354 177976 177774 215673 264000 324927
43180 324927 453442 229187 191013 136178 174989 250069 -119660 -192391 -198754 64621 104631
43169 104631 43936 190632 99037 162162 120166 80221 48403 7780 -48724 -101203 26187
43158 26187 91798 -122085 -158393 22123 18752 180672 144335 43464 -42781 -126703 -117146
43147 -117146 -100424 -108405 -25060 105313 228535 364854 231159 187861 -18637 -171420
43137 -171420 -144121 -145764 88086 -8456 -142061 -18157 -123738 -104149 -37265 -106224 76021
43126 76021 205189 114092 157646 214743 255572 142731 -126765 -300858 -221171 -108275 -77823
43115 -77823 67151 229069 197001 130621 192842 171715 40704 6320 153963 119610 71350
43104 71350 113772 100704 126701 260170 386350 133952 76282 220649 205188 -10488 126629
43093 126629 74722 30309 -8247 -91329 -29378 52710 133941 -14782 36752 -98922 -140583
43082 -140583 -137993 -168178 -38474 68078 28002 -104674 -181356 -179561 -36515 -50401 -157203
43071 -157203 -33281 -6947 180338 147010 -170821 -173708 -166460 -165982 -75383 -7748 -32329 -132174
43059 -132174 -146368 101665 252993 119835 124073 174973 165886 -172385 -74830 152037 -1509
43048 -1509 -801 -90891 -119607 -93655 -102910 124858 39818 21151 114529 157161 156156 -58548
43036 -58548 -36974 131885 -3438 -40929 9179 82714 296726 303922 303517 319087 274577 89848
43024 89848 28205 56113 48227 -40836 -81133 164551 73523 -22990 67425 42670 -104247
43013 -104247 -80842 -80863 89814 -40535 -16839 -34698 -29392 23177 -39192 -96488 -345458 -184974
43001 -184974 -138197 -44722 -70065 -245391 -358621 -218934 -39626 -59101 -53597 19214 -39358
42990 -39358 -53629 43341 13161 65488 165925 144031 81396 59910 201788 170893 134750
42979 134750 28412 -30491 20187 51459 -75375 -222965 54606 222988 196993 224229
42969 224229 92679 194482 128677 41982 -34251 -97074 138006 48064 75422 85459 58560
42958 58560 79003 115516 148127 145103 221298 203690 176545 280303 226498 -11830 -155023
42947 -155023 -155916 -240952 -97717 72945 206436 146493 193458 196722 178714 63575 34657
42936 34657 97727 126834 63758 90204 235003 295778 253392 236697 300124 193838 602
42925 602 -200434 -48327 -143690 -282582 -204076 -103711 -14722 -138842 -153190 -151384 -117280
42914 -117280 -15182 3733 -102309 -35380 99942 125072 66877 20851 84321 44892 87162
42903 87162 7869 -43027 -199696 -103836 29784 82943 322158 267103 125305 47700 89273
42892 89273 -148826 21212 3030 -57954 17337 61459 6670 -232841 -248328 -31673 -14429
42881 -14429 151541 231804 109499 49159 114510 145405 235102 189219 185650 188463 -57007
42870 -57007 -62921 -156141 -103347 2268 -13434 66057 -11873 -26030 48922 -15112 -101622 10733
42858 10733 158764 84427 31429 -55179 76099 -21594 -78204 -91374 -179318 -150567 -261002
42847 -261002 -175807 41756 54817 -43282 -284694 -254565 -129570 67371 140883 97159 86286
42836 86286 50848 86912 93457 214483 173964 81190 21419 -3766 -119061 -35890 212604
42825 212604 172402 97481 9072 -16388 58594 121997 83215 92494 206797 380758 436492
42814 436492 334054 96701 114007 -22873 -44118 -55649 -189091 -284893 -82450 142055
42804 142055 89147 -4667 -14817 115074 183676 91297 -3980 48425 -215212 -202365 -150768
42793 -150768 -4529 192646 239660 122131 -65466 94961 320035 309681 119051 107468
42783 107468 27775 68154 32218 -130346 -145893 -209694 -26090 25579 61845 101340 166386
42772 166386 6710 -199238 -243026 -166992 -301052 -188161 -144361 -103650 11978 -155994
42762 -155994 -71825 43679 22740 81080 96515 40819 -8379 51401 -9867 63443 200231
42751 200231 93999 -27601 -93743 -208020 -110630 177923 255633 -6767 -134297 1750
42741 1750 51740 53139 131647 282122 333991 145857 -17120 162453 322384 279748 246783
42730 246783 97339 -98729 -199750 -53020 135516 264468 98021 20024 69101 -23960
42720 -23960 -48011 -74072 126973 92243 21704 39557 92784 84536 74465 233821 293815
42709 293815 48362 32893 129518 159272 184392 17371 77833 81174 157465 13602 -14870
42698 -14870 124963 293345 337221 177542 56503 -45672 -149450 -70444 -54046 19831
42688 19831 24314 137643 30010 -86616 74890 34860 49848 55708 204640 221603 111773
42677 111773 186454 -84 61977 33015 -37476 173510 185450 96841 -55124 -228694 -206631
42666 -206631 -58156 82413 114926 143357 135539 -36001 -53186 -67769 -209608 -165030 -170758
42655 -170758 -172996 -81697 13126 50063 26872 181033 334500 85149 -112087 -31430 61649
42644 61649 -21616 -128928 -74142 -8952 -71704 -274156 -197089 -199677 -300335 -275217 -34098
42633 -34098 -1839 11501 -212754 -250764 -255299 -211666 -86395 -59848 -110009 -142882 -227182
42622 -227182 -257034 -397895 -402304 -325081 -136557 48067 50987 -63702 -35035 91590 253452
42611 253452 258221 136577 232747 257528 77290 84165 103283 -15548 -96188 -4970 -30777
42600 -30777 10144 -154085 -203885 -211124 -109455 -3935 -80622 -159315 -210434 -181329 -123631
42589 -123631 91201 6203 -140688 -65762 8711 21598 20468 169316 288387 206794 220360
42578 220360 103956 74011 174891 167461 -156828 -172189 -177 167342 110777 -251385
42568 -251385 -363087 -149508 -273073 -185834 -97500 -142964 -185835 162365 115977 -72654
42558 -72654 63308 -101311 -346250 -120435 190656 250327 106300 45141 -53941 -219759
42548 -219759 -106779 2691 -24548 12564 -137125 -136652 -22325 177819 200234 95050 65653
42537 65653 33745 98726 -19678 -139755 -200568 -263547 -148848 45511 84123 16206 235082
42526 235082 234267 329741 140664 3030 -24983 -124135 12398 90752 -4655 -49661 -140196
42515 -140196 79928 103975 -69777 -15219 -81343 64176 56440 -60147 -34990 -25495 139945
42504 139945 178221 -22488 2039 -167767 -142475 -55182 103183 197691 251369 262305 154239
42493 154239 -34337 -53159 23756 41830 -200330 -199099 -14985 135520 213288 208339 -183168
42482 -183168 -52707 63374 26872 -54140 25548 93609 104395 88358 157072 72275 -76378
42471 -76378 -41330 -252518 -235442 -195657 -81381 -99287 -124489 -324819 -389675 -227344 -235033
42460 -235033 -218155 -310664 -116113 -154446 -116730 104949 271230 248234 188043 69876 105293
42449 105293 -62495 -90913 -28018 -46010 -154208 -183826 -164676 -249092 -113425 97352 170928
42438 170928 228872 210687 121565 196977 100284 14348 -74674 -136355 -38219 25997 99152
42427 99152 -155230 -121042 42818 122068 297266 240814 163835 121670 73166 -116246 31528
42416 31528 50931 32956 109541 124822 96901 30107 -53304 16872 9035 -23606 -90857 -110255
42404 -110255 -149668 -49539 74106 934 68572 -91770 -86693 66924 46009 172296 180203
42393 180203 202676 218151 212804 70463 -159951 -92846 -8903 -51897 -25920 90648 -64840
42382 -64840 -104760 -162165 67876 116100 -5379 265737 258360 139673 131545 118808 124204
42371 124204 -22607 -161340 -7872 74607 126545 128829 218258 135724 -19431 -124872 -143352
42360 -143352 -231554 -79942 -75665 -108110 142193 169492 62656 -62094 6904 78789 30481
42349 30481 183828 383234 260233 278849 254144 22928 10456 44817 -56859 -119452 -89579
42338 -89579 -66115 -21321 -140372 -75522 148609 146666 158183 65970 98572 153764 153663 33466
42326 33466 46586 146289 132481 152982 103718 -84556 -41982 82233 158961 110736 -55144
42315 -55144 -162294 -254807 -132653 48527 115106 34606 70196 107641 239754 257737 -64989
42304 -64989 -154369 -12213 86560 157063 254906 88604 118311 184911 60245 -83877 -120583
42293 -120583 -27474 -12908 195533 219894 254909 369071 334303 361191 188618 3145 99702
42282 99702 146458 67222 132077 13827 133659 206201 -5595 -9040 90997 -39539 89907
42271 89907 104335 38161 -28636 -134909 -105299 -35332 134170 163530 203320 -77774 -228007
42260 -228007 -97625 -93372 -64103 34494 92933 -60536 20579 216213 249633 231369 -136069
42249 -136069 -275083 -182652 -67842 -163959 -163990 -118598 -116820 -139685 -81874 -320893 -170239
42238 -170239 -82612 -27285 87517 -924 -119593 -11624 -138117 -234539 -4223 -49447
42228 -49447 -23069 51559 32629 79593 -126952 -161265 -138695 -27812 42219 -19156 17169
42217 17169 104027 166888 209798 131534 181270 -17395 -92886 -35313 258049 178075 108162
42206 108162 113522 -14224 -96499 -68930 182442 195406 150403 75148 37221 69869 88034
42195 88034 107810 88592 -35933 57868 -39318 28870 -325 35125 109187 70688 -1565
42184 -1565 72276 197890 285436 249443 213513 249056 266545 151153 -24243 3105 -66050
42173 -66050 -67742 124212 88643 239365 230517 255807 92736 14547 -197134 -233610 -197140
42162 -197140 -66890 2127 130087 103397 186057 328295 357632 221070 -96673 -5850
42152 -5850 -94325 -113652 36837 48238 52247 -20091 152398 274027 365879 128156 -117324
42141 -117324 111015 75012 19947 30712 38314 227781 229599 212985 102682 -61708 -60392
42130 -60392 -35849 131268 95647 83297 37085 161254 16492 -261240 -162093 123173 59857
42119 59857 2811 222324 318963 295679 134133 101852 147244 23668 -88357 48223 26023
42108 26023 -138392 15158 -45003 101108 140115 25225 -22461 27681 6545 -71720 -35765
42097 -35765 -153888 -96769 -119686 -147603 -120040 -13372 293642 283111 163965 -10354 -203489
42086 -203489 -313221 -186368 3526 -12397 183534 194107 110280 120757 89636 49599 42600
42075 42600 105386 264667 77787 122586 212899 71257 90877 18284 -96429 87054 107638
42064 107638 93555 231446 243620 216688 25521 78260 269169 297322 338356 216078 17741
42053 17741 -105219 -17804 -103129 -32535 117022 29224 -60389 -350714 -325110 -108721 -74970
42042 -74970 13678 -101231 -43312 -93332 -220284 93793 73256 -116960 -198566 -210510 -90583
42031 -90583 -52299 -14048 -63431 -4497 48672 61402 162168 283779 175011 26176 -10173
42020 -10173 -24622 208754 312721 223832 139515 90282 -89602 -206859 -101057 -73889 -216577
42009 -216577 -222399 -191135 -190274 -350284 -251282 -108819 -166318 -90388 -140423 -211985 -106798
41998 -106798 -174780 -155429 -88911 38231 -19986 30658 123410 146517 235844 108616 31632
41987 31632 -32112 -85204 -108088 45114 95225 147697 212046 147372 108247 41063 -42894
41976 -42894 -55542 -109687 13070 23019 51418 252505 281237 -56708 -142474 107320 88675
41965 88675 97617 131647 -1859 -243245 -258246 -150161 -2466 -21167 19133 -145070 -209557
41954 -209557 -193114 -182004 55404 100860 138660 28089 -46681 104739 200523 30790 -31991
41943 -31991 -86292 119234 338428 187199 91717 310947 158240 116323 153818 119794 13092
41932 13092 99279 106395 91301 145640 222371 210672 115196 192597 137949 89678 20386 80982
41920 80982 129104 47351 70115 -25967 -4435 19444 -161354 -10602 -19641 -22814 9955 -29233
41908 -29233 32130 82145 67161 70159 43407 121633 244111 318585 205657 68414 41211
41897 41211 52810 100548 106830 108842 7624 20825 -115702 -75476 -52472 774 -45226 -27936
41885 -27936 -60189 85397 202117 200407 190866 261793 83101 60465 117429 57075 -72779
41874 -72779 -78842 155579 129589 93330 177204 208322 102522 80342 117068 123380 45045 -48648
41862 -48648 -20989 90624 -76939 -163966 61052 378020 373554 90168 56793 -8778 -61975
41851 -61975 163838 206447 178997 191124 173224 131004 140873 104347 182266 281419 356378 327297
41839 327297 287944 196356 157356 236498 94080 -168171 -167329 -39462 -144939 -17641 -31701
41828 -31701 63049 138371 39414 103666 62972 -139220 6152 135309 54550 28323 79693
41817 79693 229881 142964 156816 131634 22638 32716 52833 -26291 31824 151580 -93988
41806 -93988 -196892 -48890 -128043 -51007 117461 202332 130538 -18247 86736 248120
41796 248120 179728 -57246 5476 15423 47062 50705 -35329 -20460 163443 20165 -11841
41785 -11841 105165 189120 200589 54646 74283 100180 246509 196964 81853 62659 135217
41774 135217 277457 323594 421277 378702 280396 245162 318486 364155 355505 126099 39786
41763 39786 65736 -78548 -139425 -61867 -145311 -143162 -115098 -76860 -201026 -125358 -13068
41752 -13068 175349 189679 33985 -107815 -72155 -6121 -117506 -228473 -266159 -284401 -112963
41741 -112963 18255 -68216 -59053 -10258 21296 -38399 -157590 -304539 -183653 -74777 36482
41730 36482 -23837 -65819 -188405 -252422 -55671 -148259 -179254 -21627 10864 28372 -2948
41719 -2948 -55682 -42008 -31455 -164883 -85782 -44617 -53905 -151523 -14132 -83520 -310955
41708 -310955 -331114 -90577 -14733 -180607 -267957 -179467 -22321 71256 -127343 -53264 -63438
41697 -63438 -63113 -21439 10139 94284 19703 -12691 -85985 -166609 -68761 -51567 4354 -39372
41685 -39372 -80250 49266 176754 163927 263637 207610 -31330 82651 141462 123732 41803
41674 41803 -95158 -116500 -66072 44434 256579 366213 354249 158667 -24825 -36976
41664 -36976 -57485 -105263 -55586 -115149 54471 363172 153771 47538 73560 133818 60877
41653 60877 96990 221450 228599 47765 2560 -149472 -110705 -141244 -179029 -179377 -42930
41642 -42930 -60041 -38924 -80984 -231311 -213622 -50044 161965 344501 516297 486268 280870
41631 280870 178551 -44523 -47441 95413 174047 149573 -16119 -129199 -92731 -61329 3057
41620 3057 132152 31286 240215 157788 -93314 -242993 -190882 -244343 -72163 -215746
41610 -215746 -260360 -50176 -107833 13423 60803 223233 211847 67174 47403 137109 112047
41599 112047 -65825 -165489 -136066 31170 -32072 49112 101966 -13064 -45931 -69051 -64284
41588 -64284 -71839 -44818 124359 1456 -258316 -227691 -49961 -84006 -61335 -133855 -120229
41577 -120229 -189069 -42584 227617 169520 -65839 48154 121658 20834 8071 -92666
41567 -92666 -49340 96834 155504 74785 43894 46493 -70202 42670 -9590 -74169 -85667
41556 -85667 -116246 -298834 -249276 -41948 161895 133460 126137 202711 225116 111450 132329
41545 132329 86894 149436 32618 46251 -19602 31029 117508 3131 -142442 -119044 -61191
41534 -61191 43114 116836 131291 18436 -63766 19607 22344 41029 143123 44098 62719
41523 62719 81194 2928 7409 -193564 -72768 89202 -29902 -186196 -227790 -203454 -68949
41512 -68949 -31767 137260 28808 82326 22998 -59689 -140966 -177823 -111387 -46967 -3551
41501 -3551 -50581 -42854 -153071 -293760 -40969 -25505 -188420 -73727 -16826 -80097 -57309
41490 -57309 -2376 48824 142333 186267 75601 161528 363593 307322 -28577 41970 192568
41479 192568 331141 343681 178633 41277 -89535 -98469 -81860 -48139 -155406 -106369 -108306
41468 -108306 -86993 -37291 -71281 -185522 -157311 133080 110197 99981 110478 91874 -25601
41457 -25601 -219791 -133778 -29279 -12022 60651 83546 -51659 -87059 -67053 -92416 -70869
41446 -70869 -55803 130398 145167 337832 190272 20033 76839 210993 226168 332182
41436 332182 203388 178433 192162 132336 81096 172647 115539 -117274 -124664 90139 176653
41425 176653 -57346 -100703 44350 148074 221257 162017 151125 193744 159106 87376 118069
41414 118069 172903 252047 112822 76561 25207 65664 -69853 -93551 30172 -50288 -152261
41403 -152261 -165743 75437 190517 61389 -8265 -98291 -128438 -189380 -102424 -1723 56740
41392 56740 25044 1508 172386 51896 22683 33836 -12189 -50917 -85187 -196016 12307
41381 12307 203134 143578 -12130 77589 72236 45398 -24647 -80526 -347919 -201122 -47714
41370 -47714 -102404 30367 -193629 -256912 -89823 -113117 -78059 -79029 -19181 -85783 -46747
41359 -46747 35830 15477 -20874 -130710 -254147 -121604 123256 22052 -48695 -210092
41349 -210092 -94583 37592 -96606 -70016 -126324 63727 5567 -173055 -48743 133279
41339 133279 296775 205048 -59962 -44018 171383 125558 174819 141168 216051 278944 215187
41328 215187 60267 -35250 -158679 -200412 -246892 -86005 -98606 -112541 -63723 -264101 -100846
41317 -100846 73412 208539 133225 77422 -30531 62620 212347 103222 -31376 60992
41307 60992 117033 -80299 -128022 -169926 -243725 -143726 -42229 117322 186945 51301 157792
41296 157792 157864 58073 -18963 -107748 -134930 -55442 -140109 -119885 -80595 -61829 -177362 -197654
41284 -197654 -91618 114921 212899 73324 160669 -10058 -135107 -178817 -34465 57907
41274 57907 200535 151811 2545 -28994 -70998 -2369 -107166 -75390 157450 128300 75712
41263 75712 42219 98754 74235 179151 357432 167011 12726 -12455 -36932 -24256 -3356
41252 -3356 -6269 83480 150570 63690 87249 151265 105022 309206 252329 149267 101759 55772
41240 55772 -101862 167441 129504 81479 -100934 -87291 -166370 -153975 -87838 -132216 -481
41229 -481 66209 26630 -18491 94996 168645 318004 342315 239570 202460 30199 95546
41218 95546 107077 135088 215197 168239 79025 51213 54464 -49979 -4780 46078 -18477 -193072
41206 -193072 -282646 -70981 76722 101617 168913 183240 70255 4471 -93021 -76503 242824
41195 242824 249819 89725 -44269 -163078 98610 247141 84692 87440 12798 98189 -58120
41184 -58120 -72697 105235 195957 141594 -47080 -176579 -22186 -30738 76911 46990 43203
41173 43203 89125 44820 19311 188057 196992 29368 66000 144673 -48069 -113483 -66773
41162 -66773 -42168 -74516 -157110 -138782 -132537 -78936 103824 37278 -19627 -39320 -27778 -68483
41150 -68483 -119033 33241 92133 -22389 -59450 -81243 9751 74789 130360 309789 315004
41139 315004 299440 312254 29871 -141543 -13001 203403 85384 49556 -23205 -15988 55449
41128 55449 150746 151509 25203 -94792 -57757 87729 42949 -43572 -74465 -186390 -188334
41117 -188334 -117589 -143734 -27527 121953 137736 108824 118357 -53959 -17716 54204 38985
41106 38985 18890 -102529 38663 135209 121579 46526 2373 141959 166004 87819 47390
41095 47390 230068 201735 33296 135476 136207 22230 126975 -32796 -183128 -217298 -83582
41084 -83582 5370 13388 -144513 -126662 -185537 -164492 -14708 9753 -144496 -14072 153980
41073 153980 87394 132282 331352 386405 221023 -97842 27808 131278 2622 -279387
41063 -279387 -166297 79287 100122 -54264 18817 227577 126199 105516 88902 9550
41053 9550 33085 -102795 89994 179588 -13551 -2262 -25348 -102366 -273446 -180688 -32348
41042 -32348 199905 72927 -14801 26954 52442 137368 -62857 -16388 -131044 -228535 -307769
41031 -307769 -125059 -2440 1040 -4600 33469 -232 65929 94488 123906 40738 50641 -135031
41019 -135031 -106278 12560 -254202 -231543 -109095 -58795 -116084 72656 162897 101993 -13226
41008 -13226 252570 265661 40053 92711 131040 96766 16993 -12163 41339 80958 172955
40997 172955 226074 263676 219475 180178 199186 40420 -201806 -296202 -196546 -85267 -156907
40986 -156907 -191992 174511 64213 -811 152800 34189 67567 -40992 -114260 -13952
40976 -13952 31046 -42533 -16285 27375 109405 104702 141120 163681 226161 50111 -282722
40965 -282722 -144063 -69951 210045 218895 249902 105807 -119640 1432 178703 82709
40955 82709 20750 86943 -45447 61862 206057 219680 101339 22021 252 -6579 58446
40944 58446 93406 257785 271296 261568 251776 -26923 -81313 145422 197816 146484 60457
40933 60457 -209151 -237160 -141431 -292841 -170759 -258087 -212528 -163141 -16875 60443 9925
40922 9925 43518 47323 138964 207152 93406 116036 87890 -405 371622 287489 173733
40911 173733 229683 271754 238862 152060 -40707 92993 11483 16545 97797 -258805 -183576
40900 -183576 90159 172829 79967 -199127 -121314 69280 38417 -130392 -110569 -41913 -44519
40889 -44519 -17104 -125483 22143 187633 167410 64452 -2343 40180 -150080 -145606 -53665
40878 -53665 109680 178612 33188 37393 53636 152569 246109 157948 351523 470053 356620
40867 356620 187528 -43593 78359 173076 139403 52665 118906 49653 26001 24274 1667
40856 1667 -49310 14629 -46417 -128765 -63715 436 -185412 -175385 -52401 -87994 -169309
40845 -169309 136732 159055 -33916 165134 328301 479912 329540 101229 151360 249200
40835 249200 196875 194195 143741 265471 295383 63278 -21829 104099 156652 151226 238915
40824 238915 234123 13799 -86377 -236801 -219816 -169604 -76558 -54230 29777 205250 29396
40813 29396 -213961 -156858 44234 34029 18652 -49380 -8530 53112 9755 17180 -7684
40802 -7684 -193981 -219350 -217090 -154167 -109990 -4361 -69728 29578 44722 -69540 -118300
40791 -118300 -183625 -231197 -171747 -47787 -2539 45177 -92919 -114855 -47337 -112703 -300538
40780 -300538 -111529 -38728 38773 174581 107968 76268 161625 -24359 -241426 -87687
40770 -87687 -97106 -136194 -88157 -28520 -145795 -3744 -52681 -122599 109984 201414 -8844
40759 -8844 -76371 -50910 190601 57474 -109176 23662 116382 160998 -99942 -120842 11457
40748 11457 29964 158663 149109 101131 148797 117293 167341 -18345 157616 256551 195152
40737 195152 193540 78185 628 79407 63073 -61097 7616 80696 -63534 34326 37899
40726 37899 -13123 -130523 -93585 -140700 -19712 206734 22637 -219880 -215911 -188688 -94431
40715 -94431 194192 181868 -103252 -59857 -50902 -124341 -52847 30466 73553 217203 179130
40704 179130 159011 -48004 -136104 -40256 -86487 -6243 309387 443611 244477 174796 -11770
40693 -11770 -28107 16445 18078 9452 288342 319482 170227 -45612 -25378 -24047 22272 105663
40681 105663 -33776 -70776 -25164 8531 -186683 -24799 14951 -85520 27501 -191163
40671 -191163 -184894 -14122 218263 234904 133477 56550 -9002 11035 129875 -16238 -123427
40660 -123427 -49395 25460 -169416 -81397 -104112 -235943 -114287 18044 -54693 -132960 45058
40649 45058 73655 42148 61582 73603 75024 29495 53575 108288 -150853 -94704 45101
40638 45101 181225 185205 -38649 -196657 -65724 89869 89668 -63567 -87291 -152052 -150820
40627 -150820 -122452 -142012 -157915 -21072 40085 -95387 127986 176796 87394 172016 129551
40616 129551 -130365 -119024 -30067 -65875 -107791 166918 97245 9593 -94720 -240937 -87833
40605 -87833 49548 122250 167761 144783 82863 15520 35115 66723 39874 29571 58799
40594 58799 -15707 28168 36507 177114 29044 -189721 -218685 -68741 71143 242286 202565
40583 202565 151971 122641 139780 49667 72564 29287 -60523 190327 87366 -94638 -74876
40572 -74876 -9141 -124567 -228669 -283790 -115501 -49328 -9204 -45524 -140574 -7249 72203
40561 72203 -23066 -75789 56673 -81897 -157214 -191085 -168919 -140527 -203891 -308161 -256783
40550 -256783 -199914 -203050 -23516 136556 113997 -113921 -57103 262141 254423 70317 -29402
40539 -29402 -26964 6781 31797 -15262 -215182 -174553 -231714 -49037 37949 27627 38339
40528 38339 234618 210483 118957 141968 182724 52792 -52889 43369 54949 -43558 104250
40517 104250 212649 203478 167897 112727 201998 398590 199237 97313 -21528 -44502 92679
40506 92679 133581 157171 -125611 -323806 -220446 -76078 -8443 -54462 10582 -48699 6987
40495 6987 -89663 -74133 -173852 -37666 2994 -32177 7874 85586 -47113 -21735 -66243
40484 -66243 -2977 6520 190772 292596 150048 -73864 109086 164768 234155 218884 170407
40473 170407 280458 87630 -12649 28507 141335 198096 232221 166840 119951 -31460
40463 -31460 64477 221215 287472 243976 188249 169784 204226 157557 45449 24685 98634
40452 98634 -174912 -200618 -39200 -77628 50708 68527 85825 112269 296108 196642 214760
40441 214760 115103 91599 197338 147448 108012 164466 23139 12770 -12642 1496 -93194
40430 -93194 -247293 -331349 -211052 -148221 -66532 -100183 -158966 48946 163794 -100162 -86431
40419 -86431 184114 8684 -47336 39849 16817 40239 53396 53097 -108640 -161000 -211421
40408 -211421 22342 16920 60087 163523 125011 78880 81691 -42821 -23270 143329 117644
40397 117644 -53711 148856 208524 198221 49875 108617 101949 35340 20329 -21882 88233
40386 88233 163590 231506 148530 -96229 -161660 -129808 -57062 130156 147607 231058 33352
40375 33352 -60248 -50710 -127857 -253722 -121202 4291 -50147 16975 71852 168663 162648
40364 162648 97300 -41008 -93117 199871 285438 127287 171948 173225 67845 40774 -16008
40353 -16008 46389 36968 -108703 -97391 46901 270017 197313 9281 33075 148745 299609
40342 299609 205808 9091 10895 81067 -63307 -79248 8894 -40722 24926 137261 80742
40331 80742 -10126 -1191 -19465 57521 55769 -36387 -115200 -35341 40411 28802 -49347 139411
40319 139411 82901 15955 95728 140771 -11680 -57304 39328 -26831 -54850 19042 51802
40308 51802 -34756 -146198 -23155 -134393 -190405 -157866 -25400 -145455 -172008 -54773
40298 -54773 136590 896 -214719 -180516 -1123 209470 225933 198226 170963 160610 71819
40287 71819 -42806 -15110 -135555 -65203 -141017 -264037 -153413 -27465 -79015 -76156 60441
40276 60441 148283 -26570 -163895 -101259 -228902 -244107 -149240 -305588 -367788 -220967 -229272
40265 -229272 -49709 102948 205755 51728 92013 111831 -96283 15527 175935 76565
40255 76565 303 -59212 -25655 -141839 -285000 -65684 67756 72617 -77658 116660 141435
40244 141435 149588 89537 63308 43536 -3162 95797 96571 92165 13749 36547 151615 254668
40232 254668 136158 -78176 9999 129088 14337 78416 91665 227436 189350 129450
40222 129450 -30761 12004 33714 -65716 24214 -101750 -63148 73606 40756 -53756 -58503
40211 -58503 83310 69557 161392 161572 7410 74256 -176291 -46064 40374 -94053 52219
40200 52219 153253 307062 144778 153177 185129 223937 112843 34434 64811 100069 111704
40189 111704 217031 138016 -78473 -57734 -24777 321 -98257 51178 154964 244557 183003
40178 183003 50757 101745 142884 277611 289912 237234 199047 236065 282273 288156 48363
40167 48363 -86605 -106853 -4573 147895 211163 260660 261255 248735 214326 60987 -57475
40156 -57475 -117246 -65975 43328 -64598 -57407 184263 207958 154365 94724 52374 -35712
40145 -35712 38229 -39425 45515 183825 138612 24579 111718 114096 -50298 -126755 -192503
40134 -192503 3039 18506 -48121 -11422 3717 29730 -134079 -131619 153082 167005 182774
40123 182774 88036 -102192 -121240 -91344 39885 -26210 -280733 -70964 -84974 -306033
40113 -306033 -348945 -166198 -12635 -139555 -197402 64772 153127 85336 215227 6024
40103 6024 -62832 -38369 -37890 67501 118867 79674 -66737 -115943 -51414 152779 34800
40092 34800 92716 223212 179554 91604 73544 309466 245506 241679 257532 171083 49526
40081 49526 23220 59555 208376 -7941 -293899 -252122 -169534 -99048 -94233 -178278 -159933
40070 -159933 -307007 -173788 -99987 -121204 -256633 -58288 -22469 38941 160609 308335
40060 308335 343769 189295 88415 249053 154358 161345 114812 56800 -47813 32150 -86019
40049 -86019 -181868 -345573 -324967 -336845 -272520 -186566 -167237 -136258 18508 89960 56723
40038 56723 -18732 6776 86893 272672 296369 194090 104152 25346 69650 367824 326607
40027 326607 128722 70952 61153 52328 144621 247676 163194 144056 186870 166593 233773
40016 233773 117998 131974 181982 28309 9354 14189 -55764 1966 73794 249388 299512
40005 299512 292197 350250 109379 -136028 -49513 147533 140272 125708 45289 42782 74684
39994 74684 124955 215234 309498 210599 95773 51960 -30089 -123590 -57678 -38881 -71868
39983 -71868 -133579 7365 -35041 13613 -31620 38751 26072 3493 132656 195836 103491
39972 103491 77552 4207 -64030 -173451 -80827 169401 293494 250458 387092 376282 136674
39961 136674 -9789 -8181 -122820 -180475 -42862 -10552 -171908 -212907 -34706 -37981 14454
39950 14454 -108329 -88365 19803 261680 -47313 -310049 -157054 -19890 -34997 -64902
39940 -64902 -56053 -143691 68251 126860 72907 71168 76536 29519 -86030 -28570 19918 148740
39928 148740 195880 93144 7479 -186679 -101395 89038 151318 362476 238428 69458
39918 69458 167869 225192 32418 132874 225983 260445 303963 206756 104398 84290 95407
39907 95407 66982 -25048 206391 78241 24487 56101 51718 61522 -28301 -112361 -285310
39896 -285310 -410811 -252231 4483 -19317 137235 178871 105383 53683 26219 117008 232199
39885 232199 265195 175336 170281 231153 47406 -62510 -46892 285628 123492 -39302 -57921
39874 -57921 -151028 -186853 -63932 102217 33746 -100440 -63913 55998 69740 187475 53675
39863 53675 -57552 75190 252876 192835 65749 123955 63802 48515 -66280 -128703 -17952
39852 -17952 -30657 50515 -90431 -104423 6794 -16698 -117268 -95526 -2518 198656 165721
39841 165721 85200 104658 258396 202824 138041 253107 187035 125187 24793 -39736 5464
39830 5464 -185263 -253295 -317932 -231645 -138887 -82945 -189461 -79567 -26431 -167829 -220187
39819 -220187 -122760 2675 28251 11223 -51556 -110635 105794 138373 -27223 -57710 -52016
39808 -52016 -167522 -150940 -52746 -78603 -10834 -16070 -34968 -124469 -164110 -284588 -216308
39797 -216308 -214887 -232855 -136164 27678 143022 111089 108808 120558 33953 21711 -3710
39786 -3710 -57802 20599 16272 56849 -102518 -58028 95153 -51556 -184984 -356569 -187093
39775 -187093 -66174 5359 -65023 -120795 -83641 -34310 -29044 41170 198938 248911 270063
39764 270063 135571 301053 350536 119662 -109868 122120 195040 70073 23506 278336
39754 278336 341854 180407 83147 -135001 -207191 -77588 -69754 31338 -32390 28257 115379
39743 115379 133423 57612 -105431 69614 75462 -92165 -169707 12586 31597 36187 90092
39732 90092 -182328 -286579 -136794 -114387 66312 49691 -41264 -115121 -153380 -115925 -68285
39721 -68285 46161 -9143 3176 10158 -794 144343 211186 63906 102789 85591 194789
39710 194789 65546 10810 183737 28167 -136079 -40358 -129696 -216650 -132343 58962
39700 58962 13748 -24236 -62501 -301388 -150086 -71077 -67791 3469 93180 -7418 96698
39689 96698 19864 64613 63663 34880 -159189 -54382 98516 -56261 -13969 -17467 -109152
39678 -109152 -174819 -218459 -16884 151060 61758 -115077 -46821 86707 171614 176719 133892
39667 133892 93599 -12928 -65739 13033 171068 228213 186480 150461 83931 -26155 -152461
39656 -152461 -109994 -124296 13631 88887 -8017 1100 49293 -41594 -162714 -191927 -35143
39645 -35143 12041 -39134 -32874 31083 60232 48474 18606 -116605 -147784 -3656 -30750
39634 -30750 447 -63646 -95036 -151402 -190713 19861 34216 -189742 -258959 -170218 5810
39623 5810 95555 207589 54561 40172 8036 -154087 -45951 22291 82453 190019 127067
39612 127067 -50732 -98162 18618 -86487 -142287 -43815 -82691 9067 133684 340247
39602 340247 339066 209638 29615 -2519 37683 -44577 -85330 58545 71018 246867 182867
39591 182867 201630 299165 149006 -65612 -6728 47175 125839 131184 225975 201980 270027
39580 270027 399196 211747 94139 135217 15557 -23665 99845 109129 46850 600 -211658
39569 -211658 -197488 -25787 -68002 82033 61115 6210 -35033 102017 123150 180097 262129
39558 262129 116851 45622 9430 -39503 -162466 -113902 109414 54607 6805 107501 46577
39547 46577 -36850 164962 210632 96087 84198 19632 -34838 -9454 205510 245283 164518
39536 164518 259719 332279 166383 -113749 -181276 -196392 -22697 35115 116241 94804 145963
39525 145963 32895 -49236 -143882 -49637 297982 206049 -66281 83240 106019 63561 14540
39514 14540 -39456 -93332 -189508 75618 -23100 -153482 -29183 -21959 -90046 -225384 -240100
39503 -240100 -217276 40297 25844 26766 147318 117700 175492 434460 493777 367198 82295
39492 82295 30082 121870 92821 70413 319766 368655 217290 164525 105687 58467 322733
39481 322733 424673 174552 142074 165084 50952 -6442 -4387 172860 105195 4889 27677
39470 27677 31218 12738 -186823 -190822 -219581 -224924 14392 114351 -31492 -171897 -29714
39459 -29714 148075 7023 -247846 -151847 50126 76627 16072 -124010 -22548 -5543
39449 -5543 -31743 -35532 -37187 -88596 167869 361217 181742 58963 119386 12058 144879
39438 144879 67162 31197 149248 4493 -84998 -36289 11974 -23050 -117483 34649 227724
39427 227724 200835 74733 109210 161167 174657 111783 35720 170662 191798 44954 56285
39416 56285 126462 122790 205100 209793 55654 35001 -103244 -60041 19549 26348 62157 99400
39404 99400 97732 -94618 -59397 -79973 17432 10353 109518 159011 269063 363686 254016
39393 254016 326011 420086 245980 94434 62233 6506 107842 169525 -141523 -198978 -208406
39382 -208406 -130022 -56019 -60340 40982 76190 221234 323426 155165 -17591 -101657 -171952
39371 -171952 -274919 -10283 123049 40837 183632 72705 76602 135494 6125 69969
39361 69969 210979 201838 67916 55085 27838 147283 188379 257952 194560 91201 48463
39350 48463 170264 146964 -83607 58351 88684 111825 -73675 -98788 100578 238774
39340 238774 219136 213004 281059 275937 219784 52434 205698 171974 194918 -60867 -165527
39329 -165527 209864 166261 97083 136563 96031 48868 6799 224614 246212 268516 286233
39318 286233 283525 275138 320895 244444 156962 -86991 -221673 -192833 -91067 -139366 -62702
39307 -62702 105008 -32065 -159103 -88706 60332 -173804 -204926 -119773 -221950 -78619
39297 -78619 83872 77057 80798 69284 18939 -43945 36891 97674 179143 12521 -17042 8138
39285 8138 2351 147206 109255 52667 -42246 -29995 -145893 -34588 77970 -2723 -47668
39274 -47668 -183277 -291576 -463545 -476578 -297279 -120416 -63705 -26429 -56976 -227996
39264 -227996 -232012 -158670 -200659 -126367 -168656 -79867 96011 240810 98881 10938 14151
39253 14151 53256 54217 -21244 85021 233691 62425 172443 96572 9153 85824 -28118
39242 -28118 79881 162649 14708 99475 -7933 57996 24618 59487 150267 57212 -72696
39231 -72696 -82494 -3049 -7044 74559 78634 -86367 -87054 134500 318097 279919 420705 177475
39219 177475 38656 143883 75891 104015 -58063 -63740 29927 35110 130587 86640 -72310
39208 -72310 -170611 -135148 -24829 -21131 -67474 -69375 -12410 -100747 -940 143908 163303 153940
39196 153940 -15811 -206897 -64514 236167 189122 58238 103282 166663 99232 60590
39186 60590 61110 56610 158183 135898 85868 109672 4767 164017 317541 219011 174819
39175 174819 65782 -270789 -206189 63920 144682 30443 -103771 -26306 243397 277759
39165 277759 53288 -205884 -85376 19638 -38311 -71040 -33779 -35496 -59030 -133602 75901
39154 75901 195115 25519 -106450 -133779 -122958 -202597 -117050 -139693 -56989 89278 81413
39143 81413 68588 88410 141395 -18220 22053 207892 153220 -125002 -48557 -33904 -53869
39132 -53869 6467 137128 87523 59008 -38192 107322 52519 -56764 14761 172096 36259
39121 36259 92172 5093 -13197 71842 94980 6042 135036 125882 179670 273040 249812 413407
39109 413407 337982 89959 162013 207708 162835 129188 254261 287019 202237 213470 70980
39098 70980 167805 303420 260449 39644 160654 29296 25433 59163 74324 41088 127272
39087 127272 103794 237843 324950 123974 69571 25418 -23022 29967 101961 -120987 -24278
39076 -24278 58391 29648 -39663 -35451 -177279 -199468 -188778 -240570 -7772 29835 -20497
39065 -20497 -24809 110175 -8852 -124879 -65080 -100850 -219713 -187702 -124140 -12321 6113
39054 6113 -63479 -42319 -91363 -97707 -50821 -154073 -36538 -217860 -225327 -252739 -115318
39043 -115318 -19933 -198075 -66716 -51953 -87560 7492 7511 -17691 -87903 -73978 -85953 26829
39031 26829 -31622 -79390 -32693 -49001 -70955 -170561 -115200 35944 50142 72308 83636
39020 83636 69279 -14498 -21974 57676 -44844 -211752 -262943 -168844 -241506 -293751 -248794
39009 -248794 29883 145327 44146 -146215 -98460 -34204 440 -109370 -272285 -290807
38999 -290807 -51161 173276 77609 241350 118529 29507 172379 204397 61210 -101876
38989 -101876 -147683 -134644 -79094 50130 14500 -80277 58305 -11319 -93797 -123231 -103912
38978 -103912 66704 183787 -33350 -97549 -87344 38548 199596 97642 -2795 -125428
38968 -125428 96029 273586 271161 410329 168832 115884 50097 -30489 14926 52012 38337
38957 38337 -39578 -60741 -237936 -240162 -83354 169548 185792 2402 8461 83046 56318
38946 56318 9182 77560 67326 69111 -71396 -75009 -83942 -186234 -56020 -35676 -144467
38935 -144467 -35617 102692 -13472 -5773 -85878 132763 206320 365342 457987 308377
$$ [...]
##END NTUPLES=NMR SPECTRUM
##END=
